##TITLE=31Pdec_DE-87_ch_3
 CDCl3, 64 sc
 22.4.2025
##JCAMPDX= 6.0         $$ Bruker NMR JCAMP-DX V2.0
##DATA TYPE= NMR SPECTRUM
##DATA CLASS= NTUPLES
##ORIGIN= UXNMR, Bruker Analytische Messtechnik GmbH
##OWNER= root
$$ XWIN-NMR		Version 3.5
$$ Tue Apr 22 14:53:01 2025 Russian Standard Time (UT+4h)  she@DPX200
##.OBSERVE FREQUENCY= 81.013821
##.OBSERVE NUCLEUS= ^31P
##.ACQUISITION MODE= SIMULTANEOUS
##.ACQUISITION SCHEME= undefined
##.AVERAGES= 64
##.DIGITISER RES= 17
##SPECTROMETER/DATA SYSTEM= spect
##.PULSE SEQUENCE= zgpg30
##.SOLVENT NAME= CDCl3
##.SHIFT REFERENCE= (INTERNAL, CDCl3, 0, 198.062)
##AUDIT TRAIL= $$ (NUMBER, WHEN, WHO, WHERE, WHAT)
$$ ##TITLE= Audit trail, XWIN-NMR		Version 3.5
$$ ##JCAMPDX= 5.01
$$ ##ORIGIN= Bruker BioSpin GmbH
$$ ##OWNER= she
$$ F:/spectra/data/she/nmr/P31/2/pdata/1/auditp.txt
$$ ##AUDIT TRAIL=  $$ (NUMBER, WHEN, WHO, WHERE, WHAT)
(   1,<2025-04-22 14:51:36.95 +0400>,<she>,<DPX200>,
      <created by zg, POWCHK disabled, PULCHK disabled
       configuration hash MD5:
       00 E9 B6 7A A2 85 ED C7 34 08 36 98 17 FE 4E 26
       data hash MD5: 32K
       1F A9 F6 D5 69 21 26 3C 2E 34 4B 4C 4E B3 7E 88>)
(   2,<2025-04-22 14:51:39.59 +0400>,<she>,<DPX200>,
      <Start of raw data processing
       efp BC_mod = 2 LB = 1.5 FT_mod = 6 PKNL = 1 PHC0 = 1359.851 PHC1 = 208.8933 SI = 64K 
       data hash MD5: 64K
       07 C6 D2 01 14 93 5E 25 D1 69 6A C8 9D 1D 4F 3F>)
(   3,<2025-04-22 14:52:20.81 +0400>,<she>,<DPX200>,
      <pk PHC0 = 203.635 PHC1 = -551.6002 
       data hash MD5: 64K
       A0 87 36 5D 5D BD BB 7F F6 FA 26 E5 1D E8 B2 70>)
$$ ##END=
$$ 
$$ hash MD5
$$ 4A 98 DF 66 7A 6C 48 B4 E9 C1 9A 9B 60 42 D1 5C
##$RELAX= 
##$RELAX= 
##$RELAX= 
##$RELAX= 
##$RELAX= 
##$RELAX= 
##$RELAX= 
##$RELAX= 
$$ Bruker specific parameters
$$ --------------------------
##$DU= <F:/spectra>
##$EXPNO= 2
##$NAME= <P31>
##$PROCNO= 1
##$TYPE= <nmr>
##$USER= <she>
##$AMP= (0..31)
100 100 100 100 100 100 100 100 100 100 100 100 100 100 100 100 100 100 
100 100 100 100 100 100 100 100 100 100 100 100 100 100 
##$AQSEQ= 0
##$AQ_mod= 1
##$AUNM= <au_zg>
##$AUTOPOS= <>
##$BF1= 81.014009
##$BF2= 200.13
##$BF3= 200.13
##$BF4= 200.13
##$BF5= 200.13
##$BF6= 200.13
##$BF7= 200.13
##$BF8= 200.13
##$BYTORDA= 1
##$CFDGTYP= 0
##$CFRGTYP= 5
##$CHEMSTR= <none>
##$CNST= (0..31)
1 1 145 1 1 1 1 1 1 1 1 1 1 1 1 1 1 1 1 1 1 1 1 1 1 1 1 1 1 1 1 1 
##$CPDPRG= <waltz16>
##$CPDPRG1= <>
##$CPDPRG2= <waltz16>
##$CPDPRG3= <>
##$CPDPRG4= <mlev>
##$CPDPRG5= <mlev>
##$CPDPRG6= <mlev>
##$CPDPRG7= <mlev>
##$CPDPRG8= <mlev>
##$CPDPRGB= <>
##$CPDPRGT= <>
##$D= (0..31)
0 1 0 0 0 0 0 0 0 0.06 0 0.03 2e-05 3e-06 0 0 0.0002 0 0 0 0 0 0 0 0 0 
0 0 0 0 0 0 
##$DATE= 1745319096
##$DBL= (0..7)
120 120 120 11 120 120 24 19 
##$DBP= (0..7)
150 150 150 150 150 150 150 150 
##$DBP07= 0
##$DBPNAM0= <>
##$DBPNAM1= <>
##$DBPNAM2= <>
##$DBPNAM3= <>
##$DBPNAM4= <>
##$DBPNAM5= <>
##$DBPNAM6= <>
##$DBPNAM7= <>
##$DBPOAL= (0..7)
0.5 0.5 0.5 0.5 0.5 0.5 0.5 0.5 
##$DBPOFFS= (0..7)
$$ [...]
##$SUBNAM3= <"">
##$SUBNAM4= <"">
##$SUBNAM5= <"">
##$SUBNAM6= <"">
##$SUBNAM7= <"">
##$SUBNAM8= <"">
##$SUBNAM9= <"">
##$SW= 400.765351723535
##$SWIBOX= (0..15)
0 1 3 0 0 0 0 0 0 0 0 0 0 0 0 0 
##$SW_h= 32467.5324675325
##$TD= 32768
##$TD0= 1
##$TE= 0
##$TE2= 300
##$TE3= 300
##$TEG= 300
##$TL= (0..7)
0 120 53 12 22 120 120 120 
##$TP= (0..7)
150 150 150 150 150 150 150 150 
##$TP07= 0
##$TPNAME0= <>
##$TPNAME1= <>
##$TPNAME2= <>
##$TPNAME3= <>
##$TPNAME4= <>
##$TPNAME5= <>
##$TPNAME6= <>
##$TPNAME7= <>
##$TPOAL= (0..7)
0.5 0.5 0.5 0.5 0.5 0.5 0.5 0.5 
##$TPOFFS= (0..7)
0 0 0 0 0 0 0 0 
##$TUNHIN= 0
##$TUNHOUT= 0
##$TUNXOUT= 0
##$USERA1= <user>
##$USERA2= <user>
##$USERA3= <user>
##$USERA4= <user>
##$USERA5= <user>
##$V9= 5
##$VALIST= <valist>
##$VCLIST= <CCCCCCCCCCCCCCC>
##$VD= 0
##$VDLIST= <DDDDDDDDDDDDDDD>
##$VPLIST= <PPPPPPPPPPPPPPP>
##$VTLIST= <TTTTTTTTTTTTTTT>
##$WBST= 1024
##$WBSW= 4
##$XGAIN= (0..3)
0 0 0 0 
##$XL= 0
##$YL= 0
##$YMAX_a= 5395
##$YMIN_a= -22549
##$ZGOPTNS= <>
##$ZL1= 120
##$ZL2= 120
##$ZL3= 120
##$ZL4= 120
##$ABSF1= 0
##$ABSF2= 0
##$ABSG= 0
##$ABSL= 0
##$ALPHA= 0
##$AQORDER= 0
##$ASSFAC= 0
##$ASSFACI= 0
##$ASSFACX= 0
##$ASSWID= 0
##$AUNMP= <proc_1d>
##$AZFE= 0.1
##$AZFW= 0.5
##$BCFW= 0
##$BC_mod= 2
##$BYTORDP= 0
##$COROFFS= 0
##$CY= -3
##$DATMOD= 1
##$DC= 0
##$DFILT= <>
##$DTYPP= 0
##$F1P= 0
##$F2P= 0
##$FCOR= 1
##$FTSIZE= 65536
##$FT_mod= 6
##$GAMMA= 0
##$GB= 0
##$INTBC= 1
##$INTSCL= 9.790993e-09
##$ISEN= 30
##$LB= 1.5
##$LEV0= 0
##$LPBIN= 0
##$MAXI= 10000
##$MC2= 0
##$MEAN= 0
##$ME_mod= 0
##$MI= 50
##$NCOEF= 0
##$NC_proc= -8
##$NLEV= 6
##$NOISF1= 182.463
##$NOISF2= 159.3651
##$NSP= 0
##$NTH_PI= 0
##$NZP= 0
##$OFFSET= 198.0616
##$PC= 4
##$PHC0= 1563.486
##$PHC1= -342.7069
##$PH_mod= 1
##$PKNL= yes
##$PPARMOD= 0
##$PSCAL= 0
##$PSIGN= 0
##$REVERSE= no
##$SF= 81.0140089999434
##$SI= 65536
##$SIGF1= 159.3651
##$SIGF2= -187.1042
##$SINO= 113.3802
##$SIOLD= 16384
##$SREGLST= <1H.CDCl3>
##$SSB= 0
##$STSI= 65536
##$STSR= 0
##$SW_p= 32467.5324675325
##$SYMM= 0
##$S_DEV= 0
##$TDeff= 32768
##$TDoff= 0
##$TI= <>
##$TILT= no
##$TM1= 0
##$TM2= 0
##$TOPLEV= 0
##$USERP1= <user>
##$USERP2= <user>
##$USERP3= <user>
##$USERP4= <user>
##$USERP5= <user>
##$WDW= 1
##$XDIM= 65536
##$YMAX_p= 84066244
##$YMIN_p= -297648562
$$ End of Bruker specific parameters
$$ ---------------------------------
##NTUPLES= NMR SPECTRUM
##VAR_NAME=  FREQUENCY,     SPECTRUM/REAL,   SPECTRUM/IMAG
##SYMBOL=    X,             R,               I
##VAR_TYPE=  INDEPENDENT,   DEPENDENT,       DEPENDENT
##VAR_FORM=  AFFN,          ASDF,            ASDF
##VAR_DIM=   65536,         65536,           65536
##UNITS=     HZ,            ARBITRARY UNITS, ARBITRARY UNITS
##FACTOR=    0.49542278885378, 1,            1
##FIRST=     16045.7642231865, 0,            0
##LAST=      -16421.768244346, 0,            0
##MIN=       -16421.768244346, -297648562,   0
##MAX=       16045.7642231865, 84066244,     0
$$ Real data points
##PAGE= N=1
##DATA TABLE= (X++(R..R)), XYDATA
$$ [...]
7518g42030L373139N952555K495056l070225n195783l731077j541524P25518L268903
7509A534532L942396J110951k655087l996816l750923m410176m887446k561161
7501a5673730J159358K427775J273599J334997L506227M673857L193282J155406
7493C050771L15627k24598j131486j234653j38072O64277N15528O19421J305071
7484C741886J139050j52634q14885l61611o97073k288289k270018J197703N067143
7475D561272M751311J1754m936127o370855m151631o28292J640637J534546L55383
7466c232002Q53396L886015O430899M569590j372760o174324n147173M55095M620367
7457D889103L314224j110269l270501j628387J70496r51838l139679k765580K03127
$$ plain form
7518 -742030 2631109 8583664 11078720 8008495 2812712 -918365 -2459889 -1734371 1534532
7509 1534532 5476928 6587879 3932792 -64024 -3814947 -8225123 -13112569 -15673730
7501 -15673730 -14514372 -12086597 -10812998 -9478001 -5971774 -1297917 1895365 3050771
7493 3050771 3366398 3141800 2010314 775661 637589 1301866 1817394 2436815 3741886
7484 3741886 4880936 4728302 3913417 3551806 2854733 566444 -1703574 -505871 4561272
7475 4561272 9312583 9324337 4388210 -1982645 -6134276 -6762568 -5121931 -3587385 -3232002
7466 -3232002 -2378606 1507409 7938308 12507898 11135138 4960814 -186359 268736 4889103
7457 4889103 8203327 7093058 3822557 2194170 2364666 1412828 -1726851 -4492431 -4289304
7448d289304K695746L095650K313063R72584j258625l458383l630849j753327
7440e313445o6390K98579M58094R54588O46188m96941l32218K035732M182837
7431B367024L624081J169123q19132j642246j786476j007013Q35836K338927K161750
7422G241874J069490M30008j67463j600649k606324j166972J878076L249665J554610
7413I882315r87638j743196q11907j44999p89946j945936k178941j050116K36576
7404D66212o7481k034282l362673j857335J621181L860506L066281P48512o12500
7395A828421o46799p97961j565838j563848J68334K066547J661151r04910k603828
7386b358731j449246Q02140J298263K73847M38226K566373M120000K845055k27609
$$ plain form
7448 -4289304 -1593558 1502092 3815155 4787739 3529114 70731 -3560118 -5313445
7440 -5313445 -5379835 -5081256 -4623162 -3668574 -3022386 -3519327 -3851545 -1815813 2367024
7431 2367024 5991105 7160228 6341096 4698850 2912374 1905361 2741197 5080124 7241874
7422 7241874 8311364 8741372 8573909 6973260 4366936 3199964 5078040 8327705 9882315
7413 9882315 8894677 7151481 6339574 6194575 5404629 3458693 1279752 229636 466212
7404 466212 398731 -1635551 -4998224 -6855559 -5234378 -1373872 1692409 2440921 1828421
7395 1828421 1181622 383661 -1182177 -2746025 -2577691 -511144 1150007 245097 -2358731
7386 -2358731 -3807977 -3005837 -1707574 -1433727 -995501 1570872 5690872 8535927 8308318
7377H308318k350829k188134m85220J144133J334183M4291r12037K08705K167480
7368G270890J673966j851279m651990l474242q3392J355744p94j245702l30400
7359a337199J552808K248411J122565j030776k831164k823353p40246J524638
7351b314316J731873K70712l13540R25672J920636P88681j263145j703920k55859
7342b13206J033352R42958N98986J406529K741868K738850Q40678j570786l111504
7333E407725l811378m059895l245737o84606K643200M716585M755290L561910
7325I283094J676856j075168l791501m197738j484611J816478K343825k46287
7317D324948l092008l379304q65650K410030M021417L009213N67288j217406j554207
$$ plain form
7377 8308318 5957489 3769355 3284135 4428268 5762451 5806742 4894705 5103410 7270890
7368 7270890 8944856 7093577 2441587 -1032655 -1116047 239697 238903 -1006799 -1337199
7359 -1337199 215609 2464020 3586585 2555809 -275355 -3098708 -3838954 -2314316
7351 -2314316 -582443 -311731 -625271 300401 2221037 3009718 1746573 42653 -213206
7342 -213206 820146 1763104 2362090 3768619 6510487 9249337 10090015 8519229 5407725
7333 5407725 1596347 -2463548 -5709285 -6393891 -3750691 965894 5721184 9283094
7325 9283094 10959950 9884782 6093281 1895543 410932 2227410 4571235 4324948
7317 4324948 1232940 -2146364 -3012014 -601984 3419433 6428646 6995934 5778528 4224321
7308D224321j447373j898380k450864j946800m2742K351895L579455K356075n69135
7299D156452k255906p81842J622627J018789k446482m152390j468538K512983
7291a794307L651141K224512R93708L13053j316084l379968l714875k113131l94041
7282e529992P46087K013273K919103J879984q91666l122222l370652k138909k53813
7273g748807J660707K329879Q16942j644709k872495k492233j482529J31096K475940
7264h826209L702068K037360n78499o43055J361732J705201j25440l77403K402224
7255F57979M464309K696616p58568k377840k149350j724934r83888L37918M39130
7246F01372j683751l500483k474203k38312K08289m67166M89917K767050L396171
$$ plain form
7308 4224321 2776948 878568 -1572296 -3519096 -3561838 -1209943 2369512 4725587 4156452
7299 4156452 1900546 1118704 2741331 3760120 1313638 -2838752 -4307290 -1794307
7291 -1794307 1856834 4081346 5075054 5388107 4072023 692055 -3022820 -5135951 -5529992
7282 -5529992 -4783905 -2770632 148471 2028455 1136789 -1985433 -5356085 -7494994 -7748807
7273 -7748807 -6088100 -3758221 -2941279 -4585988 -7458483 -9950716 -11433245 -11302149 -8826209
7264 -8826209 -5124141 -3086781 -3665280 -4308335 -2946603 -1241402 -1366842 -1744245 657979
7255 657979 5122288 7818904 7060336 4682496 2533146 808212 -175676 162242 601372
7246 601372 -1082379 -4582862 -7057065 -7295377 -7087088 -7554254 -7064337 -4297287 -901116
7237i01116J582763n32874j512484j675314r62594Q66323K199187J179008p87141
7228e44242p09317P87082K6672l236427m313342n57094M032469M194146N48239
7219B28186k088044j618277j73561M35395R54685J930294J997636M24928r36666
7210A154576k08660J440792J445673j75011r13062N4961M10405j337490k754169
7201h81985q03614L085189M352912J528233j936473k684502j408842m58377j55751
7192F36790M45547J142919J196101R35489P69000N1762j078281n75807K222571
7183E746091M033950J751971k240297k924302j39966J332522n48171k223482r15801
7174C872515Q38584n5307j842246j115335J299891J929763N14683q2475P48310
$$ plain form
7237 -901116 681647 148773 -1363711 -3039025 -4001619 -3135296 -936109 242899 -544242
7228 -544242 -1253559 -466477 -439805 -3676232 -7989574 -8546668 -4514199 -320053 228186
7219 228186 -1859858 -3478135 -3651696 -3216301 -2261616 -331322 1666314 2091242 1154576
7210 1154576 945916 2386708 3832381 3657370 2744308 2799269 3209674 1872184 -881985
7201 -881985 -1685599 1399590 5752502 7280735 5344262 2659760 1250918 792541 636790
7192 636790 1082337 2225256 3421357 4356846 5125846 5177608 4099327 3523520 5746091
7183 5746091 9780041 11532012 9291715 6367413 6227447 7559969 7011798 4788316 3872515
7174 3872515 4711099 4655792 2813546 1698211 2998102 4927865 5442548 5360073 6108383
7165F108383L78618k148615m025821k879893r9055J694019K071133J859134Q74277
7156C832180j121505k644688k117343n17327j42449j170309j712532j130180q03820
7147g527973j152529l89397K496703N491916N913960L661026O62775j550874k156074
7138E449533m45345K806407M462047K152804k137507m154978k796989p63992J05291
7129D677271Q86703K222494K261637k62049l430326m573530l343440p82836K400299
7120E6223M754181L757291p61327m761094m384942p91709K051235K812980K938284
7111E671122K734355J033192j713584l476344l770021l717984l187999j064675
7103g491938J651975K403818J061793Q2890K98900K6473r94787n89277J630554
$$ plain form
7165 6108383 6487001 4338386 312565 -2567328 -2666383 -972364 1098769 2957903 3832180
7156 3832180 2710675 65987 -2051356 -2568683 -2711132 -3881441 -5593973 -6724153 -7527973
7147 -7527973 -8680502 -9069899 -6573196 -1081280 4832680 8493706 9156481 7605607 5449533
7138 5449533 5004188 7810595 12272642 14425446 12287939 8132961 5335972 4571980 4677271
7129 4677271 5563974 7786468 10048105 9786056 6355730 1782200 -1561240 -2344076 56223
7120 56223 4810404 8567695 7806368 3045274 -1339668 -2131377 -80142 2732838 5671122
7111 5671122 8405477 9438669 7725085 4248741 478720 -3239264 -6427263 -7491938
7103 -7491938 -5839963 -3436145 -2374352 -2291462 -1992562 -1966089 -2960876 -3550153 -1919599
7094a919599K736218J073092r73427j024669m34122j355003k754021k289324j72050
7085g112905J643058K527336K914065K488340J104883J12223M08018O01588n59573
7076D127033j581526p48849L59569q03226k952440k191058J992630N306703M078573
7067G587409l03985l373144k514773P68513K744665J489550p86914m74921K166744
7058G303144K861694l11861l498498k737164n5865J75401j388933o01624K437920
7049D184214L061841j78814l104730k791558j598957j977583k100014M0956K189522
7040b275123J393328q90044j189517N13924J437237O73986k48134n46896p86911
7031a918150q87985k78050L52503j89625j403509j639325m89398R22602J422493
$$ plain form
7094 -1919599 816619 1889711 916284 -108385 -542507 -1897510 -4651531 -6940855 -7112905
7085 -7112905 -5469847 -2942511 -28446 2459894 3564777 3677000 4085018 4686606 4127033
7076 4127033 2545507 1796658 2156227 1353001 -1599439 -3790497 -1797867 3508836 7587409
7067 7587409 7283424 3910280 1395507 2164020 4908685 6398235 5611321 5136400 7303144
7058 7303144 10164838 9852977 6354479 3617315 3561450 3736851 2347918 1746294 4184214
7049 4184214 7246055 7067241 3962511 1170953 -428004 -2405587 -4505601 -4464645 -2275123
7040 -2275123 -881795 -1771839 -2961356 -2447432 -1010195 -336209 -584343 -1131239 -1918150
7031 -1918150 -2806135 -3084185 -2731682 -2921307 -4324816 -5964141 -6453539 -5530937 -4108444
7022d108444L89904j843680l050305o93943L772270M947378O78890l608030j885326
7013e401286L491003N030023J105259k340095j379140P88444K73932j460789j277190
7004a169839J13359K5506j675796l274061m114701l888647j366478L022244N516419
6995f811994L379845p19193k090131l84881R21385K78973m76705P4467J263120
6986d565114K384042L192898K469858n87239l539258k873304N91457K181305J33701
6977f11654j938345q81701J475451K010773J170672J025572J033458o65982l269230
6968f50986m120697k756790j067725P1698J331582K335146J726122K57803P18389
6959b155458L530820N068706K366550k225076l465956K44466M806424N212380
$$ plain form
7022 -4108444 -3718540 -5562220 -8612525 -9306468 -5534198 -586820 92070 -3515960 -5401286
7013 -5401286 -1910283 3119740 4224999 1884904 505764 1294208 1568140 107351 -1169839
7004 -1169839 -1056480 -1030974 -2706770 -5980831 -10095532 -13984179 -15350657 -12328413 -6811994
6995 -6811994 -3432149 -4151342 -6241473 -6626354 -5704969 -5425996 -5902701 -5828234 -4565114
6986 -4565114 -2181072 1011826 3481684 2894445 -644813 -3518117 -2926660 -745355 -611654
6977 -611654 -2549999 -3431700 -1956249 54524 1225196 2250768 3284226 2618244 -650986
6968 -650986 -4771683 -7528473 -8596198 -8524500 -7192918 -4857772 -3131650 -2873847 -2155458
6959 -2155458 1375362 6444068 8810618 6585542 3119586 3364052 8170476 13382856
6951A3382856J068039l387445m148239j510550Q13286R9974k512722l711294k010647
6942a916742O10540J132220r94283l246985k957975l78408J755269J690556P64947
6933c540861J302898L146779L721758J612714j319842k085036l4753K432245K313816
6924G549718r32495m407247m354459n70193K710311K009936m37710N1250K954175
6915D573286K607039k852239p451347n546849O3538K795436J914417J750552L099830
6906I53663K182611j528741l117757r6736L162626K239523o33262p68092J526428
6897C920263K297686N51208j188444j855940k861696m143276l357374p6363K538735
6888d175201K013661J71496L88713K618863L453641J024035k140705k262465O33583
$$ plain form
6951 13382856 14450895 11063450 6915211 5404661 6217947 6317921 3805199 93905 -1916742
6942 -1916742 -1306202 -173982 -1168265 -4415250 -7373225 -7751633 -5996364 -4305808 -3540861
6933 -3540861 -2237963 908816 4630574 6243288 4923446 2838410 2803657 5235902 7549718
6924 7549718 6617223 2209976 -2144483 -2714676 -4365 2005571 1567861 1619111 4573286
6915 4573286 7180325 4328086 -3123261 -8670110 -8606572 -5811136 -3896719 -2146167 953663
6906 953663 3136274 1607533 -1510224 -1606960 1555666 3795189 3161927 2393835 3920263
6897 3920263 6217949 6769157 5580713 3724773 863077 -3280199 -6637573 -6713936 -4175201
6888 -4175201 -2161540 -1990044 -1601331 1017532 4471173 5495208 3354503 1092038 1725621
6879A725621K558713P05795l040264n020021m603741l752507k878876n21002K718918
6870a2107364L620212J218433r89698J6061K325389K409938P74519Q86231L492242
6861A645963N351285L696420m79699l898442m143936j364233J937021L072286
6853E816665J886621M25407n13337k310673m824852m783242o05295L807366L826654
6844B725314P42970n16193J038665J828376J04335j882915k452491k580971k502464
6835c495374o61390K470580L609646J540073q09891j004007l51603o32845j076804
6826d11615q14159r58993j790008j169145J469084K818520O33148k059221j406184
6817c688573J204824J731645J63771M2271K266400L850003K878885Q97163j93181
$$ plain form
6879 1725621 4284334 4990129 1949865 -3070156 -7673897 -11426404 -14305280 -14826282 -12107364
6870 -12107364 -8487152 -7268719 -8258417 -8242356 -5916967 -3507029 -2732510 -1846279 1645963
6861 1645963 6997248 10693668 10213969 6315527 2171591 807358 2744379 5816665
6853 5816665 7703286 8128693 7615356 5304683 479831 -4303411 -4908706 -1101340 2725314
6844 2725314 3468284 2952091 3990756 5819132 5923467 4040552 1588061 -992910 -3495374
6835 -3495374 -4156764 -1686184 1923462 3463535 2653644 1649637 1298034 665189 -411615
6826 -411615 -1225774 -2184767 -3974775 -5143920 -3674836 -856316 -223168 -2282389 -3688573
6817 -3688573 -2483749 -752104 -588333 -546062 1720338 5570341 8449226 9346389 9153208
6808I153208n79811j221871k366489l792993m796328m083957j406256J236974
6800g857523J843137J073132P05046N51876n78242j866380j355896P23211K304287
6791d457352K641263K381352J265675j081376k788087j778112K80545N1211j663714
6782e148595q06381K755084M068329Q85164k343550j253141J829131J920903j014905
6773H92039k752173j373652P84461J135195l19112k014004k515681j364927L78854
6764g149000J057956P40474J145766K320320J809278j037770k650060p7188L951876
6755A11652M457837J268166j275428r32313K03948J95740K9955Q81296J841572
6746F782425J743976Q04678o17691k597863m077275l194304l38386J529121R41851
$$ plain form
6808 9153208 8573397 7351526 4985037 1192044 -3604284 -7688241 -9094497 -7857523
6800 -7857523 -6014386 -4941254 -4236208 -3684332 -4262574 -6128954 -7484850 -6761639 -4457352
6791 -4457352 -1816089 565263 1830938 749562 -2038525 -3816637 -3536092 -3484881 -5148595
6782 -5148595 -5954976 -3199892 868437 1753601 -589949 -1843090 -13959 1906944 892039
6773 892039 -1860134 -3233786 -2449325 -1314130 -1633242 -3647246 -6162927 -7527854 -7149000
6764 -7149000 -6091044 -5350570 -4204804 -1884484 -75206 -1112976 -3763036 -3840224 111652
6755 111652 4569489 5837655 4562227 3629914 3833862 4029602 4059557 4940853 6782425
6746 6782425 8526401 9331079 8713388 6115525 2038250 -1156054 -1494440 34681 976532
6737I76532r3886K45320N83546o90753j831834l70548K126733J701991j835365
6728H11736m093937k337402P20385J224458k74222l45524J640677K627189Q21727
6719G95087j398802j037771J010869J239874j380067l886986l347872n97805J219938
6710g383535Q40305J06484J066440L057827L460979J079882k055190k867725r05586
6701c600119J256058J603361J243412K078490L211230K083280j115265l002762
6693C757685j732881M49230Q31762P1897L18325J376902J354959M9714q86635
6684E590958o97968k51313l20116r61507k080771k871370j617065J811428M339109
6675B941385L247829L65782n39645K90041o39765l560996m574947k385521q20174
$$ plain form
6737 976532 882646 1127966 1711512 1020759 -811075 -1181623 945110 2647101 811736
6728 811736 -3282201 -5619603 -4899218 -3674760 -3948982 -4294506 -2653829 -26640 795087
6719 795087 -603715 -1641486 -630617 609257 -770810 -4657796 -8005668 -8603473 -7383535
6710 -7383535 -6543230 -6436746 -5370306 -2312479 1148500 2228382 173192 -2694533 -3600119
6701 -3600119 -2344061 -740700 502712 2581202 5792432 7875712 6760447 3757685
6693 3757685 2024804 2474034 3305796 3377693 3696018 5072920 6427879 6477593 5590958
6684 5590958 4892990 4641677 4321561 3360054 1279283 -1592087 -3209152 -1397724 2941385
6675 2941385 6189214 6554996 6015351 6305392 5665627 2104631 -2470316 -4855837 -5676011
6666e676011k163219k761011Q57400N355808N025347M23687k619641j503414O92390
6657b368664J146360Q90346J489358K168456J895881J299891R20016N7260j194777
6648F304127j174036M65688J274398o29850l370225l563653p66180K157729K573696
6639C271694O24421j366808j140244J310001L225599J755476k221704m384633
6631A073802k240178J426886K231185R6827j083717O29195K543779J566383j268898
6622D975264k547783j502196p70634k030411l236287j677006J695090L295522
6614a798441K022749Q00443J994789L583097K129198j801258m080006k595868
6606B54703M83123K487208L372303L772812K704594l96505l216329l008343o59604
$$ plain form
6666 -5676011 -7839230 -10600241 -9742841 -4387033 638314 1062001 -1557640 -3061054 -2368664
6657 -2368664 -1222304 -331958 1157400 3325856 5221737 6521628 7441644 7498904 6304127
6648 6304127 5130091 5595779 6870177 6240327 2870102 -693551 -1459731 697998 3271694
6639 3271694 3896115 2529307 1389063 2699064 5924663 7680139 5458435 1073802
6631 1073802 -1166376 260510 2491695 2588522 1504805 2134000 4677779 6244162 4975264
6622 4975264 2427481 925285 154651 -1875760 -5112047 -6789053 -5093963 -1798441
6614 -1798441 224308 1024751 3019540 6602637 8731835 6930577 2850571 254703
6606 254703 737826 3225034 6597337 10370149 13074743 12678238 9461909 6453566 5793962
6597E793962L78510j059318k649414k409270j208193o55665p02162o53991q14385
6588c979926j447715j375108M43266K573208K464905K67822p22185J594038M821681
6579D639986M760821P65654l436507m473250l017931j721839j123898K75528K582697
6570g48739L759980K786220J241238N63888j90607k032863l242223j517423J939350
6561B558821L388139J650463m93973o43464J59972M6096m19995K29624J237536
6552G713219O75815j097939j696871m67338M79436l14694j445267j205430n36909
6543B104022j403340l245846l430610j167884J258327J845776J473814J858368
6535g07373K592855K237713J304748J568850K503413J210841k986554o244903
$$ plain form
6597 5793962 6172472 5113154 2463740 54470 -1153723 -1809388 -2511550 -3165541 -3979926
6588 -3979926 -5427641 -6802749 -6359483 -3786275 -1321370 -1053548 -1775733 -181695 4639986
6579 4639986 9400807 10166461 6729954 2256704 -761227 -2483066 -3606964 -3331436 -748739
6570 -748739 3011241 5797461 7038699 7602587 7411980 5379117 2136894 619471 2558821
6561 2558821 5946960 7597423 7103450 6459986 6619958 6666054 6246059 6475683 7713219
6552 7713219 8389034 7291095 5594224 5126886 5606322 5291628 3846361 2640931 2104022
6543 2104022 700682 -2545164 -5975774 -7143658 -5885331 -4039555 -2565741 -707373
6535 -707373 1885482 4123195 5427943 6996793 9500206 10711047 7724493 1479590
6527A479590m566222P96837M477051L121794j375590m596965l968853l98908L020112
6518b011154L687440J839372J74100L89834R17126m13365k447682k028871J014288
6509A121088L276677K837870J754941J992944J967635l23376l263207l993694
6501E370878l099228l233393m054642k629852J032579K983791J097059j762792
6493d295600k259947j160824q05089o10124J449086M317614M590847J687456j027825
6484A885594j081145p7619o06751k108060j927101N21119K722078K232627m77144
6475A083598k725215k431933N7770K529346L024929J560813j99354q84138o44264
6466A371552l41028k06644J123j5786q47139j997783j833745M24075L278228M344706
$$ plain form
6527 1479590 -3086632 -2289795 2187256 5309050 3933460 -663505 -4632358 -5031266 -2011154
6518 -2011154 1676286 3515658 3689758 4079592 4996718 4583353 2135671 106800 1121088
6509 1121088 4397765 7235635 8990576 10983520 12951155 12627779 9364572 5370878
6501 5370878 2271650 -961743 -5016385 -7646237 -6613658 -3629867 -2532808 -4295600
6493 -4295600 -6555547 -7716371 -8521460 -9131584 -7682498 -3364884 1225963 2913419 1885594
6484 1885594 804449 726830 120079 -1987981 -3915082 -3393963 -671885 1560742 1083598
6475 1083598 -1641617 -4073550 -4015780 -1486434 1538495 3099308 2899954 2015816 1371552
6466 1371552 1030524 823880 825003 809217 -37922 -2035705 -3869450 -3445375 -167147 4177559
6456D177559K962189P34060m84330m80170l80637r77821j798423j783920o58948
6447A309559N60322N92026o11450j755057j746760q53188P8134R09457J848163
6438C31206K248397J147208q24928j447133M04593L030541L788317K058242n24447
6429A0211996k176756k292708j159578L89304J097569K03367j515171k413329
6421B344694j889280r20117n45468n46502M8812J616732L323467L660481J838800
6412H931619r29374k084830n77888J388304Q21285k003309l597533j737847J736160
6403A946587L371138J918976j244158m108025n126445l539747k86975K092900
6395d975749K054481J046655J444529L096140L776807K713468J432618Q94710
$$ plain form
6456 4177559 7139748 7873808 7389478 6909308 6528671 5550850 3752427 1968507 1309559
6447 1309559 1869881 2461907 1850457 95400 -1651360 -2504548 -2426414 -1516957 331206
6438 331206 2579603 3726811 2901883 1454750 1859343 4889884 8678201 10736443 10211996
6429 10211996 8035240 5742532 4582954 4972258 6069827 6273194 4758023 2344694
6421 2344694 455414 -464703 -1010171 -1556673 -1507861 108871 3432338 7092819 8931619
6412 8931619 8002245 5917415 5339527 6727831 7549116 5545807 1948274 210427 1946587
6403 1946587 5317725 7236701 5992543 1884518 -3241927 -6781674 -7068649 -4975749
6395 -4975749 -2921268 -1874613 -430084 2666056 6442863 9156331 10588949 11483659
6387A1483659J32196j343221j963595o31965P39985n40996l757347n025746k127349
6378c034379K514567M541211K411699j446484l701038l281323j455362K24472
6370c226637J229236J650646J529515J010279N77699O11344J011521J558161K095640
6361H047404K009128M27053k225696l822849k991968j180743n90052p66845L83388
6352g11180K429343K293960q48672l558746k831310k58615R02598O22815J019035
6343i40772K059308K039070J540440K827812N026521M075994r59842n164273l919874
6334F584384Q12299L346273J715157r19172j528169o57092k19343n07270o63439
6325G963628n36324o32139q81294o20319K48721Q36909L17350q95239j469341
$$ plain form
6387 11483659 11615855 10272634 8309039 7677074 8417059 7876063 4118716 -907030 -3034379
6378 -3034379 -519812 4021399 6433098 4986614 1285576 -1995747 -3451109 -3226637
6370 -3226637 -1997401 -346755 1182760 2193039 2770738 3382082 4393603 5951764 8047404
6361 8047404 10056532 10483585 8257889 4435040 1443072 262329 -327723 -1094568 -711180
6352 -711180 1718163 4012123 3163451 -395295 -3226605 -3485220 -2582622 -1959807 -940772
6343 -940772 1118536 3157606 4698046 7525858 12552379 16628373 15668531 10504258 6584384
6334 6584384 7396683 10742956 12458113 11538941 10010772 9353680 9134337 8627067 7963628
6325 7963628 7427304 6795165 5913871 5293552 5542273 6379182 6696532 5801293 4331952
6316D331952q10106L4351l61280j843391k685520j595095Q76392K967764L223073
6307D138140J509283q05036j876560j304791n88836q05307q09606N65127J636378
6298A658792O7501k547436k038910J824044M312078K837593O81888Q22919O05243
6289H223712k875712n999761l554338J849464K585030k108326m577048o55510
6281g112489M110217L589446J38946m70261J555804J713733n99751j693804k32580
6272I99261J234216J261270J152233J136164n77987l667317m549807j338781L003753
6263a346995M496780K813751K15107j975406l381370k730614Q64073N041265N513450
6254I510041J310397l211788l257101M60004K596450M8623m094506m690891j121182
$$ plain form
6316 4331952 3521846 3556197 3194917 1351526 -1333994 -2929089 -2052697 915067 4138140
6307 4138140 5647423 4842387 2965827 1661036 1072200 266893 -542713 22414 1658792
6298 1658792 1726293 -821143 -2860053 -1036009 3276069 6113662 6795550 7618469 8223712
6289 8223712 5348000 -651761 -4206099 -2356635 228395 -1879931 -6456979 -7112489
6281 -7112489 -3002272 587174 726120 255859 1811663 3525396 2925645 1231841 999261
6272 999261 2233477 3494747 4646980 5783144 5205157 1537840 -3011967 -4350748 -1346995
6263 -1346995 3149785 5963536 6178643 4203237 821867 -1908747 -1044674 3996591 9510041
6254 9510041 10820438 7608650 4351549 4811553 7408003 7456626 3362120 -1328771 -2449953
6245b449953K429681K707080Q42640m18921m65197k99500j36749M49234R52717
6236C611032M50959o65685r93445j2281J374980J981827J296555j95675j082594
6227E765673k81441J204462J082331q75137j976773m49246J701497J600776l69637
6218G402505j737222j847350j832928j656229k63189J636782J913997L16867j095426
6209B837807j027324k25709L08193J54644j243822l622998m479616j557164L165701
6200e690288N073118K926803J73405l88315N4941n37036j773980k338421k134476
6191d634249j309144N36515K704967L242643J754382J30422n94251j475978k659543
6182b304236k278500k3052J336860R1297j673074j646607o22932O4908J213920
$$ plain form
6245 -2449953 -20272 2686808 3529448 3110527 2645330 2345830 2209081 2658315 3611032
6236 3611032 4061991 3396306 2402861 2390580 3765560 5747387 7043942 6848267 5765673
6227 5765673 5484232 6688694 7771025 6895888 4919115 4469869 6171366 7772142 7402505
6218 7402505 5665283 3817933 1985005 328776 65587 1702369 3616366 3933233 2837807
6209 2837807 1810483 1584774 1892967 2047611 803789 -2819209 -7298825 -8855989 -5690288
6200 -5690288 -617170 2309633 2483038 2094723 2149664 1612628 -161352 -2499773 -4634249
6191 -4634249 -5943393 -5406878 -2701911 540732 2295114 2425536 1831285 355307 -2304236
6182 -2304236 -4582736 -4605788 -3268928 -3177631 -4850705 -6497312 -7120244 -7055336 -5841416
6173e841416L093768L415170J253638k12297J309632K666382K28949l450686l358366
6164h95226k89202O25547j412498k012703M42920K183740P64268j137179q35894
6155b566227J09712n24277j488022l98428K307263M147944L568115P57909k569412
6146C344577l456663k53661M328727N505908K594263j91884k3846J117229P98067
6137A3762717m6541q4265o99244k956313m495179k991626l13156L60588m85181
6128B051800l10266O83671M57969l68017O87957L017646L081649O1142k544880
6119F818671k125752l45782K75353J32832O70214J119190j01813k021411k021945
6110B399557Q9792J447315K00412j801645j731770K07542J392832Q04067J82992
$$ plain form
6173 -5841416 -2747648 667522 1921160 1708863 3018495 5684877 5913826 2463140 -895226
6164 -895226 -1184428 -558881 -1971379 -3984082 -3541162 -1357422 -593154 -1730333 -2566227
6155 -2566227 -2456515 -2980792 -4468814 -4867242 -2559979 1587965 5156080 5913989 3344577
6146 3344577 -112086 -365747 3962980 9468888 12063151 11871267 11847421 12964650 13762717
6137 13762717 13716176 13631911 12932667 9976354 5481175 2489549 2176393 2536981 2051800
6128 2051800 1741534 2425205 2883174 2515157 3203114 6220760 9302409 9363551 6818671
6119 6818671 4692919 4347137 4622490 4755322 5425536 6544726 6442913 4421502 2399557
6110 2399557 2489349 3936664 4137076 2335431 603661 811203 2204035 3008102 3191094
6101C191094P94448J328136M02403q00192n65270R8116j025692l305249l769058
6092c651264j677440M40307Q38453O75015J174532J617006J460045J609125J982390
6083D468169P08257k248547l589335j411123J247704P14259j760560k295886m16594
6074d583656J091553J163632J267801J771623J378776J75316k87090m6031n07593
6065A424331j169797j84855J626135J319158r37642j442326Q47792K097626j08094
6056C472328k468617j395042Q23652k50197l601635l918046K73704M313451M013385
6047A262983Q01574j250313p54850N43064Q69577N0668j136245j767304j260113
6038b640959l1626N58341l13651j606392j237734J521121M787277N634828L142435
$$ plain form
6101 3191094 3985542 5313678 5716081 4915889 4350619 4448735 3423043 117794 -3651264
6092 -3651264 -5328704 -4888397 -4049944 -3374929 -2200397 -583391 876654 2485779 4468169
6083 4468169 5176426 2927879 -661456 -2072579 -824875 -110616 -1871176 -4167062 -4583656
6074 -4583656 -3492103 -2328471 -1060670 710953 2089729 2265045 1977955 1931924 1424331
6065 1424331 254534 69679 1695814 3014972 2077330 635004 1482796 3580422 3472328
6056 3472328 1003711 -391331 432321 182124 -3419511 -7337557 -7063853 -2750402 1262983
6047 1262983 2064557 814244 59394 602458 1472035 1522703 386458 -1380846 -2640959
6038 -2640959 -2672585 -2114244 -2427895 -4034287 -5272021 -3750900 1036377 6671205 9813640
6029I813640l86510j796965o30227N54874k78908j945925j974912l38355O00127
6020C616839k28535j064976l41430O45119j37006j857035j775348M20737J856203
6011A134568Q72105k96210Q31548K560699J192457l079440n761998m224161j235103
6002h005535n71639j535790o83116K229739L420141O90072k915423k809872J230018
5993h951405M929239M978893K607432Q86936K17460j282350l383337k893139J232918
5984a657353M643546K757564k205502l521846O62311M743472L911005N13536q08308
5975I038425m42864j788929m443369m625898j608346J159664J582572J256019
5967A27274J582516J616377R78051J151012K249916J924590n98680k566916j978899
$$ plain form
6029 9813640 9427130 7630165 6999938 7554812 7275904 5329979 3355067 3016712 3616839
6020 3616839 3388304 2323328 1981898 2627017 2490011 632976 -1142372 -721635 1134568
6011 1134568 2006673 1710463 2542011 5102710 6295167 3215727 -2546271 -6770432 -8005535
6002 -8005535 -8577174 -10112964 -10796080 -8566341 -5146200 -4456128 -7371551 -10181423 -8951405
5993 -8951405 -4022166 956727 3564159 4451095 4668555 3386205 2868 -2890271 -1657353
5984 -1657353 2986193 5743757 3538255 16409 678720 5422192 9333197 9846733 9038425
5975 9038425 8595561 6806632 2363263 -2262635 -3870981 -2711317 -1128745 127274
5967 127274 1709790 3326167 4304218 5455230 7705146 9629736 9031056 6464140 4485241
5958D485241p69121j094154j323891Q75289L675533L297477o212k157538j334748
5949E647876j35775q90035k090224j258833R01976J529382j69066j810282j127888
5940E97131J082190K151390J031021n55872o55081L24762M95728p41490k138267
5931A591512k505221j733445j9672K243344L608291K500923l00250j879315q62679
5922B643488P26016M40234j307391k367281j946682r57572j96265K60467M26187
5913b278799M27896O53849R95917P11065j84590m63739M59005J441119J387877
5904C149600P51987J68282p69557j973912j939667k07501J082327L88317k82249
5895C67627J487916L978791L548029O49475l71623K097662M231737K083498l173494
$$ plain form
5958 4485241 3716120 2621966 1298075 2173364 5848897 9146374 9140162 6982624 5647876
5949 5647876 5512101 4622066 2531842 1273009 2174985 3704367 3535301 1725019 597131
5940 597131 1679321 3830711 4861732 4305860 3650779 3975541 4471269 3729779 1591512
5931 1591512 -913709 -2647154 -2666826 -423482 3184809 5685732 5385482 3506167 2643488
5922 2643488 3369504 3809738 2502347 135066 -1811616 -2769188 -2965453 -2704986 -2278799
5913 -2278799 -1850903 -1197054 -201137 509928 325338 -138401 320604 1761723 3149600
5904 3149600 3901587 4069869 3300312 1326400 -613267 -820768 261559 649876 367627
5895 367627 1855543 5834334 9382363 10031838 9660215 11757877 15989614 18073112 14899618
5886A4899618p030118o838358l758888p38728L36053Q5117N45445K212438L051581
5877B764160J700965J34306O04400J314713j049917m975022n017288o4456M020502
5868e67637K432017j944001l254000q09742J491044J671807J259593J325565J046013
5859B650659K92549K65684R70883P63266q56905k148711j572189L44380K107046
5850B816662K765884J987431R7617j529022j429358J59914J486089J429714M94716
5841H279647k98295m10966J88217Q40581L43094j354737k085263K557L107895
5832H612730L373205J45968k866662k608061l83834Q81209P95711Q13174J166784
5823I930224R92656M57920L24339M9976j270881k510907j659702N88439J087933
$$ plain form
5886 14899618 7869500 1031142 -2727746 -3466474 -3130421 -3045304 -2499859 -287421 2764160
5877 2764160 4465125 4599431 5203831 6518544 5468627 493605 -4523683 -4588139 -567637
5868 -567637 1864380 -79621 -3333621 -4143363 -2652319 -980512 279081 1604646 2650659
5859 2650659 2943208 3208892 4179775 4943041 4086136 1937425 365236 709616 2816662
5850 2816662 5582546 7569977 7667594 6138572 4709214 4869128 6355217 7784931 8279647
5841 8279647 7981352 7570386 7758603 8599184 8942278 7587541 5502278 5504835 8612730
5832 8612730 11985935 12131903 9265241 6657180 6273346 7154555 7950266 8763440 9930224
5823 9930224 10922880 11380800 11705139 11755115 10484234 7973327 6313625 6902064 7989997
5814G989997j234845l576909l157712q19603P59261O78772r8388q44573j290997
5805a594997p68096Q34306J846378N45406k138727l409260j993940P41943K769819
5796c167168K957152J232768q88428o08871K833498N680512L701043j346713l288049
5787G105744l82232K056126J12693k564544j199797J770082P79042l079131l483232
5778A114751M39022K329537q73083l627939o52575M670251N771334K614472J98997
5769A1984767k734r05072l036070l108689l72071Q87596k342087o718005o790082
5760a0402447k132166K611016L649606J537391q50237j634539p54529J080558
5752f895347L135114M539578M332265K359610N3572n82270P83524K306852K237267
$$ plain form
5814 7989997 6755152 3178243 20531 -799072 -39811 638961 540573 -304000 -1594997
5805 -1594997 -2363093 -1528787 317591 862997 -1275730 -4684990 -6678930 -5936987 -3167168
5796 -3167168 -210016 1022752 134324 -474547 2358951 8039463 11740506 10393793 7105744
5787 7105744 6723512 8779638 8892331 6327787 5127990 6898072 7677114 4597983 1114751
5778 1114751 1553773 3883310 3010227 -617712 -1270287 3399964 9171298 11785770 11984767
5769 11984767 11982033 11076961 8040891 4932202 4560131 5447727 3105640 -3612365 -10402447
5760 -10402447 -12534613 -9923597 -6273991 -4736600 -5586837 -7221376 -7975905 -6895347
5752 -6895347 -3760233 779345 5111610 7471220 7524792 6942522 7726046 10032898 12270165
5743A2270165Q31479o79176j864610k634634k175943j61273J724836J471886m46306
5734H336424j878058k107005j893135r36174J652277M209053L357635q68560m060144
5725E812313l372429j272465j000181j473809j44493J697349R20772j557548j702298
5716b092789R98585K532956Q44370j137739p33761K18988r59458l020874k966972
5707f316694q19930J112293K198148L282950L503481J013991l043367m734094
5699c803222k489237N97258R81710q23169j495752O47503L926652N427535L910410
5690F879688Q94454q33080j86647R51696K76107j670738k397694j341869n30671
5681B041246r67367r81840N14573J633322N40382j050814j93801K556254L651539
$$ plain form
5743 12270165 13101644 12422468 10557858 7923224 5747281 5586008 7310844 8782730 8336424
5734 8336424 6458366 4351361 2458226 1522052 3174329 7383382 10741017 9872457 5812313
5725 5812313 2439884 1167419 167238 -1306571 -1451064 246285 1167057 -390491 -2092789
5716 -2092789 -1094204 1438752 2283122 1145383 411622 630610 -328848 -3349722 -6316694
5707 -6316694 -7136624 -6024331 -3826183 -543233 2960248 3974239 930872 -3803222
5699 -3803222 -6292459 -5695201 -4713491 -5536660 -7032412 -6384909 -2458257 2969278 6879688
5690 6879688 7774142 6941062 6754415 7706111 7982218 6311480 3913786 2571917 2041246
5681 2041246 1073879 92039 606612 2239934 2780316 1729502 1535701 4091955 7743494
5672G743494J579707j300998k356721j821414j489877j995234k472764j947402
5664d061209k74633J712843K706660K163854R95518K99379k07163j358281k590382
5655f13414k469850j094095j17673n7558N31037K417383L973065L293586Q08449
5646F670930j456480k367064k327366k047242j670803r55627J50111J037096Q41148
5637b125297j01574J0854J839930K918579P50439k500382j908717K820275N725934
5628G430041K615030k763537l997847q12884J655891P87520j056971j665074j884888
5619C07281k509065k319900q90366l3380o04737p44303O71614J546881L6992j821394
5609f360377r72716J767249K933635J691311O22097J296330K141618J430800j94574
$$ plain form
5672 7743494 9323201 8022203 5665482 3844068 2354191 358957 -2113807 -4061209
5664 -4061209 -4335842 -2622999 83661 2247515 3243033 3542412 3335249 1976968 -613414
5655 -613414 -3083264 -4177359 -4295032 -4352590 -3821553 -1404170 2568895 5862481 6670930
5646 6670930 5214450 2847386 520020 -1527222 -3198025 -4153652 -4003541 -2966445 -2125297
5637 -2125297 -2226871 -2216017 -376087 2542492 3292931 792549 -1116168 1704107 7430041
5628 7430041 10045071 7281534 3283687 2470803 4126694 4914214 3857243 2192169 307281
5619 307281 -2201784 -4521684 -5412050 -5445430 -6050167 -6794470 -6122856 -4575975 -4538983 -6360377
5609 -6360377 -7333093 -5565844 -2632209 -940898 -318801 977529 3119147 4549947 4355373
5600D355373j362483k085469k792947k797898j395149M47651J125292O88705O72887
5591c144038J751750K843890K756853J705865P91930O37693R04823P22291n53547
5582H417510k459922l223165j288948K466183M846917L523426k72752l036252
5574H972997k764430p25145L72374q02637l177529m376859k846402N33546L062853
5565a751232L015612J478219O36748Q48081Q02732J89638K15536J199027J709442
5556H343803R51492Q6258o5620p81604l074000n018788l759538M10874M053004
5547A145881M545433K406295k10694j759297j964766j531188j316942j063486
5539B51236M92548L250721M539938K077673k545831n417550m997948l162357j831799
$$ plain form
5600 4355373 2992890 907421 -1885526 -4683424 -6078573 -5630922 -4505630 -3816925 -3144038
5591 -3144038 -1392288 1451602 4208455 5914320 6706250 7343943 8248766 8971057 8417510
5582 8417510 5957588 2734423 1445475 3911658 8758575 12282001 12009249 8972997
5574 8972997 6208567 5483422 5855796 5053159 1875630 -2501229 -5347631 -4814085 -1751232
5565 -1751232 1264380 2742599 3379347 4227428 5030160 5219798 5435334 6634361 8343803
5556 8343803 9295295 9381553 9315933 8534329 5460329 441541 -3317997 -2907123 1145881
5547 1145881 5691314 8097609 7886915 6127618 4162852 2631664 1314722 251236
5539 251236 743784 3994505 8534443 10612116 8066285 2648735 -2349213 -5511570 -7343369
5530g343369j032903m70403m15996k97291J236810L845615N200121M201181K464585
5521G388350J532932Q05008m00393j026031l98458o0964j212452k181453j140007
5512C306532K48757q14245l151357k597906J628501N124377M203869O80866j281295
5503G348099q79350n43161j277828j246563N94335K051250N91269k661735l981856
5494e540j950042P55963J236683J48770q0893N93460Q2832j801131k524032q71314
5484d415244Q61467L95682r71360n97104J228396J879139N92291n31827J77776
5475a380784J798365K391431J195767j080220k852458k431407M32885L624043
5467A697622M565484L085518J057877n42602k275239l871368l696860j524201
$$ plain form
5530 -7343369 -8376272 -8846675 -9262671 -9559962 -8323152 -4477537 722584 4923765 7388350
5521 7388350 8921282 9726290 9325897 8299866 7901408 7840444 6627992 4446539 3306532
5512 3306532 3555289 2741044 -410313 -3008219 -1379718 3744659 7948528 8629394 7348099
5503 7348099 6468749 5925588 4647760 3401197 3995532 6046782 6638051 3976316 -5540
5494 -5540 -1955582 -1199619 37064 185834 104941 698401 781233 -1019898 -3543930 -4415244
5484 -4415244 -3553777 -3158095 -4129455 -4726559 -3498163 -1619024 -1026733 -1558560 -1380784
5475 -1380784 417581 2809012 4004779 2924559 72101 -2359306 -1926421 1697622
5467 1697622 6263106 9348624 10406501 9863899 7588660 3717292 20432 -1503769
5459a503769L70436L59319j59182O48175J729291Q21306j533526k353038n07883
5450b128871J846345K627101K361704K344290K210069R68123q27935j759823j726612
5441E914391j706232j693343p38840Q58124J342402J85637q00944k59708L40729
5432C442216j076152l631099m375337k463672j65683O39906P69014J563772K413351
5423b883684K081283J153189J240526K384581L002986K165510M11371j524023
5415H031739l250449l967205k807084m26030J130214Q75188Q1205K12067P26067
5406F05712J81650j130099j250958O03885K654038K763223J128540l02419n74501
5397D679071m90165o21183k06677J128640K018450J241317l5302J76965J433501
$$ plain form
5459 -1503769 -1133333 -774014 -933196 -285021 1444270 2265576 732050 -1620988 -2128871
5450 -2128871 -282526 2344575 4706279 7050569 9260638 10228761 9400826 7641003 5914391
5441 5914391 4208159 2514816 1775976 2634100 3976502 4162139 3361195 3101487 3442216
5432 3442216 2366064 -1265035 -5640372 -8104044 -8269727 -7629821 -6860807 -5297035 -2883684
5423 -2883684 -802401 350788 1591314 3975895 6978881 9144391 9555762 8031739
5415 8031739 4781290 814085 -1992999 -2419029 -1288815 -413627 -332422 -120355 605712
5406 605712 787362 -342737 -1593695 -989810 1664228 4427451 5555991 5253572 4679071
5397 4679071 4188906 3567723 3361046 4489686 6508136 7749453 7714151 7891116 9324617
5388I324617J430573k31627j414091j146530j266409k965178m223682k867913
5380c360240k08943R81620P17639J117035K301728K131136J03079j363512l83599
5371B035943J756488K405470O45006k045051l259875j742869J037822J858228
5363B691162l81590k618061j498576J610573K406867P4241j653777m77366J108134
5354A261607J38573k266883l031405j505059O13581J963710K034633O50209j059533
5345a200567q31376J583089L204854J934914l4923M31653K424988K529406J07514
5336A0149552k325706l230146l141701k141303J79089K215785J459062j327985
5328A836647k446867o48493J152349P53349j08967P15547K049081J657280R011
$$ plain form
5388 9324617 10755190 10523563 9109472 7962942 6696533 3731355 -492327 -3360240
5380 -3360240 -3569183 -2587563 -1869924 -752889 1548839 3679975 3783054 2419542 2035943
5371 2035943 3792431 6197901 6842907 4797856 1537981 -204888 832934 2691162
5363 2691162 2309572 -308489 -1807065 -196492 2210375 2284616 630839 153473 1261607
5354 1261607 1400180 -866703 -3898108 -5403167 -4789586 -2825876 -791243 -141034 -1200567
5345 -1200567 -2031943 -448854 2756000 4690914 4655991 5087644 7512632 10042038 10149552
5336 10149552 7823846 4593700 1451999 -689304 -510215 1705570 3164632 1836647
5328 1836647 -610220 -1258713 -106364 646985 538018 1253565 3302646 4959926 4968937
5319D968937q59940o64150n72059p29514l82521K92394N03223M17791O87977R56566
5309D618704M65000l20296j90931J025071K329206K719929J603468j030933l778086
5300G441132m351345k344131k40971q7354n41187P01797K897160L343448J641191
5291H459740n5677o98528j279346k045950j798307n40309m6417r06681j502133
5282d13608q25473J10375N78387J241500J843612O46657k168374l328814r33907
5273c249645K329888K963363J481852O13666N67405n15416k513083l201425j886145
5264c409540k17331N78568P92230P12751L43264L48170J024596R22864r49335
5255A46237k359928n53458K773297L063138l02537k868982j744742O51395J118912
$$ plain form
5319 4968937 4108997 3444847 2872788 2143274 1760753 2053147 2556370 2974161 3662138 4618704
5309 4618704 5083704 4763408 4572477 5597548 7926754 10646683 12250151 11219218 7441132
5300 7441132 3089787 745656 504685 417331 -123856 577941 3475101 6818549 8459740
5291 8459740 8404063 7705535 6426189 4380239 2581932 2041623 1995206 1088525 -413608
5282 -413608 -1239081 -1128706 -550319 691181 2534793 3181450 1013076 -2315738 -3249645
5273 -3249645 -919757 2043606 3525458 4139124 4706529 4191113 1678030 -1523395 -3409540
5264 -3409540 -3626871 -3048303 -2256073 -1543322 -1200058 -851888 172708 1095572 146237
5255 146237 -2213691 -2767149 6148 3069286 2766749 -102233 -1846975 -1195580 -76668
5246g6668J21088n49253j075856j855764j436856P63892K249507J080937o06622
5237a385595o1962J277668K45331k470305l346871j669467j2216M90908J245305
5228e687204K452215K282198N32736m93533J62080O03525l82610j289209p90677
5219b610479P7470J89923K58673Q64227R62107J42121Q6522J708321K917226J661072
5209F257183m65389l67206J780745K637819L77143l029908m529893l310842q87368
5200a537716R96585J839244K121959K160229J775698J320902J970942L677222
5192A4325065L802415K39091m384990m879396p58970K148105m74710n132795n348229
5183d64414n60752L753898L753217R34695j673733l009987k812280n65804K586246
$$ plain form
5246 -76668 44420 -504833 -1580689 -3436453 -4873309 -4109417 -1859910 -778973 -1385595
5237 -1385595 -1447557 -169889 75442 -2394863 -5741734 -7411201 -7423417 -6932509 -5687204
5228 -5687204 -3234989 -952791 -420055 -913588 -751508 -147983 -530593 -1819802 -2610479
5219 -2610479 -2533009 -2343086 -2084413 -1220186 -258079 -115958 -29436 1678885 4596111 6257183
5209 6257183 5791794 5424588 7205333 9843152 10220295 7190387 2660494 -650348 -1537716
5200 -1537716 -541131 1298113 3420072 5580301 7355999 8676901 10647843 14325065
5192 14325065 18127480 18366571 13981581 9102185 8343215 10491320 10016610 4883815 -464414
5183 -464414 -1025166 2728732 6481949 7416644 5742911 2732924 -79356 -645160 1941086
5174A941086L526339Q84475k601147l311589j094722J303686K105146J915080
5166D668354J737508J421695M95427n61382o46409M98353J591774J042647j019438
5157I228529k629546k513496j913607k631395l904906l226018l03374K073391
5149e820422J963635R01471J092546J875500J147494r35359k190794j813214j061554
5140d840697n78487M86011K134427K641757J108762r90092k021399k217301k154553
5131f431572j128162R72201J891322j10939k637142j671140K394183M654077K478315
5122D11143q11886q47937J840382L245398J460105j793870m110854m308446k076255
5113f992220J667630M199082L207162o0230j894021q11986P19255r5543k704931
$$ plain form
5174 1941086 5467425 6351900 3750753 439164 -655558 648128 2753274 4668354
5166 4668354 6405862 7827557 8322984 7761602 7115193 7613546 9205320 10247967 9228529
5157 9228529 6598983 4085487 2171880 -459515 -4364421 -7590439 -7893813 -5820422
5149 -5820422 -3856787 -2955316 -1862770 12730 1160224 224865 -1965929 -3779143 -4840697
5140 -4840697 -5419184 -4933173 -2798746 -156989 951773 -38319 -2059718 -4277019 -6431572
5131 -6431572 -7559734 -6587533 -4696211 -4807150 -7444292 -9115432 -6721249 -2067172 411143
5122 411143 -400743 -1248680 591702 3837100 5297205 3503335 -607519 -4915965 -6992220
5113 -6992220 -5324590 -1125508 2081654 2021424 127403 -684583 34672 -60871 -2765802
5104b765802m139045k565633Q88310L301103K675908L3330j426142l545K256895
5095a744621K227466j47985k163361k255931j338328m18081N51039J166429N83549
5086c539824l04007O21172K986444L519151R22921j541081o02516K122896K558769
5077F743925N8611j996012r51004K154704M337260L668855N36800k872939m379342
5068G300858l715904k284961j035817O1660L94694j067297l123038k733502L09151
5059e894156K082485L22174j588290M3885K699788J356046k975394m228110p82752
5050h964324K005281N35715j282868J469368O569893P650905L281440j529404
5042I736006k449474m97560R79434P27171m86283k023361l472890l841514k543864
$$ plain form
5104 -2765802 -6904847 -9470480 -8582170 -5281067 -2605159 -2571829 -3997971 -4001516 -1744621
5095 -1744621 482845 334860 -1828501 -4084432 -5422760 -5840841 -5289802 -4123373 -3539824
5086 -3539824 -3843831 -3222659 -236215 3282936 4205857 2664776 2062260 4185156 6743925
5077 6743925 6802536 4806524 3855520 6010224 10347484 14016339 14553139 11680200 7300858
5068 7300858 3584954 1299993 264176 325836 720530 -346767 -3469805 -6203307 -5894156
5059 -5894156 -3811671 -3489497 -5077787 -5033902 -2334114 -978068 -3953462 -8181572 -8964324
5050 -8964324 -6959043 -6423328 -7706196 -6236828 333065 7983970 11265410 9736006
5042 9736006 7286532 6788972 7768406 8495577 8009294 5985933 2513043 -1328471 -3872335
5033c872335o29120N83855J565247L347405M571573K501643k250628n008435l102842
5024b293637j5482l29335k703338k180856J613570L738931J801089o42994k37165
5015a249217J439345J890377K019102K963745K464324j390723n649807o072167
5007c585021l132380m38626Q28256J727670J737832k09769k167751j395670O01206
4998f034253p4724l166440m199292j142550L152020N565823N754684M146443R52899
4989D954610j949327j831720J039437L297858K909094R84344r86296k612625l084680
4980B720695j362833J611549L542533L623884K340211n47361m578595o543757
4972H06326m103188l64753k2928j850523o53145L692974N551784K579685r63445
$$ plain form
5033 -3872335 -4501455 -3917600 -2352353 995052 5566625 8068268 5817640 809205 -2293637
5024 -2293637 -2309119 -2638454 -5341792 -7522648 -5909078 -2170147 -369058 -1012052 -1249217
5015 -1249217 190128 2080505 4099607 7063352 9527676 8136953 2487146 -3585021
5007 -3585021 -6717401 -7156027 -6327771 -4600101 -2862269 -3072038 -5239789 -6635459 -6034253
4998 -6034253 -6108977 -9275417 -13474709 -14617259 -11465239 -5899416 -144732 4001711 4954610
4989 4954610 3005283 1173563 2213000 5510858 8419952 9404296 8418000 5805375 2720695
4980 2720695 1357862 2969411 6511944 10135828 12476039 11928678 7350083 806326
4972 806326 -3296862 -3661615 -3684543 -5535066 -6188211 -2495237 3056547 5636232 4672787
4963D672787j568976j000055j223347o43812J746862L548474L131696K118273
4955A0781902J383253o15526l301547l076962L59911K179456j7482k219338j079628
4946D394039N01667r31043l224803k919082j331232j444509k391595j709113P7076
4937h978595J277857K357231L717420L478232R94813q77604l25157M50122p0369
4928B023950M19652K913447L697519L41436l570208m089667k719638k252740j678448
4919d914697J84519J025517k16783k25685K206085K448574j716187m484823j220654
4910f914134K999659J481729l229372m589077k832289k138872j850451Q85258
4902a6187549L864836L451427J532443J435806J496333k48758p27782J504852
$$ plain form
4963 4672787 3103811 2103756 880409 236597 1983459 5531933 8663629 10781902
4955 10781902 12165155 11549629 8248082 5171120 5531031 7710487 7693005 5473667 4394039
4946 4394039 4895706 3964663 739860 -2179222 -3510454 -4954963 -7346558 -9055671 -8978595
4937 -8978595 -7700738 -5343507 -1626087 1852145 2846958 1969354 1644197 2094319 2023950
4928 2023950 2443602 5357049 9054568 9396004 5825796 1736129 -983509 -3236249 -4914697
4919 -4914697 -4730178 -3704661 -3921444 -4147129 -1941044 507530 -1208657 -5693480 -6914134
4910 -6914134 -3914475 -2432746 -5662118 -10251195 -13083484 -15222356 -17072807 -16187549
4902 -16187549 -12322713 -8871286 -7338843 -5903037 -4406704 -4655462 -5383244 -3878392
4894c878392J332594l243858m922389K91476M087781K36979l133190J336788N051198
4885b841013o87278o466685j564701M177263j973255r591350m068519K128545
4877b0886993q971825k1281716j0574720j104050l8549867r9911877r6367514
4870b97648562L108466J09119644J20835786N3697327J661524M183660J7574576
4863A2532421N690795j0780370o323921N435385L728004l506555j031083M841225
4855A0585901J746829n329273n788951k247817j525182r49522K771285M093485
4847C356755n6811k044993K685294O000559J509251l722556k218110J112531k30163
4838F391757k212874J51837J884986j993918n383703j496272M344719L699827
$$ plain form
4894 -3878392 -2545798 -5789656 -10712045 -10420569 -6332788 -6095809 -9228999 -7892211 -2841013
4885 -2841013 -3528291 -9994976 -11559677 -7382414 -9355669 -18947019 -23015538 -20886993
4877 -20886993 -29858818 -51140534 -61715254 -62819304 -101369171 -201281048 -297648562
4870 -297648562 -294540096 -185420452 -64584666 -10887339 -9225815 -5042155 12532421
4863 12532421 18223216 7442846 1118925 6554310 10282314 6775759 5744676 10585901
4855 10585901 12332730 7003457 1214506 -1033311 -2558493 -3508015 -736730 3356755
4847 3356755 3299944 1254951 3940245 9940804 11450055 7727499 5509389 6621920 6391757
4838 6391757 4178883 4330720 6215706 4221788 -1161915 -2658187 1686532 5386359
4830E386359q43349j602870R12982J320321n0496J05203K71700j714048k306412
4821A479390J171566L592302M70105l002826o51155L403056K239429j201247N8428
4812G559048L787402K727110j988793l287525j148972j593784m517847l837226
4804b300587Q50188L266685J302253n84373j86376p8053q93606j81200J567072
4795B762003J196343o68018n43916R82997N57943n30320J739477N283217L664849
4786A4444575k795228o262188l154194J333199K230640P30706q71762k821333
4778B834415m092111j837726K718730M198966J350526q23451L74515J201401j046533
4769D878732k891936j033747J731448J378858j050685k263063k040824j832137
$$ plain form
4830 5386359 4543010 2940140 3853122 5173443 5122947 5228150 5499850 3785802 1479390
4821 1479390 2650956 6243258 6713363 3710537 3059382 6462438 8701867 7500620 7559048
4812 7559048 11346450 14073560 12084767 8797242 7648270 6054486 1536639 -2300587
4804 -2300587 -1450399 1816286 3118539 2534166 2347790 2269737 1376131 1194931 2762003
4795 2762003 3958346 3290328 2746412 3729409 4287352 3757032 5496509 10779726 14444575
4786 14444575 11649347 5387159 2232965 3566164 5796804 6527510 5655748 2834415
4778 2834415 -1257696 -3095422 -376692 3822274 5172800 4349349 4723864 5925265 4878732
4769 4878732 1986796 953049 2684497 4063355 3012670 749607 -1291217 -3123354
4761c123354j287267J57000J071335O43229Q29812K913301M442868K619806j280708
4752F986022l514122k360220Q21451L400971L117046j08627l082455k357087J072029
4743C975008K898263J736348N46689R69507O14239k020469m170402l302499j459987
4734b13303j680505k798616j509083K101937M583931L963783J787030M01657Q5317
4725F722148p63713l202680n742580n507389k146256Q66374P43932m82486O33094
4716h879556L058946L074468R65629P11966K912989L615670J268313p51060l64742
4707E612623J4239r87532n71046K417513L808229O14419l258252k704434P64996
4698E710755J944702j43965k255167k688619k256584j104131R59856K209827J126393
$$ plain form
4761 -3123354 -4410621 -4253621 -3182286 -2539057 -1709245 1204056 5646924 8266730 6986022
4752 6986022 3471900 1111680 1933131 5334102 8451148 8342521 5260066 2902979 3975008
4743 3975008 6873271 8609619 9156308 10125815 10740054 8719585 4549183 1246684 -213303
4734 -213303 -1893808 -4692424 -6201507 -4099570 484361 4448144 6235174 6636831 6722148
4725 6722148 5958435 2755755 -2986825 -8494214 -10640470 -9774096 -9030164 -9512650 -8879556
4716 -8879556 -5820610 -2746142 -1780513 -1068547 1844442 5460112 6728425 5977365 5612623
4707 5612623 5626862 4639330 4068284 6485797 10294026 10908445 7650193 4945759 5710755
4698 5710755 7655457 7511492 5256325 2567706 311122 -793009 166847 2376674 3503067
4689C503067m22233J60730J750345J469814l40515j084286n54050n54782r77807
4680B950283l73713M60958l29525j577947m73719K376729L522988K152191Q11348
4671I519593O66243K95340n68418m29810L26904m38779k090705j363571J695629
4662G612426K624237n82345l963779l699791j609666j103206j266191O54899L409318
4653B075902L278995L90286j185840K12820J507445j5140k661701l263034j742552
4644a402819m94941n53048o78169Q9648R92042J106358R06752J393693K454293
4635C813809L013305K449888J078841m83960j586290j424349K20569K046839K160700
4626A1289352L08725j751095k446942j995318j459963j302457j375414j309744
$$ plain form
4689 3503067 3080834 3241564 4991909 6461723 6121208 5036922 4482872 3928090 2950283
4680 2950283 2576570 3037528 2708003 1130056 656337 3033066 6556054 8708245 9519593
4671 9519593 10185836 10481176 9912758 9482948 9809852 9371073 7280368 5916797 7612426
4662 7612426 10236663 9654318 5690539 1990748 381082 -722124 -1988315 -1333416 2075902
4653 2075902 5354897 5745183 4559343 4772163 6279608 6264468 3602767 339733 -1402819
4644 -1402819 -1897760 -2450808 -3128977 -3039329 -2047287 -940929 -34177 1359516 3813809
4635 3813809 6827114 9277002 10355843 9871883 8285593 6861244 7081813 9128652 11289352
4626 11289352 11598077 9846982 7400040 5404722 3944759 2642302 1266888 -42856
4618d2856m32026J551881L361099L096577J028113k90324L58112J031366j50325
4609I511617j921474k027210p92052j17798k02622Q8047M90062j96135j397539
4600C434896j354300k69762p8975r41652p98600J039981K567435K222485R30478
4591F751986m072p31447j388092j024557M81222J385121O46997j36990Q01264
4582F781432K451432K565750J056235l13693r57580j911269l316541l598326j807549
4573I49891O94490J791166J063942m2458j26124O67068J053316L01118p75396
4564E577013q76521j12240M8944r23446j463902r3373K046912K385417L92728
4555F981532j795395k371355j668814m28635J608978L880162L783695n7098m444130
$$ plain form
4618 -42856 -474882 1076999 4438098 7534675 8562788 8272464 8630576 9661942 9511617
4609 9511617 7590143 5562933 4770881 4653083 4450461 4538508 5028570 4832435 3434896
4600 3434896 2080596 1810834 1731859 790207 -8393 1031588 3599023 5821508 6751986
4591 6751986 6747914 6016467 4628375 3603818 4085040 5470161 6117158 5980168 6781432
4582 6781432 9232864 11798614 12854849 12541156 11583576 9672307 6355766 2757440 949891
4573 949891 1644381 3435547 4499489 4457031 4330907 4997975 6051291 6352409 5577013
4564 5577013 4700492 4588252 4637196 3713750 2249848 2156475 4203387 6588804 6981532
4555 6981532 5186137 2814782 1145968 717333 2326311 6206473 9990168 9933070 5488940
4546E488940m754912j289935J011337j45572j323958M69187K459352O86383k990764
4537c89942l386089j05453K130092J254157N37296K123616L016620L77705l235324
4528B322678l603534j051895Q17743P62296O40601J509183K199763J550230j84480
4519D962585j795506j584616J351412M748681M145782j355539o373766n475200
4511a376167l98828K644896J528805l12395l55835k8253n29717k53649J712693
4502B631550L235968K662592J749930K489591L378626J801009j396511k780687
4494A3772068j304460L26932l44918k329231l103827k324374j833787k234415
4486F23988j558023J386790L969779K604456j797578m318399k614058J76671N77581
$$ plain form
4546 5488940 734028 -555907 455430 309858 -1014100 -544913 1914439 2600822 -389942
4537 -389942 -3776031 -3881484 -1751392 -497235 40061 2163677 5180297 5558002 2322678
4528 2322678 -1280856 -2332751 -1515008 -752712 -112111 1397072 3596835 5147065 4962585
4519 4962585 3167079 1582463 2933875 7682556 11828338 10472799 4099033 -1376167
4511 -1376167 -1774995 869901 2398706 2086311 1730476 1702223 1172506 918857 2631550
4502 2631550 5867518 8530110 10280040 12769631 16148257 17949266 16552755 13772068
4494 13772068 12467608 12794540 12449622 10120391 7016564 4692190 2858403 623988
4486 623988 -934035 452755 4422534 7026990 5229412 911013 -1703045 -1526374 -948793
4477i48793m29301j78373J114225J767345K060998K568213J362576k794237o315106
4468a792453m738346K82152K969605J695326n7324n56994j562367k678103n50993
4459f989497M294500O022184K038626k403302j894180J524341K607334P54330
4451E954336r21361j226788j057241k97971J222326J589958n31158k800654k286177
4442c54730Q3299J486351J686072K027981J972094N04811p22723K84365J847640
4433H815160R71187j609307k870850k663024k898829k769458K1080L691853L711999
4424D399811L47147p29608K827720N883990L404936j972581l839058q98081K041091
4415A1465367R91630k648598m771688l604558j059010J88900j36447l37933J59730
$$ plain form
4477 -948793 -1378094 -1556467 -442242 1325103 3386101 5954314 7316890 4522653 -1792453
4468 -1792453 -6530799 -6248647 -3279042 -1583716 -1641040 -2198034 -3760401 -6438504 -6989497
4459 -6989497 -2694997 3327187 5365813 2962511 1068331 2592672 5200006 5954336
4451 5954336 5032975 3806187 2748946 2450975 3673301 5263259 4732101 1931447 -354730
4442 -354730 -271431 1214920 2900992 4928973 6901067 7405878 6683155 6967520 8815160
4433 8815160 9786347 8177040 5306190 2643166 -255663 -3025121 -3004041 687812 4399811
4424 4399811 4746958 4017350 6845070 12729060 16133996 14161415 10322357 9424276 11465367
4415 11465367 12456997 9808399 5036711 1432153 373143 562043 425596 87663 247393
4406B47393n3670j422611j779605L55362K626749J790550j391716l333552k877724
4397e838824j902822j125563P35443L234213L693795J681650L48816J581289L088971
4388E496968K376949O27060J86628P77142R45497J143486K315913K989695J048481
4379A7907819k353103l808424k533205j330046k094628k930237j182410K348712
4371D024478M139173K362302j076739l115565k733068q31107J722218M192695
4363H684387M826468K141397k124423l909447k043870j66140j403516l527276
4355B477580k435522J397987L778053L099348J652693Q53559m01608j910186j170079
4346G341825J969682L576188J104608k530793l204766j375789n47369j799202
$$ plain form
4406 247393 193723 -1228888 -3008493 -2653131 -26382 1764168 372452 -2961100 -5838824
4397 -5838824 -7741646 -8867209 -8131766 -4897553 -1203758 477892 826708 2407997 5496968
4388 5496968 7873917 8500977 8687605 9464747 10410244 11553730 13869643 16859338 17907819
4379 17907819 15554716 11746292 9213087 7883041 5788413 2858176 1675766 4024478
4371 4024478 8163651 10525953 9449214 6333649 3600581 2769474 4491692 8684387
4363 8684387 13510855 15652252 13527829 9618382 7574512 7408372 6004856 2477580
4355 2477580 42058 1440045 5218098 8317446 9970139 10823698 10422090 8511904 7341825
4346 7341825 9311507 12887695 13992303 11461510 8256744 6880955 6333586 4534384
4338D534384l072135k867903j684918j54024J704623L238782L115382R76584j857501
4329C933274l491657k870821n79202J407191J536905N42536M65246J701589K544192
4320E189253J918324O50267m94011j789456k769827k026043n4634M34373j142833
4311h4587j463128J605284M845055M036992M02845j253455L32736J762283P38340
4302A0922365r85140j086554J45181J184487J329853M27599j366837k732386k002360
4293E836208L78711J927802J309389j83199q89733q34117q35841j133580j621564
4284C954076k144154k082506j008570K7122m17887j556293j029591J172641K025360
4275a059802R8761j727624n21996J881595J517531j520049l251782k056775q18388
$$ plain form
4338 4534384 1462249 -1405654 -3090572 -3244596 -1539973 1698809 4814191 5790775 3933274
4329 3933274 441617 -2429204 -3008406 -1601215 -64310 478226 943472 2645061 5189253
4320 5189253 7107577 7757844 7263833 5474377 2704550 678507 623873 1058246 -84587
4311 -84587 -1547715 57569 4902624 8939616 9342461 8089006 8421742 10184025 10922365
4302 10922365 9937225 8850671 8995852 10180339 11510192 11937791 10570954 7838568 5836208
4293 5836208 6214919 8142721 9452110 9268911 8379178 7545061 6709220 5575640 3954076
4284 3954076 1809922 -272584 -1281154 -1254032 -1671919 -3228212 -4257803 -3085162 -1059802
4275 -1059802 -961041 -2688665 -3210661 -1329066 188465 -1331584 -4583366 -6640141 -7458529
4266g458529j623450j996568Q86443M872268N404697K284168j811J181756L419265
4257F968239L675234K482345J595313L91623k303812m732914m074119r80883J044104
4248D065130N70729n01382n79259j78800K42848J163436J956819R13321j667661
4239E985181l102889k106162l10993R18675K161526L187656J967423j561863l971280
4230C167274l049600j077258p70399j045823k1068Q13708n56547k141992q33397
4221e515102J920893K132346p5511q00516R10311J657205k54917j898819m79780
4212b403890K552431M041985L233050J681210Q42368R24799R71883k32126k313900
4203I297810l062974j565164j99360j098010k261178o87265J958387J299059k477231
$$ plain form
4266 -7458529 -9081979 -11078547 -10192104 -5319836 84861 2369029 2367218 3548974 6968239
4257 6968239 10643473 13125818 14721131 15112754 12808942 8076028 4001909 3021026 4065130
4248 4065130 4635859 4134477 3555218 3376418 3619266 4782702 6739521 7652842 5985181
4239 5985181 2882292 776130 465137 1383812 3545338 6732994 8700417 7138554 3167274
4230 3167274 117674 -959584 -1729983 -2775806 -2796874 -1983166 -2539713 -4681705 -5515102
4221 -5515102 -3594209 -1461863 -1537374 -2337890 -1427579 229626 -25291 -1924110 -2403890
4212 -2403890 148541 4190526 7423576 9104786 9947154 10871953 11843836 11611710 9297810
4203 9297810 6234836 4669672 4470312 3372302 1111124 423859 2382246 3681305 1204074
4194A204074m118819q60363L906357N825892M595899K354631N81622J19888J118383
4185A4727564J637607o24808m199896m778347j344943K129485K345804M90090
4177A0382556q34698q42393M90530K886690L990674J276754l077196l872801p79274
4168I620842Q31070j236941k466764O3379K334315P09846j452891Q9787L039947
4159A1532590L142671J600415J792843K665928J530413k48097j59422P69762J537600
4150B4164703M173913P507135N431919o76053K317388J7849816K3297423m346398
4142G9719846m9312711o7238641l9911196J582976J8645338J0458783K120339
4135d3935266M223917O254177K122799p39846J734585K939334m63088j654986
$$ plain form
4194 1204074 -2914745 -3775108 131249 5957141 10553040 12907671 13489293 13609181 14727564
4185 14727564 16365171 15740363 11540467 6762120 5417177 7546662 9892466 10382556
4177 10382556 9547858 8705465 9195995 12082685 16073359 17350113 14272917 10400116 9620842
4168 9620842 10451912 9214971 6748207 6811586 9145901 9855747 8402856 8492643 11532590
4159 11532590 14675261 16275676 18068519 20734447 22264860 22016763 21857341 22627103 24164703
4150 24164703 28338616 35845751 41277670 40601617 42919005 60768821 84066244 79719846
4142 79719846 30407135 -36831506 -76742702 -75159726 -56514388 -46055605 -43935266
4135 -43935266 -39711349 -33457172 -31334373 -32074219 -30339634 -27400300 -27863388 -29518374
4127b9518374L463465P844327M486746k406603m365929p32224K613496K425815
4119a6189281L07953j501130j802442K91682L997701O070518M236550K97870k243301
4110f533880k233004p51644J268606L114076L354038J207913j690639k725502
4102d990036j383043K57426J13851j455650j956366L40725L769233M559941J541247
4093G97328j890550k158147l52680q1413j626618j817957L93968K081564J069525
4084c584980q62436j179316k43308K25965K66016J159417L029610M524096M221180
4075G556244J772139j402360k696232j292722j48234k408845o077524n806506
4067a0504040n83744M373393M873811K772145J421393L62426j802473k845444
$$ plain form
4127 -29518374 -26054909 -18210582 -13723836 -16130439 -20496368 -21228592 -18615096 -16189281
4119 -16189281 -15881328 -17382458 -19184900 -18893218 -14895517 -8824999 -4588449 -4290579 -6533880
4110 -6533880 -8766884 -9518528 -8249922 -5135846 -1781808 -573895 -2264534 -4990036
4102 -4990036 -6373079 -6115653 -6001802 -7457452 -9413818 -9073093 -5303860 -743919 797328
4093 797328 -1093222 -3251369 -3604049 -3685462 -5312080 -7130037 -6736069 -4654505 -3584980
4084 -3584980 -4447416 -5626732 -5870040 -5644075 -5378059 -4218642 -1189032 3335064 7556244
4075 7556244 9328383 7926023 5229791 3937069 3788835 1379990 -4697534 -10504040
4067 -10504040 -11087784 -6714391 -1840580 931565 2352958 2715384 912911 -1932533
4059a932533l4558M315315N325878K627941M04294O46952P29428j661044m829375
4050E592298n570952k949892J246120M038765L178287n40334l164981j953380
4042a24069P13715M64807k583789l944875j534150J426602J490521l49818r81525
4033e422581L70401K059530K593934J500350r37741l257231l417784j228797R60520
4024f779399J207796M61585Q66263K628293L920736L316822J254364o58194j265092
4015D953174r94072j256775k279539k314109k08658K204534K293668M73169o42328
4006B229064m16676m74218r73462k49049J291480Q62499j783664l059429j143023
3997c716478Q97187R1387j934201k436346k010028j970083o32709L337944O559390
$$ plain form
4059 -1932533 -1967091 2348224 7674102 10302043 10706337 11353289 12082717 10421673 5592298
4050 5592298 21346 -2928546 -1682426 2356339 5534626 4994292 1829311 -124069
4042 -124069 589646 1054453 -1529336 -5474211 -7008361 -5581759 -4091238 -4441056 -5422581
4033 -5422581 -5052180 -2992650 -398716 1101634 163893 -3093338 -6511122 -7739919 -6779399
4024 -6779399 -5571603 -5110018 -4243755 -1615462 2305274 5622096 6876460 6218266 4953174
4015 4953174 3959102 2702327 422788 -1891321 -2099979 104555 2398223 2871392 2229064
4006 2229064 1812388 1338170 364708 115659 1407139 2269638 485974 -2573455 -3716478
3997 -3716478 -2819291 -2727904 -4662105 -7098451 -9108479 -11078562 -11711271 -8373327 -1813937
3988a813937M942740L25335j963491r73352l89009j585957j929978l70312N25388
3979c232573n96615j510202m98812R67896J203674O44818n7713j129719j887541
3970f096787j135925l7298q39986k140140n2395M658234N973173J599735k861887
3961i33276k365524J41621l95188k393451j038625K712075L537884Q02902o70386
3952f01968J074940K427295R94003o75436k72664K77236j188757k965996k448221
3943c379568l06306J208254J796073K148087J510588p24921k437944j002351K461879
3934A273791L955632J783620j577476l182464k947422k342412j616929J2398K217855
3925b423407L302851K305395L28308p32527k38058Q73894J365124P02341q71357
$$ plain form
3988 -1813937 3128803 3454138 1490647 517295 128286 -1457671 -3387649 -3757961 -3232573
3979 -3232573 -3829188 -5339390 -5838202 -4870306 -3666632 -3021814 -3079527 -4209246 -6096787
3970 -6096787 -7232712 -7270010 -8109996 -10250136 -10302531 -5644297 328876 1928611 -933276
3961 -933276 -3298800 -3157179 -3552367 -5945818 -6984443 -4272368 -734484 68418 -601968
3952 -601968 472972 2900267 3894270 3218834 2946170 3223406 2034649 -931347 -3379568
3943 -3379568 -3685874 -2477620 -681547 1466540 2977128 2252207 -185737 -1188088 1273791
3934 1273791 5229423 7013043 5435567 2253103 -694319 -3036731 -4653660 -4641262 -2423407
3925 -2423407 879444 3184839 3513147 2780620 2542562 3416456 4781580 5483921 4612564
3916D612564k489111l001333j990142m76235J79702M7844L11574J198878J569414
3907c6845Q38192j79743q53979j509371j858200o33047J850532K763773N07569
3898H88881k185028j481803K162043M582199L477862P24657r44516j011258l94116
3889E818921J99520L09415k76209q91705o23439J82898L63332j31723l14922j12767
3879D523321m14191j101500r96774K559P32670R56016J581738K355191J770679
3870I409709l5944q91700j66413j45595k255751m352901l842720j509599P4925
3861c715989M06964Q73386J805738K182950J794300J547914J721518J593906Q29068
3852I039755m9087n27165n19717j19447L80901N78898M67215J68668q85663l044481
$$ plain form
3916 4612564 2123453 -877880 -2868022 -3344257 -3164555 -3116711 -2805137 -1606259 -36845
3907 -36845 801347 621604 -232375 -1741746 -3599946 -4232993 -2382461 381312 888881
3898 888881 -1296147 -2777950 -615907 3966292 7444154 8168811 7224295 6213037 5818921
3889 5818921 6018441 6327856 6051647 5159942 4536503 4719401 5082733 4951010 4636088 4523321
3879 4523321 4109130 3007630 2010856 2013415 2746085 3702101 5283839 7639030 9409709
3870 9409709 9373765 8482065 8315652 8170057 5914306 1561405 -2281315 -3790914 -3715989
3861 -3715989 -3309025 -2435639 -629901 1553049 3347349 4895263 6616781 8210687 9039755
3852 9039755 8990668 8463503 7943786 7824339 8205240 8784138 9251353 9420021 8534358 5489877
3842E489877m456492k326575K664038N669589L538168p47205k183775n43320L09332
3833G413637j199286k583788k032685j101194j415370j767504m66884J508827
3825a644247J879918M42790q59771q04339k26714l38084p69800K6412K546389
3816B52554M952177M678809J398805k368155l962702l091180j198004M74665J277995
3807B414964Q55656j11003J42533K088820L346541J490492k132189l646626j658242
3798B790946J178965J947655Q01434j97211M6964Q32330P20297j037481l367323
3789C716576l817206j272807K078205L006637J240071m99873k58256J296254K641275
3780H130876K792468R20402k798752n571269m159548L66416L014682J449151q77191
$$ plain form
3842 5489877 1033385 -1293190 1370848 7040437 10578605 9831400 7647625 7104305 7413637
3833 7413637 6214351 3630563 1597878 496684 -918686 -2686190 -3153074 -1644247
3825 -1644247 235671 678461 -181310 -985649 -1212363 -1550447 -2320247 -2293835 252554
3816 252554 5204731 9883540 11282345 8914190 4951488 1860308 662304 1136969 2414964
3807 2414964 3270620 3159617 3302150 5390970 8737511 10228003 8095814 4449188 2790946
3798 2790946 3969911 5917566 6719000 6521789 6568753 7401083 8121380 7083899 3716576
3789 3716576 -100630 -1373437 704768 3711405 4951476 4451603 4193347 5489601 8130876
3780 8130876 10923344 11843746 9044994 3473725 -685823 -319407 2695275 4144426 3267235
3771C267235k81596J533595O79660k390280l612180j647722N24905N61426k82167
3762a647124j84422K09854m23859j275346m72051J887923L527988K743617K48361
3753D614941j918655k640842k455908k276809k013222r60394P60889K066276K348381
3744b475343K082233J606549M29182j438619k520540j513949P49124K278973K466546
3735A664156K342138K520369K272877Q39642j414602l436197m280795l365523
3727b857935q27940K014195L259871K048500n09147k175735j453996J056487L057441
3718C611741K781545R75407k2674O51852J357392N37073r68068j301131j76366
3709G446771J230693J953781J348505j242167m901491o288028l090571K059305
$$ plain form
3771 3267235 2985639 4519234 5198894 2808614 -803566 -2451288 -1926383 -1364957 -1647124
3762 -1647124 -1831546 -1621692 -2045551 -3320897 -3792948 -1905025 1622963 4366580 4614941
3753 4614941 2696286 55444 -2400464 -4677273 -6690495 -7650889 -6890000 -4823724 -2475343
3744 -2475343 -393110 1213439 1642621 204002 -2316538 -3830487 -3081363 -802390 1664156
3735 1664156 4006294 6526663 8799540 9639182 8224580 4788383 507588 -2857935
3727 -2857935 -3685875 -1671680 1588191 3636691 3127544 951809 -502187 554300 3611741
3718 3611741 6393286 7368693 7346019 7997871 9355263 9892336 8924268 7623137 7446771
3709 7446771 8677464 10631245 11979750 10737583 5836092 -451936 -3542507 -1483202
3701a483202M027536J643789j273508j802819j332656j695286j539456O32037
3693b823565K654333J630756j015329j353771R37217K279913J123110J01637J147800
3684D682101K256642J315755j077Q18240K556640K181975J0023q94379j48946
3675A2776974q04121l711720n051951j907210K629670L290327l6462k450367j064916
3666C670224J746707K751765K091038J378283L21905k095790m632799m823619
3658D07714k514715J9503J370148K202610L044943L114260K017562O77160l55084
3649I984101j748589l463552l725923j510322J368638K480634J955179J384114
3641F724280O00263j691593m369880m160335l39504L577547M399001L148815K383857
$$ plain form
3701 -1483202 2544334 4188123 2914615 1111796 -220860 -1916146 -3455602 -2823565
3693 -2823565 -169232 1461524 446195 -907576 29641 2309554 3432664 3534301 4682101
3684 4682101 6938743 8254498 8253421 9071661 11628301 13810276 13820299 12925920 12776974
3675 12776974 11972853 8261133 3209182 1301972 3931642 7221969 7185507 4735140 3670224
3666 3670224 5416931 8168696 10259734 11638017 11959922 9864132 5231333 407714
3658 407714 -2107001 -2087498 -717350 1485260 4530203 7644463 9662025 10339185 9984101
3649 9984101 8235512 4771960 1046037 -464285 904353 3384987 5340166 6724280
3641 6724280 7324543 5632950 1263070 -2897265 -3236769 340778 4739779 7888594 10272451
3632A0272451J833508k68186k846862k746840K9291J420097r63213m086360l679095
3623a035209j77830K193714J311942o23014q25728M26877P78687r70867l628908
3614b550336n010636l951025j197057J408355K696703K959128K853557K248618
3606e42693Q68066n74334j003839m18333L83951J129965J847895J717800j17315
3597C291163k571658l331716j987305n84753l35286K17469K394372M546087M063794
3588E702167J232862j041034j080711j66283k09537j166340j436072j88629J292939
3579B939362Q24196j863694l975662k603571J161155L048192J365577m40301J062798
3570A518052L852975L448609J2288j703990L27357K386755R09597k217475k948841
$$ plain form
3632 10272451 12105959 11837773 8990911 6244071 6273362 7693459 6730246 2643886 -1035209
3623 -1035209 -1213039 980675 2292617 1669603 843875 1270752 2049439 1078572 -2550336
3614 -2550336 -7560972 -11511997 -12709054 -11300699 -8603996 -5644868 -2791311 -542693
3606 -542693 325373 -248961 -1252800 -1671133 -1287182 -157217 1690678 3408478 3291163
3597 3291163 719505 -2612211 -4599516 -5184269 -5519555 -5302086 -2907714 1638373 5702167
3588 5702167 6935029 5893995 4813284 4647001 4437464 3271124 1835052 1646423 2939362
3579 2939362 3763558 1899864 -2075798 -4679369 -3518214 -470022 895555 455254 1518052
3570 1518052 5371027 8819636 8831924 7127934 7455291 9842046 10751643 8534168 5585327
3561E585327j039884N21677M55954J56467L30741l7022j109733j453709o81697
3552B728121m18325j495584k317259j519493m27839r06235k083771j532801R18320
3543g054866K895690K970000K196450J733155J101583j54968r69012m19542M75709
3534B774199K97108m81805m57930K90648O46119O66147J262885K027516J658204
3525H683091N18744L15428R22661K27392k034839l170108j860594q47297k748989
3516E489n334798m224707O79442M688882M262851Q23183j798251j664503J22281
3507b440131J111319j43974k504413l130578q43409K109592K968450K113105J810926
3498A050887K288249J807516K70601m18988N3768l40401k130076k802587p64311
$$ plain form
3561 5585327 4545443 5067120 5523074 5679541 6010282 5973260 4863527 3409818 2728121
3552 2728121 2309796 814212 -1503047 -3022540 -3450379 -4356614 -6440385 -7973186 -7054866
3543 -7054866 -4159176 -1189176 1007274 2740429 3842012 3687044 2718032 2298490 2774199
3534 2774199 3071307 2589502 2131572 2422220 3068339 3734486 4997371 7024887 8683091
3525 8683091 9201835 9517263 10439924 10667316 8632477 5462369 3601775 2754478 5489
3516 5489 -5329309 -9554016 -8874574 -4185692 77159 900342 -897909 -2562412 -2440131
3507 -2440131 -1328812 -1472786 -3977199 -7107777 -7951186 -5841594 -2873144 -760039 1050887
3498 1050887 3339136 5146652 5417253 4998265 5052033 4711632 2581556 -221031 -985342
3489i85342J818687K212575R43298J54697O2015l01053k42769J615449M072924
3480I350481M015379O77162l098175m488580l665513k320639r92269O65386J967578
3471B110810J441056p95094k332487j244279J128810J686919j17751j409061l12023
3462A56900Q25946j073860m564680n166579j781446J892937K942830K679798L077911
3453a010243L245841J879119L68487M48076Q74709l63382k177741k081651n73192
3444F10023k79318j324425j115929J190607L269719L146269J357442q70454k981514
3435C002420m148717l574250k313947k290901k986591j855561J333278L663417
3427i170852L635321L229976L736819L056320r5108k490349p97220K445743J795942
$$ plain form
3489 -985342 833345 3045920 3989218 4143915 4205930 3904877 3662108 5277557 9350481
3480 9350481 13365860 14043022 10944847 6456267 2790754 470115 -522154 143232 2110810
3471 2110810 3551866 2756772 424285 -819994 308816 1995735 1877984 468923 156900
3462 156900 982846 -91014 -4655694 -9822273 -11603719 -9710782 -6767952 -4088154 -1010243
3453 -1010243 2235598 4114717 4483204 4931280 5805989 5442607 3264866 1183215 610023
3444 610023 330705 -993720 -2109649 -919042 2350677 5496946 6854388 5983934 3002420
3435 3002420 -1146297 -4720547 -7034494 -9325395 -12311986 -14167547 -12834269 -9170852
3427 -9170852 -5535531 -2305555 1431264 4487584 4392476 1902127 1104907 3550650 5346592
3418E346592k883013n737718l083712J787284L661379K068292M42337P69894J936467
3409D307802K505644K447495J964013P11157j058984k023431j451517m90724q05277
3400F106178k395784l660369l328668j480779J057645L223370L737902K082976
3392E342471j61225n02354J066606J446480j295560m508010m141429n22303J960453
3383a314871J052930n88764m3942J320836L77020k530568l911673k201399L12755
3374g527676J140263Q92003J675959L576939M333644K298719j339429l614897
3366A435525k753260J40563K388150K559649J581346R42753O02709m40902j946632
3357D509901k223641n54654J397993J629222M72780q1095N58596Q19751l54824
$$ plain form
3418 5346592 2463579 -3274139 -6357851 -4570567 -909188 1159104 1601441 2371335 4307802
3409 4307802 6813446 9260941 11224954 11936111 10877127 8853696 7402179 6911455 6106178
3400 6106178 3710394 50025 -3278643 -4759422 -3701777 -478407 3259495 5342471
3392 5342471 5181246 4678892 5745498 7191978 5896418 1388408 -2753021 -3275324 -1314871
3383 -1314871 -261941 -850705 -894647 426189 803209 -1727359 -5639032 -7840431 -7527676
3374 -7527676 -6387413 -5495410 -3819451 -242512 4091132 6389851 5050422 1435525
3366 1435525 -1317735 -1177172 1210978 3770627 5351973 6294726 6897435 6456533 4509901
3357 4509901 2286260 1731606 3129599 4758821 5231601 5150506 5709102 6528853 6174029
3348F174029j650027j338864K6105M38053o33504j797568k002883j530032p18510
3339c033201M27217J091410J87188j337579j026367J206544K282505P37411n08205
3330B6923J106345K926089J008811k857279l106088R14455L483827R54629l233138
3321A224574m329668k790297j736619j345958J94596K342779K953889K274223
3313a212481K425529L369551K811617K24359j963164j667299N48724K720139L186568
3304A0443543J204868k155272l928732k157126J275955K751616J487422l20145
3296H602129j393396k368683k965513j750639M24360L30832k588473m274679j489468
3287g473530L410781N750941M437058J782713o79816k918072m108760l155982
$$ plain form
3348 6174029 4524002 3185138 3211243 3649296 3015792 1218224 -784659 -2314691 -3033201
3339 -3033201 -2605984 -1514574 -1327386 -2664965 -3691332 -2484788 -202283 535128 26923
3330 26923 1133268 4059357 5068168 2210889 -895199 19256 3503083 4457712 1224574
3321 1224574 -3105094 -5895391 -7632010 -8977968 -8783372 -6440593 -3486704 -1212481
3313 -1212481 1213048 4582599 7394216 7618575 5655411 3988112 4536836 7256975 10443543
3304 10443543 11648411 9493139 5564407 3407281 4683236 7434852 8922274 8602129
3296 8602129 7208733 4840050 1874537 123898 548258 879090 -1709383 -5984062 -7473530
3287 -7473530 -4062749 1688192 6125250 7907963 7228147 4310075 201315 -2954667
3279b954667j260761q47950j782517j549143M28419J640484O38731m78085O12024
3270e553465K884087L757336K820335J560654N02456r65697k321892j878235N32181
3261A337760K650525K415322L50307j415594j664824r08166l06458m96764j184243
3252G77865j394270l38502J635102L131657K913157Q51813k118838m406889m338739
3243c287644j533470J935522K998056J021940j303529j519323n71118p95977j820288
3234d875831r75693K249081M748069L706523K8930l246715m301448l086980k13068
3225e967132K918058M001150J863652j775697m067843m102814k919777j299197
3217a1349600N56345J674914R77552n43381n24920J261639K184166N75302j655326
$$ plain form
3279 -2954667 -4215428 -5063378 -6845895 -8395038 -7966619 -6326135 -5687404 -6165489 -5553465
3270 -5553465 -2669378 1087958 3908293 5468947 5971403 5005706 2683814 805579 1337760
3261 1337760 3988285 6403607 6753914 5338320 3673496 2765330 2458872 1962108 777865
3252 777865 -616405 -954907 680195 3811852 6725009 7576822 5457984 1051095 -3287644
3243 -3287644 -4821114 -2885592 112464 1134404 -169125 -1688448 -2259566 -3055543 -4875831
3234 -4875831 -5851524 -3602443 1145626 4852149 4881079 1634364 -2667084 -5754064 -5967132
3225 -5967132 -3049074 952076 2815728 1040031 -3027812 -7130626 -10050403 -11349600
3217 -11349600 -10793255 -9118341 -8140789 -8684170 -9209090 -7947451 -5763285 -5187983 -6843309
3208f843309j868871o25258n09907j717107j413374J850139N223164M812939R31060
3199a60524j978434q95451K155642L209971J626517J87913N76223J368006R95825
3190G085688Q5641m91112j437539k800551k197339J601670M892971K847254l208381
3181F378302o497170l680694Q78570J631959q46807j962057k0387K395305K804470
3172A081491J417975l57742j462212j169588M65797K019603K074813J067162L70296
3163E507595Q0j041631k476911k775242j484035L14285J942706L546976M330726
3154G864549K675745r87455l452032k481712K7792L81941k060924m022957k339947
3145d395000K275895N890756N272871Q93280l784174n666919m398854j627806
$$ plain form
3208 -6843309 -8712180 -9337438 -9847345 -11564452 -12977826 -11127687 -5904523 -1091584 -160524
3199 -160524 -2138958 -3034409 -878767 2331204 3957721 4145634 4721857 6089863 7085688
3190 7085688 7171329 6680217 5242678 2442127 244788 1846458 6739429 9586683 6378302
3181 6378302 -118868 -3799562 -2920992 -1289033 -2135840 -4097897 -4118284 -1722979 1081491
3172 1081491 2499466 2141724 679512 -490076 -24279 1995324 4070137 5137299 5507595
3163 5507595 5507675 4466044 1989133 -786109 -2270144 -1955859 -13153 3533823 7864549
3154 7864549 10540294 9552839 6100807 3619095 3646887 4028828 1967904 -2055053 -4395000
3145 -4395000 -2119105 3771651 9044522 9937802 6153628 486709 -3912145 -5539951
3137e539951R92635K411953J947026L2343j278499l64259J471252J451510n48141
3128E75869j550051R3079K150975J910683N3656r61470p42197n87854l84695J019731
3118A577726K537233J215367l087639o090192m007276J531582N368545M722580
3110C767926J508265p60467p04955M43696Q58617j5239j175406j265185o3463
3101B593789J293235J591325P58946l02635p66673n99495m98984j101963j916460
3092A051085j407585R53485L038224K052331j502696l735160k299181M01541P33814
3083g14142j018084j603420j3698J374789J002431L68325J009114J919678J634522
3074C959515P01216J56049n87015k070367k609395n28556K361764K493134m68808
$$ plain form
3137 -5539951 -4547316 -2135363 -188337 -155994 -1434493 -1798752 -327500 1124010 575869
3128 575869 -974182 -881103 1269872 3180555 3234211 2272741 1530544 942690 557995 1577726
3118 1577726 4114959 5330326 2242687 -3847505 -7854781 -6323199 -954654 3767926
3110 3767926 5276191 4515724 3810769 4254465 5113082 5097843 3922437 2657252 2593789
3101 2593789 3887024 5478349 6237295 5934660 5167987 4568492 4069508 2967545 1051085
3092 1051085 -356500 596985 3635209 5687540 4184844 449684 -1849497 -1447956 -714142
3083 -714142 -1732226 -3335646 -3349344 -1974555 -972124 -603799 405315 2324993 3959515
3074 3959515 4660731 4816780 4229765 2159398 -449997 -978553 1383211 3876345 3407537
3065C407537l183537l379321k191282j089611N28564L033770M381767K715042
3057D222929l40974j555512n54427Q2421r21883j677522l58342J638873J392943
3048A928506j454782l930610l303227l61616J730944J457671N72755J159844K265979
3039F5464J148101k361644m785090l192752J061365M133726M112391K105670k01827
3030B085404k068347k934424k168303k21125J280059J245846N1581j477572k806403
3021g013284l055848j177480K180739M214661K912140r9457j189770Q27452L237129
3012H36282K807459l66948l091683k701237J29842K207245J237497j715051l425168
3003d081762k175807L73920J450773N56039n28922o76136o00541p70849p6055
$$ plain form
3065 3407537 224000 -3155321 -5346603 -6436214 -5907650 -2873880 1507887 4222929
3057 4222929 3881955 2326443 1772016 1854437 932554 -744968 -1103310 535563 1928506
3048 1928506 473724 -3456886 -6760113 -7121729 -5390785 -3933114 -3360359 -2200515 65464
3039 65464 1213565 -1148079 -5933169 -9125921 -8064556 -3930830 181561 2287231 2085404
3030 2085404 17057 -2917367 -5085670 -5306795 -4026736 -2780890 -2729309 -4206881 -7013284
3021 -7013284 -10069132 -11246612 -9065873 -4851212 -1939072 -2038529 -3228299 -2400847 836282
3012 836282 3643741 3276793 185110 -2516127 -2386285 -179040 1058457 -656594 -4081762
3003 -4081762 -6257569 -5883649 -4432876 -3876837 -4405759 -5081895 -5682436 -6453285 -6529340
2994f529340K064840L781324L005007Q06289M8514R23273O34568j802232l422625
2985d90382j781883J011558J479895R4711p9920R94837K72378k520623l322698
2976d342127O4416L843107L290266n21531k528799q07952J606261J604314n14930
2967A693025k717973l633697k605356L02588L361339M054443J921223p54307j699038
2958g7753p94619Q61211K337444K707370J295299r44061j859716r34289j67396
2949B423490j092047k568219k859782k182634j464281k32150J984368L433214
2941b558041K072447q42243j885168k02236J508793J176431r0856n89470p10410
2932b120753j368636j581000K23563L303367M960227L695777O89580j865721k856927
$$ plain form
2994 -6529340 -4464500 -683176 2321831 3128120 3176634 4099907 4734475 2932243 -490382
2985 -490382 -2272265 -1260707 219188 313899 233979 1228816 1501194 -1019429 -4342127
2976 -4342127 -4277711 -434604 2855662 2334131 -194668 -1002620 603641 2207955 1693025
2967 1693025 -1024948 -4658645 -7264001 -6961413 -3600074 454369 2375592 1621285 -77753
2958 -77753 -872372 -11161 2326283 5033653 6328952 5384891 3525175 2590886 2423490
2949 2423490 1331443 -1236776 -4096558 -6279192 -7743473 -7975623 -5991255 -2558041
2941 -2558041 -485594 -1327837 -3213005 -3415241 -1906448 -730017 -820873 -1410343 -2120753
2932 -2120753 -3489389 -5070389 -4846826 -1543459 3416768 7112545 7802125 5936404 3079477
2923C079477k578161j829745j093891l64867L98475Q61650P07038K78469J67578
2914c73977K08812k06315p54514l39270J012196J812798J416910J172676K098827
2905F048143K876938J867337q3902r85528r76823j723325k915830k298743L40953
2896B149220K084079J022822r57644j214048o2023N72720M55339N50940M72564
2887E073969q51366k494524k201842J63091K164720K134383Q96507k24471r89327
2878C671140j173136o0618J869034K644828J582629O98485J689750K952416J700629
2869A5575157j807623m408126m205664k576123j703421j871449j940182j239697
2861d177128k5709J259950K301945K714070K166156Q36833m55086p62302J25331
$$ plain form
2923 3079477 501316 -1328429 -2422320 -2787187 -2388712 -1527062 -820024 -541555 -373977
2914 -373977 -165165 -371480 -1125994 -1465264 -453068 1359730 2776640 3949316 6048143
2905 6048143 8925081 10792418 10708516 9722988 8746165 7022840 4107010 1808267 2149220
2896 2149220 4233299 5256121 4298477 3084429 3022406 3595126 4050465 4601405 5073969
2887 5073969 4222603 1728079 -473763 -310672 1854048 3988431 4884938 4660467 3671140
2878 3671140 2498004 2437386 4306420 6951248 8533877 9232362 10922112 13874528 15575157
2869 15575157 13767534 9359408 5153744 2577621 874200 -997249 -2937431 -4177128
2861 -4177128 -4202837 -2942887 -640942 2073128 4239284 5076117 4621031 3858729 3984060
2852C984060J295782J534495O75552k84770o06435o83341j032225j111642l7476
2843C734000J850028L007406K248539k23458l084890m690369m108614k151536
2835c418894r39826j539613k468915j656112N46629J810904J226975N11474J279203
2826d648175K700628K954201J853684O78765O7188m36599q47386k26779J665716
2817C761243L165534K277549o12529k624867j616503J051809J971847j84193l117989
2808D071901l823851j921636O38722K127870K182483J223499P1974l07994J28949
2799D391917J95591o24225p86378J119605L558214L708412J614656O0567J29910
2790A3368269j88457k109689l774248l514868k639177k618145j932953J142577
$$ plain form
2852 3984060 5279842 6814337 7489889 7205119 6598684 5915343 4883118 3771476 3734000
2843 3734000 5584028 8591434 10839973 10616515 7531625 2841256 -1267358 -3418894
2835 -3418894 -4358720 -5898333 -8367248 -10023360 -9476731 -7665827 -6438852 -5927378 -4648175
2826 -4648175 -1947547 1006654 2860338 3539103 3606291 3169692 2322306 2095527 3761243
2817 3761243 6926777 9204326 8591797 5966930 4350427 5402236 7374083 7189890 4071901
2808 4071901 248050 -1673586 -1034864 1093006 3275489 4498988 4570962 4262968 4391917
2799 4391917 4587508 3963283 3176905 4296510 7854724 11563136 13177792 13238359 13368269
2790 13368269 13179812 11070123 7295875 3781007 1141830 -1476315 -3409268 -2266691
2782b266691M311394L581162n91258l108668q59398L408360N026673K903137l94170
2773A2010541k262427k036022m01602J409828K080824J067446q16956k143822
2765H907810k172327j268350l38088n8039m29513r84589j501653k156561k627787
2756b629097j772512Q22290L496508M095258K661666J009637k30745j987250l720066
2747A745689k740278J551382M908353K786569l116825o092160k629545L432521
2739a54294O169671M446165J463044n75334k237707l862371m036945k089935J99043
2730f78663Q93347L79461O7277j9439m92664m97772J255199L661686L938992J651363
2720A0158787k96812K30565J526868P21825j982770l796735l238417j462883O6467
$$ plain form
2782 -2266691 2044703 5625865 5034607 1925939 1066541 4474901 9501574 12404711 12010541
2773 12010541 9748114 7712092 7310490 8720318 10801142 11868588 11051632 8907810
2765 8907810 6735483 5467133 5129045 5071006 4641493 3656904 2155251 -1310 -2629097
2756 -2629097 -4401609 -3579319 -82811 4012447 6674113 7683750 7453005 5465755 1745689
2747 1745689 -994589 556793 5465146 8251715 5134890 -957270 -3586815 -154294
2739 -154294 6015377 10461542 11924586 11349252 9111545 5249174 1212229 -877706 -678663
2730 -678663 214684 594145 661422 641983 149319 -348453 906746 4568432 8507424 10158787
2720 10158787 9861975 10092540 11619408 12341233 10358463 6561728 3323311 1860428 1926895
2711A926895J207440K044591J877067L21895j460992j697224m6246J805729J770776
2702G749931m04450k609271k439318P3551K320997K021399l36128k405478k639957
2693A331276j365832Q5209M40377o68960j953761j275617J577860L680229K185134
2684D035915j721771m045575l044164r02851l5231r8431K25068O51462L08334
2675d627244j87252K72687J072224O95098o07119r17719M69114J946593J786808
2666i6810J43016j560890k093721q45872J971785M802149N459030L390926N53068
2657A1722681r34981j320026k192557l510107l416700j237803J077800J392929
2649A581236k9881j422663j816172j119303R18842L804073N051091K434643k279560
$$ plain form
2711 1926895 3134335 5178926 7055993 7377888 5916896 4219672 4173426 5979155 7749931
2702 7749931 7345481 4736210 2296892 2370443 4691440 6712839 6376711 3971233 1331276
2693 1331276 -34556 50653 491030 -177930 -2131691 -3407308 -1829448 1850781 4035915
2684 4035915 2314144 -1731431 -4775595 -5678446 -5713677 -5812108 -5587040 -4935578 -4627244
2675 -4627244 -4814496 -4541809 -3469585 -2774487 -3381606 -4299325 -3830211 -1883618 -96810
2666 -96810 46206 -1514684 -3608405 -4454277 -2482492 2319657 7778687 11169613 11722681
2657 11722681 10787700 9467674 7275117 3765010 348310 -889493 188307 1581236
2649 1581236 1551355 128692 -1687480 -2806783 -1887941 1916132 6967223 9401866 7122306
2640G122306m446242k392052K05978n74880l499696m238779j477219J785535K625893
2631d889156J308890k43440r02599n53837M61103J248351Q19674o39460j695478
2622e085952j258690L23283J796692K021417P74093o59422k88057K030673L624895
2613C278932K271532l68659r26004N41154O31437j819013l586586j954821J185247
2604g46781K335451J214111N9427j85573k90754m41470j66123N1441n22181j014476
2594B93072j53634J015021K22264k059784k439996O25631M120504M126999Q10640
2585F560717k044177j949992m48730m65623k072994k288370O53471M201452M280069
2576F425823P67816k002122q69152K167783L034701Q09329k108811l540518k875484
$$ plain form
2640 7122306 2676064 284012 489990 -84890 -3584586 -7823365 -9300584 -7515049 -4889156
2631 -4889156 -3580266 -3823706 -4726305 -5280142 -4819039 -3570688 -2751014 -3390474 -5085952
2622 -5085952 -6344642 -6021359 -4224667 -2203250 -1429157 -2088579 -2376636 -345963 3278932
2613 3278932 5550464 5181805 4255801 4796955 5428392 3609379 22793 -1932028 -746781
2604 -746781 1588670 2802781 2862208 2676635 2385881 1944411 1778288 1829729 1307548 293072
2594 293072 139438 1154459 1376723 -683061 -3123057 -2497426 1623078 5750077 6560717
2585 6560717 4516540 2566548 2117818 1652195 -420799 -2709169 -2055698 2145754 6425823
2576 6425823 7193639 5191517 4322365 6490148 9524849 10334178 8225367 4684849 1809365
2567A809365j00290L690813N490198L155552j058010k699965j034058L59869o53915
2558H959559j946586j348245j22416J0547J60677J600512K374620J76643l080937
2549F784374l432175p82762J069645J03249j895254l164794m042808m279359k064536
2540a1704420K320098N060808L629504O82973L36624K329492K977963Q75225j522774
2531D985493j803892l93576Q07964N16103j341725l346009l119225p8402K796305
2522i76964K359945L4213K8150K830445M296210K184581n10249q35272m51955
2513H959104j709706k748865r11967J611159P33700k385207k660277P31172L005621
2504D624734J436569r27572r76796p6593l01284n04592N53795Q92620j052560
$$ plain form
2567 1809365 1709075 5399888 10890086 14045638 12987628 10287663 9253605 9613474 8959559
2558 8959559 7012973 5664728 5542312 5552859 5713536 7314048 9688668 9865311 6784374
2549 6784374 3352199 2569437 3639082 3742331 1847077 -1317717 -5360525 -9639884 -11704420
2540 -11704420 -9384322 -4323514 -694010 -11037 325587 2655079 5633042 6508267 4985493
2531 4985493 3181601 2788025 3595989 4112092 2770367 -575642 -3694867 -3773269 -976964
2522 -976964 1382981 1417194 1445344 4275789 8571999 10756580 10246331 9411059 8959104
2513 8959104 7249398 4500533 3588566 5199725 5933425 3548218 887941 1619113 4624734
2504 4624734 6061303 5133731 4156935 4080342 3779058 3274466 3828261 4720881 3668321
2495C668321k557064o74609K162584J361174k335945l477985P0784M234523M716501
2486G168284K145710j83717p61423k80376L64836P26274M59724m91826j763722
2477G383764k862114l180296k247048p69831m51664j479071j526538P58040K776714
2468a598044J450150j461663j405226J767508L057775p0641l578664k759485J124737
2459c473553L240361J916152k94923r58255j13904J151818J973379J695611M84447
2450E621133k47895M47847J354213O55480j226607k072808j009627L95097L81634
2441D298467r09572j948358j623522k69230P61243N79405j49185j48913M61463
2432A051798K77499r62930j639104q36731o6332r66048k672722l216018k385067
$$ plain form
2495 3668321 1111257 436648 2599232 3960406 1624461 -1853524 -1782740 2451783 7168284
2486 7168284 9313994 9130277 8368854 8088478 8453314 9179588 9639312 9147486 7383764
2477 7383764 4521650 1341354 -905694 -1675525 -2127189 -3606260 -5132798 -4374758 -1598044
2468 -1598044 -147894 -1609557 -3014783 -1247275 1810500 1739859 -1838805 -4598290 -3473553
2459 -3473553 -233192 1682960 1388037 429782 315878 1467696 3441075 5136686 5621133
2450 5621133 5373238 5821085 7175298 7830778 6604171 4531363 3521736 3916833 4298467
2441 4298467 3388895 1440537 -182985 -452215 309028 888433 739248 590335 1051798
2432 1051798 1329297 366367 -1272737 -2109468 -2175800 -3141848 -5814570 -9030588 -11415655
2423a1415655j292585r0733J678877L167851L033648J822996J196931J012668
2415h86002k56331k169109k276857o7949J899114J938310J537248K104105K175040
2406C997569K90608j640607r62428J230100J580953k95285j563335j047398p01134
2397H89043j426375j049835J661912M011364L060835J70025j115156k90843J01532
2388F012502j079615k353093k748895l003800l097427j623670J211294K666445
2380d016259J233519q55929p90878R64947K043176J874704J701786J907143J686034
2371E748243Q94381J75782m40881j291727j823454j353526o75613j099427k262626
2362b128848k710090k194817j433738j30726K341113M585132M284752J895370
$$ plain form
2423 -11415655 -12708240 -12798973 -11120096 -7952245 -4918597 -3095601 -1898670 -886002
2415 -886002 -1142333 -3311442 -5588299 -5656248 -3757134 -1818824 -281576 1822529 3997569
2406 3997569 4288177 2647570 1685142 2915242 4496195 4200910 2637575 1590177 889043
2397 889043 -537332 -1587167 74745 4086109 7146944 7316969 6201813 5910970 6012502
2388 6012502 4932887 2579794 -169101 -3172901 -6270328 -7893998 -6682704 -4016259
2380 -4016259 -2782740 -3638669 -4429547 -3464600 -1421424 453280 2155066 4062209 5748243
2371 5748243 6642624 6818406 6377525 5085798 3262344 1908818 1233205 133778 -2128848
2362 -2128848 -4838938 -7033755 -8467493 -8598219 -6257106 -1671974 2612778 4508148
2354D508148M56287J095419J503166m0964j818869j506201L41156J540687J400169
2345G478998P51441J18655m34391n25327L5947O17314O38151L26416l1131n11676
2335H464397o88903K01325J543604J524973R908o69071P62020J996037J19073
2326A3263363m061603o639248n053275n60386L257218L584617P23296j986159
2318B527823j487885J461072L434399K942325J600304N16925j199386l187239
2310F608338k783638M86414K807394J466136q02083m23557J073598J59638k144071
2301F448169k065387Q6079N37385j008871q44552J811793L041044R64932r92438
2292G978154o6305J254269j43111k541412k418607k47136P75045J87291M30966
$$ plain form
2354 4508148 4964435 6059854 7563020 7522056 5703187 4196986 4538142 6078829 7478998
2345 7478998 8230439 8349094 7914703 7389376 7425323 8042637 8680788 9007204 8976073 8464397
2335 8464397 7775494 7976819 9520423 11045396 11055304 10386233 11148253 13144290 13263363
2326 13263363 9201760 2562512 -2490763 -3051149 206069 3790686 4513982 2527823
2318 2527823 1039938 2501010 5935409 8877734 10478038 10994963 9795577 6608338
2310 6608338 3824700 4311114 7118508 8584644 7782561 7359004 8432602 8592240 6448169
2301 6448169 4382782 4468861 5006246 3997375 3152823 4964616 8005660 8970592 7978154
2292 7978154 7911849 9166118 9023007 6481595 4062988 3815852 4590897 4778188 5209154
2283E209154K011421K226450m21841l278100k752029P51475L016924J351673j720754
2274F394373j590452K070171M406101J878946k681785l945014j332549R46674
2266F146465N05562l95029N93129J944084Q34043k419439m574323l297685M24455
2257b38738L304524K909412L77221m61146K254837N528745N093748R70650k998768
2248A6740485m430031m190277l295806j574580J66496J58302j152835j091705
2240A330049R90803K472198J612330p0538q19334r84957j010187j90031J048407
2231D378740P85481q61568j128329P56368J913270Q87708M48884K426621L614537
2222A3221712O73967l984394n458880l224445o74738L16928L93503j37540j201752
$$ plain form
2283 5209154 7220575 9447025 9025184 5747084 2995055 3746530 6763454 8115127 6394373
2274 6394373 4803921 6874092 11280193 13159139 10477354 6532340 5199791 6146465
2266 6146465 6652027 6256998 6850127 8794211 9628254 7208815 2634492 -663193 -238738
2257 -238738 3065786 5975198 6352419 5891273 8146110 13674855 18768603 19739253 16740485
2248 16740485 12310454 8120177 4824371 3249791 3416287 3574589 2421754 1330049
2240 1330049 2320852 4793050 6405380 6334842 5515508 4530551 3520364 3330333 4378740
2231 4378740 5164221 4302653 3174324 3930692 5843962 6731670 7180554 9607175 13221712
2222 13221712 13895679 9911285 4452405 1227960 553222 870150 1263653 1126113 -75639
$$ [...]
##END NTUPLES=NMR SPECTRUM
##END=
