##TITLE=31Pdec_DE-87_5_k
 CDCl3, 64 sc
 24.6.2025
##JCAMPDX= 6.0         $$ Bruker NMR JCAMP-DX V2.0
##DATA TYPE= NMR SPECTRUM
##DATA CLASS= NTUPLES
##ORIGIN= UXNMR, Bruker Analytische Messtechnik GmbH
##OWNER= root
$$ XWIN-NMR		Version 3.5
$$ Tue Jun 24 13:55:20 2025 Russian Standard Time (UT+4h)  she@DPX200
##.OBSERVE FREQUENCY= 81.013821
##.OBSERVE NUCLEUS= ^31P
##.ACQUISITION MODE= SIMULTANEOUS
##.ACQUISITION SCHEME= undefined
##.AVERAGES= 64
##.DIGITISER RES= 17
##SPECTROMETER/DATA SYSTEM= spect
##.PULSE SEQUENCE= zgpg30
##.SOLVENT NAME= DMSO
##.SHIFT REFERENCE= (INTERNAL, DMSO, 0, 198.062)
##AUDIT TRAIL= $$ (NUMBER, WHEN, WHO, WHERE, WHAT)
$$ ##TITLE= Audit trail, XWIN-NMR		Version 3.5
$$ ##JCAMPDX= 5.01
$$ ##ORIGIN= Bruker BioSpin GmbH
$$ ##OWNER= she
$$ F:/spectra/data/she/nmr/P31/2/pdata/1/auditp.txt
$$ ##AUDIT TRAIL=  $$ (NUMBER, WHEN, WHO, WHERE, WHAT)
(   1,<2025-06-24 13:54:11.25 +0400>,<she>,<DPX200>,
      <created by zg, POWCHK disabled, PULCHK disabled
       configuration hash MD5:
       00 E9 B6 7A A2 85 ED C7 34 08 36 98 17 FE 4E 26
       data hash MD5: 32K
       25 29 ED 41 30 0C B0 07 EE 17 E4 4D 40 F0 ED BC>)
(   2,<2025-06-24 13:54:13.89 +0400>,<she>,<DPX200>,
      <Start of raw data processing
       efp BC_mod = 2 LB = 1.5 FT_mod = 6 PKNL = 1 PHC0 = 1661.815 PHC1 = -736.3068 SI = 64K 
       data hash MD5: 64K
       B2 E3 4D 0A 1D F2 42 FB 80 72 46 4B D9 6E 0E EE>)
(   3,<2025-06-24 13:54:44.07 +0400>,<she>,<DPX200>,
      <pk PHC0 = -367.749 PHC1 = 1107.402 
       data hash MD5: 64K
       0D 54 DD 68 C0 76 A5 46 DD 77 2E D3 E4 5E CE 56>)
(   4,<2025-06-24 13:54:48.56 +0400>,<she>,<DPX200>,
      <abs ABSG = 5 
       data hash MD5: 64K
       1D EA 9F 53 AA 82 2E 2B DF EC FB C9 EF 54 DC 4D>)
$$ ##END=
$$ 
$$ hash MD5
$$ 1F 51 E2 02 91 CC F1 A1 F8 49 19 85 0A DC A4 3C
##$RELAX= 
##$RELAX= 
##$RELAX= 
##$RELAX= 
##$RELAX= 
##$RELAX= 
##$RELAX= 
##$RELAX= 
$$ Bruker specific parameters
$$ --------------------------
##$DU= <F:/spectra>
##$EXPNO= 2
##$NAME= <P31>
##$PROCNO= 1
##$TYPE= <nmr>
##$USER= <she>
##$AMP= (0..31)
100 100 100 100 100 100 100 100 100 100 100 100 100 100 100 100 100 100 
100 100 100 100 100 100 100 100 100 100 100 100 100 100 
##$AQSEQ= 0
##$AQ_mod= 1
##$AUNM= <au_zg>
##$AUTOPOS= <>
##$BF1= 81.014009
##$BF2= 200.13
##$BF3= 200.13
##$BF4= 200.13
##$BF5= 200.13
##$BF6= 200.13
##$BF7= 200.13
##$BF8= 200.13
##$BYTORDA= 1
##$CFDGTYP= 0
##$CFRGTYP= 5
##$CHEMSTR= <none>
##$CNST= (0..31)
1 1 145 1 1 1 1 1 1 1 1 1 1 1 1 1 1 1 1 1 1 1 1 1 1 1 1 1 1 1 1 1 
##$CPDPRG= <waltz16>
##$CPDPRG1= <>
##$CPDPRG2= <waltz16>
##$CPDPRG3= <>
##$CPDPRG4= <mlev>
##$CPDPRG5= <mlev>
##$CPDPRG6= <mlev>
##$CPDPRG7= <mlev>
##$CPDPRG8= <mlev>
##$CPDPRGB= <>
##$CPDPRGT= <>
##$D= (0..31)
0 1 0 0 0 0 0 0 0 0.06 0 0.03 2e-05 3e-06 0 0 0.0002 0 0 0 0 0 0 0 0 0 
0 0 0 0 0 0 
##$DATE= 1750758850
##$DBL= (0..7)
120 120 120 11 120 120 24 19 
##$DBP= (0..7)
150 150 150 150 150 150 150 150 
##$DBP07= 0
##$DBPNAM0= <>
##$DBPNAM1= <>
$$ [...]
##$SUBNAM3= <"">
##$SUBNAM4= <"">
##$SUBNAM5= <"">
##$SUBNAM6= <"">
##$SUBNAM7= <"">
##$SUBNAM8= <"">
##$SUBNAM9= <"">
##$SW= 400.765351723535
##$SWIBOX= (0..15)
0 1 3 0 0 0 0 0 0 0 0 0 0 0 0 0 
##$SW_h= 32467.5324675325
##$TD= 32768
##$TD0= 1
##$TE= 0
##$TE2= 300
##$TE3= 300
##$TEG= 300
##$TL= (0..7)
0 120 53 12 22 120 120 120 
##$TP= (0..7)
150 150 150 150 150 150 150 150 
##$TP07= 0
##$TPNAME0= <>
##$TPNAME1= <>
##$TPNAME2= <>
##$TPNAME3= <>
##$TPNAME4= <>
##$TPNAME5= <>
##$TPNAME6= <>
##$TPNAME7= <>
##$TPOAL= (0..7)
0.5 0.5 0.5 0.5 0.5 0.5 0.5 0.5 
##$TPOFFS= (0..7)
0 0 0 0 0 0 0 0 
##$TUNHIN= 0
##$TUNHOUT= 0
##$TUNXOUT= 0
##$USERA1= <user>
##$USERA2= <user>
##$USERA3= <user>
##$USERA4= <user>
##$USERA5= <user>
##$V9= 5
##$VALIST= <valist>
##$VCLIST= <CCCCCCCCCCCCCCC>
##$VD= 0
##$VDLIST= <DDDDDDDDDDDDDDD>
##$VPLIST= <PPPPPPPPPPPPPPP>
##$VTLIST= <TTTTTTTTTTTTTTT>
##$WBST= 1024
##$WBSW= 4
##$XGAIN= (0..3)
0 0 0 0 
##$XL= 0
##$YL= 0
##$YMAX_a= 22501
##$YMIN_a= -7863
##$ZGOPTNS= <>
##$ZL1= 120
##$ZL2= 120
##$ZL3= 120
##$ZL4= 120
##$ABSF1= 198.0616
##$ABSF2= -202.7028
##$ABSG= 5
##$ABSL= 3
##$ALPHA= 0
##$AQORDER= 0
##$ASSFAC= 0
##$ASSFACI= 0
##$ASSFACX= 0
##$ASSWID= 0
##$AUNMP= <proc_1d>
##$AZFE= 0.1
##$AZFW= 0.5
##$BCFW= 0
##$BC_mod= 2
##$BYTORDP= 0
##$COROFFS= 0
##$CY= -3
##$DATMOD= 1
##$DC= 0
##$DFILT= <>
##$DTYPP= 0
##$F1P= 0
##$F2P= 0
##$FCOR= 1
##$FTSIZE= 65536
##$FT_mod= 6
##$GAMMA= 0
##$GB= 0
##$INTBC= 1
##$INTSCL= 9.790993e-09
##$ISEN= 30
##$LB= 1.5
##$LEV0= 0
##$LPBIN= 0
##$MAXI= 10000
##$MC2= 0
##$MEAN= 0
##$ME_mod= 0
##$MI= 50
##$NCOEF= 0
##$NC_proc= -8
##$NLEV= 6
##$NOISF1= 182.463
##$NOISF2= 159.3651
##$NSP= 0
##$NTH_PI= 0
##$NZP= 0
##$OFFSET= 198.0616
##$PC= 4
##$PHC0= 1294.066
##$PHC1= 371.0952
##$PH_mod= 1
##$PKNL= yes
##$PPARMOD= 0
##$PSCAL= 0
##$PSIGN= 0
##$REVERSE= no
##$SF= 81.0140089999434
##$SI= 65536
##$SIGF1= 159.3651
##$SIGF2= -187.1042
##$SINO= 113.3802
##$SIOLD= 16384
##$SREGLST= <1H.CDCl3>
##$SSB= 0
##$STSI= 65536
##$STSR= 0
##$SW_p= 32467.5324675325
##$SYMM= 0
##$S_DEV= 0
##$TDeff= 32768
##$TDoff= 0
##$TI= <>
##$TILT= no
##$TM1= 0
##$TM2= 0
##$TOPLEV= 0
##$USERP1= <user>
##$USERP2= <user>
##$USERP3= <user>
##$USERP4= <user>
##$USERP5= <user>
##$WDW= 1
##$XDIM= 65536
##$YMAX_p= 376748034
##$YMIN_p= -113938497
$$ End of Bruker specific parameters
$$ ---------------------------------
##NTUPLES= NMR SPECTRUM
##VAR_NAME=  FREQUENCY,     SPECTRUM/REAL,   SPECTRUM/IMAG
##SYMBOL=    X,             R,               I
##VAR_TYPE=  INDEPENDENT,   DEPENDENT,       DEPENDENT
##VAR_FORM=  AFFN,          ASDF,            ASDF
##VAR_DIM=   65536,         65536,           65536
##UNITS=     HZ,            ARBITRARY UNITS, ARBITRARY UNITS
##FACTOR=    0.49542278885378, 1,            1
##FIRST=     16045.7642231865, 0,            0
##LAST=      -16421.768244346, 0,            0
##MIN=       -16421.768244346, -113938497,   0
##MAX=       16045.7642231865, 376748034,    0
$$ Real data points
##PAGE= N=1
##DATA TABLE= (X++(R..R)), XYDATA
$$ [...]
46470 -5248124 -3739782 -3536651 -1959799 2844082 8413800 11058470 10882570 11194826 13407318
46461 13407318 15232320 14501340 12295589 10806313 9920762 7940561 4640008 1485832
46453 1485832 -794114 -2841749 -4768998 -5488105 -4553650 -3215931 -2732446 -2614160 -1526339
46444 -1526339 638168 2521353 2972085 2255593 1507195 1409963 1641531 1473211 614051
46435 614051 -675718 -2023722 -3076983 -3386430 -2850260 -2279440 -2637495 -3462100 -3042271
46426 -3042271 -688943 2197684 4047045 4989221 5808619 6252296 5922903 5869678 7295966
46417 7295966 9173236 9257235 7355778 5368876 3875590 1192193 -3156086 -6342698
46409 -6342698 -5513251 -1751354 1250636 1791489 1486250 2117313 3068704 2722483 1294546
46400 1294546 980387 3220733 6719031 8919819 9159529 9243777 10511262 11540816 10003205
46391 10003205 6079693 2462589 1105366 1487172 2205136 2717174 3016161 2963865 2713119
46382 2713119 2802858 3191271 3014014 1750204 -190061 -2259845 -4081897 -4759572 -3320185
46373 -3320185 -451447 1571043 1529745 712323 1002681 2760561 5350462 8305795 10813777
46364 10813777 11414707 9743963 7639609 7033671 7434667 6881338 4829166 2790328 2512763
46355 2512763 4556508 8133258 11373137 12404747 11205226 9759802 9540674 9772779
46347 9772779 9157407 8002739 7169888 6173526 4271664 2502077 2473331 3683123 4129521
46338 4129521 3145382 1504507 -800118 -4305398 -7617875 -7958334 -4886144 -1159715
46330 -1159715 1026908 2530761 4855760 7267636 7927250 6575780 4553926 2999535
46322 2999535 2241508 2233171 2476845 2098203 920976 -42903 82050 805259 1134478 1141357
46312 1141357 1776833 3253117 4213422 2703986 -1891277 -7665279 -11350138 -11374183 -9454105
46303 -9454105 -8322628 -8416908 -8169226 -7087991 -6452510 -6668260 -6136447 -3815324 -1126315
46294 -1126315 112233 342296 1329947 3453209 5415066 6206067 6117221 5980037 6220784
46285 6220784 6483724 5754242 3318201 -78478 -2734813 -3952268 -4526167 -4965204 -4611161
46276 -4611161 -3324327 -2608640 -3726289 -5663231 -6264522 -4615742 -1192779 3270747
46268 3270747 7498162 9188652 6974700 2852662 831119 2598295 5671466 6343481
46260 6343481 3651084 -59985 -1994890 -1789946 -1445603 -2551148 -4215058 -4495566 -3344346
46251 -3344346 -2557323 -2747961 -2391326 -745027 274999 -1259281 -4270607 -6140490 -6080538
46242 -6080538 -5232257 -4406557 -3650582 -3213803 -2953380 -1573771 1375588 3433889 1596337
46233 1596337 -3537024 -8263761 -10162198 -9697058 -7982948 -5900080 -5326489 -7778066
46225 -7778066 -11032041 -10453966 -5127577 378426 2158394 1901098 3189258 5507414
46217 5507414 5372039 2065702 -1215850 -1769375 -261813 999956 635689 -1222294 -3279625
46208 -3279625 -3786343 -2175762 -82671 331546 -1073206 -2528476 -2617271 -1305423 743902
46199 743902 2529794 2891024 1862689 1433708 3238120 5813143 6113323 3666007 1055514
46190 1055514 58442 -280732 -957137 -938030 555190 1706675 234160 -3347342 -6660799
46181 -6660799 -8687703 -9760780 -9033966 -4886133 1628808 6337137 6444309 3862232
46173 3862232 2522760 3599746 5136404 5591839 5637360 6342583 7408679 7897216 7457532
46164 7457532 6090962 3777772 1257578 247314 1607678 3722527 3980971 1879650
46156 1879650 -378358 -534501 1304966 3067693 2818666 373703 -2410072 -2856475 86465
46147 86465 4321801 6416191 5317875 3345240 3072196 4479368 6086606 7590998 9674174
46138 9674174 11808138 12202398 10163955 7034503 4407021 2727179 2133224 3243054
46130 3243054 6055196 9013876 10334741 9783159 8278488 6378752 4260470 2631802
46122 2631802 2149867 1969592 393914 -2631141 -5053397 -5471871 -5118815 -5981869 -7864942
46113 -7864942 -8692918 -7288592 -4512421 -1856702 -249824 -231966 -1858550 -4024612 -5084643
46104 -5084643 -4631487 -3648426 -2663900 -1233781 171864 -365592 -3384637 -6134176 -5490493
46095 -5490493 -1983087 1091063 2031697 2009388 2150519 1832587 499349 -1022461 -2121653
46086 -2121653 -3552330 -5697262 -7141877 -6447848 -4268334 -2262267 -807963 710587
46078 710587 2094134 2504839 2163051 2330605 3591163 5347610 6917665 7846293 7182113
46069 7182113 3989852 -892506 -4810566 -5779286 -4310594 -2266091 -751557 39778
46061 39778 -367768 -2643236 -6031228 -7849055 -5720329 -431146 4206124 4932897 2184180
46052 2184180 -869118 -1957227 -1380470 -290465 1045212 2553189 3389353 3074282 2751951
46043 2751951 3756269 5346304 5486689 3784639 1923366 834942 -734711 -3718870
46035 -3718870 -6185586 -5173698 -889211 2565884 1418137 -3548002 -7778506 -7731259
46027 -7731259 -4159118 -684985 -106723 -2642172 -6731029 -10051749 -10153729 -6176277
46019 -6176277 -676320 1997501 450288 -1975932 -1649096 465621 517083 -2525979 -5650256
46010 -5650256 -6346146 -5558946 -5090690 -4563682 -2893310 -1140128 -1506288 -3912898 -5526681
46001 -5526681 -3993435 -5655 3581453 4396702 2223499 -1149724 -3340868 -3038869
45993 -3038869 -737890 1920907 3360424 2841559 718527 -1714483 -3035662 -2804965
45985 -2804965 -1827192 -1295197 -1880642 -3420664 -4851517 -4594307 -2014159 1249787 2384399
45976 2384399 320948 -3217990 -5918683 -7117201 -7441712 -7640079 -8753720 -12007894
45968 -12007894 -16774713 -19526873 -16961197 -10166312 -3946372 -1789628 -3022315 -5063501
45960 -5063501 -6532536 -7272098 -7106719 -6230066 -5876386 -6926466 -8177897 -7465275 -4492809
45951 -4492809 -1242865 660890 1723203 3118676 4628203 5180298 4797637 4540589 4505922
45942 4505922 3411482 919208 -912400 44971 2819522 4264365 3270233 2251344
45934 2251344 3584531 6161778 7049698 5561535 3668372 2613587 1305180 -1161332
45926 -1161332 -3074224 -1694819 3281770 8958922 11812027 10483899 6421898 2476970
45918 2476970 707671 938876 1444694 1194550 899239 1385920 1738882 243424 -3098128
45909 -3098128 -6376181 -8327852 -9700978 -11308469 -11930351 -9588108 -4515031 535148
45901 535148 3132166 3272368 2287779 668752 -2110031 -5908963 -8921648 -8709115 -4229353
45892 -4229353 3029093 9850552 13496572 13440973 11037239 7726307 4102149 811867
45884 811867 -545086 1479365 6081412 10063679 10515398 7596734 4264505 3183524
45876 3183524 4323610 5854367 6779356 7571222 8137985 6727711 2193809 -3515748 -6970410
45867 -6970410 -7225040 -6269714 -5266071 -2712937 2258552 6852495 7365237 4133420 1255041
45858 1255041 1363492 2770795 2268715 -904889 -4581804 -5984311 -4048148 -379386
45850 -379386 1900044 1244707 -448458 -361511 1083424 605853 -2999734 -6565903 -6397524
45841 -6397524 -2599950 1882931 4935561 6209826 5747692 3830579 1564285 -284555
45833 -284555 -2562627 -6031551 -8909150 -8350469 -4521814 -1061095 -785200 -2685371 -4126200
45824 -4126200 -4484591 -5133103 -6601426 -7317714 -5346166 -597772 4924203 8729615 9583458
45815 9583458 7968981 5250834 2655516 902494 212439 269229 417940 214057 -321673
45806 -321673 -946814 -1266586 -704525 697366 1395114 -381660 -3853811 -5665655 -3855127
45797 -3855127 -560446 895145 487805 755183 2112289 1773963 -1847465 -5979108 -6367283
45788 -6367283 -2205381 3167860 5847605 4540995 651787 -3525100 -6290886 -6792454
45780 -6792454 -4673188 -359087 4136778 5837535 3502248 -596030 -2743577 -1575305
45772 -1575305 1145601 3211235 4070888 4243424 4098956 3760299 3292317 2604046 1741034
45763 1741034 1134557 825037 -16188 -1630076 -2477142 -1221591 766817 1113527 80829
45754 80829 -326955 -589890 -3242569 -7558658 -8968299 -5871860 -2963353 -4451499 -7430372
45745 -7430372 -6326007 -1386842 2362890 3237340 4348402 6890733 7571234 4503206
45737 4503206 1050710 1037331 3384239 4323808 2529315 -564954 -3461674 -4946087 -3544187
45728 -3544187 392068 3248107 1844350 -1912048 -2854331 1021081 6492407 9688409
45720 9688409 10216775 9925400 9764046 9397890 8676876 7944043 7257456 6266235 4760447
45711 4760447 2896873 1044217 -380860 -1112440 -1100780 -269805 1332308 2689108 1978015
45702 1978015 -1124170 -3846035 -2970464 739130 2857707 912754 -2374578 -3041812
45694 -3041812 -1272473 -458738 -1979096 -3801200 -4225574 -4168013 -4868689 -5772897 -6140502
45685 -6140502 -6808122 -8462814 -9548419 -8054315 -4675759 -2064896 -1160918 -361266 1327013
45676 1327013 2214043 -25517 -5355252 -11293252 -15112046 -15551483 -13130256 -9543371
45668 -9543371 -6375711 -3882477 -1284664 1613041 3820379 4642072 5044348 6612950
45660 6612950 9270266 10864791 9447581 5621904 2033220 345378 -608079 -2777154
45652 -2777154 -5429959 -5508306 -2086405 1463171 1543336 -868876 -2020235 -1164586 -1356453
45643 -1356453 -4183648 -6997568 -6854943 -4549708 -2669606 -1641194 -35687 2484538
45635 2484538 4719457 5601930 4588052 1438384 -2529866 -4092172 -1259954 3914294
45627 3914294 7707284 9051009 9265439 8593155 6215291 3424555 3184343 5661346 7275792
45618 7275792 5567784 2374308 485000 -551175 -3145961 -7805085 -12694618 -16120391
45610 -16120391 -17618441 -17225670 -15218753 -12220234 -8615719 -4573194 -1374000 -1317006
45602 -1317006 -4815195 -8745075 -9543535 -7274072 -4878904 -4056429 -3892836 -3203631 -1948835
45593 -1948835 -125914 2510245 4904983 4932108 2424902 358729 1349545 4011338 4625502
45584 4625502 1948482 -1554636 -3379432 -3952167 -4983726 -6365913 -6471890 -5121259
45576 -5121259 -4460586 -6365307 -10142657 -13561636 -15270761 -15234668 -13464868 -9757770 -4885000
45567 -4885000 -989446 -78655 -2219727 -5358466 -6969376 -6287342 -5159631 -6104277 -9043277
45558 -9043277 -10768638 -8605684 -3886645 -464254 -328628 -2337967 -4858756 -7332713
45550 -7332713 -8810745 -7432454 -2980993 1575304 2873350 786036 -1962200 -3012587
45542 -3012587 -1960068 445904 3052740 4456903 3789662 1591620 -775504 -2480551
45534 -2480551 -3453252 -3706244 -3216033 -2209025 -905005 738754 2511698 3621776 3388001
45525 3388001 1767262 -1071099 -4688884 -7432194 -7062521 -3565489 -11757 986235
45517 986235 521219 1187865 2740069 2558197 41017 -2369427 -3040965 -3394976 -5163577
45508 -5163577 -7523445 -8446442 -7403552 -5306028 -2945959 -865254 201687 125685 -92849
45499 -92849 197264 -702 -1884485 -4694723 -6364536 -5985930 -4339854 -2260731 8399
45490 8399 1708864 1393787 -1264450 -4341340 -5252465 -3261951 38186 2480051 3181706
45481 3181706 2946437 3260377 4814731 6726482 7319116 5933664 3810940 2812944 3375508
45472 3375508 4208465 4006667 2768921 1107837 -1018896 -4087754 -7822184 -11029936
45464 -11029936 -12564662 -11824121 -8582882 -3411830 1633373 3930476 2568760 -866917
45456 -866917 -4085550 -5972363 -6566684 -6306877 -5865355 -5746637 -5432003 -3886734 -1443785
45447 -1443785 89282 -45995 -416495 131886 512827 -492695 -1769602 -1603087 -473236
45438 -473236 344806 1594407 4235737 5794920 2661593 -3630423 -6607433 -2864781
45430 -2864781 3694302 7571751 8198016 8103311 7819678 6463648 5330578 6546725 8831362
45421 8831362 8666066 5805003 3811970 4332635 4546930 2089638 -728451 -428304 2039702
45412 2039702 2593314 197346 -1542288 482789 4807335 7813077 8279270 7608699 6731778
45403 6731778 5189465 3159548 2090271 2602594 3569655 4165584 4951176 5623347 3877336
45394 3877336 -1002945 -5088225 -3846325 1231588 3820718 1135947 -2691564 -3147088
45386 -3147088 -1465534 -1347869 -2561269 -1856401 1170421 3284307 2624713 961803 244659
45377 244659 -155438 -1514516 -3283798 -4010250 -3316482 -1775023 136238 1978816 3118633
45368 3118633 3433143 3707686 4759750 6610699 8730930 10468318 11115598 10331183 8622433
45359 8622433 6614747 3887739 -286179 -4858537 -7133721 -5890605 -3399950 -3173477
45351 -3173477 -6002299 -9063982 -8952202 -5121126 -276236 2391011 2129686 650866
45343 650866 -444226 -1276125 -2309943 -2581502 -738874 2576454 4875430 4407892 1469753
45334 1469753 -2747339 -7179374 -10567534 -11600446 -10122387 -7393430 -4784356 -2945704
45326 -2945704 -2185258 -2350019 -2084175 289108 4394057 7526362 7673989 5898847 4775391
45317 4775391 5149631 5401895 3617867 -172124 -3824756 -4986720 -3423332 -1296640
45309 -1296640 -651113 -1114946 -1032976 -209262 112538 -411216 -1067036 -2272007 -5242789
45300 -5242789 -8645194 -8397487 -2809609 4078570 6621284 3848689 -382635 -2434139
45292 -2434139 -1908303 -319076 1036043 1842075 2842558 5028848 7870521 9223882
45284 9223882 8192198 6838296 7292482 8366542 7362574 4387707 2172596 1933917
45276 1933917 2224162 2031579 2173972 2927183 2980189 1987354 1823981 3629710 5336620
45267 5336620 3971529 -568053 -5452186 -7892472 -7173995 -4577374 -2257290 -1470978
45259 -1470978 -1219481 430758 3129230 3832965 783929 -3526338 -5146104 -3557736
45251 -3557736 -1850002 -2406389 -4560715 -6910304 -9876351 -14387501 -18916496 -19799722
45243 -19799722 -15208779 -7761179 -1929928 868079 3077092 6545755 9259172 8274249
45235 8274249 4470088 1576145 763520 -698324 -4559716 -8261296 -8299545 -4781854 -493513
45226 -493513 2941726 5568400 6885291 5780280 2501660 -1324337 -4552306 -6743505
45218 -6743505 -6962779 -4425890 -389940 2528779 3212415 2604703 1378435 -979187 -4302356
45209 -4302356 -6945798 -7781578 -7476685 -6907423 -5766094 -3759866 -1843641 -1039325 -1061334
45200 -1061334 -1235358 -1753391 -2760201 -3147497 -1808048 447827 1753585 1738478 1805361
45191 1805361 2864543 4128118 4431616 3601686 2046320 -16497 -2167677 -3256313
45183 -3256313 -2203555 644462 3529613 4848489 4457661 3321771 2262950 1551696
45175 1551696 1542080 2758044 4788140 5854124 4579967 1982440 603790 1615135 3827014
45166 3827014 5620905 6505649 6378548 4835868 2270407 371702 140500 316653 -733176
45157 -733176 -2321138 -2395439 -801304 378089 -67606 -855356 -391760 874655 1251291
45148 1251291 -18915 -2318595 -4742622 -6723553 -7865267 -7831695 -6454360 -3919869
45140 -3919869 -1114388 480488 56596 -1336380 -1806100 -964552 -191127 -252933 9771
45131 9771 1774836 4110294 4965199 3732180 1755985 557986 321868 -112436 -2205110
45122 -2205110 -6057640 -9295675 -8634568 -3626716 1970099 3845348 1567090 -1820581
45114 -1820581 -3706142 -3582228 -1516342 2389135 6517886 8095221 6326794 3641432
45106 3641432 2584841 2786627 2283168 600533 -1128691 -2316743 -3375454 -4190617 -3708397
45097 -3708397 -1370111 1981201 4846757 6123233 5508805 3573283 1402921 -345644
45089 -345644 -1827032 -3016026 -3040125 -1502927 144046 69202 -1213599 -1198503 1232361
45080 1232361 4375433 6325707 7453148 9030056 10646984 10771955 9377368 8191169
45072 8191169 8147348 8102063 6697990 4384103 2749002 2534452 3071607 3169050 1849556
45063 1849556 -1211832 -4966284 -7068778 -5980762 -3135495 -1768713 -3127368 -4984276
45055 -4984276 -4596993 -1946547 1025262 3217408 4774744 5551054 5299036 5146987 6563643
45046 6563643 8516196 8026323 4444402 871917 -48555 458612 -423 -984976 -532725
45037 -532725 1096601 2055785 2283543 2881618 2629337 -1029654 -7036480 -10592970 -9446230
45028 -9446230 -6916674 -6622164 -7261847 -5478132 -1589496 871872 172301 -2094451 -3962791
45019 -3962791 -5022041 -5598117 -6067324 -6797833 -7260997 -6001498 -3170966 -1733559 -3647608
45010 -3647608 -6115858 -5017419 -1468310 -966052 -5473049 -10319533 -10602008 -7250779
45002 -7250779 -4395698 -3407369 -2458205 -385598 1859021 3050910 2947048 1983768 970810
44993 970810 562841 290979 -798515 -1958328 -1115426 1428851 2121707 -824618 -3793527
44984 -3793527 -2275284 2552364 5483432 4827573 4184697 6154804 8212103 6742790
44976 6742790 2413616 -872161 -895901 1002581 2226530 1629908 204543 -236122 635862
44967 635862 713860 -2221409 -7306013 -11121417 -11510903 -9265335 -5959978 -2378493 251870
44958 251870 51218 -2802881 -5169596 -4747586 -3206743 -3439514 -5157583 -5777660 -4716428
44949 -4716428 -3926981 -4373447 -4771064 -4273803 -3862668 -4013840 -3096476 286460 4579798
44940 4579798 6497513 4535697 211791 -3880395 -6312463 -7192008 -7158547 -6532762 -5388702
44931 -5388702 -4078990 -3186371 -2790518 -2237296 -1013701 527749 1728905 2444389 2748770
44922 2748770 2358665 1172016 1777 -215334 190662 -10472 -1141823 -2068255 -1693972
44913 -1693972 -348467 626858 315283 -931532 -1987468 -2360349 -2933381 -4664670 -6673402
44904 -6673402 -6902865 -4994970 -2782809 -1090764 1713711 6090813 8570993 5933639
44896 5933639 728159 -1547606 -598985 -2143629 -9365582 -17820215 -21321212 -19443154
44888 -19443154 -15982314 -12686878 -8520974 -3817670 -1072322 -1340226 -2709559 -2909626
44880 -2909626 -1533779 457674 1702756 923911 -1873528 -4725746 -5731583 -5478189
44872 -5478189 -5896389 -7227818 -8084750 -8078632 -8030262 -7644383 -5553068 -2110146 367006
44863 367006 974877 1474609 3002951 3788561 1868042 -1614199 -3739630 -3416324 -1980596
44854 -1980596 -939263 -610019 -573341 -280671 529772 1310592 1104734 -32405 -888183
44845 -888183 -937088 -1101021 -1754798 -1402219 1061503 3767580 3501694 -334999 -4966247
44836 -4966247 -7354029 -6695325 -3886278 -42180 3885210 6923446 8179569 7130845
44828 7130845 4122998 817425 -677839 26253 967327 368500 -931219 -961890 123439
44819 123439 259786 -1029075 -1439717 878428 4402421 5854253 4035097 971084 -485234
44810 -485234 538445 2411452 2848859 1319605 -343540 -5885 2200317 3948191 3401883
44801 3401883 1139370 -840461 -1365356 -929857 -763819 -1498496 -2517835 -2414614 -359707
44792 -359707 2854538 5432393 6274248 5703899 4587032 3359788 2058845 636998 -1098639
44783 -1098639 -3292015 -5285897 -5472778 -2611722 2523861 7110542 8301009 5667648
44775 5667648 1679973 -634829 -673479 -467886 -1818353 -4125305 -5659766 -5914671 -5448414
44766 -5448414 -4204303 -1728327 1186729 2879287 3032687 2903679 3101417 2870887 2038310
44757 2038310 1764413 2448084 2669243 1515255 439787 1234361 3220628 3957017 1992554
44748 1992554 -2137916 -6563115 -8642369 -6507972 -1849022 296892 -3095710 -8817298
44740 -8817298 -11013676 -8255408 -4276372 -2158007 -1144325 273798 1477065 1494246
44732 1494246 1122157 1396329 1762410 1504239 1427618 2328641 3050650 1912357 -757582
44723 -757582 -3074952 -3875112 -3239124 -1656341 -104895 -115957 -2162478 -4543941 -5237573
44714 -5237573 -4222451 -2749482 -1381957 -439269 -1194469 -4173164 -6838228 -5714376
44706 -5714376 -1016603 3278130 4417124 3598493 3128700 3408258 4009141 5430104 7832091
44697 7832091 9571830 8999830 6794043 4811879 3419771 1610303 -888808 -3319154
44689 -3319154 -5278906 -6757523 -7028024 -5182538 -1890354 802359 1678764 1227825 285284
44680 285284 -860033 -1791328 -1860334 -1383908 -1727679 -3439677 -5399823 -6717403 -8289450
44671 -8289450 -10941942 -12723021 -10181737 -2951200 4501446 7020846 4051354 -383101
44663 -383101 -2569344 -2393487 -1465993 164033 3712239 8819567 12996901 14210491 12543042
44654 12543042 8841639 3351689 -3144065 -8081862 -8842009 -5690908 -1883575 -629937
44646 -629937 -2372630 -4744098 -4682841 -1054346 4159455 7654251 8224545 7677375 7910542
44637 7910542 8472139 8175582 7591852 7886742 8281823 7255086 5735319 6210872 8560729
44628 8560729 9718342 8074392 5260231 2641622 -636124 -4360367 -5462620 -2562959
44620 -2562959 374894 -1183519 -5487365 -6608349 -2903841 828170 254059 -3221092
44612 -3221092 -5559299 -5385210 -4135918 -3143750 -2803759 -3303418 -4204833 -4108650 -2327419
44603 -2327419 -303578 -47511 -1646761 -3410218 -3980896 -3287694 -1890508 -464582 266175
44594 266175 -79107 -1241088 -2720280 -4055041 -4505503 -3315925 -791529 1732491 3507466
44585 3507466 4969099 6230814 6447928 5697270 5864486 7939532 9778856 8785032 5846253
44576 5846253 3947401 3351069 1330785 -2899301 -6350115 -6870604 -6543754 -7839949 -8640156
44567 -8640156 -4740044 3372061 9923726 10828102 8318028 7064630 7958902 8111841 5840259
44558 5840259 2931449 1735728 2140608 2456029 2008810 1588256 1882888 2651756 3411435
44549 3411435 4069586 4652575 4950776 4708176 3910513 2777868 1646069 805070 255134
44540 255134 -193296 -319907 569814 2459570 3762536 2740035 -187205 -2721519 -3632459
44531 -3632459 -4202635 -6021326 -8484538 -9612170 -8546460 -6045022 -3162768 -771681
44523 -771681 182873 -455913 -1196330 -534120 688247 422206 -981180 -544839 3163606
44514 3163606 7807752 10571184 11633161 12439429 12336515 9706570 5509991 2635468
44506 2635468 1773152 847867 -1015908 -2055750 -1659218 -2539230 -6634703 -11011834 -11080524
44497 -11080524 -6929225 -3154330 -2397302 -2310258 18036 3473590 4822008 3424181
44489 3424181 1661318 1366469 1997261 2362462 2381597 2614965 3231270 4030649 4759392
44480 4759392 4992056 4291438 2810524 1272246 212167 -214770 346930 2347573 5262865
44471 5262865 7437717 7655672 6360879 4764420 3300478 1674888 -129773 -1970602
44463 -1970602 -4412675 -8157237 -12225906 -13868156 -11273127 -5962457 -1618747 -579127
44455 -579127 -2063279 -3689079 -3831991 -2242012 663447 4068303 6551434 6681458 4309845
44446 4309845 906589 -1633698 -2290678 -1178558 713706 1828262 1016490 -1092139
44438 -1092139 -2381401 -1705872 -391353 -272083 -941499 -487754 1389066 2904713 3073055
44429 3073055 3094390 4068413 5173700 5413326 5520700 6348355 6650463 4685375 1335150
44420 1335150 -713069 -718232 -457003 -823122 -434646 1267561 1853812 -1092548 -6064439
44411 -6064439 -8945896 -7956223 -5450629 -4581169 -5700634 -6789598 -6367311 -4816343 -3115181
44402 -3115181 -1513560 -133595 -102874 -2627962 -6635123 -8793333 -7138817 -3751328
44394 -3751328 -2164297 -2686540 -2466758 -229386 1678660 1056019 -729593 -1045492 10131
44385 10131 287287 -835340 -2075496 -2877092 -3797228 -4344877 -3105835 -538088 848353
44376 848353 58848 -873900 -159022 1134680 1406820 1514880 3126289 5326390 5379079
44367 5379079 2427054 -1689366 -5025170 -6907943 -6940560 -4957782 -2380305 -1490331 -2536570
44358 -2536570 -3287691 -2315434 -1029847 -1334985 -2802797 -3603447 -3060371 -1780129 -187606
44349 -187606 1485003 2444743 2186729 1651349 2002655 2619810 1909836 -102128 -1708713
44340 -1708713 -2078659 -2172768 -2848917 -3733526 -4462137 -5437320 -6687169 -7462313 -7671456
44331 -7671456 -8143744 -8637963 -7453372 -4409886 -2340332 -3421605 -5361552 -4034861
44323 -4034861 498520 3553768 2042286 -1409667 -2106538 610844 2928164 1802978
44315 1802978 -1110949 -1513026 2183583 6512366 6587412 1766397 -3483819 -4841059 -2890581
44306 -2890581 -1327494 -1615526 -1793051 -409303 1033008 656841 -767421 -1064497 143591
44297 143591 1045077 48900 -2420547 -4214327 -3035439 1494812 6722405 8921087 7266924
44288 7266924 4852821 4704538 5986810 5748924 3414820 1340468 1190167 2017832 2354536
44279 2354536 2203958 2052002 1470029 -29494 -1680441 -2194943 -1340942 74746 1397079
44270 1397079 2503500 3281853 3522607 3343429 3198517 3377094 3756262 4040153 4033290 3663742
44260 3663742 2869858 1603269 117092 -801448 -400699 898288 1516971 624624 -379121
44251 -379121 663641 3801885 6688015 7257150 5520540 2524838 -839768 -3148891
44243 -3148891 -2284522 2123214 6857818 7775579 4362074 32585 -2142305 -2116482 -874371
44234 -874371 1802368 5741787 8301594 6791658 2797156 1289863 4411829 8319957
44226 8319957 7925608 3249498 -1105081 -1930188 -291410 1528113 3106989 4634254
44218 4634254 4895266 2856065 209483 -144007 1817101 2771329 408239 -3283999 -4284772
44209 -4284772 -1423539 2099972 2130065 -1998286 -6614333 -7319955 -3396878 1662716 4031753
44200 4031753 3182317 1168909 -569774 -2096903 -3109710 -2324342 464032 3142514
44192 3142514 3238931 419383 -3669227 -7249312 -9384561 -9951943 -9569988 -8990725 -7891820
44183 -7891820 -5075959 -650856 3059891 4068918 3291489 2921196 2925896 1346405 -1854378
44174 -1854378 -3587805 -1415642 3031121 5844341 5241596 2936947 1598063 2130505
44166 2130505 3450426 4036936 3412055 2464629 2532299 4154575 6708646 8949844 9495634
44157 9495634 7254915 2550412 -2115199 -3857845 -2712709 -1852238 -3361933 -4988354
44149 -4988354 -2889269 2976772 8303462 9440476 7048074 4182127 2572588 2003450
44141 2003450 1958193 2161977 2065127 1298819 530565 754582 1834818 2715514 2889611 2607226
44131 2607226 1803620 114608 -1914670 -2973421 -2806421 -2734328 -3765534 -5297421 -6431644
44122 -6431644 -7405831 -8584197 -9044587 -7771098 -5762812 -5216132 -6526636 -7656133 -6870621
44113 -6870621 -4706580 -2619199 -1091928 -147638 -528525 -2741180 -5438823 -6447737
44105 -6447737 -5503003 -4496967 -4652076 -4950268 -4208858 -3269885 -3559358 -4401310 -3886945
44096 -3886945 -2301208 -2292096 -4687426 -6314395 -3969398 811607 3505961 2743471 2034291
44087 2034291 4792098 9958720 13793265 14162697 11563700 7502953 3833981 2605640
44079 2605640 4295407 6492129 6235251 3542944 931911 -254600 -891192 -1361567 -318928
44070 -318928 2767742 5809949 6391510 4620713 2317639 424097 -1281424 -2650407
44062 -2650407 -2953529 -2004555 -332130 1566413 3140219 3269035 1062145 -2705465 -5848296
44053 -5848296 -6649923 -4970047 -1701922 1978486 4743584 5407106 3699590 616565
44045 616565 -2211862 -3599672 -3589973 -3412720 -4374232 -6494405 -8483524 -9215213 -8766763
44036 -8766763 -7812426 -6670921 -5400194 -4204820 -3237183 -2566994 -2658653 -3886274 -5063743
44027 -5063743 -3916304 -236048 2866500 2774208 1331293 2499653 6563310 9644386
44019 9644386 9392751 8085109 8602899 9957763 9145851 5745480 2099351 -159927 -1279586
44010 -1279586 -1561168 -942220 -542706 -2095783 -4951011 -5790072 -2795821 1396553 2564120
44001 2564120 -252024 -4351946 -7009931 -7537653 -6065656 -2680082 1376973 3507163
43993 3507163 2281993 -761282 -3160694 -4596719 -6450480 -8871604 -10199372 -9528968
43985 -9528968 -8126510 -7492601 -7292621 -6240833 -4192325 -2279234 -1399675 -1404514 -1446024
43976 -1446024 -469212 2216434 6085543 9369282 10531536 9608455 7702985 5617909
43968 5617909 3519711 1452058 -449493 -1861999 -2032995 -458002 1651708 1800835
43960 1800835 -735561 -3418769 -3562731 -1903949 -1016850 -1006989 427849 3605604 5535344
43951 5535344 4084790 988006 -919181 -1453320 -2092030 -2741792 -1835759 973489 4266875
43942 4266875 6848883 8671477 9860934 10297537 10241108 10116175 9573859 7927256 5644188
43933 5644188 4235275 4350330 5024240 5202106 5005365 4853486 4170396 1968269 -1440827
43924 -1440827 -4083430 -4016915 -1323558 1664356 2285278 -60937 -3361074 -4882282 -3587018
43915 -3587018 -727196 1576076 2095844 1253037 654759 1725718 4252552 6304366 6099004
43906 6099004 3986092 2075203 1817801 2576356 2892517 2500306 2314906 2725210 2902467
43897 2902467 2082245 728236 -140474 -155106 578832 2203995 4500505 5989809 5299235
43888 5299235 3550739 3538380 5827877 7609803 6723177 4837232 4554465 5148162 4236213
43879 4236213 2604920 3466562 6658930 7555530 3324784 -3083518 -7464795 -9953497
43871 -9953497 -13023096 -16074885 -15942917 -12197233 -8282554 -6753373 -6200313 -4117846
43863 -4117846 -824375 1003416 -289283 -3697085 -7019026 -9145638 -10611415 -11967440
43855 -11967440 -12175381 -9641654 -4916899 -870146 656439 911268 1692802 2300527 1051643
43846 1051643 -1304440 -2308439 -1616197 -1517810 -3338059 -5649617 -6752992 -6862851 -6806810
43837 -6806810 -6239636 -4416694 -1673442 919239 2703170 3621631 3917570 4001580 3985987
43828 3985987 3339649 1812109 374358 -2747 -51940 -869492 -1193220 1437097 6385614
43819 6385614 9573647 8697879 6265802 5617164 6282420 5897344 4997598 6590424 11298301
43810 11298301 15865443 17117528 15387774 13221540 12105872 11380747 9693825 6946807
43802 6946807 4911967 5655693 8970389 12034913 12440798 10834971 9419117 8673298 7468225
43793 7468225 6111596 6760522 9812829 11961126 9852013 4779788 1545093 2474969
43785 2474969 4523094 3428340 -581693 -3114040 -1359813 2536704 4698645 4421043
43777 4421043 4166927 5625455 7934028 9796379 11265387 12633504 13128092 11902738
43769 11902738 9537646 7679212 7609416 9416402 11798783 12576864 10557684 7161641
43761 7161641 4901726 4035260 2519715 -156478 -1414749 632139 3864410 4826384
43753 4826384 3385097 2380368 3414923 5266015 6092099 5132040 2419370 -1200720
43745 -1200720 -3775358 -3807298 -2293377 -1681169 -2747545 -3973453 -3962822 -2930140 -1744987
43736 -1744987 -967833 -868457 -1060627 -308236 1854694 3689103 3168532 931666 -679434
43727 -679434 -1069185 -1375119 -1331080 574850 3281902 3088431 -905904 -4408878 -3405273
43718 -3405273 434025 2587689 2022772 1517064 2721983 4206296 4393720 3689212 3132036
43709 3132036 2981217 3265992 4145437 5112380 5130852 4177829 3695441 5024842 8057416
43700 8057416 11571230 14106274 14451945 12309293 8913849 6284043 5397771 5537361 5608267
43691 5608267 5484092 5649125 5995879 5662032 4198522 2553709 2438984 4507708 7446009
43682 7446009 9247476 9172447 7998163 6703224 5703870 5064906 4306742 2147434 -2075949
43673 -2075949 -6550769 -8231423 -6466459 -3662223 -1693811 119043 2158224 2230704
43665 2230704 -1197282 -5335627 -6072974 -3890885 -3223443 -5808239 -8263631 -7383207 -4572924
43656 -4572924 -2937460 -2395281 -446283 3332826 6152623 5407836 1670093 -1873245
43648 -1873245 -2230815 793602 4110347 4008610 58421 -4323061 -5941992 -5382344 -5165487
43639 -5165487 -5416323 -3607121 1368746 7051118 10251291 10533306 9744611 9206918 8767038
43630 8767038 8025106 7019812 5747098 4267401 3473936 4526296 7025919 8912439
43622 8912439 9019552 8699100 9661234 11049623 10481702 7756143 5400844 4970501 4847577
43613 4847577 3042669 519516 -185513 1294765 2834232 2882556 2011130 1447534 1749926
43604 1749926 3009621 4726409 5309509 3429161 279350 -1223055 -173256 968590
43596 968590 -429211 -4089003 -7759430 -9663793 -9018422 -5854842 -1854836 122524
43588 122524 -838143 -2239907 -1660948 -410537 -1289950 -3711997 -4175975 -1588632 1027283
43579 1027283 971623 -794992 -2148719 -3105733 -4516247 -5310128 -3616261 209541 3929164
43570 3929164 6319747 7628593 7487637 4828241 311591 -3366410 -4591446 -4500080 -4406828
43561 -4406828 -3316619 204080 4905677 7836791 7983498 6721702 4706332 871074
43553 871074 -4569746 -8519314 -8344112 -5354146 -2814107 -1492998 317464 2805599
43545 2805599 3683370 2051079 603398 2201622 5931499 8530229 8638138 7572012
43537 7572012 6471176 4895264 2492533 275153 -504129 275971 1868833 3512916
43529 3512916 4659307 5061394 5034679 5181141 5672420 6143678 6192360 5567363 4219655
43520 4219655 2799141 2572659 3840082 4892788 3853581 1261030 -672828 -1180416
43512 -1180416 -1478198 -2111366 -2001691 -962431 -1005499 -3589199 -7069449 -8535023 -7129004
43503 -7129004 -4120015 -769289 2239645 4113331 4431502 3888224 3276385 2447728 1552562
43494 1552562 2168593 5258915 8840196 9937559 8468899 6953160 6597075 6113527 4567336
43485 4567336 2858470 1687394 291437 -1819098 -3731343 -4699703 -5216496 -5693014 -5672522
43476 -5672522 -5071748 -4513268 -3796636 -2009119 152464 562899 -755540 -933138 1203737
43467 1203737 2754298 1452203 100442 2708923 7849303 9863453 6283924 528475
43459 528475 -2912129 -2886278 -904188 1004661 1087238 -1016127 -3274045 -3387915 -2043199
43450 -2043199 -1724463 -2394457 -1450388 1540569 3530127 2752930 1510865 2130882 2981393
43441 2981393 1168240 -2842613 -6000265 -6674835 -5491363 -3347562 -927858 676937
43433 676937 940984 772371 778295 -144902 -2594904 -4417881 -3141377 279246 2627703
43424 2627703 2606749 1383095 -254726 -2366059 -3807534 -2787627 180315 2507702
43416 2507702 3116815 3375991 4210915 4943131 5419716 6449106 7448919 6713880 5027982
43407 5027982 5608664 8670625 9467484 4572316 -2633167 -6069362 -4451051 -1047511
43399 -1047511 2322544 6599009 11231472 13246382 11686729 9313725 8189717 6577381
43391 6577381 2350922 -2945233 -6026455 -6283127 -5655936 -5022474 -3378099 -512987 1882571
43382 1882571 2381613 1388736 -89242 -1728568 -3049795 -2636991 296382 4001192 5244592
43373 5244592 2618523 -1833320 -4590685 -4011315 -1678431 -684817 -2665974 -6397079
43365 -6397079 -9235724 -9774053 -8751051 -7492176 -6244876 -4428733 -1751445 1632232
43357 1632232 5367705 8345401 8649681 5643733 1873013 1063216 3839699 7066864
43349 7066864 7944610 6907916 5535208 3701057 751222 -2008735 -2497041 -955392
43341 -955392 395111 612119 833917 1760217 2402678 1790642 165355 -1993125 -4436973
43332 -4436973 -6093372 -5263085 -1817335 2035377 3907003 3124247 267536 -3523313
43324 -3523313 -6262730 -6073405 -3540320 -1521113 -1493387 -1741127 -471509 1103837 743303
43315 743303 -1209355 -2495507 -2407164 -2301411 -3006946 -3824144 -4088532 -3867234 -2932770
43306 -2932770 -704537 2420633 4988697 6082529 5994722 5221605 3863591 2201665 919514
43297 919514 470034 719261 1104625 800347 -591347 -1894611 -963333 2470500 5680075
43288 5680075 6156994 4770934 3833910 3315230 1759950 195623 1613759 6138679 9944169
43279 9944169 10069570 7564093 4675871 1810773 -917280 -1812128 137591 2891129
43271 2891129 3806386 3247214 3400632 4497855 4641711 2896133 401775 -1343096 -1590333
43262 -1590333 -181487 1971258 2721870 855244 -1935527 -3013876 -2288501 -1765699 -2069926
43253 -2069926 -1822212 -506389 579877 826456 1491164 3489441 5949750 7917745 9707851
43244 9707851 11548456 12534717 11916776 9843919 6091825 211479 -5870393 -7993257
43236 -7993257 -4790252 -546460 -244666 -3193387 -4585169 -2310902 1180145 3282744
43228 3282744 3739088 2501866 -957285 -4913938 -5594696 -2287800 663433 -515827
43220 -515827 -3867218 -4939475 -3014594 -766133 693551 2570248 4803327 5528611
43212 5528611 4382178 3049792 2038224 37416 -2827743 -4342639 -3907346 -3720729
43204 -3720729 -4749734 -4689419 -2046662 734995 963988 -51902 360892 1478707 752816
43195 752816 -1224417 -1226127 1693148 5441754 8802887 12349838 15210475 14836320 11199750
43186 11199750 7859761 7188939 7311329 5542831 2397118 170624 -446647 -338784 -178295
43177 -178295 -523336 -2186037 -4635935 -5380341 -2845029 1200526 3809536 4347915 4106388
43168 4106388 3616514 2425269 790823 -403691 -1051631 -1574888 -1813733 -1580407 -1511298
43159 -1511298 -1798521 -1024989 1888229 5522419 7877241 9502832 12086426 14572322
43151 14572322 13982858 10428221 8003938 9353155 11989830 11903101 8848552 5861391
43143 5861391 4686894 4025013 2225185 -63566 -662945 1351540 4276685 5378860
43135 5378860 3681836 604956 -2260800 -4862375 -7317910 -8215958 -6279977 -3111362
43127 -3111362 -1873753 -3075554 -3952744 -2648156 -777668 -781067 -2710651 -5041237 -6989448
43118 -6989448 -8421741 -8767084 -7677434 -5863958 -3953623 -1567982 1102815 2078248
43110 2078248 -183855 -4155214 -6698509 -6589716 -4874890 -2468780 463864 3174950
43102 3174950 4788552 6143390 8791983 11790556 12046360 8876564 5763210 5820675 7505084
43093 7505084 7153592 4491956 2888259 4410389 7198502 8319871 7189763 5098262
43085 5098262 2831900 187141 -2809106 -5365568 -6482351 -5561915 -2976304 -514567
43077 -514567 -413545 -2923568 -5412850 -5103203 -2375968 -71691 270565 -152674 82191
43068 82191 536517 223027 -612645 -1451509 -3035921 -6127503 -9304495 -9861641 -6984473
43059 -6984473 -2606799 1043795 3497382 5456586 7392344 9108524 9782855 8289127
43051 8289127 4532286 579633 -858402 513951 2327932 2854300 3016937 4082910
43043 4082910 4837669 2908027 -1653802 -5884656 -7165927 -5730820 -3682596 -2574843
43035 -2574843 -2407424 -2184071 -822028 1980024 5061289 6203567 4023563 -318246
43027 -318246 -3953872 -5329882 -5776723 -7186579 -8681560 -7265236 -2087759 3761876
43019 3761876 6837378 7162565 6932090 6880829 6269587 5531126 6013612 7085568 6322740
43010 6322740 3243819 402240 -107844 1044387 2447741 3692980 3831256 862890
43002 862890 -5134221 -10620509 -12670360 -12479117 -12404759 -11660494 -8176207 -3122601 227351
42993 227351 1388170 2555321 3838577 2771418 -661431 -2632969 -1099444 515302
42985 515302 -1937017 -7079951 -9571376 -6978745 -2409813 -337719 -1899542 -4906739
42977 -4906739 -7113668 -8292921 -9128213 -8977595 -6068741 -502659 4263543 4743074 1754401
42968 1754401 -648660 -570154 -143634 -1322441 -2523735 -1435206 845209 1278861 -234760
42959 -234760 -286949 3160346 7440204 8182835 4773331 1224172 1277262 3833325 4683751
42950 4683751 2550626 1144030 3669879 7198416 5754836 -1189946 -6892268 -5420654
42942 -5420654 1246538 6304412 6056858 2185292 -2130221 -5026531 -5513887 -3560472
42934 -3560472 -1154395 -718491 -1669853 -707815 3561485 8336313 10232278 9389445 8292942
42925 8292942 7959980 7548331 7049036 7732035 9390467 9405279 6099020 1676568 -132366
42916 -132366 1135912 2355533 1523863 471712 1418107 2755476 1022007 -3398517 -5521406
42907 -5521406 -1739151 5516870 10594829 10760001 7967742 5476168 4504802 4124964 3050270
42898 3050270 1102482 -656230 -1246944 -1218023 -1972801 -3395102 -3476286 -1263020 1148282
42889 1148282 1143223 -813532 -1976669 -1151906 338824 1344943 2234401 3050911 2520487
42880 2520487 154801 -2181646 -2268964 -190667 2263454 4097101 5646521 7089334
42872 7089334 7945861 8188824 8492706 8731972 7221992 2605114 -3713039 -8126182 -8284793
42863 -8284793 -5312107 -2034864 195448 1794711 2684688 1768477 -741410 -2314244
42855 -2314244 -895115 2397564 4905389 5873821 6489070 7161514 7046041 6307305 6522170
42846 6522170 7982194 8480801 6057220 1680761 -1988166 -3475425 -2986717 -1101140
42838 -1101140 1433071 3125233 2663306 630794 -838060 -469135 862057 1541599 1211677
42829 1211677 850257 1248439 2029193 2318458 2059531 2221821 3561204 5524217 6788932
42820 6788932 6711376 5746558 4551421 3308896 2024517 857250 -125981 -1119891 -2344045
42811 -2344045 -3940609 -5917339 -7524683 -6945171 -2868411 3289717 8006359 9252830
42803 9252830 8423203 7793924 7303941 5454992 2604438 1171628 2326405 4391716 5422021
42794 5422021 5847252 7150363 8827625 8399800 4510706 -1200774 -5602708 -6559339 -3805805
42785 -3805805 1343502 6269531 8009902 5446034 533968 -3628543 -5904100 -7279103
42777 -7279103 -8163004 -7339315 -4404768 -1631639 -1729630 -4426783 -6790270 -6623098 -4219264
42768 -4219264 -1135330 1133029 1267176 -1290680 -5260784 -8307164 -9410265 -9314467 -8391232
42759 -8391232 -5858049 -2076082 155636 -1560143 -5927020 -9199436 -9307381 -7288118
42751 -7288118 -4998293 -3088594 -1375096 304756 2197917 4624170 7321875 9408867
42743 9408867 10227868 9635252 7486178 3821691 -194106 -2620658 -2677564 -1539566 -529854
42734 -529854 691414 3211464 6736298 9551706 10452645 9645122 7747066 5090931 2365334
42725 2365334 737195 440816 4066 -2120591 -5563571 -8499033 -9584167 -8476422
42717 -8476422 -5131796 -257566 3758387 4462802 2499369 1298361 2617162 4183348
42709 4183348 3195753 424041 -1237937 -984672 -419809 -521449 -978659 -2133222 -4604886
42700 -4604886 -6804548 -5948716 -2470260 -462532 -2223138 -5040898 -5399377 -3935084
42692 -3935084 -3609630 -4859209 -5703220 -5677395 -6450506 -8584963 -10393781 -10421722 -8934441
42683 -8934441 -6578405 -3557883 -654082 786669 612259 134689 64216 -355280 -1571264
42674 -1571264 -2700424 -3177894 -3892543 -5410513 -6335816 -5075777 -2509338 -1134794 -1655961
42665 -1655961 -2028703 -397518 2241330 3258377 1696487 -685056 -1701003 -1180140
42657 -1180140 -617291 -1010954 -1940716 -2676609 -3231176 -3901817 -4413591 -4102155 -2771528
42648 -2771528 -1147292 -588725 -2044150 -4647317 -5734161 -3530083 179881 1632775
42640 1632775 -308851 -2950898 -3870503 -3948674 -4668899 -4648347 -1722779 2739812 4825908
42631 4825908 3198058 396821 -1138937 -1595240 -1790305 -1408970 -391163 191702 -12951
42622 -12951 106616 635944 -557454 -4554794 -8498318 -8380508 -4064325 605151 2507786
42613 2507786 2203509 2069869 3263376 5315253 7577239 9826729 11523608 11384859 8465563
42604 8465563 3713967 -269210 -1697248 -1508201 -2069785 -4209660 -6447353 -7089660 -6010510
42595 -6010510 -4119334 -2022596 299336 2954215 5459950 6444629 4657199 967772
42587 967772 -1607635 -1262882 88572 -497880 -2649001 -3548392 -2664721 -2389736 -3684295
42578 -3684295 -4638935 -4522868 -5658384 -9131080 -11817073 -10495348 -6381367 -2584771
42570 -2584771 557140 4030479 5991687 3449213 -2493792 -7092195 -7801695 -6317902
42562 -6317902 -4776656 -3548659 -3297335 -5385185 -8731619 -9505210 -5981817 -1265475
42554 -1265475 851626 688652 1253999 3770771 6943564 9522837 11236898 11653932 10199976
42545 10199976 7400200 4640496 2521430 483137 -1855920 -3889260 -4777512 -4483255
42537 -4483255 -3870757 -3913331 -4650284 -4857043 -3151441 381822 4060399 6202032 6347545
42528 6347545 4855014 2125263 -1299218 -4489514 -6606214 -7431249 -7232372 -6455466 -5668197
42519 -5668197 -5334558 -5473883 -5906394 -6726471 -7880823 -8415309 -7208601 -4767242 -3267724
42510 -3267724 -4095400 -5937323 -6027793 -3072490 1427848 4553432 4540103 2338205 670849
42501 670849 1144286 2397646 1793998 -1052345 -3324245 -1994909 2763320 7566797 9006852
42492 9006852 6806948 4084257 4352948 7945031 11661043 12241682 9528768 5679014
42484 5679014 2360504 2836 -1134265 -1058305 -854005 -1483193 -1878534 -188398 3020876
42475 3020876 4905836 4019904 1755119 -309295 -2153932 -3625402 -3506744 -1709485
42467 -1709485 -190432 79013 1148090 5043732 10137695 12642187 10823958 6152116
42459 6152116 1364568 -1094128 -102937 2789452 4236996 3131487 2417255 4860025
42451 4860025 8585470 9542619 7210820 4738816 4079027 4273195 4415259 4941362 5505889
42442 5505889 4714210 2836992 1959542 2427006 1940611 -464539 -2249436 -1029767 1850934
42433 1850934 3521455 3606753 3881029 5205296 6914104 8311637 8843790 7538698 4135253
42424 4135253 242558 -2268754 -3496705 -4536051 -4932011 -3118942 713277 4147168
42416 4147168 5365479 5025900 4877336 5672653 6863163 7359552 6236630 3636830 1348769
42407 1348769 1528820 4286188 7275986 8223167 7176020 5718885 4770252 4193269 4134086
42398 4134086 5264023 7171551 7670138 5027922 650843 -1844611 -700669 2031077
42390 2031077 3476378 3681011 4772145 7173459 8929559 8906587 8312738 8218375 7833876
42381 7833876 6689318 6396083 8087114 9762977 8813717 6062833 4387282 4013919 2563681
42372 2563681 -201037 -1389595 166564 1600778 641505 -352834 2195642 7581074
42364 7581074 11587831 11505152 7840650 2395227 -2437101 -3537584 312477 5910710
42356 5910710 8892044 9339993 10752201 13469737 13448713 8801510 3275253 811596 373348
42347 373348 -686669 -1437814 343372 3059950 3160077 1069049 741081 3456869 6245839
42338 6245839 6876646 6518428 6590341 6551817 5999683 5757889 5745143 4939559 4483713 7038882
42328 7038882 11426503 12185362 7343185 2620975 3832748 8334473 9015956 4621176
42320 4621176 434888 -505622 -921318 -3098686 -4619380 -2800710 549834 1914825
42312 1914825 1152584 1018890 3139586 6672073 9806313 10844654 8960224 5507723
42304 5507723 3474256 4131278 5425633 5228455 4734425 6466346 9953144 12051002 11414576
42295 11414576 10159560 10537754 12017059 12645380 11747793 9974834 7623655 4315111
42287 4315111 153620 -3782792 -6315565 -7158526 -7042956 -7048584 -7614465 -7996066 -7020969
42278 -7020969 -4698906 -2616784 -2101956 -2447407 -2068124 -1246104 -2028251 -4687966 -6074868
42269 -6074868 -3275526 2222689 6333757 7768476 8822243 10601742 10824699 8029056
42261 8029056 5080471 5682734 9116153 11406458 10733271 8666306 6438457 3159825
42253 3159825 -1635287 -6157707 -8220379 -7552512 -5718109 -4813412 -6144715 -8798257
42245 -8798257 -9814587 -7432491 -3669273 -1641734 -1036446 847391 3874415 4649767
42237 4649767 2109784 -257322 434242 2462430 3005645 2619589 3209960 4008569 3132277
42228 3132277 1579788 1975420 3988498 4440733 2029127 -966289 -2077548 -1326583 10062
42219 10062 1223981 2039848 2254176 2266021 2990433 4864219 7531344 10202982 11531190
42210 11531190 9908075 5308630 295790 -2326413 -2435791 -1795014 -1236855 -710130 -1337186
42201 -1337186 -4420052 -8068574 -7863734 -2392811 4106119 6620284 5471159 5351317
42193 5351317 8823518 13053067 13632018 10007869 5616342 3255912 2347917 1481309 1586188
42184 1586188 4114101 6971908 5764754 48512 -4783952 -3948016 820377 4345208
42176 4345208 4919795 4890360 5723843 6264621 5661928 4575729 3117739 658491 -1738358
42167 -1738358 -1605349 1306129 4289804 5553351 6369135 8275811 10564703 11975637
42159 11975637 12772672 13563318 13819230 13075662 12065646 11327997 10224716 8637840 8020221
42150 8020221 9242597 10804992 10730453 9047964 7025474 5175061 3410684 1972473
42142 1972473 791731 -870644 -2784197 -3067268 -699139 2551071 4376190 4877388
42134 4877388 5462981 6115349 6026790 5986324 7491748 9773090 10267660 8387669 6629797
42125 6629797 7208513 9228736 10056547 8449708 5745536 4708333 7384089 13112057
42117 13112057 18314021 19129329 14841461 8469269 4016653 3495899 6196153 9840823
42109 9840823 12309917 12987199 12786097 12656068 12226943 10391613 7145484 4323034 4240833
42100 4240833 7549454 12374051 15893518 17226151 18393118 21676115 26555624 30625366
42092 30625366 33127772 35501662 38241441 39754384 39428161 39343401 40994783 42304489
42084 42304489 40336414 35645908 31444381 29366703 28512091 27921172 27330327 25799891
42076 25799891 22342488 18172193 15958090 16431051 17857249 19233888 21692840 25935354
42068 25935354 30409408 33278792 34673543 35862642 37448041 39371399 41554694 43499024
42060 43499024 44137952 42994095 40816281 38512474 36277843 34257507 33015685 32602031
42052 32602031 32071325 30767565 29325981 28547971 27947449 26410852 23950279 21816475
42044 21816475 20821019 20313931 19271937 18090745 18538096 21374247 24497145 24741823 21837886
42035 21837886 19146042 19478408 21541879 22096182 20460020 18620011 17480029 15776104
42027 15776104 13128105 11566935 12719728 15263873 16573089 15594030 12826641 8732065
42019 8732065 3857713 -118802 -1245069 594873 3451286 5425524 6291815 6734604
42011 6734604 6670209 5215205 2450400 296862 585364 2559633 3725982 3396855 3668038
42002 3668038 6031900 8831839 9592538 8268106 6268714 3839498 919660 -729155
41994 -729155 548195 2888798 2841491 621554 -102015 1910164 3519298 2339905 311769
41985 311769 284145 2028778 3820669 5428266 7180231 8187890 7887310 7618485 8454746
41976 8454746 9077566 7986446 6303026 6185441 7806870 9965315 12275190 14638858
41968 14638858 15996277 15912751 16158662 18434422 21664778 23620013 23797069 22538359 19211042
41959 19211042 14202724 10966102 12371716 16006554 16867998 14202200 11830759 11862055
41951 11862055 12218607 11098279 10000290 10817275 12927738 14705138 15567542 15434616 14431843
41942 14431843 13953702 15525332 17798267 17464907 14255447 12093100 13748892 17185519
41934 17185519 19080049 19204931 18961657 18098997 15844868 13518763 12961236 13436020 12894700
41925 12894700 11655613 12246462 15829538 20829981 24841801 26212488 24388085 20650083
41917 20650083 18048921 18671062 21278904 23303864 24423905 26062668 28113441 28952864
41909 28952864 28593591 28849017 29835850 29306540 26732358 25313810 27893411 32890775 36589342
41900 36589342 37918812 38362611 38171580 35886279 31874457 29408437 30816218 34440543
41892 34440543 36996664 37654851 38116014 39574630 41604913 43840672 46807309 50642199
41884 50642199 54550233 58212867 62372695 67118029 70869562 72399123 72969881 74983378
41876 74983378 79068225 84115830 89874621 97532092 107254516 116927315 124604190 131351624
41868 131351624 140463613 154085875 171406016 190076856 208745614 227956185 248843049
41861 248843049 271174171 292574905 309229595 317088191 313273076 298058092 275998182
41854 275998182 253500084 233878071 215689825 197036470 179927235 168102932 161591080
41847 161591080 156652445 151444337 148685789 151442316 158774826 167397885 175848093 185059272
41839 185059272 196130220 209584100 226117788 246215577 269209470 293889366 319450214
41832 319450214 344442623 365188797 376748034 375783375 362149844 338417686 308729542
41825 308729542 277323933 246811825 218022493 192064395 171383379 157318737 147466659
41818 147466659 137501679 125644061 113724159 103783857 95452956 87370507 79662264 73670185
41810 73670185 69799757 66851909 63723483 61152729 61134349 64390378 68884313 71618431
41802 71618431 71911584 72018974 74252818 78494524 83122481 87362740 91689223 96447242
41794 96447242 100963612 103703083 102882838 97675738 89367077 80466405 72125635 63575293
41786 63575293 54755250 47793194 44386428 43149615 41468548 38918882 36806045 35257679
41778 35257679 33217554 30920637 29908087 30474372 31196063 31123125 30459593 29016839 26140092
41769 26140092 22435571 19447945 17269694 14653359 11921130 11263285 13168998 14954243
41761 14954243 14341431 12580254 12363777 14185661 16431258 17843899 18250036 17770100 16868754
41752 16868754 16607715 17647644 19467198 21284397 22896601 23917369 23382184 21161551
41744 21161551 18708656 17293408 16443794 15194569 13892105 13632173 14798944 17169020
41736 17169020 20458538 23773894 25712279 26125731 26441814 26971039 25606162 21170968
41728 21170968 16534854 15684077 18366552 20371145 19120796 16536002 15914233 18054403
41720 18054403 21216186 23345578 23541406 22338869 21085845 20491069 19970566 19139259 19126578
41711 19126578 20886091 22871013 22557509 20287342 19396350 21934658 26145867 29089801
41703 29089801 30247282 31423478 34013880 37306882 39200206 38515548 37024344 38438730
41695 38438730 44047127 50042037 51272512 47494731 43583526 43328746 45540262 46919998
41687 46919998 46043291 43177963 38761771 34057956 31336307 31274858 31658424 30457565 28510778
41678 28510778 27175058 25298168 21331818 16943191 15194837 15879358 16038680 14866196
41670 14866196 14549997 15826772 16288801 14427819 12204036 11660896 11624337 10179237 8343996
41661 8343996 8358664 9511700 8804519 5708676 3566868 5511911 10844296 16288844 19384199
41652 19384199 19699463 17973944 15466255 13669180 13382729 13912988 13862241 12746531 11265900
41643 11265900 10086184 9249489 9029206 10302311 13138662 15673845 15723172 13543691 11794047
41634 11794047 12386202 14415040 15736108 15587785 14868061 14652573 15348539 16664316 17585682
41625 17585682 17113404 15871431 15963895 18013446 19507254 17937147 14633193 13027295
41617 13027295 13557510 13219020 10510941 7756521 7274479 8042009 8125564 8175488 10063238
41608 10063238 13533719 16600458 18231181 18483251 17046763 14062497 11544557 11334102
41600 11334102 12050167 10733939 7388302 5133842 5635728 7193262 8045552 8802439 10386636
41591 10386636 12039898 12980152 14041657 15997539 17912772 18719983 18806536 18482807 16700167
41582 16700167 13288842 10745741 11239028 13016465 12543150 9534420 7079990 7031411 8081551
41573 8081551 8597544 8541787 7864918 5644502 2126753 -507038 -928257 -531926 -1019582
41564 -1019582 -1667384 -807256 1154326 2280839 2152204 2410547 4208389 6663865 8165319
41555 8165319 8035975 6569424 4485925 2947018 3312569 5959170 9391050 11149203
41547 11149203 10029373 7391252 5932118 6883658 8671727 8835065 7081758 5658481
41539 5658481 6557861 9177120 11134810 10703906 7981327 4402498 1807681 1408448 2836490
41530 2836490 4500119 5498270 6736545 9363244 12520583 13755258 11770897 7987805
41522 7987805 5166850 4958660 6761409 8369307 7682836 4401890 310731 -2365319
41514 -2365319 -2901009 -2191928 -1323581 -700873 -502194 -1189498 -3192246 -6359116 -9791359
41505 -9791359 -11978209 -11330356 -7259454 -968612 5106838 8737650 8822247 5554136 469942
41496 469942 -3963871 -5863881 -5324485 -3781825 -2058844 166300 2938434 5158520
41488 5158520 5724242 4937399 4254334 4912207 6902725 8818422 8751771 6173106 3058214
41479 3058214 2173433 3886439 5696946 5407153 3542078 1771816 228759 -2056863
41471 -2056863 -4747732 -5921288 -4148222 331170 6195671 11430642 13551233 11571568
41463 11571568 8219835 8091741 12288001 16412035 15546860 10180473 5325869 4385394
41455 4385394 6065817 7426482 7622767 7523714 7498016 7495121 8367193 10904614 13538667
41446 13538667 13059871 8506488 2895416 -85235 -6372 1126149 2709317 6286808
41438 6286808 12146759 17271643 18097316 14331865 8826819 4461973 2515665 3420982
41430 3420982 7066445 11803396 14596679 13240817 8100676 1452223 -4206652 -7117262
41422 -7117262 -6878671 -5053116 -4277579 -5575763 -6956914 -5794615 -2367756 162907
41414 162907 -564868 -3523672 -5754310 -5508611 -3350371 -839253 969825 1831908 1850494
41405 1850494 1068845 -550931 -2809418 -4989947 -6098319 -5578702 -3868428 -2284730
41397 -2284730 -2259741 -4277376 -7229057 -9073671 -8635228 -6725701 -5128256 -4613849 -4471686
41388 -4471686 -3870528 -2943961 -2356762 -2432837 -3019540 -3787907 -4478082 -5193184 -6328223
41379 -6328223 -7563101 -7218300 -3971222 481617 2065357 -1228329 -6600094 -9480847
41371 -9480847 -8595714 -6622085 -6373005 -7975804 -9744881 -10192911 -8689569 -5335431 -953224
41362 -953224 3199925 5940912 6278581 3754160 -434231 -3404952 -3229713 -1284928 -382515
41353 -382515 -862426 -536663 1533547 3667957 4564847 5133024 6131506 6431176 5439002
41344 5439002 5069792 6884176 8842786 7616639 3280617 -790800 -2211055 -1544096
41336 -1544096 -463907 -141689 -1045632 -2215567 -1309144 2292289 5182261 3700407 -485829
41327 -485829 -2136807 149839 2345017 1690528 546504 1361585 2007259 -349332 -3881149
41318 -3881149 -4749119 -3067836 -2062544 -2575846 -2554683 -1305645 -194473 625595 2112211
41309 2112211 2895308 312989 -4270026 -5592917 -1761962 2566421 2669839 -138597
41301 -138597 -1845236 -1880025 -2027380 -1603632 1607187 6409774 8552264 6415628 2934846
41292 2934846 1210633 1166523 1382908 1503481 1575556 1190149 613156 1125947 3169009
41283 3169009 5567714 7295280 8344299 8237571 5835045 1829525 -641611 400239
41275 400239 3122530 4473400 3943460 3058532 2704176 3032971 4637504 7351135 8825440
41266 8825440 6856770 2603726 -843115 -2458537 -3268780 -2994877 -18128 5058460
41258 5058460 9032533 10158692 9806584 9225604 7663502 5024914 3336164 3542940 3502112
41249 3502112 1492921 -657015 -583750 655378 710680 230704 1491116 3888106 4578027
41240 4578027 3210001 2274354 2512795 1704838 -901786 -2228871 729341 6816932 12153734
41231 12153734 14064899 12419589 8746359 5344678 3947833 4074708 3663163 1906566
41223 1906566 132803 -524265 -454814 121732 1978848 4681333 5621566 3161894 -679722
41214 -679722 -2522272 -1526248 574746 2196010 2939986 2876764 2513406 2804642 3839153
41205 3839153 4402741 4060743 4294462 5946341 7124094 5906151 3739778 3308247 3900767
41196 3900767 2142858 -2731044 -7435434 -8985392 -7796919 -5752997 -3770245 -2319264
41188 -2319264 -1968606 -1971752 -200228 4016663 8410692 10384274 9799132 8094007 6068777
41179 6068777 3825846 1632048 -536012 -3265037 -6277862 -7774656 -6486531 -3433278
41171 -3433278 -395829 2320097 5211374 7779872 9194257 9972189 11051547 11610245
41163 11610245 9881311 6222332 3435335 3423726 4934408 5293391 3391577 448395
41155 448395 -1353417 -663981 1732360 3132603 1398733 -2365442 -4537111 -2842758
41147 -2842758 1374426 5194834 7294951 8206126 8472582 8044029 7199468 6719522 6975944
41138 6975944 7769995 9090221 10971902 12421582 11709033 8445664 4516088 2115700
41130 2115700 1451660 1129532 155661 -1399279 -3124847 -4422383 -4309821 -2503939 -624965
41121 -624965 -827074 -3040654 -5052323 -5556951 -5348695 -4960123 -3355119 -386918 1533733
41112 1533733 525881 -1372320 -553086 3067831 5997771 6115193 4975551 4638433 4683958
41103 4683958 3583658 1221881 -1252289 -2825701 -2841527 -1000656 1805031 3597353
41095 3597353 3177338 1178807 -1235752 -3659748 -5800134 -6775906 -6057056 -4297920 -2470472
41086 -2470472 -895313 416649 1457449 2658478 4380822 5559105 4493551 1698459
41078 1698459 56418 979819 2413109 2308140 2076740 4157505 7595281 8905246 6743812
41069 6743812 3120958 289831 -994483 -225158 2949908 6772741 7759119 4473379
41061 4473379 -552187 -3889719 -5120249 -6520239 -9550642 -12798611 -13473239 -10520325
41053 -10520325 -5968833 -2810104 -1590282 -123460 2952910 5857549 6307682 5139044
41045 5139044 5072914 6517332 7062843 5221141 2411557 784274 957409 2310541 3678692
41036 3678692 3388021 610151 -2727347 -3384673 -957041 1318793 759069 -1675207 -3413198
41027 -3413198 -3366150 -1809073 724117 2889343 2886319 1186680 949802 3498491 5264315
41018 5264315 2154911 -4347694 -8825148 -9126130 -8325266 -9070107 -9635279 -7430030 -3667338
41009 -3667338 -1792439 -2562670 -3387178 -2348055 -514011 404086 830752 2274386 4402235
41000 4402235 4958238 2760979 -689771 -3324911 -5015391 -6738991 -8062274 -7164229
40992 -7164229 -3376695 1696876 5833729 7852998 7610265 5750491 3798409 3171028
40984 3171028 3659210 4010650 4068385 4702841 5483959 4657468 2230098 753018 1669928
40975 1669928 3083713 2924448 2200923 2750908 3533674 2009469 -1821134 -5471156 -7372267
40966 -7372267 -7715591 -6620781 -4262938 -2483874 -3438439 -6510190 -9013119 -9938688 -10494662
40957 -10494662 -11009278 -10202907 -7900024 -5626515 -3937732 -1949419 -140829 -534315
40949 -534315 -3035788 -4724002 -4230537 -3706642 -4590257 -4644401 -1859452 1485611 1902256
40940 1902256 -185518 -1667684 -1502575 -882281 113766 2402008 4962447 5486462 3973044
40931 3973044 2679249 2508892 2510977 3049591 5984630 10783104 13676822 12256482 8329524
40922 8329524 4614839 1053340 -3568837 -8375553 -11220099 -11544386 -10281143 -7863492
40914 -7863492 -4477043 -1617475 -1033087 -1999091 -1599948 1671039 5913613 8021057 6899588
40905 6899588 3908099 955444 -901691 -1304535 -217287 1574894 2079391 -535806
40897 -535806 -5587172 -9764609 -10421051 -8438616 -6612767 -5756772 -4290410 -1671403 85082
40888 85082 -773057 -3395575 -6099833 -8572837 -10556831 -10209073 -6440967 -1880541 -558108
40879 -558108 -2761588 -4868855 -4525424 -3293186 -3430304 -4733572 -6020843 -7407791 -9030374
40870 -9030374 -9173624 -6112479 -1063650 2845467 4224321 4182776 3719076 2398487 -33049
40861 -33049 -2514376 -3939990 -4342628 -4100700 -3075894 -1430972 -408905 -1082073 -2560557
40852 -2560557 -2470531 481487 4847900 7628567 7101836 4422614 2329939 2245037 2885918
40843 2885918 1940083 -1235566 -5008148 -7257219 -7159959 -5372172 -3181789 -1564913 -492421
40834 -492421 883433 2846120 4111259 3075415 71098 -2643790 -3402605 -2655029 -1670308
40825 -1670308 -898678 -309603 -241276 -815110 -1204263 -591111 554926 1080899 650153
40816 650153 -200403 -1044423 -1690936 -1794316 -1397663 -1500530 -2945566 -4971905 -6020438
40807 -6020438 -5816489 -5496202 -5801520 -6380838 -6784003 -6796631 -5816268 -3477453 -1134284
40798 -1134284 -1018100 -3284393 -5454837 -5628210 -4742676 -4539801 -4690850 -3540397 -931410
40789 -931410 1259950 1260444 -805840 -3001649 -3037099 -400638 2534953 2696225 216274
40780 216274 -1414196 -120850 1842738 1662657 618059 1899441 5019627 6237853
40772 6237853 4562542 3441022 5344110 8178893 9055762 8656258 9204856 10302813 9850179
40763 9850179 7854513 6346089 6093118 6095137 6064939 6788673 7901085 7779269 6119004
40754 6119004 4391501 3164536 1269913 -1389807 -2508312 -547210 2441210 3134000
40746 3134000 1067145 -1385015 -2433599 -2414952 -2265117 -2302920 -2661028 -3421675 -4026046
40737 -4026046 -3756182 -3041423 -3131698 -4231811 -5142694 -5046413 -4362062 -3433047 -1932240
40728 -1932240 -443161 -953989 -4083909 -6969344 -6115859 -2009077 1351105 1769678 1449930
40719 1449930 3257641 6394450 7640331 5741256 2495181 -41546 -1333810 -1308449
40711 -1308449 293406 2601390 3379447 1531768 -1188126 -2352823 -1923556 -1602391 -1786530
40702 -1786530 -1198107 386317 1116606 -397603 -3201583 -5786477 -8308411 -11429552
40694 -11429552 -14012066 -13989371 -11235788 -7724116 -4806476 -2129834 478135 1955469
40686 1955469 1644408 372547 -1048933 -2804560 -4357590 -3581459 270505 3964659
40678 3964659 3386117 -943562 -3998785 -2379295 1891871 4498622 3734129 1067698
40670 1067698 -1458731 -2790664 -2935588 -2991409 -4328280 -6545769 -7230700 -5105868 -2270167
40661 -2270167 -1434868 -1893758 -672668 2739152 5644794 6503496 7094846 8956712 10274956
40652 10274956 8647431 5199269 3158916 3160300 2881355 1382036 816504 2663939 4739820
40643 4739820 4146317 1831317 1629434 4868274 8242656 7972487 4498023 1587466 1494843
40634 1494843 2583582 1920880 -993360 -3859966 -4428600 -2879516 -1228159 -850329 -1140108
40625 -1140108 -788551 58143 -257892 -2551977 -5268771 -6307301 -6002575 -6961016 -10599794
40616 -10599794 -14970650 -16752490 -14684090 -10320592 -6053648 -3267709 -2041010 -1718088
40608 -1718088 -1735651 -2278403 -3890666 -6267622 -8167323 -8935913 -9132073 -9012337 -7788094
40599 -7788094 -5574220 -4423617 -5311953 -5509760 -1972498 3420609 5726087 4146455
40591 4146455 3111590 4825003 5369436 1458634 -2914987 -1545975 4528326 8284511
40583 8284511 6888966 4830013 5735605 6660504 3733228 -742673 -1415730 2000064 4370703
40574 4370703 2526492 -1002573 -2412941 -1570802 -883783 -1410487 -2219627 -2706834 -3597075
40565 -3597075 -5481961 -7515528 -8115114 -6660446 -4248134 -2753969 -3061267 -4184517
40557 -4184517 -4402369 -3428950 -3056079 -5006225 -8243963 -9435545 -6775760 -2573986 -711609
40548 -711609 -1801951 -2660251 -1026937 1283891 1477785 169378 63779 1202642 753183
40539 753183 -2214012 -4897408 -4883746 -3294296 -2047722 -533096 2456052 5415321 5862467
40530 5862467 4362874 3728144 4602846 4946081 4080194 4130792 6401301 8919564 9160615
40521 9160615 7363229 5569368 4745773 4358738 3781675 2738334 1051405 -932462 -2233586
40512 -2233586 -2340930 -1727611 -674563 1366302 4368020 6725638 6748004 4463485 1244083
40503 1244083 -1364735 -1844659 581450 4145035 5181492 2536517 -177503 787854
40495 787854 3632794 3151156 -1785222 -6382406 -6339438 -2963813 -313675 165994 -61306
40486 -61306 61905 105107 -171463 23559 1612432 4796240 8706129 11277143 10398377
40477 10398377 6225577 1571590 -1064146 -2101637 -3472516 -5529595 -6799863 -6274748
40469 -6274748 -4599701 -3344638 -4094539 -7460457 -11667367 -13091652 -10092722 -5641248
40461 -5641248 -3946970 -4865601 -4241911 -407 4893356 6581591 5010280 2918766
40453 2918766 1998419 1846376 1461560 92191 -2480951 -5075286 -5460275 -3027532 -234967
40444 -234967 88853 -1927034 -4028440 -5055054 -5482074 -5412892 -4140331 -1682030 905647
40435 905647 2721900 3227409 1838323 -902541 -2377960 -530291 2680848 3065495 -218638
40426 -218638 -3530814 -3844591 -2135064 -487826 1201219 3604544 5628837 6328099 7129863
40417 7129863 9207610 10176120 6732241 -160230 -5936783 -8033075 -7829172 -7098582 -5747755
40408 -5747755 -3686389 -2003879 -1233379 -797001 -942299 -2721332 -5254856 -5933435 -4640152
40399 -4640152 -4683563 -7548821 -9786119 -7957239 -4037756 -2343861 -3066987 -2957191 -1232135
40390 -1232135 -261145 -522960 443698 3021363 3770238 808757 -2577899 -2437563 350167
40381 350167 1983613 1212228 -112336 -639629 -655751 -353956 171840 -410783 -3207972
40372 -3207972 -6336064 -6465331 -3579610 -1448752 -2417035 -4345848 -4284798 -2866313 -2812278
40363 -2812278 -4621853 -6301488 -6747290 -6968399 -7793177 -8305915 -7234657 -4745866 -2348876
40354 -2348876 -1685208 -3384186 -6228368 -7614271 -6044354 -3143403 -1804640 -2226898
40346 -2226898 -1587926 1707424 5450744 6760445 6087458 5878065 6257800 4830148 930749
40337 930749 -2497087 -2397195 807953 4418188 6852437 8246132 8555573 7030107 3796745
40328 3796745 657023 -447158 523136 1548542 619736 -1869470 -3133798 -1142757
40320 -1142757 2472025 3996977 2373170 601639 1405823 3336116 3217019 1182320
40312 1182320 492415 2532730 4791274 4613444 2709879 1590904 2085210 2889484 2667174
40303 2667174 1373450 -17734 -418253 202672 334986 -1362745 -3746909 -4258467 -2864161
40294 -2864161 -2797296 -5955634 -9579553 -9685429 -6275664 -2522410 158220 3094137 6679801
40285 6679801 9033933 9182490 8791183 9275331 9411609 7685887 5429613 5491259 8449931
40276 8449931 11858282 12985788 11070093 7173545 3115969 605577 372754 1695197
40268 1695197 3003183 2972264 1128014 -1911711 -4449990 -4807985 -3172404 -1763217 -2360310
40259 -2360310 -4160273 -4934317 -3844471 -2120255 -1261543 -1651690 -2830523 -4023738 -4268526
40250 -4268526 -3044878 -1146675 -148140 -664523 -1844343 -2896886 -4269879 -6635474
40242 -6635474 -9331687 -10761293 -10242976 -8706207 -7414750 -6630319 -5905023 -5222972 -5141659
40233 -5141659 -5750811 -6156615 -5520428 -4278892 -3613575 -3708845 -3358138 -1724626 189935
40224 189935 594494 -923658 -3132806 -4959312 -6583753 -8404356 -9756669 -9461915 -7347040
40215 -7347040 -4478864 -1898651 214081 1927675 2792474 2330621 998969 -128779
40207 -128779 -732717 -1494713 -2531164 -2396639 249695 4194046 6155931 4261657 260255
40198 260255 -2322627 -1646538 1447552 5206342 8552624 10973356 12009381 11489543 9770232
40189 9770232 7261471 4074496 597201 -1955833 -2379247 -1015714 237526 53464
40181 53464 -504117 930300 4948736 9063160 9993213 6906335 1910646 -2240060 -4152640
40172 -4152640 -3816713 -1886737 524911 2157450 2522666 2288118 2261311 2242509 1359925
40163 1359925 -640809 -2937118 -4440451 -4699538 -3968235 -2718511 -1329906 -162196
40155 -162196 474738 843511 2062368 4952381 8229313 8932163 5768575 1256197 -991637
40146 -991637 -596355 -89602 -489780 134484 2852318 5300058 4810700 2085516 -553475
40137 -553475 -2930659 -6207960 -9323064 -9486152 -6282375 -2421080 70872 1768400
40129 1768400 3277278 3555186 2342847 1959646 4489409 8486637 10533817 9427497
40121 9427497 7166107 6140267 6666766 7181917 6069950 3537026 1972379 3581528
40113 3581528 7292435 9451969 8415829 6624854 6544214 6481257 3229204 -2241368 -5280299
40104 -5280299 -4027866 -1994394 -2747195 -4858852 -4505708 -1164263 2215446 3872839
40096 3872839 4891414 5751181 4218559 -1276147 -7721178 -9609727 -5135383 1496496
40088 1496496 4680110 3060949 -379724 -2714586 -3760876 -4603705 -5379823 -5455736 -4682957
40079 -4682957 -3410440 -1921172 -823786 -1350594 -3978650 -7016570 -7953999 -6427551
40071 -6427551 -4637940 -4372804 -4751526 -3751398 -1122034 1351300 2153336 1510764 518917
40062 518917 -208524 -610399 -658727 -471531 -587692 -1394515 -2354554 -2522613 -1966182 -1889501
40052 -1889501 -2870411 -3724999 -3077810 -1623017 -1432506 -2779319 -3156582 -613677 2895660
40043 2895660 3278228 -511428 -4699767 -5038653 -1845692 686127 -182103 -2717667 -3484096
40034 -3484096 -1701453 410413 862394 -198818 -1833309 -3870138 -6306451 -8334845
40026 -8334845 -9096814 -8692162 -7395030 -4577412 220461 5493713 8484165 7793549 4337106
40017 4337106 27167 -3185956 -3429052 -214332 3924339 5141779 2677681 -46283
40009 -46283 162847 2306294 3047045 1125524 -1877844 -4218153 -5414923 -5395249 -4082988
40000 -4082988 -2005398 -63720 1349508 2148105 1944082 810003 95910 941331 2221580
39991 2221580 1582988 -1447633 -4841602 -6577768 -6263752 -4182413 -528546 3703802
39983 3703802 6492904 6489207 4371038 2073532 1128144 1611576 1898775 -185261 -4708769
39974 -4708769 -8484435 -8246079 -4767004 -1773779 -794429 253294 2684356 4295738
39966 4295738 2831248 -304166 -2294819 -3047141 -4253822 -5611280 -5186386 -3186304
39958 -3186304 -2216131 -3309904 -4393617 -3621362 -1943740 -1055891 -661239 567158 2541939
39949 2541939 3986927 4433914 4465430 4336855 3864200 3684901 5080550 7819864 9257483
39940 9257483 6847205 1371850 -3467936 -5067032 -4594737 -4861782 -6303933 -6657394 -4656505
39931 -4656505 -2207852 -1788715 -3059657 -3783748 -3319525 -2976662 -2784867 -306076 5888849
39922 5888849 13020781 16351405 14349494 10049863 7135731 6109492 5015777 2809574
39914 2809574 713560 468410 2320265 5013745 7106463 7925698 7668734 6993426 6391116
39905 6391116 5790073 4871329 3648445 2345582 891246 -725365 -1689409 -1087281 408793
39896 408793 1098556 1196328 3356031 8595081 13311871 12926552 7692054 2111184 -1067417
39887 -1067417 -3108522 -5317582 -6451718 -5601928 -4482776 -4594137 -4612837 -3068433 -1371979
39878 -1371979 -1402741 -2111662 -1755862 -1737573 -4295425 -7486460 -6991141 -2903239 -102592
39869 -102592 -823056 -1349197 1672613 5621545 6026113 3575449 2983108 5975850 9167063
39860 9167063 9079898 6373415 4189844 4205790 5384815 5661881 4038397 1324486 -834260
39851 -834260 -1562379 -1104310 225668 2354213 4357504 4479112 2386212 348844 693220
39842 693220 2738434 3819981 2975993 1938099 2390324 3823754 4682205 4521635 4260443
39833 4260443 4811405 6045360 6990530 6861398 5865535 4822550 4049485 3246153 2637547
39824 2637547 3221890 5198999 7096886 7456645 6567259 5412088 3861593 1531725 -373034
39815 -373034 -270263 954804 680664 -1510610 -3007990 -2191164 -921025 -1400684 -2568956
39806 -2568956 -1928052 327656 1656988 1192156 791782 1780849 3026945 3215186 3067066
39797 3067066 3826305 4919449 4881373 3879953 3506186 4135844 4134342 2179243 -764643
39788 -764643 -2479220 -1891925 -5988 1063402 -197049 -3162065 -4937883 -2803697
39780 -2803697 2483096 6772796 6942397 4367716 2647685 2717178 2297909 38730 -2281145
39771 -2281145 -2617361 -1709161 -1723955 -3168575 -4699273 -5037477 -3597260 -168218 4279622
39762 4279622 7217253 6982576 5222630 4845581 5637101 4230274 -1030489 -7319590 -10385336
39753 -10385336 -8690664 -3669264 2196193 6178730 6082120 2422174 -1065101 -1103943 1366613
39744 1366613 2713389 1229697 -1634259 -4057739 -5397971 -4857797 -1360499 3970700
39736 3970700 7332827 6220420 2792999 1373004 3068090 4673798 2991540 -1326710
39728 -1326710 -4819221 -4993626 -2201638 1672348 5300427 8380373 10614269 11087216
39720 11087216 9133394 5514016 2027682 -219562 -1615037 -2892550 -3846878 -3747350
39712 -3747350 -2576472 -1198964 -542583 -1108801 -2839263 -4695436 -4810188 -2221929 1578854
39703 1578854 3997902 4358170 4261714 4559062 3619587 -89972 -4886106 -7144813 -5385547
39694 -5385547 -1560677 1589144 2887717 2333326 185111 -2656175 -4629399 -4994450
39686 -4994450 -4599379 -4325604 -3580626 -1385288 1641621 3517389 2834005 -354659 -5027271
39677 -5027271 -9483493 -11665311 -10696100 -8112607 -6259841 -5374700 -3611103 -161780
39669 -161780 3200026 4362032 3293935 1290058 -1075852 -4060895 -7520460 -10633232
39661 -10633232 -12452681 -12138935 -9516865 -6264201 -5445078 -8344343 -12340012 -13462820
39653 -13462820 -10804775 -7004224 -4699715 -4149974 -4254501 -4055820 -2843801 -502693
39645 -502693 1537327 1184472 -1612464 -4275750 -4555410 -2941999 -1313187 -383953 437086
39636 437086 1641314 3136503 4384430 4281802 2044219 -938777 -1653643 728271 3038508
39627 3038508 1921952 -1793666 -4599882 -4944128 -3792466 -1605504 1875253 4960136
39619 4960136 4758611 1536193 -815064 -15177 1790550 2140773 2248144 4325862 7232620
39610 7232620 7931262 6044700 4032968 3530609 4137636 5331961 6931041 7784621 6515494
39601 6515494 3808574 1923977 1848745 2854626 4582150 7003842 8268229 5666269
39593 5666269 -218934 -5048273 -5912893 -4648064 -4297740 -4650087 -3699821 -1665261 -469734
39584 -469734 -81396 1497713 4481002 6302769 5221514 2800777 1621769 2111791 3044683
39575 3044683 4070612 6012014 8883248 11153810 11521570 10563753 9885974 9978227 9713536
39566 9713536 8088578 5736879 4169429 3974765 4575812 5589502 7353099 9700831
39558 9700831 11145900 10227725 7422926 4906311 4298907 5186490 6050464 6127871 5768109
39549 5768109 5158932 3704336 1331642 -365790 287993 2444158 3474901 2867999 3322799
39540 3322799 6488929 9616304 9029976 5631794 3670619 4473427 5042366 3345984 1130462
39531 1130462 -103875 -2212408 -6764017 -11234189 -12268159 -10753136 -10027634 -10423264
39523 -10423264 -9527271 -7292284 -6712735 -8817928 -10686155 -9863484 -7849724 -7433519 -8767680
39514 -8767680 -9916089 -9640726 -7846308 -4462451 293053 4998297 7626015 6994353
39506 6994353 3413392 -1324131 -4499006 -4435985 -2487450 -1649205 -2600829 -2889008 -1041071
39497 -1041071 679987 -300802 -2404265 -1848399 1466413 3208224 514756 -3959234
39489 -3959234 -5477076 -2939737 694840 2521304 1986679 -432953 -4206689 -7582555
39481 -7582555 -7701576 -3810106 758949 1828576 -896830 -4247870 -6224144 -7610974
39473 -7610974 -8766121 -7969593 -4629440 -1490690 -1123711 -2032444 -1052059 1699175 3347460
39464 3347460 2944619 2305275 2331267 1859248 594536 -121037 -475075 -2951827 -8238913
39455 -8238913 -12940361 -13388900 -9929193 -5770511 -3350151 -3391563 -5642776 -8554891 -9668642
39446 -9668642 -8187198 -6014822 -4873794 -4058949 -2666173 -2002138 -3354958 -4992968
39438 -4992968 -4224131 -1489335 314829 -43246 -1293909 -2461550 -3794274 -4972472
39430 -4972472 -4931714 -3794817 -2939287 -2924370 -3145292 -3489490 -4402565 -5371971 -5380030 -4878170
39420 -4878170 -5256310 -6330049 -6509138 -5521846 -4672756 -4281732 -3451311 -2726141 -4052982
39411 -4052982 -7151185 -8876172 -7794045 -6708237 -8463959 -11418582 -11682150 -8438047
39403 -8438047 -4418753 -1877539 -548763 615167 1824452 2790852 3068232 1737309
39395 1737309 -1930566 -6935292 -10474918 -10082843 -5897282 -821629 1752221 907354
39387 907354 -1086235 -1578747 -771226 -986933 -2903865 -4403968 -3773471 -2052394 -857216
39378 -857216 397582 3148312 6668683 8566043 7883909 5897337 4082014 3032969
39370 3032969 3250924 5085203 7487364 8408451 7136775 5150762 4107263 4031028 4171338
39361 4171338 4704534 6518521 9567426 12300122 12998506 11458962 9181123 7896750
39353 7896750 8047614 8826762 9401893 9510984 8965152 7499686 5471692 3844261 2901443
39344 2901443 1742973 -276636 -2377020 -3442683 -3569959 -3574456 -3599386 -3264780 -2605883
39335 -2605883 -1700303 58575 2923103 5423653 5570760 3306374 352318 -2180390
39327 -2180390 -4408654 -6067399 -6344670 -5687043 -5663249 -6239039 -5282593 -2006303 1155700
39318 1155700 1874934 1281305 1631583 2096080 -45225 -4526001 -7731711 -7722193 -6548771
39309 -6548771 -6322986 -5856486 -3405605 -522245 -187410 -2218368 -3634019 -3398105 -3771308
39300 -3771308 -6256368 -8889298 -9037506 -6891976 -4374566 -2037746 821950 3726617
39292 3726617 4939519 3976278 2477024 2004488 2132277 1417143 -424343 -2059567 -2182621
39283 -2182621 -1202081 -882028 -2018831 -2962747 -1547715 1553590 3065364 1411779 -1036599
39274 -1036599 -1504396 -827077 -1517683 -3084145 -2549581 431565 2345584 805923 -1961496
39265 -1961496 -2307951 118571 2599049 2869638 792384 -2378923 -4860574 -5277251 -4014287
39256 -4014287 -2961162 -3078578 -3311611 -2818202 -2776794 -4488184 -6946440 -8079856 -7522112
39247 -7522112 -6426809 -5348764 -4217517 -3832413 -5240931 -7562543 -8240219 -5960885
39239 -5960885 -2241001 200178 20447 -1617727 -1926506 940599 5494778 7892876
39231 7892876 6192070 2614054 483499 240923 194354 -11472 888283 2972962 4317881
39222 4317881 3266179 139809 -3163949 -4219898 -1678573 2571160 4066648 833308
39214 833308 -3377486 -3647377 -547000 1312581 651428 898696 3605890 5213476 2533149
39205 2533149 -2385123 -5658309 -6847042 -7819388 -8765770 -8680010 -8227508 -8841749 -9752271
39196 -9752271 -8792855 -5884621 -3402384 -3180145 -4864086 -6878141 -7532999 -5833706 -2778985
39187 -2778985 -1167395 -2487419 -4689249 -4635318 -1970354 1071187 2696281 2452353 187845
39178 187845 -3363148 -5551239 -4079790 -317951 2051366 1778721 1025017 1392798 1723685
39169 1723685 792709 -298923 -55147 808812 477003 -1160446 -2294614 -1436567 1051839
39160 1051839 3452744 4262951 3519459 2650315 2699898 3114723 3012453 2902773 3664341
39151 3664341 4363983 3214174 761764 -197429 1461867 3608618 4226312 4073540 4340199
39142 4340199 3841001 1078453 -2308428 -3172313 -1627722 -1380887 -4765149 -9769382 -13031928
39133 -13031928 -13885748 -13879366 -13559212 -11798091 -8292144 -5026712 -4258350 -5565694 -5866872
39124 -5866872 -2663561 3142027 8081125 9588691 8103822 5703883 3474899 937299
39116 937299 -2316114 -5418480 -7037869 -6944086 -6349030 -6672908 -7986598 -8625178 -6609011
39107 -6609011 -1921465 2662532 3704706 531474 -3804844 -5507623 -3816362 -1340745
39099 -1340745 -874112 -2707448 -5192214 -6893649 -7414768 -6825967 -5470982 -4219797 -3826776
39090 -3826776 -3825733 -2971577 -1123748 177442 -379477 -2001000 -2521378 -731199 2524083
39081 2524083 5337502 6439332 6140399 5924974 6910527 8494448 8776551 6465882 2110490
39072 2110490 -2467811 -5398481 -5562734 -3195637 -51052 1836487 1931730 1148061 188964
39063 188964 -761968 -733819 1557645 5074437 6441709 4186197 1125816 444598 1089443
39054 1089443 -141840 -3103513 -4294573 -2210511 621008 1645961 1380910 1249534
39046 1249534 788922 -1253186 -4615700 -7770749 -9321715 -8250385 -4244536 1098156
39038 1098156 4698020 4755362 2089229 -1797539 -6253014 -10180519 -11375265 -9053641
39030 -9053641 -5600717 -3854562 -3688514 -3002975 -938533 1859041 5061506 8358077
39022 8358077 9965284 7980902 3310225 -805318 -2353626 -1962888 -953579 -89602
39014 -89602 -357077 -2611266 -5669763 -6751178 -4830730 -1911741 17268 1562036 4088349
39005 4088349 6821564 7662304 6173399 4022312 2670207 2008036 1227867 -180367 -2427232
38996 -2427232 -5329300 -7799681 -8136180 -5358238 -182126 5321773 8941838 9660694
38988 9660694 8424617 7385571 7671814 7996903 6249714 2407184 -1191621 -2735754
38980 -2735754 -2832363 -2664151 -1544354 1891700 6526842 9031031 7993250 6000063 6293738
38971 6293738 8651256 10200455 9394238 7154847 4435482 958824 -3078476 -6064487
38963 -6064487 -6948327 -6842062 -7402533 -8585422 -9304176 -9592543 -10589723 -12471185 -13649066
38954 -13649066 -12398496 -8662392 -4014921 -218107 1962714 2604194 1594208 -1507484
38946 -1507484 -5995231 -9248996 -9085338 -6830548 -6131297 -8096241 -9618723 -7793208
38938 -7793208 -4081249 -2050295 -2368490 -2621822 -1514964 -523952 -1038047 -2202708 -2570067
38929 -2570067 -2206236 -1975503 -1827743 -1040797 288115 1043759 562489 -202591 446233
38920 446233 2642570 4096114 2587244 -946975 -3529673 -4577071 -6809550 -11474330
38912 -11474330 -15299202 -14771570 -11349929 -8996730 -7945124 -5043351 163852 4223496
38904 4223496 5339010 5785463 7140518 7142479 3816523 -617101 -2939610 -3366808 -3672848
38895 -3672848 -3250649 -690406 2301686 2449102 -185113 -2232915 -1855629 -560549 -124633
38886 -124633 -508437 -1180698 -1995547 -2219582 -885995 1330210 2520081 2199407 1634842
38877 1634842 1286156 206960 -1391970 -1345994 1482700 5280228 7612508 8145201 7832429
38868 7832429 6901443 5120981 2944132 879952 -1494201 -4488987 -6797997 -6430462
38860 -6430462 -3197233 544756 1832471 -264117 -3617773 -4807078 -2674297 35708
38852 35708 -233524 -3221115 -5076172 -3630915 -1317557 -1513786 -3870977 -5334971 -4585542
38843 -4585542 -3058126 -2015600 -1025464 332330 1303756 1405714 1607768 2953017 4762432
38834 4762432 5235938 3628485 1178325 -132671 574077 2466625 4011351 4375059 3744024
38825 3744024 2553497 941459 -1030548 -3235143 -5683928 -8160028 -9480496 -8159315
38817 -8159315 -4391810 -403647 1962738 3009021 3548073 2764546 -480864 -4900298
38809 -4900298 -7549834 -7510583 -6843491 -7318309 -7981479 -6966666 -4294009 -1610260 -92755
38800 -92755 188176 -440572 -1315348 -1194271 768344 3741934 5742171 5483886 3180627
38791 3180627 -204952 -3619958 -5875170 -5972080 -4041257 -1549900 -144372 -353946 -1482562
38782 -1482562 -2509899 -2926636 -2789413 -2085711 -260701 3121938 6960406 8492306 5658719
38773 5658719 -258272 -5287649 -6614612 -5138269 -3601195 -3014549 -2283930 -1046788
38765 -1046788 -917199 -3020644 -5853370 -7240985 -7497456 -8555324 -10238386 -9873974 -6337075
38756 -6337075 -2170694 -132936 482380 1939810 3934359 4238125 2993437 3220960 6293749
38747 6293749 9496650 9509435 6431726 2773810 -56103 -2438139 -4663568 -6225339
38739 -6225339 -6725608 -6183303 -4641493 -2445016 -522711 571723 1461196 2843349 4169242
38730 4169242 4564294 4503496 5136590 6194198 6078242 4238285 2270055 2268565 4777348
38721 4777348 8447227 11176876 11817324 11308116 11611509 12916613 12936354 10117614 6285998
38712 6285998 4204037 3534300 1723117 -1715965 -4758544 -6615295 -8549194 -10241070
38704 -10241070 -8889193 -3716139 1693323 3955439 4280558 5607426 7533162 7360229
38696 7360229 4770702 2024407 148553 -1849665 -4160538 -5581145 -5924993 -6307420
38688 -6307420 -6733932 -6016971 -4497930 -4168380 -5360177 -5959176 -4994265 -4466674 -6043580
38679 -6043580 -8084863 -7889037 -5446440 -3209149 -3148725 -5363123 -8511359 -10404377 -9305586
38670 -9305586 -5888210 -2856981 -1652865 -952050 515563 1675026 1522870 1928977 5285158
38661 5285158 10472655 14050542 14858054 14529399 13824027 11896846 9693151 10333313 14135658
38652 14135658 16131297 11514289 2259107 -4460880 -4159346 820484 5055865 5851469
38644 5851469 4504532 3280968 2700174 1840958 409279 -334050 985243 3868637 6144814
38635 6144814 6302950 4907171 3278338 1546841 -1059609 -4350996 -6746597 -7021267
38627 -7021267 -5739253 -4450531 -3849581 -3212683 -1503187 1355483 4258126 5666275
38619 5666275 4671535 1783005 -1179983 -2400703 -1691920 -686755 -1081429 -2770424 -3994483
38610 -3994483 -3163423 -183698 3718708 6821738 7736611 6440912 4798650 5115942 7509586
38601 7509586 9315376 7771388 2864340 -2938732 -7099476 -8504112 -7431941 -5252929
38593 -5252929 -3769179 -3643706 -3586394 -2108477 166470 1201295 446260 -472434 -256236
38584 -256236 427327 534824 421352 773932 791319 -939048 -3973710 -5866598 -4878540
38575 -4878540 -1967786 415044 1013887 674006 666220 726313 -625612 -3796744 -6913093
38566 -6913093 -7583517 -5492665 -2417076 39943 1569243 2060392 980182 -1358223
38558 -1358223 -3145820 -2929403 -1465144 -647944 -1139680 -2187494 -3305830 -4714039 -6160621
38549 -6160621 -6735696 -6253919 -5743248 -6087657 -7128484 -8633063 -11110299 -14643151 -17529097
38540 -17529097 -17361774 -13604170 -8327793 -4290164 -2941623 -4304211 -7593821 -11080378
38532 -11080378 -12213605 -9567304 -4958855 -2304146 -3517333 -6453676 -7913176 -7764255
38524 -7764255 -8421948 -10609565 -11855662 -10013910 -6484332 -4400159 -4651914 -5399873 -5040930
38515 -5040930 -3926851 -3072017 -2686395 -2468866 -2232862 -1746130 -913069 -549755 -1813439
38506 -1813439 -4043142 -4317161 -621736 5093661 8724905 8978366 8815288 11116492 14400517
38497 14400517 14543010 10159728 4389488 1066900 764010 1370076 1141695 -62103 -1486846
38488 -1486846 -1880235 80443 4002876 6786911 5308874 161677 -4992633 -7736853
38480 -7736853 -8441674 -7459859 -3859477 1657045 5447069 4990755 2236708 329712 -1047783
38471 -1047783 -3826313 -6662226 -6175826 -2799479 -1035664 -3005169 -5696989 -6178125
38463 -6178125 -5740635 -6410083 -6606431 -3667582 1358813 4858805 5465160 4770236 4097868
38454 4097868 3453645 3177926 3833508 4520937 3719974 1766535 323402 -347594 -1255977
38445 -1255977 -2178201 -1995588 -1421844 -2369778 -4317180 -4535111 -2642276 -1447427 -1914710
38436 -1914710 -982012 3193012 7092566 6287331 1713417 -2096594 -3436738 -4222254 -5181689
38427 -5181689 -4295467 -495280 4250645 7409839 8184500 6951456 4692144 3329870
38419 3329870 4266880 6089637 6031948 4139690 3367601 4864027 6110383 5071202 3312599
38410 3312599 3107501 4102715 5212141 7325665 11083717 13896979 12806673 9290999
38402 9290999 7523008 8131246 7421228 3333038 -1393549 -3433695 -3293010 -3442982 -4170539
38393 -4170539 -3670589 -1166572 2146327 4789863 6102418 6104884 5676348 6516774 9473885
38384 9473885 12848887 13581804 10481360 5536342 1806584 684264 1482109 2973649
38376 2973649 4536696 5803091 5908016 3868819 -64772 -3922981 -5452937 -4012171
38368 -4012171 -746169 2790678 5557461 6823200 6099102 3708554 827670 -1468936
38360 -1468936 -2884264 -3503601 -3283970 -2270050 -933909 35223 197372 -248017 -232132
38351 -232132 1583927 5105725 7913217 7288284 3419638 -447014 -1402640 588170 3767300
38342 3767300 6662504 8175179 7074830 3196426 -1287347 -3320335 -1880331 1298016
38334 1298016 3728704 4174818 3008589 1578368 1213106 2116004 3203296 3429825 2925035
38325 2925035 2329752 1693083 1021332 1422892 4342515 9518906 14656710 17273402 16231168
38316 16231168 11829453 5715273 774598 -498962 1474905 3321675 2221752 -890418
38308 -890418 -2467876 -525104 3168385 5288063 4674973 3172767 2906132 3674244 3748904
38299 3748904 2681398 2023366 3051111 4998778 6258408 6322367 5506344 3546439 -82257
38290 -82257 -4573281 -7737262 -7841182 -4926442 -440137 3688646 5751934 5046895 2378243
38281 2378243 -526173 -2175288 -1932365 -185691 1591480 1732865 211968 -1009372
38273 -1009372 -337778 1477499 2783046 3492317 4484490 5215578 4055492 1078209 -1383187
38264 -1383187 -1422485 614384 3227242 5284221 6318291 6798493 8191868 11137663 13586536
38255 13586536 12780957 9249715 6435581 5804148 5042456 2322339 -440953 -651980 944508
38246 944508 1891235 2034944 3100061 5135770 6112091 4912086 2610526 744936 -123361
38237 -123361 -328082 -908814 -2979047 -5955919 -7305924 -5706142 -3400649 -3238300 -4298186
38228 -4298186 -3200727 650775 4173084 5159151 4703880 4328350 3715693 2837306 3652971
38219 3652971 7328382 11366327 11916521 8338031 3733941 1374086 1966899 4097858
38211 4097858 6040459 7061952 7611292 8193920 8102334 6197790 3188835 1648219 2808719
38202 2808719 4705636 4867138 3616262 2868929 2592989 894463 -2447396 -5052586 -5463999
38193 -5463999 -5594023 -8047214 -12158221 -14497438 -12987490 -8955055 -5030074 -2555340
38185 -2555340 -1707107 -2710613 -5340793 -7725873 -7461401 -4416330 -1142786 247517
38177 247517 485589 1420328 3010496 3684274 3106161 2568578 2480506 1470716 -1148796
38168 -1148796 -3671316 -4098813 -2904343 -2233891 -2933967 -3837182 -3882601 -3593354 -4013188
38159 -4013188 -4971973 -5010457 -2953815 553856 3175212 2928990 324995 -1987998 -2039970
38150 -2039970 -515863 516296 202267 -641663 -1288062 -2128494 -3623329 -5044177 -4980227
38141 -4980227 -3009542 -457059 733673 -112746 -1802530 -2685097 -2448360 -2201967 -3049146
38132 -3049146 -5123757 -7750796 -9667890 -9275629 -6028190 -1881611 131457 -448607
38124 -448607 -724103 1562428 4737191 5646009 4159196 2871741 2962872 3130752 2803650
38115 2803650 3491444 5774044 7422595 6395020 3970326 2834211 3269174 3472528 2896049
38106 2896049 2802122 3517416 3509142 1950177 325889 245090 874648 6851 -2781751 -5285896
38096 -5285896 -5116938 -2316484 679349 1372226 -652745 -3779527 -6315920 -8039811
38088 -8039811 -9623080 -11005467 -11131326 -9429195 -6958855 -5650037 -6406187 -7979217
38080 -7979217 -7855838 -4822186 -864423 387087 -2126958 -5218288 -5326547 -3107256
38072 -3107256 -2009650 -2847279 -2881362 -967421 -265256 -3663309 -9062535 -12107719 -11913717
38063 -11913717 -10944068 -10358754 -9009358 -6722512 -5015266 -4109082 -2530786 -543174
38055 -543174 -739674 -3742158 -6200787 -5083392 -1695379 608667 805519 300086 396319
38046 396319 1686971 4331020 6916358 6716327 3262632 -36267 -261808 803702 -299664
38037 -299664 -3210691 -4853424 -4770869 -5125206 -5760604 -3799247 1062503 4997607 5325511
38028 5325511 3837534 3038438 2295921 110958 -2339191 -2651350 -715139 1324840 1515914
38019 1515914 -860300 -5162793 -8968786 -9542585 -7221636 -5519988 -6356266 -7392370
38011 -7392370 -6141687 -4329028 -5134067 -7750866 -8183872 -4882882 -470776 2079989
38003 2079989 2289401 1046479 -822861 -2223057 -1901571 320853 3339824 5762550
37995 5762550 6370930 4477248 1149428 -981053 -867273 -816978 -2940650 -5165577 -3860888
37986 -3860888 352823 3066427 2449799 1446642 2684954 4651013 4574595 2278163 -762310
37977 -762310 -3882393 -6795666 -8578164 -8952386 -9057030 -9419305 -8805445 -6549680 -4179806
37968 -4179806 -3048681 -2227574 -629915 738171 889914 1247696 3141078 4633926 3189804
37959 3189804 311767 -255123 1497002 1630731 -1563637 -5038762 -5791952 -4638730 -3409161
37950 -3409161 -1646559 1340518 3742563 3669274 2574023 3008858 3979992 1977287 -3398931
37941 -3398931 -7982587 -8015281 -4232844 -130526 1782524 1020105 -1564967 -4023292 -4338993
37932 -4338993 -2711118 -1659927 -2549043 -3417880 -2116980 -294774 -1565395 -6016276
37924 -6016276 -9361634 -8292812 -4380863 -1449533 -919790 -1365482 -1350222 -750104 243920
37915 243920 1653455 3010372 3240412 1655208 -1353799 -4588876 -6682196 -6749352 -4949188
37906 -4949188 -2371507 -202456 832893 438981 -1008687 -2201855 -2064169 -1468399 -2372142
37897 -2372142 -4640380 -5460560 -3194590 -191608 112961 -2258708 -4238832 -3780205 -1289296
37888 -1289296 2274918 6069537 8256552 6996536 3199895 56522 -879936 -1112116
37880 -1112116 -2120685 -3196769 -3409013 -3462167 -4010080 -4013270 -2674557 -1579991 -2866768
37871 -2866768 -6119966 -8919282 -9872034 -9444950 -8261953 -6286267 -3681072 -1185317
37863 -1185317 489255 854969 -480529 -3237956 -5997069 -7167605 -6311049 -3976354
37855 -3976354 -770195 2575644 4704148 4294425 1260449 -3208519 -7479426 -9923160
37847 -9923160 -9364815 -6225865 -2913538 -1928242 -3372049 -4916657 -4296728 -1471521 1543695
37838 1543695 2629632 1456092 -416050 -1480544 -2039618 -3246293 -4660402 -4241808
37830 -4241808 -1253941 2248054 3757132 3041019 1567569 267610 -935934 -2147739
37822 -2147739 -3281286 -4439995 -5732506 -7167843 -9100052 -11755611 -13837815 -13097244
37814 -13097244 -9282755 -5054379 -2737671 -1683357 -268604 1245492 1913396 2610937
37806 2610937 4752659 7476942 8774753 8852409 9734667 11804076 13286033 13063335 11564483
37797 11564483 9041786 5621168 2948993 2729245 3305502 1019088 -4065233 -7119510
37789 -7119510 -4957807 -559826 1029763 -1116402 -4271266 -6621165 -8217551 -8497497
37781 -8497497 -6219480 -2083628 1113394 1689240 846464 667380 1635330 2778841 3285726
37772 3285726 3211090 3109326 3627567 5239084 7728662 9756026 9478518 6340461 2179151
37763 2179151 -378464 -927578 -1592669 -3677361 -5488097 -5008206 -3371421 -3234538 -4369554
37754 -4369554 -3826752 -697012 2306033 3017189 2745976 3371925 4033316 3102554 1678674
37745 1678674 2305118 4939866 6712952 5656768 2746326 61624 -1506933 -2323070
37737 -2323070 -2877166 -3126796 -2639008 -1389414 -432931 -1025757 -2667038 -2992521 -497650
37728 -497650 3342040 5546111 4636545 1476563 -2043879 -4202245 -4134528 -2586287 -1599978
37719 -1599978 -2422928 -3957557 -4043183 -1974589 824541 2203824 947981 -2283678 -5253541
37710 -5253541 -6156493 -5575849 -5305483 -5155908 -2969583 1410783 4679452 4431920 2807323
37701 2807323 3118066 4463696 3023566 -1878285 -6376679 -7145138 -5066611 -2959580
37693 -2959580 -1940158 -1270434 -215670 1200026 2464745 2961091 2684738 2531663 2903584
37684 2903584 2413142 -415355 -4296556 -6032751 -4586903 -2335530 -1539533 -1528493 -572284
37675 -572284 1230113 2635844 3578933 4797793 5648025 4273306 319545 -3879063 -5518829
37666 -5518829 -4041888 -1119175 1463209 3083532 3687419 3060490 1356352 -371747
37658 -371747 -1232845 -1815532 -3265665 -5133972 -5628198 -4327112 -2986519 -2856165 -2875836
37649 -2875836 -1819804 -695085 -1230636 -3033038 -4067185 -3239470 -897000 2332259
37641 2332259 5336008 6050234 3491029 -94480 -1231538 749313 3437874 4606306
37633 4606306 3747550 1021837 -2767255 -5395955 -5113867 -3409377 -3328197 -5049412 -6046703
37624 -6046703 -5759812 -6519561 -8832470 -9449641 -6258329 -2124215 -1166723 -3207941 -4589143
37615 -4589143 -3291724 -912791 -122213 -1781249 -4262294 -4952103 -3200098 -1786670
37607 -1786670 -3721974 -7530632 -8374132 -4528639 366419 2797659 3581626 4359722 3567011
37598 3567011 -405351 -4660826 -4781798 -1132001 1743574 1344679 -714126 -2377401
37590 -2377401 -3316588 -3363309 -2031141 -102533 889974 1119654 2194954 4445021 6694830
37581 6694830 8471338 9930101 9837052 6442088 525089 -4990331 -8523858 -10434400
37573 -10434400 -10490645 -8004982 -4609612 -3334744 -4151615 -3774554 -780592 2589191 4887414
37564 4887414 7803642 12017443 14453867 12633366 8832056 6742217 6381682 5555551
37556 5555551 4214144 3718167 3383679 1659497 -183371 489974 2723444 2317648 -2235057
37547 -2235057 -7413748 -9254312 -7545010 -4411292 -1365736 699101 795395 -867488
37539 -867488 -2158778 -1333210 722678 1839573 1301342 -124421 -2086379 -4791496 -7321826
37530 -7321826 -7530885 -4463256 -74419 2352399 1406216 -1274751 -2926996 -2315222 -452718
37521 -452718 724939 -12477 -2402218 -4741672 -4860101 -1919793 2547080 6062444 7704892
37512 7704892 8328306 8371516 7059995 4478287 2723176 3426565 5272601 5774779 4654421
37503 4654421 3334130 1666273 -2077521 -7547788 -11368150 -11272234 -9205271 -8538212 -9642714
37494 -9642714 -10211793 -8986461 -6939222 -5079637 -3277408 -1594695 -896874 -1330009 -1605480
37485 -1605480 -774909 344697 567203 321449 994436 2705622 3972419 3580051 1769811
37476 1769811 -522625 -2577251 -3685739 -3075534 -944382 916277 575888 -1785415
37468 -1785415 -3729953 -3049230 -119097 2578956 3170330 2186147 1459505 1638637 1520462
37459 1520462 50418 -1744404 -1665797 886253 3811997 4317221 1715406 -1929389 -3746999
37450 -3746999 -2688312 -503159 57282 -1642793 -3272269 -2580995 -696472 -755855 -3261288
37441 -3261288 -4961385 -3457220 -1027208 -1877539 -6636569 -11739747 -13838090 -12668056
37433 -12668056 -9590271 -5631795 -1855797 128104 -508127 -2627152 -4139280 -3830821
37425 -3830821 -1936467 338899 1524377 943153 -453466 -954452 -61411 1177388 2010107
37416 2010107 3092462 5151799 7370949 7868198 5489643 920647 -3542296 -5487853
37408 -5487853 -4524679 -2757721 -2065697 -1358233 1612632 5917656 7642766 5247931 1929717
37399 1929717 880776 796592 -1240609 -4473642 -5552841 -3933513 -2553797 -3063039 -3706637
37390 -3706637 -2735402 -1010502 71372 855291 2053934 2959610 2712155 1987627 1857091
37381 1857091 2090078 2106343 2562037 4235565 6031696 6012260 4304428 3236902 4202272
37372 4202272 5768586 5603781 3308416 457462 -1632310 -3138739 -4657678 -5797530
37364 -5797530 -5636535 -4341865 -3335225 -3386709 -3353400 -1782931 637917 1493220 -357378
37355 -357378 -3338441 -5217180 -5604760 -5621731 -5850829 -5752306 -4922612 -3892009 -3320684
37346 -3320684 -2954878 -1890456 139237 2052026 2336190 773948 -1097364 -1554530 -386565
37337 -386565 1403832 3077777 4405987 4747301 3320364 837919 -399101 988571
37329 988571 3586143 4774683 3718902 1870007 854062 865814 1135168 1124685 1004568
37320 1004568 1364431 2515201 3787265 3778749 1916911 -345041 -722537 1168510 2880779
37311 2880779 1606614 -2473949 -5862166 -5142658 -627355 3756942 4303849 878510
37303 878510 -3649568 -6492254 -6723553 -4876059 -2514797 -2193119 -5717810 -11320791 -14141404
37294 -14141404 -11212908 -5067568 -763223 -184147 -1305188 -2411094 -4091710 -6412955
37286 -6412955 -6985276 -3909475 944248 3782309 3284139 1303936 -246861 -1125766 -1381792
37277 -1381792 -431962 1614417 3280049 3589259 3657596 5165760 7770208 9297453 8506902
37268 8506902 6629386 5764807 6350953 6812622 5685781 3606788 2636314 3527783 4475877
37259 4475877 3458785 1286492 756303 2605928 4171313 3120020 771345 -172783
37251 -172783 155222 -465624 -1905901 -1272616 2213928 4954698 3612836 -113091 -1880110
37242 -1880110 -521566 1335803 1944668 2731517 5255197 8206796 8814536 6033707 1307229
37233 1307229 -3034059 -5393135 -5647312 -4900982 -4035300 -2382207 1293728 6405069 10455349
37224 10455349 11860954 11478898 10445076 7954380 2810484 -3659862 -8142479 -8832784
37216 -8832784 -7072698 -5373058 -4914046 -5184761 -5095159 -4135540 -3149640 -3993428 -7495270
37207 -7495270 -11674843 -13202215 -11091498 -7730856 -5477105 -3610134 -299626 3285329
37199 3285329 3316932 -1648683 -8054629 -11349066 -11323153 -11403454 -13218955 -14507885 -13164661
37190 -13164661 -10903723 -10782938 -12425737 -12373852 -9101611 -5160063 -3494883 -3755357 -3838190
37181 -3838190 -3540758 -4398779 -6333907 -6777764 -3873934 888853 4210691 4300628 1805813
37172 1805813 -1798958 -5460318 -8324018 -9591736 -9263191 -8396319 -8000111 -8001120 -7755054
37163 -7755054 -7065413 -5952978 -3931592 -782630 2029866 2344240 385233 -644929
37155 -644929 1570536 5040062 5660115 2408176 -1453393 -2380933 -1786 3795606 7376160
$$ [...]
##END NTUPLES=NMR SPECTRUM
##END=
