##TITLE=31Pdec_DE-87_4k
 CDCl3, 64 sc
 24.4.2025
##JCAMPDX= 6.0         $$ Bruker NMR JCAMP-DX V2.0
##DATA TYPE= NMR SPECTRUM
##DATA CLASS= NTUPLES
##ORIGIN= UXNMR, Bruker Analytische Messtechnik GmbH
##OWNER= root
$$ XWIN-NMR		Version 3.5
$$ Thu Apr 24 15:27:12 2025 Russian Standard Time (UT+4h)  she@DPX200
##.OBSERVE FREQUENCY= 81.013821
##.OBSERVE NUCLEUS= ^31P
##.ACQUISITION MODE= SIMULTANEOUS
##.ACQUISITION SCHEME= undefined
##.AVERAGES= 64
##.DIGITISER RES= 17
##SPECTROMETER/DATA SYSTEM= spect
##.PULSE SEQUENCE= zgpg30
##.SOLVENT NAME= CDCl3
##.SHIFT REFERENCE= (INTERNAL, CDCl3, 0, 198.062)
##AUDIT TRAIL= $$ (NUMBER, WHEN, WHO, WHERE, WHAT)
$$ ##TITLE= Audit trail, XWIN-NMR		Version 3.5
$$ ##JCAMPDX= 5.01
$$ ##ORIGIN= Bruker BioSpin GmbH
$$ ##OWNER= she
$$ F:/spectra/data/she/nmr/P31/2/pdata/1/auditp.txt
$$ ##AUDIT TRAIL=  $$ (NUMBER, WHEN, WHO, WHERE, WHAT)
(   1,<2025-04-24 15:25:46.18 +0400>,<she>,<DPX200>,
      <created by zg, POWCHK disabled, PULCHK disabled
       configuration hash MD5:
       00 E9 B6 7A A2 85 ED C7 34 08 36 98 17 FE 4E 26
       data hash MD5: 32K
       0A 18 8F 20 D0 CC C1 A4 7E 0A A9 D5 2F 14 51 72>)
(   2,<2025-04-24 15:25:48.90 +0400>,<she>,<DPX200>,
      <Start of raw data processing
       efp BC_mod = 2 LB = 1.5 FT_mod = 6 PKNL = 1 PHC0 = 1560.187 PHC1 = -342.7069 SI = 64K 
       data hash MD5: 64K
       D5 F2 1C 61 BE E7 F9 D6 45 60 D3 9C D8 92 22 A5>)
(   3,<2025-04-24 15:26:21.53 +0400>,<she>,<DPX200>,
      <pk PHC0 = -145.7027 PHC1 = 424.8004 
       data hash MD5: 64K
       BD 5B C2 A0 9E B9 4B 4A 67 91 CB 12 34 BA 7E 3B>)
$$ ##END=
$$ 
$$ hash MD5
$$ 83 9B 75 AB AD 48 18 1B 47 70 55 3C 0E 3C 93 C6
##$RELAX= 
##$RELAX= 
##$RELAX= 
##$RELAX= 
##$RELAX= 
##$RELAX= 
##$RELAX= 
##$RELAX= 
$$ Bruker specific parameters
$$ --------------------------
##$DU= <F:/spectra>
##$EXPNO= 2
##$NAME= <P31>
##$PROCNO= 1
##$TYPE= <nmr>
##$USER= <she>
##$AMP= (0..31)
100 100 100 100 100 100 100 100 100 100 100 100 100 100 100 100 100 100 
100 100 100 100 100 100 100 100 100 100 100 100 100 100 
##$AQSEQ= 0
##$AQ_mod= 1
##$AUNM= <au_zg>
##$AUTOPOS= <>
##$BF1= 81.014009
##$BF2= 200.13
##$BF3= 200.13
##$BF4= 200.13
##$BF5= 200.13
##$BF6= 200.13
##$BF7= 200.13
##$BF8= 200.13
##$BYTORDA= 1
##$CFDGTYP= 0
##$CFRGTYP= 5
##$CHEMSTR= <none>
##$CNST= (0..31)
1 1 145 1 1 1 1 1 1 1 1 1 1 1 1 1 1 1 1 1 1 1 1 1 1 1 1 1 1 1 1 1 
##$CPDPRG= <waltz16>
##$CPDPRG1= <>
##$CPDPRG2= <waltz16>
##$CPDPRG3= <>
##$CPDPRG4= <mlev>
##$CPDPRG5= <mlev>
##$CPDPRG6= <mlev>
##$CPDPRG7= <mlev>
##$CPDPRG8= <mlev>
##$CPDPRGB= <>
##$CPDPRGT= <>
##$D= (0..31)
0 1 0 0 0 0 0 0 0 0.06 0 0.03 2e-05 3e-06 0 0 0.0002 0 0 0 0 0 0 0 0 0 
0 0 0 0 0 0 
##$DATE= 1745493945
##$DBL= (0..7)
120 120 120 11 120 120 24 19 
##$DBP= (0..7)
150 150 150 150 150 150 150 150 
##$DBP07= 0
##$DBPNAM0= <>
##$DBPNAM1= <>
##$DBPNAM2= <>
##$DBPNAM3= <>
##$DBPNAM4= <>
##$DBPNAM5= <>
##$DBPNAM6= <>
##$DBPNAM7= <>
##$DBPOAL= (0..7)
0.5 0.5 0.5 0.5 0.5 0.5 0.5 0.5 
##$DBPOFFS= (0..7)
$$ [...]
##$SUBNAM2= <"">
##$SUBNAM3= <"">
##$SUBNAM4= <"">
##$SUBNAM5= <"">
##$SUBNAM6= <"">
##$SUBNAM7= <"">
##$SUBNAM8= <"">
##$SUBNAM9= <"">
##$SW= 400.765351723535
##$SWIBOX= (0..15)
0 1 3 0 0 0 0 0 0 0 0 0 0 0 0 0 
##$SW_h= 32467.5324675325
##$TD= 32768
##$TD0= 1
##$TE= 0
##$TE2= 300
##$TE3= 300
##$TEG= 300
##$TL= (0..7)
0 120 53 12 22 120 120 120 
##$TP= (0..7)
150 150 150 150 150 150 150 150 
##$TP07= 0
##$TPNAME0= <>
##$TPNAME1= <>
##$TPNAME2= <>
##$TPNAME3= <>
##$TPNAME4= <>
##$TPNAME5= <>
##$TPNAME6= <>
##$TPNAME7= <>
##$TPOAL= (0..7)
0.5 0.5 0.5 0.5 0.5 0.5 0.5 0.5 
##$TPOFFS= (0..7)
0 0 0 0 0 0 0 0 
##$TUNHIN= 0
##$TUNHOUT= 0
##$TUNXOUT= 0
##$USERA1= <user>
##$USERA2= <user>
##$USERA3= <user>
##$USERA4= <user>
##$USERA5= <user>
##$V9= 5
##$VALIST= <valist>
##$VCLIST= <CCCCCCCCCCCCCCC>
##$VD= 0
##$VDLIST= <DDDDDDDDDDDDDDD>
##$VPLIST= <PPPPPPPPPPPPPPP>
##$VTLIST= <TTTTTTTTTTTTTTT>
##$WBST= 1024
##$WBSW= 4
##$XGAIN= (0..3)
0 0 0 0 
##$XL= 0
##$YL= 0
##$YMAX_a= 9076
##$YMIN_a= -10630
##$ZGOPTNS= <>
##$ZL1= 120
##$ZL2= 120
##$ZL3= 120
##$ZL4= 120
##$ABSF1= 0
##$ABSF2= 0
##$ABSG= 0
##$ABSL= 0
##$ALPHA= 0
##$AQORDER= 0
##$ASSFAC= 0
##$ASSFACI= 0
##$ASSFACX= 0
##$ASSWID= 0
##$AUNMP= <proc_1d>
##$AZFE= 0.1
##$AZFW= 0.5
##$BCFW= 0
##$BC_mod= 2
##$BYTORDP= 0
##$COROFFS= 0
##$CY= -3
##$DATMOD= 1
##$DC= 0
##$DFILT= <>
##$DTYPP= 0
##$F1P= 0
##$F2P= 0
##$FCOR= 1
##$FTSIZE= 65536
##$FT_mod= 6
##$GAMMA= 0
##$GB= 0
##$INTBC= 1
##$INTSCL= 9.790993e-09
##$ISEN= 30
##$LB= 1.5
##$LEV0= 0
##$LPBIN= 0
##$MAXI= 10000
##$MC2= 0
##$MEAN= 0
##$ME_mod= 0
##$MI= 50
##$NCOEF= 0
##$NC_proc= -7
##$NLEV= 6
##$NOISF1= 182.463
##$NOISF2= 159.3651
##$NSP= 0
##$NTH_PI= 0
##$NZP= 0
##$OFFSET= 198.0616
##$PC= 4
##$PHC0= 1414.484
##$PHC1= 82.09351
##$PH_mod= 1
##$PKNL= yes
##$PPARMOD= 0
##$PSCAL= 0
##$PSIGN= 0
##$REVERSE= no
##$SF= 81.0140089999434
##$SI= 65536
##$SIGF1= 159.3651
##$SIGF2= -187.1042
##$SINO= 113.3802
##$SIOLD= 16384
##$SREGLST= <1H.CDCl3>
##$SSB= 0
##$STSI= 65536
##$STSR= 0
##$SW_p= 32467.5324675325
##$SYMM= 0
##$S_DEV= 0
##$TDeff= 32768
##$TDoff= 0
##$TI= <>
##$TILT= no
##$TM1= 0
##$TM2= 0
##$TOPLEV= 0
##$USERP1= <user>
##$USERP2= <user>
##$USERP3= <user>
##$USERP4= <user>
##$USERP5= <user>
##$WDW= 1
##$XDIM= 65536
##$YMAX_p= 311775573
##$YMIN_p= -24179102
$$ End of Bruker specific parameters
$$ ---------------------------------
##NTUPLES= NMR SPECTRUM
##VAR_NAME=  FREQUENCY,     SPECTRUM/REAL,   SPECTRUM/IMAG
##SYMBOL=    X,             R,               I
##VAR_TYPE=  INDEPENDENT,   DEPENDENT,       DEPENDENT
##VAR_FORM=  AFFN,          ASDF,            ASDF
##VAR_DIM=   65536,         65536,           65536
##UNITS=     HZ,            ARBITRARY UNITS, ARBITRARY UNITS
##FACTOR=    0.49542278885378, 1,            1
##FIRST=     16045.7642231865, 0,            0
##LAST=      -16421.768244346, 0,            0
##MIN=       -16421.768244346, -24179102,    0
##MAX=       16045.7642231865, 311775573,    0
$$ Real data points
##PAGE= N=1
##DATA TABLE= (X++(R..R)), XYDATA
$$ [...]
44533C601480n56444j372837J21964J544078J132405N2906J27058J075268J297866
$$ 3601480 3045036 1672199 1794163 3338241 4470646 4523552 4650610 5725878 7023744
44524G023744K31516j287913k292766k370216j632486p22056l74320m98547k65075
$$ 7023744 7255260 5967347 3674581 1304365 -328121 -1050177 -1424497 -1923044 -2188119
44515b188119N50134J094765P61145J23664m6849O7238j66661q20275j491822
$$ -2188119 -1637985 -543220 217925 341589 294740 361978 195317 -624958 -2116780
44506b116780j812996j422812j69155J219518J550234P95974L33448R20660J573869
$$ -2116780 -3929776 -5352588 -5521743 -4302225 -2751991 -1956017 -1622569 -701909 871960
44497H71960J319979Q08737R20163R35788k19471j731039j801573m32229N90805
$$ 871960 2191939 3000676 3920839 4856627 4637156 2906117 1104544 672315 1263120
44488A263120M26754M6987J64977J38984m62733q42366m26038j3611m01166q71459
$$ 1263120 1689874 1736861 1901838 2040822 1578089 735723 309685 296074 -105092 -976551
44478i76551k67673J060240J606664Q04814k62350l65694L88636Q88004M26359
$$ -976551 -1244224 -183984 1422680 2227494 1965144 1599450 1988086 2876090 3302449
44469C302449n91437j316750j489541j464654j311833n30780R68964K187422K057733
$$ 3302449 2711012 1394262 -95279 -1559933 -2871766 -3402546 -2433582 -246160 1811573
44460A811573Q56462j63884l80928k64863l42526n50734o68117n96351j28157
$$ 1811573 2668035 2504151 2123223 1858360 1515834 965100 296983 -299368 -427525
44451d27525P98228J558661J391046N57328M2681M669l70376j204165j409758
$$ -427525 370703 1929364 3320410 3877738 3920419 3925088 3554712 2350547 940789
44442I40789m77975M33749J66497o72666p63059j27593J81116k8366M8665N48575
$$ 940789 462814 896563 1063060 390394 -372665 -500258 -319142 -347508 -298843 249732
44432B49732N60080k56426q71797l89068M85281L33103r78401k014675j538667
$$ 249732 809812 553386 -318411 -707479 -222198 110905 -867496 -2882171 -4420838
44423d420838K8236J186759J058931R8407p75172j195221j258040r27760j60476
$$ -4420838 -4392602 -3205843 -2146912 -2048505 -2823677 -4018898 -5276938 -6204698 -6365174
44414f365174N68509O07196J34635J78597J288176K646974K898981J605480l66010
$$ -6365174 -5796665 -5189469 -5054834 -4876237 -3588061 -941087 1957894 3563374 3197364
44405C197364j673381j596534o15145J2753m14022j145269r22863K53370J112387
$$ 3197364 1523983 -72551 -687696 -674943 -1088965 -2234234 -3157097 -2903727 -1791340
44396a791340R81032O35591Q14689R45735K38635p87771j011527m51389j53126
$$ -1791340 -810308 -174717 639972 1585707 1824342 1036571 25044 -426345 -579471
44387e79471n65541j101223j226443r92826m98927K23040P53020O56492L44939
$$ -579471 -1145012 -2246235 -3472678 -4465504 -4964431 -4741391 -3988371 -3331879 -2986940
44378b986940N40533Q24317P794j662055k102022j55464K403262K979041J541230
$$ -2986940 -2446407 -1622090 -1614296 -3276351 -5378373 -5533837 -3130575 -151534 1389696
44369A389696L58971O73448J346239J082387L20753J838k20433j128097k058694
$$ 1389696 1748667 2422115 3768354 4850741 5171494 5173332 4952899 3824802 1766108
44360A766108j531418L27710J543587R00868n13594j095015q98341r57996j285947
$$ 1766108 234690 562400 2105987 3006855 2493261 1398246 499905 -458091 -1744038
44351a744038r42459K17249J217079J434364J257824J096621P88362K76737j15223
$$ -1744038 -2686497 -2469248 -1252169 182195 1440019 2536640 3325002 3601739 3486516
44342C486516m35852j125527j848780j408302M29461K017711J762701K59218o25354
$$ 3486516 3050664 1925137 76357 -1331945 -902484 1115227 2877928 3137146 2511792
44333B511792l14542L5468n23188j516867j930602j395683k47956R06642J434625
$$ 2511792 2197250 2232718 1709530 192663 -1737939 -3133622 -3381578 -2474936 -1040311
44324a040311J046122J90748k96041p8980M73838R43832J210523J100479L36474
$$ -1040311 5811 196559 -99482 -178462 295376 1239208 2449731 3550210 3886684
44315C886684q23931j429371q94714K3531m863j047067j545175l46358J405440
$$ 3886684 3062753 1633382 738668 762199 757336 -289731 -1834906 -2181264 -775824
44306g75824J436936n55525k191951j471185N52920J383584N67506j19002L17910
$$ -775824 661112 105587 -2086364 -3557549 -3004629 -1621045 -1053539 -1172541 -854631
44297h54631Q08814K88645p21714j314604j451975j198505j71246J255256J632869
$$ -854631 -45817 242828 -478886 -1793490 -3245465 -4443970 -4615216 -3359960 -1727091
44288a727091N18269m98081j81930L20665m83326j669914j258382N38778J668186
$$ -1727091 -1208822 -1706903 -1888833 -1568168 -2051494 -3721408 -4979790 -4441012 -2772826
44279b772826J384871Q48156P24198L44179n61946j204843j154180q25057l47080
$$ -2772826 -1387955 -539799 184399 528578 -33368 -1238211 -2392391 -3217448 -3564528
44270c564528N05510J157259O46166o49777j301004r17328l10759L00779J244712
$$ -3564528 -3059018 -1901759 -1255593 -1905370 -3206374 -4123702 -4434461 -4133682 -2888970
44261b888970J647678K28917j874283j850843M35024J751656M76524p25120P20038
$$ -2888970 -1241292 -1012375 -2886658 -4737501 -4302477 -2550821 -2074297 -2799417 -2079379
44252b079379K960756K634427J26779j328701o77657P5030l68241r60880p06408
$$ -2079379 881377 3515804 3642583 2313882 1636225 1711255 1343014 382134 -324274
44243c24274j65478Q0948N28484J538336K401581K240312R48224r36156k457547
$$ -324274 -489752 -408804 119680 1658016 4059597 6299909 7248133 6311977 3854430
44234C854430k556046j199623J16753J78436j46819N86665J679543J180869o31894
$$ 3854430 1298384 98761 215514 393950 247131 833796 2513339 3694208 3062314
44225C062314j160731N03980J909013Q86572j208298j782601r46602q15491j699510
$$ 3062314 1901583 2405563 4314576 5201148 3992850 2210249 1263647 448156 -1251354
44216a251354j613798K27094J814278J304959j94179l99593O76368R57166k88915
$$ -1251354 -2865152 -2638058 -823780 481179 287000 -112593 563775 1520941 1232026
44207A232026j289266n71409P85199Q67453l21027j280902j385459j229505j073396
$$ 1232026 -57240 -628649 156550 1024003 702976 -577926 -1963385 -3192890 -4266286
44198d266286o05625p9130m4848m2512P07591J388536M65583j323944j314132
$$ -4266286 -4871911 -4951041 -4995889 -5038401 -4330810 -2942274 -2476691 -3800635 -5114767
44189e114767J024156K907513K360776R62628P46466Q93678r2850j147353n35911
$$ -5114767 -4090611 -1183098 1177678 2140306 2886772 3780450 3687600 2540247 2004336
44180B004336O84560L26703j003049j018608J8655k06952j645685j716373R4508
$$ 2004336 2688896 3015599 2012550 993942 1012597 805645 -840040 -2556413 -2461905
44171b461905J153189J44541q33350r2603Q61998K93904o83800k37220J026099
$$ -2461905 -1308716 -1164175 -1997525 -2090128 -1228130 -934226 -1618026 -1855246 -829147
44162h29147J318613N96029R4516R2664M6656J8288K41400R2794q97715j744593
$$ -829147 489466 1085495 1180011 1272675 1319331 1337619 1579019 1671813 774098 -970495
44152i70495j234955J52419R49158P84631M92951N87053P70761O32679j3989j022503
$$ -970495 -2205450 -2053031 -1103873 -319242 173709 760762 1531523 2164202 2150213 1127710
44142A127710j551349o23891J283309K224598J179466o02430j504345j524001
$$ 1127710 -423639 -1047530 235779 2460377 3639843 3037413 1533068 9067
44134I067j288876n30620R14310J775880Q35826j010536j823584j131560O4506
$$ 9067 -1279809 -1810429 -896119 879761 1715587 705051 -1118533 -2250093 -2185587
44125b185587R94533J284326L47165j528993k302592n33648J937204K010756j93215
$$ -2185587 -1191054 93272 440437 -1088556 -3391148 -3924796 -1987592 23164 -170051
44116a70051j384575J17635K159518K148821M77576p70904q69074o21191n01680
$$ -170051 -1554626 -1436991 722527 2871348 3348924 2578020 1708946 1087755 586075
44107E86075j71092M76059R36411Q45618M80222L65858O07461P35013L07243m15038
$$ 586075 414983 891042 1827453 2673071 3153293 3519151 4126612 4861625 5168868 4753830
44097D753830p94118q04399r61093j104908l76931J052655J576811M82688p01033
$$ 4753830 3959712 3155313 2194220 1089312 712381 1765036 3341847 3824535 3123502
44088C123502o12527l64137j436129k566308j447194J167306K100669N12422j007783
$$ 3123502 2510975 2146838 710709 -1855599 -3302793 -2135487 -34818 477604 -530179
44079e30179o33781L61911M59316K45690M47679J76168j001496j441084K1662
$$ -530179 -1163960 -802049 -342733 -97043 350636 526804 -474692 -1915776 -1894114
44070a894114J735261J669175N88941M24508Q58373K39031j035171r60848N13925
$$ -1894114 -158853 1510322 2099263 2523771 3382144 3621175 2586004 1625156 2139081
44061B139081J163557j2440j439149j723718j544126j844835k021700j140065
$$ 2139081 3302638 3290198 1851049 127331 -1416795 -3261630 -5283330 -6423395
44053f423395L70557J428876J758501J649764J133821L75958J38362P85882J356160
$$ -6423395 -6052838 -4623962 -2865461 -1215697 -81876 294082 432444 1218326 2574486
44044B574486O97526p46276j330782l86725R06678J075857J13730p22595n04797
$$ 2574486 3272012 2525736 1194954 808229 1714907 2790764 2904494 2181899 1677102
44035A677102M23051J035001Q22481K17262r7670k9731j4261k41515l60284j33583
$$ 1677102 2100153 3135154 3957635 4174897 4077227 4047496 4033235 3791720 3431436 3297853
44025C297853j9233o10625j576692j744864n33290J125153J787519J193751L35603
$$ 3297853 3278620 2667995 1091303 -653561 -1186851 -61698 1725821 2919572 3255175
44016C255175q0874m10765j033031j408611r15911o0956Q4368n81449j131122
$$ 3255175 3174301 2763536 1730505 321894 -594017 -654973 -570605 -1152054 -2283176
44007b283176j023196o55494m12628q7082M62967R15949J135511J443163J786647
$$ -2283176 -3306372 -3961866 -4374494 -4461576 -3998609 -3082660 -1947149 -503986 1282661
43998A282661J426878J08898j138929j211091m62094j34961n29992p29706j72614
$$ 1282661 2709539 2818437 1679508 468417 6323 -128638 -658630 -1388336 -1560950
43989a560950M61540L37618k59426l73613J97730O06712J72104o56854r54235
$$ -1560950 -1099410 -761792 -1021218 -1394831 -1197101 -590389 -418285 -1075139 -2029374
43980b029374o04906l06527l26722o0471P93540J371035P34057o47932j441603
$$ -2029374 -2634280 -2940807 -3267529 -3328000 -2534460 -1163425 -429368 -1077300 -2518903
43971b518903j251497q98349r29905q75656k14805P85025J519879J654303J079865
$$ -2518903 -3770400 -4668749 -5598654 -6474310 -6689115 -5904090 -4384211 -2729908 -1650043
43962a650043P64p86963n41349K94627N05309j29135n12283j7600N86106N77621
$$ -1650043 -1649279 -2436242 -2977591 -2682964 -2177655 -2306790 -2819073 -2836673 -2250567 -1672946
43952a672946M43680P40199R11472L56225k42502O6016P90965O33467n16217j446076
$$ -1672946 -1229266 -489067 422405 778630 536128 602144 1393109 2026576 1510359 64283
43942F4283j351399o24444O6543N56454R19106J092245R30342L60059m03878p43710
$$ 64283 -1287116 -1911560 -1845017 -1288563 -369457 722788 1653130 2013189 1609311 865601
43932H65601k79872K72738j89162j294748j298246K77384J530968Q82850n26945
$$ 865601 585729 858467 669305 -625443 -1923689 -1646305 -115337 767513 240568
43923B40568p75617k37158n79249j508211j039099J077782K601224J921363l5097
$$ 240568 -535049 -772207 -1351456 -2859667 -3898766 -2820984 -219760 1701603 1666506
43914A666506j557717k018437j395946K82456K142729K604430J300285k83293
$$ 1666506 108789 -1909648 -3305594 -3023138 -880409 1724021 3024306 2741013
43906B741013q29975o90940o64375n79810n9315M13986K57847j79975k75666j32388
$$ 2741013 1911038 1220098 555723 -24087 -83402 330584 588431 408456 132790 402
43896D02j55678k72216k34764r2395J28554N07914O72535J02944o80078m60220
$$ 402 -155276 -427492 -662256 -754651 -626097 -118183 554352 657296 -22782 -483002
43886d83002O59898J026980k3402r63022n41912R5340o35313j961949j861611
$$ -483002 176896 1203876 1180474 217452 -324460 -229120 -864433 -2826382 -4687993
43877d687993j87787J257987J398478Q24211K48360k63757m82962q899O87451
$$ -4687993 -4875780 -3617793 -2219315 -1395104 -1146744 -1410501 -1893463 -1902362 -1214911
43868a214911N24835o13124j619454j605211o51955P48192J871675J585803n41693
$$ -1214911 -690076 -1303200 -2922654 -4527865 -5179820 -4431628 -2559953 -974150 -1515843
43859a515843k873635k984455o98169J561011J932224J183169Q93984J043194
$$ -1515843 -4389478 -7373933 -8072102 -6511091 -4578867 -3395698 -2501714 -1458520
43851a458520O33512k83666o48188p5613O62880P73201K37615m71366q49075n88572
$$ -1458520 -825008 -1108674 -1756862 -1832475 -1169595 -396394 -158779 -630145 -1479220 -2067792
43841b067792J19339N65230K58149l46831k78815P35822J807741J768742L98806
$$ -2067792 -1948453 -1383223 -1125074 -1471905 -1750720 -1014898 792843 2561585 2960391
43832B960391j320743k180109j915791j282453r52021o94092N6753J149658J775984
$$ 2960391 1639648 -540461 -2456252 -3738705 -4690726 -5384818 -5328065 -4178407 -2402423
43823b402423J481233O21475j46992l76830O5210Q32814J080375K39071j109161
$$ -2402423 -921190 -299715 -446707 -823537 -758327 74487 1154862 1393933 284772
43814B84772j693627r66177M42792J590104J875887R71286r21439k583682k596932
$$ 284772 -1408855 -2375032 -1932240 -342136 1533751 2505037 1583598 -1000084 -3597016
43805c597016j079659K68134L06038k56761k31591L88432R17823J205535J362194
$$ -3597016 -4676675 -4408541 -4102503 -4359264 -4590855 -4202423 -3284600 -2079065 -716871
43796g16871J007366n8230r69919p95879l3440J35298k08627P3859J076008J473381
$$ -716871 290495 232265 -737654 -1533533 -1566973 -1431675 -1640302 -1566443 -490435 982946
43786I82946N95190n56488r81133j079967j497869j708984r75088Q3049K83114
$$ 982946 1578136 1021648 40515 -1039452 -2537321 -4246305 -5221393 -5138344 -4855230
43777d855230j48476J13286J211767J663386P21227j79733N58910K117512K167200
$$ -4855230 -5003706 -4890420 -3678653 -2015267 -1294040 -1473773 -914863 1202649 3369849
43768C369849J65974j750932j630632j81138N75451J98906m6527M02197N69529
$$ 3369849 3535823 1784891 154259 -26879 548572 747478 700951 1103148 1672677
43759A672677j19017o33681o8434O58756K55328o14199k16496J274611J611990
$$ 1672677 1553660 919979 851545 1510301 1765629 1151430 934934 2209545 3821535
43750C821535k55752k429377k526321o55970J186511J742539J267644L88968m43197
$$ 3821535 3565783 1136406 -1389915 -2045885 -859374 883165 2150809 2539777 2096580
43741B096580o89704j84019K45956k73665j207853j260974m07991M6713m02622
$$ 2096580 1406876 1222857 1468813 1195148 -12705 -1273679 -1681670 -1634957 -2037579
43732b037579p02834j12884N37150L20918k02121j0487O01992N42349k44817p06541
$$ -2037579 -2740413 -2853297 -2316147 -1995229 -2197350 -2207837 -1605845 -1063496 -1308313 -2014854
43722b014854l29719K29078K78452R12j0779M46828J038923J193003N62805m81118
$$ -2014854 -2344573 -2115495 -1837043 -1836131 -1846910 -1400082 -361159 831844 1394649 913531
43712I13531r93112m95853L29864M68383j60634p98995r66338q31018o32241m07222
$$ 913531 -79581 -575434 -245570 222813 62179 -736816 -1703154 -2534172 -3166413 -3573635
43702c573635k25938j13030J49608N96727P16399J92366k97093J07980J056695
$$ -3573635 -3799573 -3912603 -3762995 -3166268 -2449869 -2257503 -2554596 -2446616 -1389921
43693a389921J384374P82124L9111l07232m17452k41855N19546J314696R63096
$$ -1389921 -5547 776577 815688 508456 91004 -150851 368695 1683391 2646487
43684B646487n20315j586641j262577m05540j41030k51047l4019L24859L23885
$$ 2646487 2126172 539531 -723046 -1128586 -1269616 -1520663 -1554682 -1229823 -905938
43675i05938J95325L00062K55043k45225m73453K97411J421150J708342J102223
$$ -905938 -710613 -410551 -155508 -400733 -874186 -576775 844375 2552717 3654940
43666C654940L86617k38417j043920j673729j472571o69877n4419K72065O56105
$$ 3654940 4041557 3803140 2759220 1085491 -387080 -1056957 -1111376 -839311 -183206
43657a83206P50594m6846j200071j455887o42195K16527N29961N86726M25053
$$ -183206 567388 520542 -679529 -2135416 -2777611 -2561084 -2031123 -1444397 -1019344
43648a019344k82712j074077q77291L19793J267610J222469O79577J51357l84752
$$ -1019344 -1302056 -2376133 -3253424 -2933631 -1666021 -443552 236025 387382 2630
43639B630n89237Q3536R21405L97313j267879j869728n62592N34943l46825j534520
$$ 2630 -586607 -503071 418334 815647 -452232 -2321960 -2884552 -2349609 -2696434 -4230954
43629d230954l95592K289090L124007J000273j357391j260837O01245J676652
$$ -4230954 -4626546 -2337456 786551 1786824 429433 -831404 -230159 1446493
43621A446493Q79063q21966k162673k596296j920038j52845J945206L026142K398622
$$ 1446493 2325556 1503590 -659083 -3255379 -5175417 -5328262 -3383056 -356914 2041708
43612B041708Q69680j36491k43878l71998j164243j871013j466190l64613N3084
$$ 2041708 2911388 2774897 2531019 2159021 994778 -876235 -2342425 -2707038 -2653954
43603b653954m46541n31936O01527J841314J674559L27091n97246k50175O01371
$$ -2653954 -3100495 -3632431 -3030904 -1189590 484969 812060 214814 -35361 566010
43594E66010P95402J41695o01866p38681l90764k25821m71481n43575o229N29672
$$ 566010 1361412 1503107 901241 162560 -228204 -454025 -925506 -1469081 -1475310 -945638
43584i45638K42403m74713n30194J4603r88o99163o77228O20923J614276Q66497
$$ -945638 -703235 -1177948 -1708142 -1693539 -1694527 -2393690 -3070918 -2449995 -835719 30778
43574C0778o32181r53447m2183N92020L55380M2649J15773J33177q6880j52476
$$ 30778 -601403 -1554850 -1597033 -1005013 -649633 -606984 -491211 -358034 -444914 -597390
43564e97390r6292m28794r60839p27098N23798J684544J599038M22810o61364
$$ -597390 -693682 -1122476 -2083315 -2810413 -2286615 -602071 996967 1419777 758413
43555G58413p30659k231L94604k81184j218826q63210Q01484J830008R49208n65287
$$ 758413 27754 25523 420127 138943 -1079883 -1943093 -1141609 688399 1637607 1072320
43545A072320q77072k74588j25255j63182Q35615K140942J528626j024333k660181
$$ 1072320 195248 -79340 -204595 -367777 467838 2608780 4137406 3113073 452892
43536D52892j580586N08223J119486L06000k27118J07020M99878L22741l96674
$$ 452892 -1127694 -619471 500015 806015 578897 685917 1185795 1508536 1111862
43527A111862j410295k101528j614810r1349R97683O94229j03349j22433L89608
$$ 1111862 -298433 -2399961 -4014771 -4106120 -3108437 -2414208 -2517557 -2639990 -2250382
43518b250382M71670L18674Q71924J992291K458788J657185J57092j241074k048664
$$ -2250382 -1778712 -1460038 -588114 1404177 3862965 5520150 5677242 4436168 2387504
43509B387504j902272q54870K55791N92452L11283M5788j75639n81329p38075
$$ 2387504 485232 -369638 -113847 478605 789888 835676 660037 78708 -659367
43500f59367j96759K99788l34877j578173j694218k73237J102618J191132O61806
$$ -659367 -856126 -556338 -891215 -2469388 -4163606 -4436843 -3334225 -2143093 -1481287
43491a481287N67768N51500k28365j248427j122270K95568J549751J491107O00970
$$ -1481287 -913519 -362019 -590384 -1838811 -2961081 -2665513 -1115762 375345 976315
43482I76315M5313J19091K06924r8305n16563p01114p38116p69374n75831N024
$$ 976315 1021628 1140719 1347643 1249338 732775 31661 -706455 -1475829 -2051660 -2046636
43472b046636N34758M37599r0066k75859P6938L29005J01582j01746J96913N61846
$$ -2046636 -1511878 -1074279 -1164345 -1440204 -1363266 -1034261 -932679 -1034425 -837512 -275666
43462b75666K69163o07783j307598j260661m31465P95518J628519J309791J25343
$$ -275666 -6503 -614286 -1921884 -3182545 -3614010 -2818492 -1189973 119818 245161
43453B45161n88061j29872M91734N8908r11120r24564J74071J020134P86940P1738
$$ 245161 -342900 -472772 18962 77870 -833250 -1757814 -1583743 -563609 223331 295069
43443B95069l97537o07807n30128J24491R48793R30414J19975q6964Q44146J426108
$$ 295069 -102468 -710275 -1240403 -1115912 -167119 763295 883270 796306 1640452 3066560
43433C066560L76332j188168j344734k70473L12925J14329N21493J700674J692118
$$ 3066560 3442892 2254724 909990 639517 952442 1066771 1588264 3288938 4981056
43424D981056n62073l077105l298662j560451k74033l23999l06907O29832J307622
$$ 4981056 4418983 1341878 -1956784 -3517235 -3791268 -4115267 -4422174 -3792342 -2484720
43415b484720P26145L598O05748J762471J498283k21542j325834p64261J13570
$$ -2484720 -1758575 -1754977 -1149229 613242 2111525 1889983 564149 -200112 -86542
43406h6542J7427k45821M58271J234383M98167j128911j461359j54511P74065
$$ -86542 -69115 -314936 143335 1377718 1875885 746974 -714385 -868896 -94831
43397i4831K98033K1128J261668K459083J432790j036626k169254j194236q0032
$$ -94831 203202 224330 1485998 3945081 5377871 4341245 2171991 977755 897723
43388H97723k11804o40394l06960J05066k32096n83268j30889K08052o79554j755669
$$ 897723 685919 45525 -261435 -156369 -388465 -971733 -1102622 -894570 -1574124 -3329793
43378c329793j185335N05088R86099j71404q07951K36355J272955P29013k04485
$$ -3329793 -4515128 -4010040 -3023941 -3195345 -4003296 -3766941 -2493986 -1764973 -1969458
43369a969458L01213J608157J782249P26459j24776m84503j174302j776315r15639
$$ -1969458 -1668245 -60088 1722161 2448620 2323844 1839341 665039 -1111276 -2026915
43360b026915R20764J420180K4673r51065J5220J127075K00084j708679j921595
$$ -2026915 -1106151 314029 338702 -612363 -597143 529932 730016 -978663 -2900258
43351b900258l11209O62470j53370j017592j52261J606691K078766O93130q97899
$$ -2900258 -3211467 -2548997 -2702367 -3719959 -3872220 -2265529 -186763 506367 -391532
43342c91532r21592N04382J636902J135718n08578j748924j800226j063014k7479
$$ -391532 -1313124 -808742 828160 1963878 1455300 -293624 -2093850 -3156864 -3184343
43333c184343J106637J597889M13991j905925k962819j319639J352834K331497
$$ -3184343 -2077706 -479817 -65826 -1971751 -4934570 -6254209 -4901375 -2569878
43325b569878J261264o560l48092l17403m17438l41191j50915m63435r83645m43903
$$ -2569878 -1308614 -1315174 -1663266 -1980669 -2398107 -2739298 -2890213 -3353648 -4337293 -4781196
43315d781196J317108K646546K294361J086068M14933K03262m16485j238764j223943
$$ -4781196 -3464088 -817542 1476819 2562887 2977820 3181082 2764597 1525833 301890
43306C01890k65664N45513M38484k37338q41447j221358j383197j080140k30400
$$ 301890 36226 581739 1020223 782885 -58562 -1279920 -2663117 -3743257 -3973657
43297c973657O13612P54027K78771P7411P23770J611913J570214K83426j267034
$$ -3973657 -3360045 -2606018 -2327247 -2249836 -1526066 85847 1656061 1939487 672453
43288F72453j847985j133165K18015J199634J073038j06778j309409j373500l09231
$$ 672453 -1175532 -2308697 -2090682 -891048 181990 75212 -1234197 -2607697 -2916928
43279b916928P49256J055142R38502P34881J37993p15291o84162P53772K254663
$$ -2916928 -2167672 -1112530 -174028 560853 698846 -16445 -700607 53165 2307828
43270B307828K224684Q97902m54044j483749k389415k463312j013510P75035J030144
$$ 2307828 4532512 5430414 4976370 3492621 1103206 -1360106 -2373616 -1598581 -568437
43261e68437M1096k10416P11324J212806N79023o5517j72380o53109j548647j327525
$$ -568437 -527341 -737757 -26433 1186373 1765396 1699879 1527499 874390 -674257 -2001782
43251b001782L08039J323666N34396m38979j69066o8921j705711l429457k533597
$$ -2001782 -1693743 -370077 164319 -274660 -443726 -512647 -2218358 -5647815 -8181412
43242h181412M52658K510381K486697J943667J935355J636393M56562q00929j496602
$$ -8181412 -7728754 -5218373 -2731676 -788009 1147346 2783739 3240301 2439372 942770
43233I42770k049890k667782k680197j748062n41624K75311P65108J107795J160255
$$ 942770 -1107120 -3774902 -6455099 -8203161 -8744785 -8469474 -7704366 -6596571 -5436316
43224e436316Q68736M39126P9331R9242Q28535J715378J307714o88864k210890
$$ -5436316 -4567580 -4128454 -4049123 -3949881 -3121346 -1405968 -98254 -787118 -2998008
43215b998008j364220N62142P25303r65795j624149K52898K633290L036370J642127
$$ -2998008 -4362228 -3800086 -3074783 -4040578 -5664727 -5411829 -2778539 257831 1899958
43206A899958J04087r22374j560702j433076k84338R49906J170636O69548M58782
$$ 1899958 2004045 1081671 -479031 -1912107 -2196445 -1246539 -75903 593645 1052427
43197A052427N88272L48158k28657l01411L95782J107856J109107M79903k79612
$$ 1052427 1640699 1988857 1760200 1458789 1854571 2962427 4071534 4551437 4271825
43188D271825q48576j139763j131819q46759m15532j27347l07512r19296j361546
$$ 4271825 3423249 2283486 1151667 304908 -110624 -237971 -545483 -1464779 -2826325
43179b826325j034709j14585O37008Q35149P72533P31715N73876J94217j36475
$$ -2826325 -3861034 -3975619 -3338611 -2503462 -1730929 -999214 -425338 -231121 -367596
43170c67596j77318j16759l19931q55001j328244j089938J31570J527940J646804
$$ -367596 -544914 -661673 -981604 -1836605 -3164849 -4254787 -4123217 -2595277 -948473
43161i48473J77792j176426n99723J338019K274178J173622m02917n26987P13111
$$ -948473 -770681 -1947107 -2546830 -1208811 1065367 2238989 1836072 1309085 2022196
43152B022196J681329J233836l62971j996772k634159k043514r56079k55367K1413
$$ 2022196 3703525 4937361 4574390 2577618 -56541 -2100055 -3056134 -3311501 -3290088
43143c290088M32430J005051J105818M91462k62377n18406j25995P54508J622750
$$ -3290088 -2857658 -1852607 -746789 -255327 -517704 -1036110 -1162105 -407597 1215153
43134A215153J553695J06236j702674k336757j627803o68322J2267P80739J488860
$$ 1215153 2768848 2875084 1172410 -1164347 -2792150 -3460472 -3448205 -2667466 -1178606
43125a178606J434001R32433J069979J445973K74760k369034l620050j678215
$$ -1178606 255395 1187828 2257807 3703780 3978540 1609506 -2010544 -3688759
43117c688759J302443K130858Q81844N7161N14502P15827l05852j517630j668355
$$ -3688759 -2386316 -255458 626386 683547 1198049 1913876 1608024 90394 -1577961
43108a577961p90221L98646J288704J386064O58976k0723K01070Q25395O18192
$$ -1577961 -2368182 -1969536 -680832 705232 1364208 1343485 1544555 2369950 2988142
43099B988142n17980j401369j297805o80534j70772K18969N68484O78369M62463
$$ 2988142 2470162 1068793 -229012 -909546 -1080318 -861349 -292865 385504 847967
43090H47967N0025n38168j151362j089712J88792J924187K494869J213041r00346
$$ 847967 897992 359824 -791538 -1881250 -1692458 231729 2726598 3939639 3039293
43081C039293k189491j762182l7897J504906J413531k15937j585676j243135J50647
$$ 3039293 849802 -912380 -950277 554629 1968160 1752223 166547 -1076588 -925941
43072i25941R03847N86486J46605K01856N32952J034027J771749K125955J238302
$$ -925941 -22094 564392 710997 912853 1445805 2479832 4251581 6377536 7615838
43063G615838n35698j839252k087445j824348j299925j65451J147829J314322
$$ 7615838 7080140 5240888 3153443 1329095 29170 -136281 1011548 2325870
43055B325870L6853j221992j201962m48706j84484n49817p97859m78131L01765
$$ 2325870 2362723 1140731 -61231 -509937 -694421 -1244238 -2042097 -2520228 -2218463
43046b218463J144425J339602L12480j362740k191148j577879n98523l37596l89847
$$ -2218463 -1074038 265564 578044 -784696 -2975844 -4553723 -5152246 -5489842 -5879689
43037e879689J33139R59808J129785N76826J34693K07207L86302L08490J16936
$$ -5879689 -5746550 -4786742 -3656957 -3080131 -2945438 -2738231 -2351929 -2043439 -1926503
43028a926503R0443L96449J123293K017999K305417J346335m78117j935487k061322
$$ -1926503 -1836060 -1439611 -316318 1701681 4007098 5353433 4875316 2939829 878507
43019H78507r39263N11479J329008J234413P36068M04211R7295p12305j852942
$$ 878507 -60756 450723 1779731 3014144 3750212 4154423 4251718 3539413 1686471
43010A686471k310403j460874L4305R29283O78863j90406o48631J5609J485200
$$ 1686471 -623932 -2084806 -2050501 -1121218 -442355 -632761 -1281392 -1265783 219417
43001B19417K432712J824929K98443n22989k35316j41440j052830j779725q65880
$$ 219417 2652129 4477058 4775501 4252512 4017196 3875756 2822926 1043201 177321
42992A77321J021599J826046R15970j88931m2509R00576J126775m514j668601
$$ 177321 1198920 3024966 3940936 3752005 3709496 4610072 5736847 5732333 4063732
42983D063732k530913j969415n98362K59141j13968r33753o73048J077709K813874
$$ 4063732 1532819 -436596 -1034958 -775817 -889785 -1823538 -2496586 -1418877 1394997
42974A394997K564146Q9786k692187l608811k318385k95210R84071J298402J177959
$$ 1394997 3959143 4048929 1356742 -2252069 -4570454 -4865664 -3881593 -2583191 -1405232
42965a405232R39652O73412N61163N41039J25351p10847r68308N9268J337855
$$ -1405232 -465580 207832 768995 1310034 1435385 724538 -243770 -184502 1153353
42956A153353J252044P613o35460r7226K94823k05617m25819M93753J244423L60801
$$ 1153353 2405397 2413010 1777550 1680324 1975147 1769530 1343711 1837464 3081887 3442688
42946C442688j188583j355086j55404N82882K31593j2718M10787M54713m40588
$$ 3442688 2254105 899019 743615 1326497 1558090 1545372 1956159 2410872 1970284
42937A970284j140649p18766p2184l91863j152219j038442j32421L09816p8262
$$ 1970284 829635 110869 38685 -353178 -1505397 -2543839 -2676260 -2366444 -2444706
42928b444706l61248K6772M70729L37107r5896l16410l26430j92236L78497J344946
$$ -2444706 -2805954 -2779182 -2308453 -1971346 -2067242 -2383652 -2710082 -2902318 -2523821 -1178875
42918a178875J857389J280289K54677j04674K38432L89088R4m14519n82662p66283
$$ -1178875 678514 1958803 2213480 2108806 2347238 2736326 2736420 2321901 1739239 972956
42908I72956q14217j40772R46185J128538k4727j187346j184934o84496q66384
$$ 972956 158739 17967 964152 2092690 2067963 880617 -304317 -988813 -1855197
42899a855197j419880j268988n31374j81524k54207N972N09139M79273R9880L09986
$$ -1855197 -3275077 -4544065 -5075439 -5256963 -5511170 -5505198 -4996059 -4516786 -4416906 -4106920
42889d106920R31938P41062l42928q35942O4260J344035J816544J481449P48212
$$ -4106920 -3174982 -2433920 -2776848 -3612790 -3548530 -2204495 -387951 1093498 1841710
42880A841710k63877j110983j122058o32800p00353j184670p94753M76164R54272
$$ 1841710 1577833 466850 -655208 -1288008 -1988361 -3173031 -3967784 -3491620 -2537348
42871b537348J01292m28499L12470Q39587j9876q41371j15482Q82761J85907j410438
$$ -2537348 -2436056 -2864555 -2552085 -1712498 -1732374 -2573745 -2689227 -1806466 -1620559 -3030997
42861c030997j612613k57955R54527J527263K250376K752219J724393m81702j972170
$$ -3030997 -4643610 -4901565 -3947038 -2419775 -169399 2582820 4307213 3825511 1853341
42852A853341k095271j858389j609818p00123M47868M63024l67367r6829J598018
$$ 1853341 -241930 -2100319 -3710137 -4410260 -3962392 -3499368 -3866735 -3963564 -2365546
42843b365546K550293J498443P1904M9253O06064m7172j717023k627642j935669
$$ -2365546 184747 1683190 1755094 1804347 2410411 2363239 646216 -1981426 -3917095
42834c917095m39077P39056J126003Q51101L12548k25128q14677j319230j112125
$$ -3917095 -4356172 -3617116 -2491113 -1640012 -1327464 -1552592 -2367269 -3686499 -4798624
42825d798624n8841P50531M68456J08034J029918K321666J875809q2243j110821
$$ -4798624 -4857465 -4106934 -3638478 -3530444 -2500526 -178860 1696949 1614706 503885
42816E03885m97357k59989j285170j378064J066390L896533L996135J523934r01141
$$ 503885 6528 -253461 -1538631 -2916695 -1850305 2046228 6042363 7566297 6665156
42807F665156j936450k185068k088469j411730m40599J12461J79887N0500m43603
$$ 6665156 4728706 2543638 455169 -956561 -1397160 -1284699 -1104812 -1054312 -1497915
42798a497915j263460j492221o59491J46717m9508l15071N70246J642284J079252
$$ -1497915 -2761375 -4253596 -4913087 -4766370 -4815878 -5130949 -4560703 -2918419 -1839167
42789a839167n52072p88970R39828K320567J540851k55833q49306J32487J239800
$$ -1839167 -2391239 -3180209 -2240381 80186 1621037 1365204 515898 648385 1888185
42780A888185J293801M94107j87780r0803N59357R28639M83907m51620j143029
$$ 1888185 3181986 3676093 3488313 3397510 3956867 4885506 5369413 4917793 3774764
42771C774764j157630n14250L99429Q88533N64027M3235J55008L27315q38969
$$ 3774764 2617134 2102884 2502313 3390846 3954873 3998108 4153116 4480431 3641462
42762C641462k928906l452628j349601J051730J277471K72655M93985J755252
$$ 3641462 712556 -2740072 -4089673 -3037943 -1760472 -1487817 -993832 761420
42754G61420J729456l4177j448480j247182m06672P2979L68951L64064o08902
$$ 761420 2490876 2456699 1008219 -238963 -645635 -572656 -203705 160359 -448543
42745d48543j822555j294450J085736K716535J843070p351o25336l23261o67970
$$ -448543 -2271098 -3565548 -2479812 236723 2079793 2072442 1447106 1123845 455875
42736D55875j438687j063279N58617J692829J182106k80882j395881j625299j159332
$$ 455875 -982812 -2046091 -1487474 205355 1387461 1106579 -289302 -1914601 -3073933
42727c073933l98424K57301N82303O29405M88829J34543k93654l84510Q8544Q49921
$$ -3073933 -3472357 -3215056 -2632753 -2003348 -1514519 -1379976 -1673630 -2058140 -1969596 -1119675
42717a119675J380101J203377N1346j638366k506615j506502N13224J497662P78249
$$ -1119675 260426 1463803 1515149 -123217 -2629832 -4136334 -3623110 -2125448 -1347199
42708a347199j25066J95032J113950J236300N51950J15706J79635m5328q62408
$$ -1347199 -1472265 -1277233 -163283 1073017 1624967 1740673 1920308 1874980 1012572
42699A012572j414311q38394M90600J243685N95951p32819j171496k56203N93126
$$ 1012572 -401739 -1240133 -749533 494152 1090103 357284 -814212 -1070415 -477289
42690d77289k1684j270129j091834O81059J838166R20297p90331j380653r59918
$$ -477289 -498973 -1769102 -2860936 -2179877 -341711 578586 -211745 -1592398 -2552316
42681b552316q30202j114361q61740O1428P54179P46881M10935M5682l34433m65061
$$ -2552316 -3382518 -4496879 -5358619 -5297191 -4543012 -3796131 -3385196 -3339514 -3673947 -4139008
42671d139008j45802P9929l88533j011605o96016N33308J564679J821251J660180
$$ -4139008 -4284810 -4204881 -4593414 -5605019 -6301035 -5767727 -4203048 -2381797 -721617
42662g21617J186726P2678j168176j176759K72191J477588R46161n44091j052982
$$ -721617 465109 537787 -630389 -1807148 -1534957 -57369 888792 344701 -708281
42653g08281q2267J015384J007088J56505m63039k52886N83887J456474J771373
$$ -708281 -790548 224836 1231924 1388429 925390 672504 1256391 2712865 4484238
42644D484238J223714Q5004q88604j115840p81895o06973j019294j728512k130230
$$ 4484238 5707952 5792956 4904352 3788512 3006617 2399644 1380350 -348162 -2478392
42635b478392j890687j049596J22675J110236J321160P20710R5825J84851P01789
$$ -2478392 -4369079 -5418675 -5296000 -4185764 -2864604 -2143894 -2048069 -1863218 -1161429
42626a161429Q12116M16016J52929J49489k15233r98379j220741l60324O19531
$$ -1161429 -349313 66703 219632 369121 153888 -844491 -2065232 -2425556 -1806025
42617a806025O43989J65498L01653Q74953O75601m53461j225357r50445o82708
$$ -1806025 -1162036 -996538 -694885 180068 855669 402208 -823149 -1773594 -2456302
42608b456302j500141k535299j916264N36350K690984K598199Q57715k58223K71286
$$ -2456302 -3956443 -6491742 -8408006 -7871656 -5180672 -2582473 -1724758 -1982981 -1711695
42599a711695J137879P66210n13419j144990n73875K92977O35561O04793N93700
$$ -1711695 -573816 192394 -321025 -1466015 -2039890 -1746913 -1111352 -506559 87141
42590H7141O76090R45077J392478J315890O5159j402168j254934L63325R93165
$$ 87141 763231 1708308 3100786 4416676 4481835 3079667 1824733 2188058 3181223
42581C181223n47269k047292j131230R51866J137403p94137k051065j115180M63429
$$ 3181223 2633954 586662 -544568 407298 1544701 750564 -1300501 -2415681 -1952252
42572a952252R55013O78078M57813K6847p42645p64796N62512J871242J606558
$$ -1952252 -997239 -319161 138652 165499 -577146 -1341942 -779430 1091812 2698370
42563B698370L55543j79262J42532p8366j309599k240841j704909k53824P19730
$$ 2698370 3053913 2874651 3017183 2938817 1629218 -611623 -2316532 -2570356 -1850626
42554a850626O82361K19488J4365J20822K06095J42309J35709L44867O35487Q27918
$$ -1850626 -1168265 -948777 -934412 -813590 -607495 -465186 -329477 15390 650877 1478795
42544A478795R30428R17915N88236k9354m67254m64614m16403o01822m91397K88648
$$ 1478795 2409223 3327138 3915374 3886020 3418766 2954152 2537749 1935927 1444530 1733178
42534A733178Q10504o3311j689612k237167j320202m31722m16171k49835R02034
$$ 1733178 2543682 2480371 790759 -1446408 -2766610 -3198332 -3614503 -3864338 -2962304
42525b962304K100109K275055K012342K256178K394408J260143p62467k228089
$$ -2962304 -862195 1412860 3425202 5681380 8075788 9335931 8573464 6345375
42517F345375k632509k430510j669554k84259O94436R0310j349693j652059n21103
$$ 6345375 3712866 1282356 -387198 -671457 22979 113289 -1236404 -2888463 -3409566
42508c409566K33316m48483j326885q72877O60632K032212K627416K392055J275941
$$ -3409566 -3176250 -3624733 -4951618 -5824495 -5163863 -3131651 -504235 1887820 3163761
42499C163761k58510j088873p98379m27506r01220j463699q17173P32416J536075
$$ 3163761 2905251 1816378 1017999 590493 -310727 -1774426 -2591599 -1859183 -323108
42490c23108Q53075k60482m29191M84351J495982J633554P76416l45036r10674
$$ -323108 529967 269485 -159706 324645 1820627 3454181 4230597 3885561 2974887
42481B974887q10998m96954j45541L66091N85869l42421k028333k447536l66504
$$ 2974887 2163889 1666935 1521394 1887485 2473354 2130933 102600 -2344936 -2711440
42472b711440K557202L454999J685619p11660j777127j430075n26770L32726O56733
$$ -2711440 -154238 3300761 4986380 4274720 2497593 1067518 540748 873474 1530207
42463A530207Q9222p86656p78165J99616Q37239M73143J63494P89540J350279
$$ 1530207 1619429 832773 54608 254224 1091463 1564606 1728100 2517640 3867919
42454C867919N03856j132248j838275j392195j098385j411223j308454l08033
$$ 3867919 4371775 3239527 1401252 9057 -1089328 -2500551 -3809005 -4117038
42446d117038N35136L39992k01125k5202O80077J015534Q01634M74212N8489p02425
$$ -4117038 -3581902 -3241910 -3443035 -3468237 -2788160 -1772626 -970992 -496780 -438291 -1140716
42436a140716j413985j245837j94051O74119N42313j28501k70364L99417J057596
$$ -1140716 -2554701 -3800538 -3994589 -3320470 -2778157 -2906658 -3177022 -2777605 -1720009
42427a720009Q27741j18855p06084j72443J062333J897634J742421R43003J78894
$$ -1720009 -892268 -1011123 -1717207 -1889650 -827317 1070317 2812738 3755741 3934635
42418C934635j44775P2918O96651J265839J220356M44087o46071j594695k136698
$$ 3934635 3789860 3862778 4559429 5825268 7045624 7489711 6843640 5248945 3112247
42409C112247j958700q57169O25329J317614O11879q24044j828229j852998j091753
$$ 3112247 1153547 296378 921707 2239321 2851200 2027156 198927 -1654071 -2745824
42400b745824q0578M95713K39275k86329j4912R68618J112641l94067j955423
$$ -2745824 -2826402 -2330689 -2091414 -2377743 -2392655 -1424037 -311396 -705463 -2660886
42391b660886j406450R85189K805299K599266J206983o8234j024480j782691j901426
$$ -2660886 -4067336 -3082147 -276848 2322418 3529401 3461167 2436687 653996 -1247430
42382a247430j207797n06233m89847o70145k93506L09071K77508k89663m09881
$$ -1247430 -2455227 -2961460 -3451307 -4121452 -4414958 -4105887 -3828379 -4118042 -4527923
42373d527923L49471J331917J678475J141189P5082q16858q18296J23061J050432
$$ -4527923 -4178452 -2846535 -1168060 -26871 48211 -768647 -1586943 -1463882 -413450
42364d13450Q73119l38064j352254j124768J94506J549014J903090R80194m71202
$$ -413450 459669 121605 -1230649 -2355417 -2160911 -611897 1291193 2271387 1800185
42355A800185j197277o82056J90391K15366n31159r20268n88497m82621j141161
$$ 1800185 602908 -79148 111243 326609 -204550 -1124818 -1713315 -2195936 -3337097
42346c337097j495514l95711J358381J850089P46796k16930K30363J165604J013008
$$ -3337097 -4832611 -5228322 -3869941 -2019852 -1273056 -1489986 -1259623 -94019 918989
42337I18989k06487j215544j384290j094377n77749L06337J159097J171536M33765
$$ 918989 712502 -503042 -1887332 -2981709 -3559458 -3253121 -2094024 -922488 -488723
42328d88723N484L11742N61091K56077J13764O76406J091897M16202o79898q15321
$$ -488723 -483239 -171497 389594 645671 759435 1435841 2527738 2943940 2264042 1448721
42318A448721p094M66446N7063n27340p51283r13243j188620j189728q51853p55263
$$ 1448721 1441627 1908073 1965136 1437796 686513 -226730 -1415350 -2605078 -3456931 -4212194
42308d212194j098385j173563l69742R19430J805076J835770J175757L62402M4668
$$ -4212194 -5310579 -6484142 -6853884 -5934454 -4129378 -2293608 -1117851 -755449 -710781
42299g10781L98183O82086J305j394587k268961j946962r28832J41577J167947
$$ -710781 -312598 369488 370793 -1023794 -3292755 -5239717 -6168549 -6026972 -4859025
42290d859025J976242J993988J104388O1574m60127n73432n43565k18823M09946
$$ -4859025 -2882783 -888795 215593 277167 -182960 -756392 -1299957 -1518780 -1108834
42281a108834Q11378O31276K14012j2820l7215J59357O99068J133285O61491m87239
$$ -1108834 -297456 333820 547832 535012 497797 657154 1356222 2489507 3150998 2663759
42271B663759r85855l73228J05393m83803j141691n86777N49626P32745l8956
$$ 2663759 1677904 1304676 1410069 926266 -215425 -802202 -252576 480169 441213
42262D41213m97291l35258m02075q05355o08845L07459P26967O3875n03812K31772
$$ 441213 -56078 -391336 -793411 -1598766 -2207611 -1900152 -1173185 -1109310 -1613122 -1381350
42252a381350J603503J943020Q64469l35899n12803o0384j05197q45619j398937
$$ -1381350 222153 2165173 3029642 2693743 2180940 2120556 2015359 1169740 -229197
42243b29197j223058p94564m35571N41960K400611L458512J800733j596867l440442
$$ -229197 -1452255 -2246819 -2682390 -2140430 260181 3718693 5519426 3922559 482117
42234D82117k276715j49705O52134M25658L82282K50330n47947j045063l06695
$$ 482117 -1794598 -1944303 -1292169 -866511 -484229 -233899 -781846 -1826909 -2133604
42225b133604M67150j90744j163253m01659J402244J708234L07164m35959L71087
$$ -2133604 -1666454 -1857198 -3020451 -3422110 -2019866 -311632 -4468 -440427 -69340
42216f9340R05004P0834o75512p0573Q47567P37423N3380k08406j64759j99669
$$ -69340 835664 906498 230986 160413 1007980 1745403 1798783 1590377 1425618 1225949
42206A225949J092M42495L38183l17742k49748R25967J613399N78787j100882
$$ 1225949 1227041 1669536 2007719 1689977 1440229 2366196 3979595 4558382 3457500
42197C457500j763604j465230j190854j044307o28817j04557M23206J417437K600174
$$ 3457500 1693896 228666 -962188 -2006495 -2635312 -2739869 -2316663 -899226 1700948
42188A700948K483929O25757j024168o74882O52816Q04607l23392j220108j396897
$$ 1700948 4184877 4810634 3786466 3111584 3764400 4569007 4245615 3025507 1628610
42179A628610j477493j325371k22788J373381K137693J782083J097693M35781
$$ 1628610 151117 -1174254 -1397042 -23661 2114032 3896115 4993808 5429589
42171E429589l21063p50156m87659l25269r85530j399661k07468J527853J429213
$$ 5429589 5108526 4358370 3870711 3545442 2559912 1160251 952783 2480636 3909849
42162C909849n04024j722863q94058M81477P51853K23867k10133n62491q47690
$$ 3909849 3405825 1682962 788904 1270381 2022234 2246101 2035968 1473477 625787
42153F25787l84432Q88547J753047J358645L66475l27755p74283j108166q29806
$$ 625787 241355 1129902 2882949 4241594 4608069 4280314 3506031 2397865 1568059
42144A568059J08676O66012J38564p71444j151241j090611q82035j99520Q83221
$$ 1568059 1676735 2342747 2481311 1709867 558626 -531985 -1414020 -1613540 -730319
42135g30319J191942N3727j278975j154034J57536R72369N85167j33506l22551
$$ -730319 461623 515350 -763625 -1917659 -1760123 -787754 -202587 -336093 -658644
42126f58644j41377j32101m17352o72562m55678L23993R87746O02253o45405j196161
$$ -658644 -800021 -932122 -1349474 -2022036 -2477714 -2153721 -1165975 -563722 -1209127 -2405288
42116b405288N2084K147897L108939K197942M24179r00800j270459q35953l8300
$$ -2405288 -2353204 -205307 2903632 5101574 5525753 4624953 3354494 2518541 2480241
42107B480241M93610K88269n28278j386088j795446j532495o31268M41533R34610
$$ 2480241 2973851 3262120 2733842 1347754 -447692 -1980187 -2611455 -2169922 -1235312
42098a235312N92827K5597j15033K9448J0593j1355M26735J081962J130355L75840
$$ -1235312 -642485 -616888 -731921 -702473 -691880 -703235 -276500 805462 1935817 2311657
42088B311657l73471l80026J36244N49482Q32000J424541K175658K055061L89696
$$ 2311657 1938186 1558160 1694404 2243886 3075886 4500427 6676085 8731146 9120842
42079I120842j887668k916958k001151l91663L83148K95528K41839L43372l4817
$$ 9120842 7233174 4316216 2315065 1923402 2306550 2602078 2843917 3187289 3152472
42070C152472q18423j058109m04482L57795N63377M61858M28379L90363M51019
$$ 3152472 2334049 1275940 871458 1229253 1792630 2254488 2682867 3073230 3524249
42061C524249J026395J806969J662438L53195o51658m3338J399321J795225N66644
$$ 3524249 4550644 6357613 8020051 8373246 7721588 7678250 9077571 10872796 11439440
42052A1439440j098713j840893j362664l54836J32457m89500j645470k065805
$$ 11439440 10340727 8499834 7137170 6782334 6914791 6425291 4779821 2714016
42044B714016j309328k35094L70500P35215J116104R52890n5115r63393p94957
$$ 2714016 1404688 1169594 1540094 2275309 3391413 4344303 4289188 3325795 2530838
42035B530838J7210N13661P57263J242471J488458O88664p16641j542304j537648
$$ 2530838 2548048 3061709 3818972 5061443 6549901 7238565 6521924 4979620 3441972
42026C441972j204215m60888Q86710J757477P90441j273226k083876q74386N45447
$$ 3441972 2237757 1776869 2663579 4421056 5211497 3938271 1854395 980009 1525456
42017A525456M53803o86888j395213j044526Q0630J390163K024620J360189J1371
$$ 1525456 1979259 1292371 -102842 -1147368 -1066738 323425 2348045 3708234 3719605
42008C719605o65592m12990k82131p42321r99266o74604o06934j170296j271315
$$ 3719605 3054013 2641023 2358892 1616571 617305 -57299 -664233 -1834529 -3105844
41999c105844j12213J282494J507922P73658K83089M23720P05470Q48837Q87493
$$ -3105844 -3218057 -1935563 -427641 346017 629106 1052826 1758296 2607133 3494626
41990C494626P00372L06083J35780L60308N56612N45672O92516Q53367J87560
$$ 3494626 4194998 4501081 4636861 4997169 5553781 6099453 6791969 7645336 7832896
41981G832896j223051j857853r11115K72961J46081q39887j326819j180249j000929
$$ 7832896 6609845 4751992 3840877 4113838 4259919 3420032 2093213 912964 -87965
41972h7965o35649J19457L91720l24464o35203P39666K411413K217611Q36647
$$ -87965 -723614 -604157 -212437 -536901 -1172104 -432438 1978975 4196586 5033233
41963E033233O72571J645315J355876m56296j099572N55745K044671J269329m56952
$$ 5033233 5705804 7351119 8706995 8250699 7151127 7706872 9751543 11020872 10563920
41954A0563920j202485j569521k698994l347451j724617J192848K826723K521458
$$ 10563920 9361435 7791914 5092920 1745469 20852 1213700 4040423 6561881
41946F561881J574448O57637l95262r41269j84405Q31748K63546j563283k432934
$$ 6561881 8136329 8793966 8398704 7457435 7273030 8104778 8368324 6805041 4372107
41937D372107j541661l73222q1743j22532J06372K80556L63175Q99973J479929
$$ 4372107 2830446 2457224 2375481 2252949 2359321 2639877 3003052 3903025 5382954
41928E382954Q07462r09288j564055j92282J416542J438345O41037O85833J267811
$$ 5382954 6190416 5281128 3717073 3524791 4941333 6379678 7020715 7706548 8974359
41919H974359R04397l73322j126413q52661m17888l32218k38237j13174m38704
$$ 8974359 9878756 9505434 8379021 7526360 7108472 6776254 6538017 6424843 5986139
41910E986139r56165o47045O08288J511870J071194k6682l77478L99538J429176
$$ 5986139 5029974 4382929 4991217 6503087 7574281 7547599 7170121 7569659 8998835
41901H998835J691858R23862l23798j150996r48705J65609J498897K363047K523522
$$ 8998835 10690693 11614555 11290757 10139761 9191056 9356665 10855562 13218609 15742131
41892A5742131K253240K050755K141330K216691J939738J663642K101793L211637
$$ 15742131 17995371 20046126 22187456 24404147 26343885 28007527 30109320 33320957
41884C3320957M182830M826444O028016Q195130J0246441J1183000J1876603J3974485
$$ 33320957 37503787 42330231 48358247 56553377 66799818 77982818 89859421 103833906
41876A03833906J7449596K0484399K1371166J9154204J2931122K689154q738820
$$ 103833906 121283502 141767901 163139067 182293271 195224393 197913547 189174727
41869A89174727j6584211j8309184j5866709j2944651j1011919r071846o235645
$$ 189174727 172590516 154281332 138414623 125469972 114458053 105386207 99150562
41862I9150562k954630M0106K685485N232629P766633J0409926J3547936J7477065
$$ 99150562 96195932 96236038 98921523 104154152 111920785 122330711 135878647 153355712
41854A53355712K1823980K5409758K6868806K5587854K1973524J6824606J0979531
$$ 153355712 175179692 200589450 227458256 253046110 275019634 291844240 302823771
41847C02823771N752530K520921O78351l035734j1122457k1354581k8300216k9168156
$$ 302823771 308576301 311097222 311775573 308739839 297617382 276262801 247962585 218794429
41839B18794429k6114318k2293787j8253961j3646785r884099q483513q354393
$$ 218794429 192680111 170386324 152132363 138485578 128601479 120117966 111763573
41832A11763573p422221n919052n377309n195085l308182q4977J706460J387060
$$ 111763573 104341352 98422300 93044991 87849906 84541724 84456747 86163207 87550267
41824H7550267J739835M681048Q320181J0154688J0959519J3194487J6934703
$$ 87550267 89290102 93971150 102291331 112446019 123405538 136600025 153534728
41817A53534728J9629085J9116781J4952415P413380k659296j2994012k0610068
$$ 153534728 173163813 192280594 207233009 214646389 211987093 198993081 178383013
41810A78383013k3940612k3473957k0480975j6161228j1844969q684153o778454
$$ 178383013 154442401 130968444 110487469 94326241 82481272 73797119 67018665
41803F7018665n404445m214501l448168l035860k500982j874825j709251j926610
$$ 67018665 61614220 57399719 53951551 50915691 48414709 46539884 44830633 42904023
41795D2904023j666356p38937k96596j324375l113831m062885l634800k719451
$$ 42904023 41237667 40498730 40202134 38877759 35763928 31701043 28066243 25346792
41787B5346792k178429j840962j186787m42968m42288j461806k669020k990993
$$ 25346792 23168363 21327401 20140614 19697646 19255358 17793552 15124532 12133539
41779A2133539k289390j260341l01075Q27377J989091K176840Q35804q52348j137037
$$ 12133539 9844149 8583808 8282733 9110110 11099201 13276041 14111845 13259497 12122460
41770A2122460m9316N99244j99922j295664j251181m52411k33833o45962m93425
$$ 12122460 12073144 12672388 12472466 11176802 9925621 9473210 9239377 8593415 8099990
41761H099990O04660J557289J441982O81221J37432l5818o2731J46057O15580
$$ 8099990 8704650 10261939 11703921 12385142 12522574 12486756 12424025 12570082 13185662
41752A3185662P79169R9075j086181j963154k206597j940684j064966O13637K678685
$$ 13185662 13964831 14063906 12977725 11014571 8807974 6867290 5802324 6415961 9094646
41743I094646M221592M681250M097327K721728J010696j62141o7673J016698K036651
$$ 9094646 13316238 17997488 22094815 24816543 25827239 25665098 25597425 26614123 28650774
41734B8650774K177363J194968q02020l017241l877576k590331o04120m5618p56312
$$ 28650774 30828137 32023105 31221085 28203844 24326268 21735937 21131817 21086199 20329887
41725B0329887o55948P73323J593125Q05880K44092J406798K538941J258894j425566
$$ 20329887 19673939 20447262 22040387 22846267 23090359 24497157 27036098 28294992 26869426
41716B6869426k531555j678134j262812k223776k630678j156277O24467N90046
$$ 26869426 24337871 22659737 21396925 19173149 16542471 15386194 16010661 16600707
41708A6600707j138382k903640l557984k866810j203930L01746N32350m9308Q3005
$$ 16600707 15462325 12558685 9000701 6133891 4929961 5231707 5764057 5714749 5797754
41699E797754R35010O92562j142615k314766j019128J159044J436394k54201j587889
$$ 5797754 6732764 7425326 6282711 3967945 2948817 4107861 5544255 5290054 3702165
41690C702165j300863k81502M03190O59878N75360R0926l66003j81758L97560
$$ 3702165 2401302 2119800 2522990 3182868 3758228 3849154 3483151 3301393 3698953
41681C698953N35603O8277m54794p89238j038681r27156j45800P50596R09536
$$ 3698953 4234556 4302833 3848039 3058801 2020120 1092964 947164 1697760 2607296
41672B607296M97567L58046N48389M16179q885j1242L94154L39320m12169j031009
$$ 2607296 3104863 3462909 4011298 4427477 4418592 4407350 4801504 5140824 4728655 3697646
41662C697646r15036l80353J02279L39631J4297r97791j785581j139551N90768
$$ 3697646 2782610 2402257 2504536 2844167 2858464 1860673 75092 -1064459 -473691
41653d73691J630876J168698L68846M75909J105071J139248L37764o94665j370817
$$ -473691 1157185 2325883 2694729 3170638 4275709 5414957 5752721 5058056 3687239
41644C687239j364820p19680j31572l12996p80788l39195R01114J371464N40743
$$ 3687239 2322419 1602739 1471167 1158171 377383 38188 939302 2310766 2851509
41635B851509k8652P38342J340659m2760k307708k632070n79624J191719O64126
$$ 2851509 2822857 3561199 4901858 4859098 2551390 -80680 -660304 531415 1195541
41626A195541r83020j394729j80115J165786J615924J544310J507218J278153
$$ 1195541 212521 -1182208 -1362323 -196537 1419387 2963697 4470915 5749068
41618E749068M89554m69282q19773m34765L8515Q6570j62317m41647p22513p46198
$$ 5749068 6238622 5769340 4949567 4514802 4553317 4639887 4477570 4035923 3313410 2567212
41608B567212R4404J693608K670994J896937J87942p14345o01364p77054j583140
$$ 2567212 2661616 4355224 7026218 8923155 9111097 8396752 7795388 7018334 5435194
41599E435194j713913n69472M29755m5357j222764j627897j288194j040560o53847
$$ 5435194 3721281 3151809 3581564 3536207 2313443 685546 -602648 -1643208 -2297055
41590b297055N65530J915700J948348P85423L662J72643K73737j52899j14361
$$ -2297055 -1731525 184175 2132523 2917946 2921608 3094251 3367988 3215089 3100728
41581C100728Q38034J364301L17523j187139j156467L87269J336247L22905j552956
$$ 3100728 3938762 5303063 5620586 4433447 3276980 3664249 5000496 5323401 3770445
41572C770445k241272j241025N4804K52988m57045q39795k89873O08896J122883
$$ 3770445 1529173 288148 342952 595940 138895 -700900 -990773 -381877 741006
41563G41006J239766J184764P47557k45575j217002j363390o83343K16341J099367
$$ 741006 1980772 3165536 3913093 3667518 2450516 1087126 403783 620124 1719491
41554A719491K054319K638058K094612N88324o95966r73845n97429j26254M40458
$$ 1719491 3773810 6411868 8506480 9094804 8398838 7424993 6827564 6701310 7141768
41545G141768J077711J274823Q20667L35836L01732J91446o01127j513337j523928
$$ 7141768 8219479 9494302 10314969 10650805 10952537 11143983 10542856 9029519 7505591
41536G505591q13479n72895j107404j264265k07729J146135J264340Q8572q96900
$$ 7505591 6692112 6119217 5011813 3747548 3539819 4685954 5950294 6038866 5141966
41527E141966o47665J90745L55013k81869o70232j33172P47151J015356N45942
$$ 5141966 4494301 4685046 5040059 4758190 4087958 3954786 4701937 5717293 6263235
41518F263235r9865o05073j031117j224907q73380k27183j3327l47111m32896
$$ 6263235 6163370 5558297 4527180 3302273 2428893 2201710 2188383 1841272 1408376
41509A408376K13810R18899Q80850M89132P05059J407390J405878K28574j045705
$$ 1408376 1622186 2541085 3421935 3911067 4616126 6023516 7429394 7657968 6612263
41500F612263j172722k90517M43370L16269l55791q15811n65982L22764J198928
$$ 6612263 5439541 5149024 5592394 5908663 5552872 4737061 4171079 4493843 5692771
41491E692771J301443N95740p3015k6303L41309K06173m23949q01042o44212l99798
$$ 5692771 6994214 7589954 7516939 7490636 7831945 8038118 7614169 6813127 6168915 5769117
41481E769117k16580L86051J412826J828509Q45864p77673j551609j065438k25093
$$ 5769117 5552537 5938588 7351414 9179923 10025787 9248114 7696505 6631067 6405974
41472F405974J44641J37368J72632K87046K68942N6747k18800l57395k28904p415
$$ 6405974 6550615 6687983 6860615 7147661 7416603 7473350 7254550 6897155 6668251 6660836
41462F660836j10435n62842o67568J32754J230932J403021M05589o92962r38308
$$ 6660836 6550401 5987559 5319991 5452745 6683677 8086698 8492287 7799325 6861017
41453F861017n39581j93583n1287R2333L6657o88748j930808k641790j824704
$$ 6861017 6321436 6127853 6076566 6168899 6205556 5516808 3586000 944210 -880494
41444h80494K16526J789417J389084n24203j830565j176065M85371J342547J039341
$$ -880494 -663968 1125449 2514533 1990330 159765 -1016300 -530929 811618 1850959
41435A850959N75451M68600L64079K47874N37905Q56826K44067j046711j487792
$$ 1850959 2426410 2895010 3259089 3506963 4044868 4901694 5145761 4099050 2611258
41426B611258n87701K71315J05601j18738O51906J591775J388142M57045P9048
$$ 2611258 2023557 2294872 2400473 2281735 2933641 4525416 5913558 6370603 6449651
41417F449651J40583m79749j743275k409821j977478j087235q9772J213441K322948
$$ 6449651 6590234 6110485 4367210 1957389 -20089 -1107324 -1197096 16345 2339293
41408B339293K134510P07566l90616r6747Q21739J035299M10455j21326J03905
$$ 2339293 4473803 5181369 4790753 4694006 5515745 6551044 6961499 6840173 6944078
41399F944078Q09065J150124N10145q57337j943044j971545j145408j75099N45204
$$ 6944078 7753143 8903267 9413412 8556075 6613031 4641486 3496078 3320979 3866183
41390C866183Q84080O20577j72585q01341p45103m42096n85563j042968j214930
$$ 3866183 4750263 5370840 5198255 4396914 3651811 3209715 2624152 1581184 366254
41381C66254j002795o15456M2956Q67627J030315P9629r28704n97977Q77250K051679
$$ 366254 -636541 -1251997 -1209041 -341414 688901 768530 -160174 -758151 119099 2170778
41371B170778K081043J167654k42267j507806j739133j006236p55494j565069
$$ 2170778 4251821 5419475 5177208 3669402 1930269 924033 168539 -1396530
41363a396530j660429L57288K578249K244342J40685o65668J67015K25188q09879
$$ -1396530 -3056959 -2699671 -121422 2122920 2263605 1597937 1764952 1990140 1180261
41354A180261n28589J248888J347795j161521k513999r6371L020330K770373J81885
$$ 1180261 651672 1900560 3248355 2086834 -427165 -523536 2496794 5267167 5449052
41345E449052j062831o43646r19327j956521j736389n25422o78848k112686k017885
$$ 5449052 4386221 3742575 2823248 866727 -869662 -1395084 -2073932 -4186618 -6204503
41336f204503L41523K203551J718579N67360P37183J390695P38907r33412j911543
$$ -6204503 -5862980 -3659429 -1940850 -1373490 -636307 754388 1493295 559883 -1351660
41327a351660j462874j82814J146602J936002J771856R14117K80682L68730O70587
$$ -1351660 -2814534 -2997348 -1850746 85256 1857112 2771229 3051911 3420641 4091228
41318D091228M48835m36144j561260k204242j645392O3999J720291K069480J134770
$$ 4091228 4540063 4103919 2542659 338417 -1306975 -1242976 477315 2546795 3681565
41309C681565j51667j131239j442678o43079R74316J869596J004370m78462q52566
$$ 3681565 3529898 2398659 955981 312902 1287218 3156814 4161184 3682722 2830156
41300B830156m34160p67678j740482j731162m91475M24097L34048L30117J042512
$$ 2830156 2395996 1628318 -112164 -1843326 -2334801 -1910704 -1576656 -1246539 -204027
41291b04027J581197J333953R11502O31523j17126j297949j775844j162248m36973
$$ -204027 1377170 2711123 3622625 4254148 4137022 2839073 1063229 -99019 -535992
41282e35992j19159L93451J068458Q49383j69592l06523Q91186J510969L02336
$$ -535992 -655151 -261700 806758 1656141 1486549 1180026 2071212 3582181 3884517
41273C884517j188925j103037l2189M25318J88210m2631m57834j172940j105196
$$ 3884517 2695592 1592555 1560366 1985684 2173894 2131263 1673429 500489 -604707
41264f04707J36209P01557q59665k720794k142257K66241J474000O77049N9847
$$ -604707 -468498 233059 -626606 -3347400 -5489657 -5223416 -3749416 -3072367 -3012520
41255c012520Q87510J731105J253537K73217j3703J02211n0228r6631M45772R09060
$$ -3012520 -2125010 -393905 859632 1132849 1119146 1221357 1171129 1074498 1520270 2429330
41245B429330L59563r22608j806758j742724j135462n82537k47244J42543Q87378
$$ 2429330 2788893 1866285 59527 -1683197 -2818659 -3401196 -3648440 -3505897 -2618519
41236b618519J799987K195751J687674P69246J65500j12239m67178p64872m88584
$$ -2618519 -818532 1377219 3064893 3834139 3999639 3887400 3420222 2655350 2166766
41227B166766K29977N46367K6280p45037q56992n4569R99294J282960M65602m99381
$$ 2166766 2396743 2943110 2969390 2224353 1367361 1312792 2312086 3595046 4060648 3561267
41217C561267l82994N11687M56887j207550k737269k207538k15852J017999O80314
$$ 3561267 3178273 3689960 4146847 2939297 202028 -2005510 -2221362 -1203363 -523049
41208e23049n2301j81482M755J06909L49650O89772M74475l73970q16995l7867
$$ -523049 -575350 -756832 -752077 -645168 -295518 394254 868729 494759 -322236 -360103
41198c60103J337303J938889J149511m48145j708418j761205o20888P95175J493570
$$ -360103 977200 2916089 4065600 3617455 1909037 147832 -473056 322119 1815689
41189A815689J294973O97438P8920n16272r67992r93783m78042L92719J161853
$$ 1815689 3110662 3808100 3887020 3370748 2402756 1408973 930931 1323650 2485503
41180B485503J137759o3106j678966k213533j221500P0230N48640O55235J127449
$$ 2485503 3623262 3560156 1881190 -332343 -1553843 -1483613 -934973 -279738 847711
41171H47711J397722O47852m25998n89875j89949m56944j122449p87524M08863
$$ 847711 2245433 2893285 2467287 1877412 1687463 1230519 108070 -679454 -270591
41162b70591O52522o50763j851837j577125m65532L97944J069780J746968J701073
$$ -270591 381931 -268832 -2120669 -3697794 -4163326 -3765382 -2695602 -948634 752439
41153G52439M93936q32150j020229l06781J59079l0325l79932m81328l78482k79519
$$ 752439 1246375 414225 -606004 -912785 -753706 -784031 -1163963 -1645291 -2023773 -2303292
41143b303292l99209p38683q01910p7789J062169J632615J279613M83130m12373
$$ -2303292 -2702501 -3441184 -4243094 -4320883 -3258714 -1626099 -346486 136644 -275729
41134b75729j325551j676184q54991M27044P53239K05180K75795J174338J179076
$$ -275729 -1601280 -3277464 -4132455 -3705411 -2952172 -2746992 -2471197 -1296859 -117783
41125a17783m40034j807835j121626O87419J529351J040880K74637l15901q43092
$$ -117783 -557817 -2365652 -3487278 -2799859 -1270508 -229628 45009 -270892 -1113984
41116a113984q60974j9513Q27374P57572L88248P96729J487685J125753j69263
$$ -1113984 -1974958 -1994471 -1167097 -409525 -21277 775452 2263137 3388890 3219627
41107C219627r57123o41044O2422N81722R04605P55808r5125q39772m79946M03120
$$ 3219627 2262504 1621460 1683882 2265604 3170209 3926017 3830892 2991120 2511174 2914294
41097B914294K90448q39028j323901l13639J055939J377541N55347p16754j828246
$$ 2914294 3204742 2365714 1041813 728174 1784113 3161654 3717001 3000247 1172001
41088A172001k174934j354063P2068R49305J008742J042226J400865J433846P65469
$$ 1172001 -1002933 -2356996 -2284928 -1335623 -326881 715345 2116210 3550056 4315525
41079D315525K772l15665m58797o91920o99738l48001r8228j38481l4003K09476
$$ 4315525 4318297 4002632 3543835 2851915 2152177 1804176 1705948 1567467 1533464 1742940
41069A742940k28950j521507k312771j342273O82255J862477J378269O6804r72240
$$ 1742940 1513990 -7517 -2320288 -3662561 -2980306 -1117829 260440 327244 -644996
41060f44996j420740j464366j293561j027124o12171K57582J666207K906617K935928
$$ -644996 -2065736 -3530102 -4823663 -5850787 -6462958 -6205376 -4539169 -1632552 1303376
41051A303376J626973J47496k89278J54216K14977p65941j921127j973884q87479
$$ 1303376 2930349 3077845 2788567 2942783 3157760 2391819 470692 -1503192 -2390671
41042b390671J96537M86123K48129m9882m25407q55766q81399k87854M69914J030792
$$ -2390671 -2194134 -1708011 -1459882 -1509764 -1935171 -2790937 -3672336 -3960190 -3490276 -2459484
41032b459484J570986J934346J298473l91740j631935j235787j83078j33683q03044
$$ -2459484 -888498 1045848 2344321 1952581 320646 -915141 -1098219 -1231902 -2034946
41023b034946n84175O58372J441203J266466J251798J762235J505739j30964j663222
$$ -2034946 -2619121 -1960749 -519546 746920 1998718 3760953 5266692 5135728 3472506
41014C472506j606365n48760J14905L00742P39536J303072J210062L44200p50567
$$ 3472506 1866141 1317381 1432286 1733028 2472564 3775636 4985698 5329898 4579331
41005D579331j702155k211486j711817j21002J529896K109594J606188O50976
$$ 4579331 2877176 665690 -1046127 -1167129 362767 2472361 4078549 4729525
40997D729525m81458j552573j837936j062810k53090m62724j154295j065128k00388
$$ 4729525 4248067 2695494 857558 -205252 -458342 -921066 -2075361 -3140489 -3340877
40988c340877M03419N11514P32957R19554K70196p76297n67218J146780K231253
$$ -3340877 -2937458 -2425944 -1692987 -773433 -503237 -1279534 -1846752 -699972 1531281
40979A531281R47538j465312k340812r90346Q43025J593365J479890J325970J074277
$$ 1531281 2478819 1013507 -1327305 -2317651 -1474626 118739 1598629 2924599 3998876
40970C998876K51089q09400j153789n07419L49296O58933N65491N56379M80273
$$ 3998876 4249965 3440565 2286776 1779357 2128653 2787586 3353077 3909456 4389729
40961D389729k30418j441353k101909j444838R117J002599Q69908Q821p86349
$$ 4389729 4159311 2717958 616049 -828789 -819672 182927 1052835 1061656 275307
40952B75307j090248r48481n19052J59920R80611J456809R65181m14422j571241
$$ 275307 -814941 -1763422 -2282474 -2122554 -1141943 314866 1280047 865625 -705616
40943g05616j417330k27290O43437M56612r9974k4386O73675J154377Q19917k01875
$$ -705616 -2122946 -2350236 -1706799 -1250187 -1350161 -1374547 -700872 453505 1273422 1071547
40933A071547j327711j922477j687305r07690j05494O04222J400268K017305J836167
$$ 1071547 -256164 -2178641 -3865946 -4773636 -4879130 -4274908 -2874640 -857335 978832
40924I78832R11237J07553j53853m27402r92814j047264m0402J017689P75910
$$ 978832 1890069 1997622 1843769 1416367 423553 -623711 -664113 353576 1129486
40915A129486m43256j113564p27049k42399l06380l22904L34819J227274J530157
$$ 1129486 686230 -427334 -1154383 -1396782 -1703162 -2026066 -1691247 -463973 1066184
40906A066184J131851N46520J83203O5835n0183m83416j240086j787059j617026
$$ 1066184 2198035 2744555 2927758 2993593 2943410 2459994 1219908 -567151 -2184177
40897b184177j006126o71231o95149m72901J82819O66988O15775N59338J009912
$$ -2184177 -3190303 -3861534 -4556683 -5029584 -4846765 -4179777 -3564002 -3004664 -1994752
40888a994752J481575J105583p2490j052812j054376k26457P85357J492222J645021
$$ -1994752 -513177 592406 519916 -532896 -1587272 -1813729 -1028372 463850 2108871
40879B108871J100349K4110q66891p50577L04180J057811L47199j381011k383764
$$ 2108871 3209220 3233330 2366439 1615862 1920042 2977853 3325052 1944041 -439723
40870d39723j713234l66452J75517l3566K48078J339711K002619J240395j60453
$$ -439723 -2152957 -2519409 -2343892 -2377458 -2129380 -789669 1212950 2453345 2292892
40861B292892o01572K37132J044076O35309n34577r98855j57764J023363J355398
$$ 2292892 1691320 1928452 2972528 3607837 3073260 2074405 1916641 2940004 4295402
40852D295402R17832O15425N79292q589j337413k236314j646214r6026J002451
$$ 4295402 5213234 5828659 6407951 6399362 5061949 2825635 1179421 1083395 2085846
40843B085846R49007m3064j534406k789469k648860p47082J418211J907126P57943
$$ 2085846 3034853 2991789 1457383 -1332086 -3980946 -4728028 -3309817 -1402691 -644748
40834f44748k17770j3939N45933N22586J63818L75p7751j73776P5107N89702N11645
$$ -644748 -862518 -876457 -330524 192062 355880 356255 278504 104728 179835 769537 1281182
40823A281182m43716j261366j074813l74653J21900P24773J677579J838948J43694
$$ 1281182 837466 -423900 -1498713 -1873366 -1751466 -1026693 650886 2489834 2633528
40814B633528k179508k692610j010528P07563P68326j41335n55514k47845K17123
$$ 2633528 454020 -2238590 -3249118 -2541555 -1773229 -1914564 -2470078 -2717923 -2500800
40805b500800P38884J370188J549240P74799m00304j010421r62862q12950o35156
$$ -2500800 -1761916 -391728 1157512 1932311 1532007 521586 -441276 -1254226 -1889382
40796a889382j30014L85819K45331k82087j10703R74389J812063J520085O80206
$$ -1889382 -2019396 -1633577 -1388246 -1670333 -1781036 -806647 1005416 2525501 3205707
40787C205707K30263Q4765k73998n97639l47287J44528J39451k00571j70515J5898
$$ 3205707 3435970 3520735 3246737 2649098 2301811 2446339 2585790 2385219 2214704 2230602
40777B230602n17154j523346j570024k24132J027345P96574l56775r62068n89629
$$ 2230602 1713448 190102 -1379922 -1604054 -576709 219865 -136910 -1098978 -1688607
40768a688607J96671J032858J774481J849388P45963j005282k174374k059127
$$ -1688607 -1491936 -459078 1315403 3164791 3910754 2905472 731098 -1328029
40760a328029q97763N08152J089613J70850j373314j412136Q85211L436366L485268
$$ -1328029 -2225792 -1717640 -628027 -457177 -1830491 -3242627 -2357416 1078950 4564218
40751D564218J011230j465979k169481j636971j064234o83287k36815J53118K13253
$$ 4564218 5575448 4109469 1939988 303017 -761217 -1444504 -1681319 -1528201 -1314948
40742a314948m9310m10272m43632L21519J570251J988221R03737l69801j86423
$$ -1314948 -1364258 -1774530 -2218162 -1896643 -326392 1661829 2565566 2195765 2009342
40733B009342Q83555Q36802o57195j840813j636620q39188j99846O20617J523936
$$ 2009342 2892897 3729699 3072504 1231691 -404929 -1244117 -1443963 -823346 700590
40724G00590J408733J06593q93585o91957k60537m31082m02879M23286Q94123
$$ 700590 2109323 2215916 1322331 630374 369837 -61245 -464124 -40838 853285
40715H53285M1031r61005o14998L74865L43564n60564q37291j95147K69276N4892
$$ 853285 894316 -66689 -681687 -306822 36742 -523822 -1361113 -1556260 -1286984 -1232092
40705a232092k96799m77672o40045n87183n1295N04466N17685L23581M16906L58868
$$ -1232092 -1528891 -2006563 -2646608 -3233791 -3285086 -2780620 -2262935 -1939354 -1522448 -1163580
40695a163580l39967r51839n41588L99259P51728N54098N29529N36708O8971m03142
$$ -1163580 -1503547 -2455386 -2996974 -2597715 -1845987 -1291889 -762360 -225652 -156681 -559823
40685e59823k59861j73327r19175j528071o89313P01229P41959k15462p6872J382037
$$ -559823 -819684 -993011 -1912186 -3440257 -4129570 -3428341 -2686382 -2901844 -2978716 -1596679
40675a596679K065265R42363o13837j273025j180812n50757P66300J790049R55396
$$ -1596679 468586 1410949 797112 -475913 -1656725 -2207482 -1441182 348867 1304263
40666A304263j137341j930249o70406M73616l7561j000615j047123p25618n75944
$$ 1304263 166922 -1763327 -2433733 -1960117 -1997678 -2998293 -4045416 -4771034 -5346978
40657e346978K71316J811732K030946J91104j120059K57302K348488J976822k65233
$$ -5346978 -5075662 -3263930 -1232984 -1041880 -2161939 -1904637 443851 2420673 2155440
40648B155440j163138N0523J030935L80861o18494n69116J90675P46745P68810
$$ 2155440 992302 1042825 2073760 2454621 1836127 1267011 1457686 2204431 2973241
40639B973241K07302o50011p88781M01350J750894J585501J74144o78959k62371
$$ 2973241 3180543 2530532 1741751 2143101 3893995 5479496 5653640 4974681 4712310
40630D712310N02237R41346J206856R96195l73615k315235l139325k306960j010461
$$ 4712310 5214547 6155893 7362749 8358944 7985329 5670094 2530769 223809 -786652
40621g86652j89056M73830J186805J318776O95719K13877L95694N21842n0752
$$ -786652 -975708 -501878 684927 2003703 2699422 2913299 3308993 3830835 3780083
40612C780083p52064p42510j50164L22448L56642L2753n32333j103917j305107
$$ 3780083 3028019 2285509 2135345 2457793 2814435 2847188 2314855 1210938 -94169
40603i4169r31538k8852J172198J984836J458285l47047j839000j707651o56001
$$ -94169 -1025707 -1054559 117639 2102475 3560760 3213713 1374713 -332938 -988939
40594i88939n1645L39630J433878K343104J319488r15919j583199j15638Q25692
$$ -988939 -1040584 -700954 732924 3076028 4395516 3479597 1896398 1780760 2606452
40585B606452k88730j352073l13438J231923P41015r29249r41365Q24610J654816
$$ 2606452 2317722 965649 652211 1884134 2625149 1695900 754535 1579145 3233961
40576C233961L90689r74544o33000M72475M35676r06244k134716k105254q17956
$$ 3233961 3624650 2650106 2017106 2489581 2925257 2019013 -115703 -2220957 -3038913
40567c038913Q70327J842599J574086P15630L49114O21255P86756N68294N08862
$$ -3038913 -2168586 -325987 1248099 1963729 2312843 2934098 3720854 4289148 4798010
40558D798010P58148N36448o20482j857135j969262r50976Q1497K95977p7410
$$ 4798010 5556158 6092606 5472124 3614989 1645727 694751 776248 1072225 994815
40549I94815l22142j46066J29148J01893j85602l67072l37161m20610p63556q66321
$$ 994815 672673 526607 655755 757648 572046 204974 -132187 -552797 -1316353 -2182674
40539b182674j95268Q31676J056941K8902j175524j028510O35978K308452K453625
$$ -2182674 -2377942 -1546266 -489325 -460423 -1635947 -2664457 -2028479 279973 2733598
40530B733598J162832j51329m80739j08036J95493J18730l42614j194523j952147
$$ 2733598 3896430 3745101 3264362 3156326 3351819 3470549 3127935 1933412 -18735
40521a8735j580292R1895J492949J108810k63992o13785J62765J90811j077545
$$ -18735 -1599027 -1507132 -14183 1094627 830635 216850 379615 570426 -507119
40512e07119j738925o06379O76639L68093l91286L89950J874782J506463p28017
$$ -507119 -2246044 -2852423 -2175784 -1807691 -2198977 -1809027 65755 1572218 844201
40503H44201j969508o87509J310639J819269J001201J52888m01486q04673n67391
$$ 844201 -1125307 -1812816 -502177 1317092 2318293 2471181 2069695 1265022 697631
40494F97631M40925R69396l1091j507388j569212k25147P37501M82310J06831
$$ 697631 1138556 2107952 2076861 569473 -999739 -1224886 -487385 -5075 101756
40485A01756N63310J093803O21449l31787l30412P75785J546834R70953k57863
$$ 101756 665066 1758869 2380318 2048531 1718119 2493904 4040738 5011691 4753828
40476D753828r96717j296523j812434k134606j141641Q69362J914157R54928m52385
$$ 4753828 3757111 2460588 648154 -1486452 -2628093 -1758731 155426 1110354 657969
40467F57969l35667Q47190J093317j1984q70411n11622J63626J76247j26809j39515
$$ 657969 322302 1169492 2262809 2250825 1380414 868792 1032418 1208665 1081856 942341
40457I42341p0199j51465j1515L37166Q9735q48737j185927j89911Q84494O74211
$$ 942341 872142 720677 709162 1046328 1136063 287326 -898601 -1088512 -204018 470193
40447D70193j14391n5349M51622J0332j021223r30660K78160O19128n67521j335506
$$ 470193 355802 300453 752075 762407 -258816 -1189476 -911316 -292188 -859709 -2195215
40437b195215k24607J370611J455770M84748K64631Q43993O08034q46835j952382
$$ -2195215 -2419822 -1049211 406559 891307 1155938 1999931 2607965 1761130 -191252
40428a91252j582350n74834j71118k07170K02375J015531J358005R08205K49697
$$ -191252 -1773602 -2348436 -2519554 -2726724 -2524349 -1508818 -150813 757392 1007089
40419A007089r6163j81405m2244O36272J800556K493749J748746q4322j526157
$$ 1007089 910926 729521 687277 1323549 3124105 5617854 7366600 7282278 5756121
40410E756121j593648p25379P1396M02186M27326J79736l91410r72148j153163
$$ 5756121 4162473 3437094 3508490 3910676 4338002 4517738 4126328 3154180 2001017
40401B001017j026739r15240o76162l1013N04232o332j359630j968472p67118
$$ 2001017 974278 59038 -617124 -648137 -143905 -150237 -1509867 -3478339 -4245457
40392d245457J283293K255431J433873j29731r58039n61135L06459M78252l51531
$$ -4245457 -2962164 -706733 727140 597409 -360630 -921765 -615306 -137054 -488585
40383d88585j107281n40898R83671J722291Q76805l10160m57506K502j10382n72569
$$ -488585 -1595866 -2136764 -1153093 569198 1446003 1135843 678337 680839 570457 -2112
40373b112k05871R06395J284333K38886j202994j845638j590076q52639R5464
$$ -2112 -207983 698412 1982745 2221631 1018637 -827001 -2417077 -3269716 -3174252
40364c174252Q11372Q21442N00475P16402J244200Q57275m81224j090717j88735
$$ -3174252 -2362880 -1541438 -1040963 -324561 919639 1776914 1295690 204973 16238
40355A6238N54311m73599k134733k242347r51853k53627o00435m47541P64973
$$ 16238 570549 96950 -2037783 -4280130 -5231983 -5485610 -6086045 -6533586 -5768613
40346e768613J575834J133948O93246J296595J797276P94558p99865r96397K17499
$$ -5768613 -4192779 -3058831 -2365585 -1068990 728286 1522844 722979 -273418 -55919
40337e5919R19624J23910j090041j481634j204695r73536q40025m84218O0055
$$ -55919 863705 987615 -102426 -1584060 -2788755 -3762291 -4602316 -5086534 -5026479
40328e026479O10782J201248J694546J560207O20590m07876p23354m36154j52513
$$ -5026479 -4415697 -3214449 -1519903 40304 660894 253018 -470336 -906490 -1059003
40319a059003M6590M01621N36234j93866j335504j478032k50203Q60503N04177
$$ -1059003 -1012413 -610792 -74558 -268424 -1603928 -3081960 -3332163 -2471660 -1967483
40310a967483n67981o54201L43015Q57166K9947j170536j415545m73017J085904
$$ -1967483 -2535464 -3189665 -2846650 -1989484 -1959537 -3130073 -4545618 -5018635 -3932731
40301c932731K523159K893513J565220n72282j531637o61363L92810O3687r47990
$$ -3932731 -1409572 1483941 3049161 2476879 945242 283879 676689 740376 -207614
40292b07614j104294n51498m91489p55127m1493J536977K143542Q78115q70596
$$ -207614 -1311908 -1863406 -2354895 -3110022 -3151515 -1614538 529004 1407119 536523
40283E36523j353401m72006O94981J228858P03074p15417j919821j617488K7436
$$ 536523 -816878 -1288884 -593903 634955 1338029 622612 -1297209 -2914697 -2887261
40274b887261J424465J608140J176896Q22132K89721n28060q74210m62385k52783
$$ -2887261 -1462796 145344 1322240 2144372 2434093 1906033 1031823 569438 316655
40265C16655p89871r92796P2846J320649J112842j97547q34439j95209P06573
$$ 316655 -473216 -1466012 -1393166 -72517 1040325 842778 8339 -186870 519703
40256E19703J074267J066748Q16142J13265q48232j504877j676921j415551m78890
$$ 519703 1593970 2660718 3476860 3590125 2741893 1237016 -439905 -1855456 -2334346
40247b334346R56932J569287K92046j840275k713589j812874m26233N48002J260856
$$ -2334346 -1377414 191873 483919 -1356356 -4069945 -5882819 -6309052 -5761050 -4500194
40238d500194J528342Q36498k0145N79843K345380K891232J236140n47790n00220
$$ -4500194 -2971852 -2135354 -2155499 -1575656 769724 3660956 4897096 4349306 3849086
40229C849086L30757m7879j189898j127418K53729J099774N98932k1040K68025
$$ 3849086 4179843 4131964 2942066 1814648 2068377 3168151 3767083 3746043 4014068
40220D014068Q55900Q31811L27579j76214p69810j526232j799212j020202K01632
$$ 4014068 4869968 5701779 6029358 5853144 5083334 3557102 1757890 737688 939320
40211I39320O09861j22116r89462r97126m07633k24950o83724r33571m22100J28029
$$ 939320 1549181 1427065 437603 -559523 -967156 -1192106 -1875830 -2809401 -3231501 -3103472
40201c103472j94073r16318p28522N01732J391954R94870K8713l58910j12965
$$ -3103472 -3297545 -4213863 -4942385 -4440653 -3048699 -2053829 -2025116 -2384026 -2496991
40192b496991J48522K89069N51367Q52708R68405R88902R39352M69371l65827
$$ -2496991 -2348469 -2059400 -1508033 -655325 313080 1301982 2241334 2710705 2344878
40183B344878o22471K93574J372424J068053n89461j994870k053751j312154q87459
$$ 2344878 1722407 2015981 3388405 4456458 3866997 1872127 -181624 -1493778 -2381237
40174b381237j103509j445263j295389m89460N46423J212173J483409J893485
$$ -2381237 -3484746 -4930009 -6225398 -6714858 -6168435 -4956262 -3472853 -1579368
40166a579368K441880K191495O94766q65360j110499n64703q71909k081600k396773
$$ -1579368 862512 3054007 3748773 2883413 1772914 1208211 336302 -1745298 -4142071
40157d142071r74111O82601R84121N29102Q80555K015467K433335J423749p5362
$$ -4142071 -5116182 -4433581 -3449460 -2920358 -2039803 -24336 2408999 3832748 3757386
40148C757386q69521p22222p2003N48648N51658m45186j923803k588713j738494
$$ 3757386 2887865 2165643 2093640 2642288 3193946 2748760 824957 -1763756 -3502250
40139c502250k05353N93268L37240m8278J28853M43945K88932K3520M22812J260253
$$ -3502250 -3707603 -3114335 -2777095 -2825373 -2696520 -2252575 -1963643 -1940123 -1517311 -257058
40129b57058J399339M74730l97384j20001Q22982J042539J20852r78173j284967
$$ -257058 1142281 1617011 1219627 1099626 1922608 2965147 3085999 2107826 822859
40120H22859q84550m69137m02798n22200n49385l94698r8320L56333J008172J603669
$$ 822859 -61691 -530828 -933626 -1455826 -2005211 -2399909 -2498229 -2141896 -1133724 469945
40110D69945J554243O32969m02955n43939M9522J75897n82825j149710o71873
$$ 469945 2024188 2657157 2254202 1710263 1759785 1935682 1352857 203147 -468726
40101d68726O2083r1520p73121p87723j8270O75004R98475J209189R39596k69660
$$ -468726 -406643 -498163 -1271284 -2059007 -2077277 -1402273 -403798 805391 1744987 1475327
40091A475327j440355j088343J69050N7687j707239k459465n14890J977085K006297
$$ 1475327 34972 -1053371 -884321 -826634 -2533873 -4993338 -5508228 -3531143 -1524846
40082a524846K5050r59133K17117J708372J705048N04603p40720j507122j556928
$$ -1524846 -1499796 -2458929 -2241812 -533440 1171608 1676211 935491 -571631 -2128559
40073b128559o57240N87566Q65214l4233n84450L54622J684169J516555j01771
$$ -2128559 -2785799 -2198233 -1333019 -1367252 -1951702 -1597080 87089 1603644 1501873
40064A501873j263797q83613K8656J50675k46245n5155P04303Q76709O0206o48486
$$ 1501873 238076 -645537 -616881 -466206 -712451 -767606 -63303 813406 873612 225126
40054B25126k83417M85948L05231r10142j922317j880465j111159j86688P54132
$$ 225126 -58291 427657 732888 -177254 -2099571 -3980036 -5091195 -5277883 -4523751
40045d523751J461660J393134O92162M59081J179643J595261K83330j979611k728128
$$ -4523751 -3062091 -1668957 -976795 -517714 661929 2257190 2540520 560909 -2167219
40036b167219q92601J683849K391326Q53377r34664j187965k85693Q2706p92940
$$ -2167219 -3059820 -1375971 1015355 1868732 934068 -253897 -539590 -456884 -1249824
40027a249824j841987j743334o24408K97658M13242K75163M77308Q22603R08466
$$ -1249824 -3091811 -4835145 -5459553 -5161895 -4748653 -4473490 -3996182 -3173579 -2265113
40018b265113Q17226P59764O07821K74035N3944J06830J05621j07860j08667K87571
$$ -2265113 -1447887 -688123 -80302 193733 247677 354507 460128 352268 243601 531172
40008E31172M55303q340l45199K54520J153756J101937K00680l56860l76551r17593
$$ 531172 986475 978135 632936 887456 2041212 3143149 3343829 2986969 2610418 1692825
39998A692825k188621k777187j739345j65258L80849N1422J84507J143538J855615
$$ 1692825 -495796 -3272983 -5012328 -5177586 -4796737 -4745315 -4560808 -3417270 -1561655
39989a561655J366201m3945j327651j647714q88882L25683J122632J173505Q92645
$$ -1561655 -195454 -239399 -1567050 -3214764 -4103646 -3777963 -2655331 -1481826 -589181
39980e89181P02762N24177K87245L39235P24190O27871n38170j840971j709968
$$ -589181 113581 637758 925003 1264238 1988428 2616299 2078129 237158 -1472810
39971a472810q8033J388360J537024Q49475J72105o09309j674636k078622q47843
$$ -1472810 -1560843 -172483 1364541 2214016 2386121 1776812 102176 -1976446 -2824289
39962b824289J156217J938161J013877O099J72263O16575j38392j757840k518677
$$ -2824289 -1668072 270089 1283966 1290065 1462328 2078903 1940511 182671 -2336006
39953b336006j704374l37737M39792N84315N13087K85822n3131r0182L42815O62689
$$ -2336006 -4040380 -4378117 -3938325 -3354010 -2840923 -2555101 -2608232 -2698414 -2355599 -1692910
39943a692910K52727o48180j279801j265967p20873J67127J081147J451640J094216
$$ -1692910 -1440183 -2088363 -3368164 -4634131 -5355004 -5187877 -4106730 -2655090 -1560874
39934a560874P55534J244206K087523J896270K32724j648743k262145j472897
$$ -1560874 -805340 438866 2526389 4422659 4655383 3006640 744495 -728402
39926g28402k33854O74263J063546R09562K38313n80955r82105p72764k43176
$$ -728402 -962256 -287993 775553 1685115 1923428 1342473 360368 -412396 -655572
39917f55572L03859P46498Q37300K62709o68538r25957n157J020077N95270j110534
$$ -655572 -351713 394785 1232085 1494794 826256 -99701 -104858 915219 1510489 399955
39907C99955k124262j266963J84439L70983m53996n17607N86762J304555O17469
$$ 399955 -1724307 -2991270 -2806831 -2435848 -2889844 -3407451 -2820689 -1516134 -898665
39898h98665m88582p11382j93061L00520P23685J164247R84379j17454r83372
$$ -898665 -1387247 -2098629 -2291690 -1991170 -1267485 -103238 881141 763687 -219685
39889b19685l56861J166431J908848J390657M86099k56922r23325j136188l17290
$$ -219685 -576546 589885 2498733 3889390 4375489 4118567 3195242 2059054 1741764
39880A741764R46936J357817Q07387L04547j6538r99400k314203k251653m59659
$$ 1741764 2688700 4046517 4853904 5158451 5141913 4142513 1828310 -423343 -883002
39871h83002J006606N19373q61434j271538p17348l30271j80525L81068R86123
$$ -883002 123604 642977 -218457 -1489995 -2207343 -2537614 -2718139 -2337071 -1350948
39862a350948O32196n41000j325661j079349j17872J136859K202930K180265P14302
$$ -1350948 -718752 -1259752 -2585413 -3664762 -3782634 -2645775 -442845 1737420 2451722
39853B451722r48739j214247k77751K94507n0752l45579j0618K45057j77785p70514
$$ 2451722 1502983 288736 10985 305492 254740 -90839 -101457 143600 -34185 -804699
39843h04699q91413p25695o74756n68925p2220O36936J006157O39517l69609j282846
$$ -804699 -1696112 -2421807 -3096563 -3665488 -3737708 -3100772 -2094615 -1455098 -1824707 -3107553
39833c107553j116082K08872J392875J213110J53007l43374P2758M80980L31156
$$ -3107553 -4223635 -4014763 -2621888 -1408778 -1255771 -1599145 -1526387 -1045407 -714251
39824g14251n0348m54720q47780n20283J110999K745281K228367j67635j611435
$$ -714251 -764599 -1219319 -2067099 -2587382 -1476383 1268898 3497265 3329630 1718195
39815A718195p55603L06637m24698j550466p03562J393301K015687O65388n82052
$$ 1718195 962592 1269229 844531 -705935 -1409497 -16196 1999491 2664879 2082827
39806B082827o41139n63616q89202n25597Q57416J609783N83121r29366j159400
$$ 2082827 1441688 878072 -11130 -536727 320689 1930472 2513593 1584227 424827
39797D24827l90633m1688l20319l76141o6661q821k60809l58123m17257q60034
$$ 424827 34194 -7494 -327813 -703954 -770615 -779436 -1040245 -1398368 -1815625 -2675659
39787b675659j189285m66187R00001J312215L81801k26145Q06657K328398K186259
$$ -2675659 -3864944 -4331131 -3431130 -2118915 -1737114 -1963259 -1156602 1171796 3358055
39778C358055J69244j782072k088145j097725r6937J87639j94335p87978q68014
$$ 3358055 3527299 1745227 -342918 -1440643 -1537580 -1349941 -1544276 -2332254 -3200268
39769c200268N5960J368863J675953N76358o02305n93443L7058N987m53104n4953
$$ -3200268 -3144308 -1775445 -99492 476866 -125439 -718882 -681824 -675837 -1128941 -1183894
39759a183894J038348J086157l63196j319413k02694J676229K057946R82839J57017
$$ -1183894 -145546 940611 577415 -741998 -944692 731537 2789483 3772322 3929339
39750C929339j61904j271201l030551l257346j035216J412789J652275M04706
$$ 3929339 3767435 2496234 -534317 -3791663 -4826879 -3414090 -1761815 -1357109
39742a357109K27174J679329K710399J740418k97821j410799r43188J8970O7060
$$ -1357109 -1129935 549394 3259793 5000211 4702390 3291591 2348403 2367373 2434433
39733B434433j078372k306950k322930j257956n88643r97234j130784M27276K633513
$$ 2434433 1356061 -950889 -3273819 -4531775 -5120418 -6117652 -7248436 -6821160 -4187647
39724d187647L099917J568644L28809P13184J187740R1581j493461j448232l8226
$$ -4187647 -1087730 480914 809723 1522907 2710647 2802228 1308767 -139465 -177691
39715a77691N42544l69437j067362l25798Q12435Q24781j68879r88182j053007
$$ -177691 364853 -4584 -1071946 -1397744 -585309 239472 70593 -917589 -1970596
39706a970596n59238K10914Q75010Q42590M6275o52003m89925J58466M24382K13279
$$ -1970596 -2529834 -2318920 -1443910 -601320 -555045 -1207048 -1696973 -1538507 -1114125 -900846
39696i00846J30731M47550Q12315P99830K43483o83571j289273p79945N65224
$$ -900846 -770115 -322565 489750 1289580 1533063 849492 -439781 -1219726 -654502
39687f54502J268106M95595o45176p15037j58248m15122j264965r87735O74277
$$ -654502 613604 1109199 464023 -251014 -409262 -824384 -2089349 -3077084 -2402807
39678b402807J749578R92189k53345l63861K1166n25935j447848j053670M09735
$$ -2402807 -653229 338960 85615 -278246 -257080 -783015 -2230863 -3284533 -2874798
39669b874798Q03280n97680j854817j150234P65173J898358J603167P31678O0802
$$ -2874798 -2071518 -2669198 -4524015 -5674249 -4909076 -3010718 -1407551 -675873 -615071
39660f15071k23254K6629P78181J266230O17970q73397j897427j664663n96496
$$ -615071 -838325 -811696 -33515 1232715 1850685 977288 -920139 -2584802 -3181298
39651c181298O02200J713356K500547K268271P07759j201126j947726j149419
$$ -3181298 -2579098 -865742 1634805 3903076 4610835 3409709 1461983 312564
39643C12564J31133P62488O43667K54084k42970q97896j341812r86606Q3077R91054
$$ 312564 443697 1206185 1849852 2103936 1860966 963070 -378742 -1365348 -1282271 -291217
39633b91217J090994O93542M58709M26944J45489m29097p71121o27304m53672
$$ -291217 799777 1493319 1952028 2378972 2524461 2095364 1324243 696939 243267
39624B43267o75466r38416o17743J50269N76025L77667J75519M42237O79792K32404
$$ 243267 -432199 -1370615 -1988358 -1838089 -1262064 -884397 -708878 -266641 413151 645555
39614F45555n23587o55905k07533k34721j033225j352365j55514J587857J982909
$$ 645555 121968 -533937 -741470 -976191 -2009416 -3361781 -3517295 -1929438 53471
39605E3471P45447n64415q60384p77926j145390j447442p89272M53953J163792
$$ 53471 798918 234503 -625881 -1403807 -2549197 -3996639 -4785911 -4331958 -3168166
39596c168166J208571J368567J667353J167284k29045j059698k09237J352484
$$ -3168166 -1959595 -591028 1076325 2243609 2014564 954866 745629 2098113
39588B098113J757963O66393n54521q50850n80738m56639m32253j66349J56063
$$ 2098113 3856076 4522469 3967948 3117098 2536360 2079721 1647468 1481119 1637182
39579A637182J66021J7982M9700M6880l79099q52311n81496K71963N63154j02201
$$ 1637182 1803203 1821185 1870885 1917765 1538666 686355 104859 376822 939976 837775
39569H37775o00280m1731O06888o9228j416829j263596Q65114K735618K360908
$$ 837775 237495 195764 802652 733424 -683405 -1947001 -1081887 1653731 4014639
39560D014639N49008o58954r13839j303660j902361j546499q6736R63254N79655
$$ 4014639 4563647 3904693 2990854 1687194 -215167 -1761666 -1848402 -885148 -305493
39551c05493m22814q81083q18240o59080j62935P55378J199015N81393j21101
$$ -305493 -728307 -1609390 -2427630 -3086710 -3249645 -2494267 -1295252 -713859 -834960
39542h34960J51012N69324l15272j805086j656898M13094J941349J172488n53140
$$ -834960 -683948 -114624 -429896 -2234982 -3891880 -3478786 -1537437 -364949 -918089
39533i18089j014432j66804M86419M19930K82968K37980j80986p55376o51505
$$ -918089 -1932521 -2099325 -1612906 -1192976 -910008 -672028 -853014 -1608390 -2259895
39524b259895J23547O13113M30762K66624O32837J097473J071423N41619j89586
$$ -2259895 -2136348 -1523235 -1092473 -825849 -193012 904461 1975884 2517503 2327917
39515B327917p31954n17532N91852J535254J001301o16456j418814n84410N23497
$$ 2327917 1595963 1078431 1670283 3205537 4206838 3590382 2171568 1587158 2110655
39506B110655N14955p6114o3908L15694M3962p00233p77985n2726L37811k42782
$$ 2110655 2625610 2549496 2485588 2801282 2845244 2145011 1367026 1314300 1652111 1409329
39496A409329j079754j283103q75218m05061j71704r0304J13428O08846J020853
$$ 1409329 329575 -953528 -1828746 -2233807 -2405511 -2495815 -2382387 -1773541 -752688
39487g52688O02226o22521j414410q98918n1398l52655j327529j062180P29674
$$ -752688 -150462 -772983 -2187393 -3086311 -3137709 -3490364 -4817893 -5880073 -5150399
39478e150399J935082J011690q12073j358246l36718Q61111J342865J339871J105000
$$ -5150399 -3215317 -2203627 -3015700 -4373946 -4710664 -3849553 -2506688 -1166817 -61817
39469f1817N04060k84340o38808k82022L50258O49108M45282J07037J56208O00990
$$ -61817 442243 157903 -480905 -762927 -412669 236439 681721 788758 944966 1545956
39459A545956O95009j40606j224423j323179n60517l83274j126530j097418P67320
$$ 1545956 2240965 2100359 875936 -447243 -1007760 -1391034 -2517564 -3614982 -2847662
39450b847662K690321K270735N4186j195127m91326L00312l27151j373426j306081
$$ -2847662 -157341 2113394 2167580 972453 481127 781439 454288 -919138 -2225219
39441b225219m28020O9275J90599P61420J655807J867671J136075K73156j73005
$$ -2225219 -2653239 -2583964 -2393365 -1631945 23862 1891533 3027608 3300764 3127759
39432C127759n72912j290330j871722j582239l81167R49642J520042J078435J71659
$$ 3127759 2554847 1264517 -607205 -2189444 -2570611 -1620969 -100927 977508 1149167
39423A149167l95022l10895O8516K81012K47936J09208j04272l49202l63792L6175
$$ 1149167 754145 443250 511766 792778 1040714 1149922 1045650 696448 332656 368831
39413C68831N62679P35056N35639L98335M40758J02681j096281k608706l146206
$$ 368831 931510 1666566 2202205 2600540 3041298 3143979 2047698 -561008 -3707214
39404c707214k099453l47179P16267P84774P56843J236631J614146J089581P4761
$$ -3707214 -5806667 -6153846 -5437579 -4652805 -3895962 -2659331 -1045185 44396 119157
39395A19157k11798N81770J435595J280409K25432p93987j107183p11743K7481
$$ 119157 -92641 489129 1924724 3205133 3430565 2636578 1529395 817652 845133
39386H45133O62562Q50514O50645N68378R82977J521053J295063n6099j696218
$$ 845133 1507695 2358209 3008854 3577232 4560209 6081262 7376325 7320226 5624008
39377E624008k239139j203341L64301J001836M70887j45182M484N03579M92264
$$ 5624008 3384869 2181528 2545829 3547665 4018552 3873370 3877854 4381433 4873697
39368D873697j02927p45591j188404j431524j161596j78132P78244O57794l47263
$$ 4873697 4770770 4025179 2836775 1405251 243655 65523 843767 1501561 1154298
39359A154298q84822l32613L72891K16393n44398j125798j426030j626197j307255
$$ 1154298 269476 -63137 309754 526147 -18251 -1144049 -2570079 -4196276 -5503531
39350e503531p5601J292333J496552N28028j74295L60916J406018J647323Q60165
$$ -5503531 -5579132 -4286799 -2790247 -2262219 -2436514 -2075598 -669580 977743 1837908
39341A837908j13007o05386o46061m31407l4572K45524n0992p57123r57042k49378
$$ 1837908 1724901 1119515 473454 42047 7475 252999 202007 -555116 -1512158 -1761536
39331a761536L76419j86870j332020j375353p3721Q98892N15689j9362O61598
$$ -1761536 -1385117 -1571987 -2904007 -4279360 -4353081 -3454189 -2938500 -2957862 -2296264
39322b296264J705890J322774l35779j358803q03900M61816J481764K033281J762107
$$ -2296264 -590374 732400 396621 -962182 -1766082 -1304266 177498 2210779 3972886
39313C972886L71993j086472j027563J34292K44360j155894j827738l82890J322103
$$ 3972886 4344879 3258407 2230844 2365136 2609496 1453602 -374136 -757026 565077
39304E65077R97763o85213j469722q37188R7478Q09101J304074Q33945r93185
$$ 565077 1562840 877627 -592095 -1429283 -1331805 -522704 781370 1615315 622130
39295F22130k512075j826491Q1549N18295q34556j563811m31412R64550J100966
$$ 622130 -1889945 -3716436 -3634887 -3116592 -3951148 -5514959 -5946371 -4981821 -3880855
39286c880855P12171R85844J535014J392676N44429n40805j567226j817616m15851
$$ -3880855 -3168684 -2182840 -647826 744850 1289279 748474 -818752 -2636368 -3052219
39277c052219J932238L004613J890942K76430j30243J68583O2196m5030N29828
$$ -3052219 -1119981 1884632 3775574 4052004 3921761 4090344 4152540 4107510 4637338
39268D637338Q07568m72030k440596l109280k173117r11238J10068J162159J624693
$$ 4637338 5444906 4972876 2532280 -577000 -2750117 -3661355 -3551287 -2389128 -764435
39259g64435N25294j075262o34559K191649M453896L597156O37627j593421k051460
$$ -764435 -239141 -1314403 -1948962 242687 4696583 8293739 8931366 7337945 5286485
39250E286485j828151j784548j518171n63536O60729J345891J021141k69330j899828
$$ 5286485 3458334 1673786 155615 -407921 252808 1598699 2619840 2350510 450682
39241D50682k769800k141613n46863O55491Q11796N93226Q57033J417912J447812
$$ 450682 -2319118 -4460731 -5007594 -4352103 -3540307 -2947081 -2090048 -672136 775676
39232G75676P56280J5152k28176j17137M0702K26872L70766J73281l22583n76770
$$ 775676 1531956 1547108 1318932 1201795 1242497 1469369 1840135 2013416 1690833 1114063
39222A114063m61327o59774j475825j977756j324758k59141M0103K018Q37032
$$ 1114063 652736 -7038 -1482863 -3460619 -4785377 -5044518 -5004415 -5002397 -4165365
39213d165365J987682J566640l91126j406484j67272J480667J448983L24113k80920
$$ -4165365 -2177683 -611043 -1002169 -2408653 -2575925 -1095258 353725 677838 396918
39204C96918m25983q09843o53809Q54924K180816J307912o89443q79623R37232
$$ 396918 -29065 -838908 -1492717 -637793 1543023 2850935 2161492 1281869 2219101
39195B219101J886772N64752j044313j013608r8069L02743L62136N26929J40454
$$ 2219101 4105873 4670625 3626312 2612704 2514635 2817378 3179514 3706443 3846897
39186C846897r87915j471404m75169O92513P37120M13961O40088M17622j102271
$$ 3846897 2858982 1387578 912409 1604922 2342042 2756003 3396091 3813713 2711442
39177B711442k164921q05730J500412J653972k87703j381974o72184l44710j466866
$$ 2711442 546521 -259209 1241203 2895175 2607472 1225498 553314 208604 -1258262
39168a258262j998167m98973J135895P38741o01116m72620R65861J544428O32714
$$ -1258262 -3256429 -3755402 -2619507 -1880766 -2481882 -2954502 -1988641 -444213 188501
39159A88501k76085k20765J01077m5586l95808n26025m05485N6915Q37902J151575
$$ 188501 -87584 -308349 -207272 -252858 -648666 -1174691 -1580176 -1523261 -685359 466216
$$ [...]
##END NTUPLES=NMR SPECTRUM
##END=
