##TITLE=31Pdec_DE-85_oil2
 D2O, 64 sc
 24.3.2025
##JCAMPDX= 6.0         $$ Bruker NMR JCAMP-DX V2.0
##DATA TYPE= NMR SPECTRUM
##DATA CLASS= NTUPLES
##ORIGIN= UXNMR, Bruker Analytische Messtechnik GmbH
##OWNER= root
$$ XWIN-NMR		Version 3.5
$$ Mon Mar 24 14:19:51 2025 Russian Standard Time (UT+4h)  she@DPX200
##.OBSERVE FREQUENCY= 81.013821
##.OBSERVE NUCLEUS= ^31P
##.ACQUISITION MODE= SIMULTANEOUS
##.ACQUISITION SCHEME= undefined
##.AVERAGES= 64
##.DIGITISER RES= 17
##SPECTROMETER/DATA SYSTEM= spect
##.PULSE SEQUENCE= zgpg30
##.SOLVENT NAME= D2O
##.SHIFT REFERENCE= (INTERNAL, D2O, 0, 198.062)
##AUDIT TRAIL= $$ (NUMBER, WHEN, WHO, WHERE, WHAT)
$$ ##TITLE= Audit trail, XWIN-NMR		Version 3.5
$$ ##JCAMPDX= 5.01
$$ ##ORIGIN= Bruker BioSpin GmbH
$$ ##OWNER= she
$$ F:/spectra/data/she/nmr/P31/2/pdata/1/auditp.txt
$$ ##AUDIT TRAIL=  $$ (NUMBER, WHEN, WHO, WHERE, WHAT)
(   1,<2025-03-24 14:18:47.60 +0400>,<she>,<DPX200>,
      <created by zg, POWCHK disabled, PULCHK disabled
       configuration hash MD5:
       00 E9 B6 7A A2 85 ED C7 34 08 36 98 17 FE 4E 26
       data hash MD5: 32K
       07 D8 10 BB 2A C8 1C B2 32 58 18 12 97 09 C7 5C>)
(   2,<2025-03-24 14:18:50.07 +0400>,<she>,<DPX200>,
      <Start of raw data processing
       efp BC_mod = 2 LB = 1.5 FT_mod = 6 PKNL = 1 PHC0 = 1773.083 PHC1 = 11.09423 SI = 64K 
       data hash MD5: 64K
       84 15 A3 F0 1F 89 4F 9D 91 78 67 C3 D6 BE 95 19>)
(   3,<2025-03-24 14:19:18.04 +0400>,<she>,<DPX200>,
      <pk PHC0 = -449.3705 PHC1 = 321.8 
       data hash MD5: 64K
       07 93 D2 31 BE 6E AD 28 22 86 07 F9 60 99 08 5C>)
(   4,<2025-03-24 14:19:22.45 +0400>,<she>,<DPX200>,
      <abs ABSG = 5 
       data hash MD5: 64K
       46 88 D6 4E F6 17 20 4F 30 30 E7 74 47 A4 56 E8>)
$$ ##END=
$$ 
$$ hash MD5
$$ 6B 92 9F 3B EE 95 DC 84 FD 6C 0D B2 6F 79 A0 07
##$RELAX= 
##$RELAX= 
##$RELAX= 
##$RELAX= 
##$RELAX= 
##$RELAX= 
##$RELAX= 
##$RELAX= 
$$ Bruker specific parameters
$$ --------------------------
##$DU= <F:/spectra>
##$EXPNO= 2
##$NAME= <P31>
##$PROCNO= 1
##$TYPE= <nmr>
##$USER= <she>
##$AMP= (0..31)
100 100 100 100 100 100 100 100 100 100 100 100 100 100 100 100 100 100 
100 100 100 100 100 100 100 100 100 100 100 100 100 100 
##$AQSEQ= 0
##$AQ_mod= 1
##$AUNM= <au_zg>
##$AUTOPOS= <>
##$BF1= 81.014009
##$BF2= 200.13
##$BF3= 200.13
##$BF4= 200.13
##$BF5= 200.13
##$BF6= 200.13
##$BF7= 200.13
##$BF8= 200.13
##$BYTORDA= 1
##$CFDGTYP= 0
##$CFRGTYP= 5
##$CHEMSTR= <none>
##$CNST= (0..31)
1 1 145 1 1 1 1 1 1 1 1 1 1 1 1 1 1 1 1 1 1 1 1 1 1 1 1 1 1 1 1 1 
##$CPDPRG= <waltz16>
##$CPDPRG1= <>
##$CPDPRG2= <waltz16>
##$CPDPRG3= <>
##$CPDPRG4= <mlev>
##$CPDPRG5= <mlev>
##$CPDPRG6= <mlev>
##$CPDPRG7= <mlev>
##$CPDPRG8= <mlev>
##$CPDPRGB= <>
##$CPDPRGT= <>
##$D= (0..31)
0 1 0 0 0 0 0 0 0 0.06 0 0.03 2e-05 3e-06 0 0 0.0002 0 0 0 0 0 0 0 0 0 
0 0 0 0 0 0 
##$DATE= 1742811527
##$DBL= (0..7)
120 120 120 11 120 120 24 19 
##$DBP= (0..7)
150 150 150 150 150 150 150 150 
##$DBP07= 0
##$DBPNAM0= <>
##$DBPNAM1= <>
$$ [...]
##$SUBNAM3= <"">
##$SUBNAM4= <"">
##$SUBNAM5= <"">
##$SUBNAM6= <"">
##$SUBNAM7= <"">
##$SUBNAM8= <"">
##$SUBNAM9= <"">
##$SW= 400.765351723535
##$SWIBOX= (0..15)
0 1 3 0 0 0 0 0 0 0 0 0 0 0 0 0 
##$SW_h= 32467.5324675325
##$TD= 32768
##$TD0= 1
##$TE= 0
##$TE2= 300
##$TE3= 300
##$TEG= 300
##$TL= (0..7)
0 120 53 12 22 120 120 120 
##$TP= (0..7)
150 150 150 150 150 150 150 150 
##$TP07= 0
##$TPNAME0= <>
##$TPNAME1= <>
##$TPNAME2= <>
##$TPNAME3= <>
##$TPNAME4= <>
##$TPNAME5= <>
##$TPNAME6= <>
##$TPNAME7= <>
##$TPOAL= (0..7)
0.5 0.5 0.5 0.5 0.5 0.5 0.5 0.5 
##$TPOFFS= (0..7)
0 0 0 0 0 0 0 0 
##$TUNHIN= 0
##$TUNHOUT= 0
##$TUNXOUT= 0
##$USERA1= <user>
##$USERA2= <user>
##$USERA3= <user>
##$USERA4= <user>
##$USERA5= <user>
##$V9= 5
##$VALIST= <valist>
##$VCLIST= <CCCCCCCCCCCCCCC>
##$VD= 0
##$VDLIST= <DDDDDDDDDDDDDDD>
##$VPLIST= <PPPPPPPPPPPPPPP>
##$VTLIST= <TTTTTTTTTTTTTTT>
##$WBST= 1024
##$WBSW= 4
##$XGAIN= (0..3)
0 0 0 0 
##$XL= 0
##$YL= 0
##$YMAX_a= 20453
##$YMIN_a= -15740
##$ZGOPTNS= <>
##$ZL1= 120
##$ZL2= 120
##$ZL3= 120
##$ZL4= 120
##$ABSF1= 198.0616
##$ABSF2= -202.7028
##$ABSG= 5
##$ABSL= 3
##$ALPHA= 0
##$AQORDER= 0
##$ASSFAC= 0
##$ASSFACI= 0
##$ASSFACX= 0
##$ASSWID= 0
##$AUNMP= <proc_1d>
##$AZFE= 0.1
##$AZFW= 0.5
##$BCFW= 0
##$BC_mod= 2
##$BYTORDP= 0
##$COROFFS= 0
##$CY= -3
##$DATMOD= 1
##$DC= 0
##$DFILT= <>
##$DTYPP= 0
##$F1P= 0
##$F2P= 0
##$FCOR= 1
##$FTSIZE= 65536
##$FT_mod= 6
##$GAMMA= 0
##$GB= 0
##$INTBC= 1
##$INTSCL= 9.790993e-09
##$ISEN= 30
##$LB= 1.5
##$LEV0= 0
##$LPBIN= 0
##$MAXI= 10000
##$MC2= 0
##$MEAN= 0
##$ME_mod= 0
##$MI= 50
##$NCOEF= 0
##$NC_proc= -8
##$NLEV= 6
##$NOISF1= 182.463
##$NOISF2= 159.3651
##$NSP= 0
##$NTH_PI= 0
##$NZP= 0
##$OFFSET= 198.0616
##$PC= 4
##$PHC0= 1323.713
##$PHC1= 332.8942
##$PH_mod= 1
##$PKNL= yes
##$PPARMOD= 0
##$PSCAL= 0
##$PSIGN= 0
##$REVERSE= no
##$SF= 81.0140089999434
##$SI= 65536
##$SIGF1= 159.3651
##$SIGF2= -187.1042
##$SINO= 113.3802
##$SIOLD= 16384
##$SREGLST= <1H.CDCl3>
##$SSB= 0
##$STSI= 65536
##$STSR= 0
##$SW_p= 32467.5324675325
##$SYMM= 0
##$S_DEV= 0
##$TDeff= 32768
##$TDoff= 0
##$TI= <>
##$TILT= no
##$TM1= 0
##$TM2= 0
##$TOPLEV= 0
##$USERP1= <user>
##$USERP2= <user>
##$USERP3= <user>
##$USERP4= <user>
##$USERP5= <user>
##$WDW= 1
##$XDIM= 65536
##$YMAX_p= 300851021
##$YMIN_p= -50785201
$$ End of Bruker specific parameters
$$ ---------------------------------
##NTUPLES= NMR SPECTRUM
##VAR_NAME=  FREQUENCY,     SPECTRUM/REAL,   SPECTRUM/IMAG
##SYMBOL=    X,             R,               I
##VAR_TYPE=  INDEPENDENT,   DEPENDENT,       DEPENDENT
##VAR_FORM=  AFFN,          ASDF,            ASDF
##VAR_DIM=   65536,         65536,           65536
##UNITS=     HZ,            ARBITRARY UNITS, ARBITRARY UNITS
##FACTOR=    0.49542278885378, 1,            1
##FIRST=     16045.7642231865, 0,            0
##LAST=      -16421.768244346, 0,            0
##MIN=       -16421.768244346, -50785201,    0
##MAX=       16045.7642231865, 300851021,    0
$$ Real data points
##PAGE= N=1
##DATA TABLE= (X++(R..R)), XYDATA
$$ [...]
44296b458951J798757L313158K272043R70534P72531J093329J293625J325043
$$ -2458951 -660194 2652964 4925007 5895541 6668072 7761401 9055026 10380069
44288A0380069P45588q92918k626419k783254j263382L90100J234605J627091
$$ 10380069 11125657 10232739 7606320 4823066 3559684 3949784 5184389 6811480
44280F811480J578077K87119k061387l699169l387378j866970m11820P49162J623633
$$ 6811480 8389557 8676676 6615289 2916120 -471258 -2338228 -2750048 -2000886 -377253
44271c77253J470001R3352q39138M41969K989929L692438R36164l411491o096313
$$ -377253 1092748 1186100 346962 788931 3778860 7471298 8407462 4995971 -1100342
44262a100342n673058l100841J4278K677381M115825L428020O84280k059976k292779
$$ -1100342 -6773400 -9874241 -9859963 -7182582 -3066757 361263 1045543 -1014433 -3307212
44253c307212o9204J690439Q34934j184938j511212L4427J106891P21137M97924
$$ -3307212 -3376416 -1685977 -851043 -2035981 -3547193 -3512766 -2405875 -1684738 -1186814
44244a186814J481074K097215O82536j726103k816102k029684n69849O63493J493707
$$ -1186814 294260 2391475 3074011 1347908 -1468194 -3497878 -4067727 -3404234 -1910527
44235a910527J523564M77534p63955q39215M92290K303724L557556L368112J176752
$$ -1910527 -386963 90571 -673384 -1512599 -1020309 1283415 4840971 8209083 9385835
44226I385835k024714l615146k178642L54316J237320P72524J319192K956524
$$ 9385835 7361121 3745975 1567333 1921649 3158969 3931493 5250685 8207209
44218H207209L029261M14552k500247l178193k038327r07215k69147L94649R23083
$$ 8207209 11236470 11651022 9150775 5972582 3934255 3027040 2757893 3152542 4075625
44209D075625O85379l28736j620249k576764k269613k02430K161459K389597N42510
$$ 4075625 4761004 4432268 2812019 235255 -2034358 -2236788 -75329 2314268 2856778
44200B856778l68130J152726K298141k8306m077627n151778j985360J766388K585096
$$ 2856778 2488648 3641374 5939515 5911209 1833582 -3318196 -5303556 -3537168 -952072
44191i52072R38001p24442j525308k205527k913828k612400o30589J995015L140078
$$ -952072 -14071 -738513 -2263821 -4469348 -7383176 -9995576 -10626165 -8631150 -5491072
44182e491072J798414l94264o58926J446655L123244J969978n23346q68942J559681
$$ -5491072 -3692658 -4086922 -4745848 -3299193 -175949 1794029 1270683 401741 1961422
44173A961422L615942K535787q21110l541858l996687k643823n33996J714483
$$ 1961422 5577364 8113151 7292041 3750183 -246504 -2890327 -3424323 -1709840
44165a709840L525323L811868J608741k290173m865579l530562L41496K252872
$$ -1709840 1815483 5627351 7236092 4945919 80340 -3450222 -3108726 -855854
44157h55854N6396l177074l510309j465582k56906k73901P67823K628715K020650
$$ -855854 -799458 -3976532 -7486841 -8952423 -9209329 -9483230 -8715407 -6086692 -4066042
44148d066042j647232m227879k769806Q7982O07345k00141R57069L400202L229928
$$ -4066042 -5713274 -9941153 -12710959 -12622977 -12015632 -12215773 -11258704 -7858502 -4628574
44139d628574j66348k688450j465730J317287K187461J223472Q33659J439371
$$ -4628574 -4794922 -7483372 -8949102 -7631815 -5444354 -4220882 -3387223 -1947852
44131a947852J094489r48096k681175k115438n1873J216297J164441J314174K244326
$$ -1947852 -853363 -1801459 -4482634 -6598072 -6649945 -5433648 -4269207 -2955033 -710707
44122g10707K294297M17267j327335l20579K371432K949059K04834k736586k805169
$$ -710707 1583590 2000857 673522 352943 2724375 5673434 5878268 3141682 336513
44113C36513o62858J211512J743824R63695j182692l579403l630424q24991J239723
$$ 336513 -326345 885167 2628991 3592686 2409994 -1169409 -4799833 -5624824 -4385101
44104d385101n14315l550926k963477J102596L515805J763905q18884o27994J311019
$$ -4385101 -4899416 -8450342 -11413819 -10311223 -6795418 -5031513 -5850397 -6478391 -5167372
44095e167372K062381J238374L10476r0775K10033J874352M143773M046085L55263
$$ -5167372 -3104991 -1866617 -1556141 -1646916 -1436883 437469 4581242 8627327 8982590
44086H982590l407823l203914l82737L92838j542126j971780J125892L955241
$$ 8982590 5574767 2370853 1988116 2380954 838828 -1132952 -7060 3948181
44078C948181K571011j162878k420099j95645K125859K100172Q42983J81676O6779
$$ 3948181 6519192 5356314 2936215 2740570 4866429 6966601 7809584 7991260 8058039
44069H058039j94157k87801J10819J20848j099292k736523l268377k504272j541230
$$ 8058039 7863882 7576081 7686900 7807748 6708456 3971933 703556 -1800716 -3341946
44060c341946j078635q95519p54671o78286l27490Q31301K490074L376025K413640
$$ -3341946 -4420581 -5316100 -6070771 -6749057 -7076547 -6245246 -3755172 -379147 2034493
44051B034493l40084l626748n286360l394891J454675N362649M542826q6064l540161
$$ 2034493 1694409 -1932339 -7218699 -10613590 -9158915 -3796266 746560 660496 -2879665
44042b879665k712451K00851J396122O19589M81632J855198K681286J375115r02601
$$ -2879665 -5592116 -5391265 -3995143 -3375554 -2893922 -1038724 1642562 3017677 2115076
44033B115076k141333k026207j586683j329826q03751L40286J630829K190087
$$ 2115076 -26257 -2052464 -3639147 -4968973 -5772724 -5432438 -3801609 -1611522
44025a611522J614588L95200n49227p36390l73209J21634L82115k6114j187265
$$ -1611522 3066 398266 -150961 -887351 -1260560 -1138926 -756811 -782925 -1970190
44016a970190k157268j681745L1629J277502J060604J95041l31815o13465n94870
$$ -1970190 -4127458 -5809203 -5777574 -4500072 -3439468 -3244427 -3576242 -4189707 -4784577
44007d784577O22241K766063L418776J126079j891191k479013q60334L89340O29375
$$ -4784577 -4162336 -1396273 2022503 3148582 1257391 -1221622 -2081956 -1692616 -1063241
43998a063241J262557K113247J297402r90232k059367r76064O3590j59639K46239
$$ -1063241 199316 2312563 3609965 2619733 560366 -415698 -352108 -511747 -265508
43989b65508K395569L711084J626969k078070l624693k373632p06684J48630J087265
$$ -265508 2130061 5841145 7468114 5390044 1765351 -608281 -1314965 -1166335 -79070
43980g9070K201056J839114o60058l322480l729624j836059K75972J019443R43909
$$ -79070 2121986 3961100 3301042 -21438 -3751062 -5587121 -5311149 -4291706 -3347797
43971c347797J474394K370362J625342j272936l344092j589505K154080K871143
$$ -3347797 -1873403 496959 2122301 849365 -2494727 -4084232 -1930152 940991
43963I40991o79918l943525k944418M62354K077725J364815Q15803J247223J306082
$$ 940991 261073 -3682452 -6626870 -6164516 -4086791 -2721976 -1906173 -658950 647132
43954F47132P67207R48464K005826K607432K266624J553182J44371k760986n966996
$$ 647132 1414339 2362803 4368629 6976061 9242685 10795867 10940238 8179252 2212256
43945B212256o710845m072421j2963L233607M919297M884353L097839N81022j050695
$$ 2212256 -4498589 -8571010 -8583973 -5350366 -431069 4453284 7551123 8132145 7081450
43936G081450j461960j575718j713285j471883j252527j786592k191113q77436
$$ 7081450 5619490 4043772 2330487 858604 -393923 -2180515 -4371628 -5249064
43928e249064J448763K317595J462324J359206K828245L157099N02748k463186
$$ -5249064 -3800301 -1482706 -20382 1338824 4167069 7324168 7826916 5363730
43920E363730j966115J457755L752748K835061P21934P3131P10309M98862j372481
$$ 5363730 3397615 4855370 8608118 11443179 12165113 12238244 12948553 13447415 12074934
43911A2074934l186020k974632j333197q18773k238063l070890j092139J734807
$$ 12074934 8888914 5914282 4581085 3762312 1524249 -1546641 -2638780 -903973
43903i03973J561635j530378l041539j23929M535700O293286L899258k70110l529527
$$ -903973 657662 -872716 -3914255 -4038184 497516 6790802 10690060 10419950 6890423
43894F890423m646781l579697j271692Q18090K016112K684574K810058J655293
$$ 6890423 2243642 -1336055 -2607747 -1789657 226455 2911029 5721087 7376380
43886G376380o06463k443040k893486k412263j229531J100657L680549M188227
$$ 7376380 6769917 4326877 1433391 -978872 -2208403 -1107746 2572803 6761030
43878F761030K208957L58057M90725J199705R40359Q91865K048816K094388j277545
$$ 6761030 8969987 9328044 9818769 11018474 11958833 12850698 14899514 16993902 15716357
43869A5716357n795073p178446n023539k334271k83188K274906M551049L820733
$$ 15716357 9921284 2742838 -2280701 -4614972 -4898160 -2623254 1927795 5748528
43861E748528L66795j900143j162108k23381j528341l153475k194851O21505K422184
$$ 5748528 6115323 4215180 3053072 2829691 1301350 -1852125 -4046976 -3425471 -1003287
43852a003287K331419J596090J009342N75195P00591J532653J800501K91585j912908
$$ -1003287 1328132 2924222 3933564 4508759 5209350 6742003 8542504 8834089 6921181
43843F921181k420065o63154J324595J450943R67p71735O79275K984613K883341
$$ 6921181 4501116 3837962 5162557 6613500 6614467 5842732 6522007 9506620 12389961
43834A2389961p89199m883690n342026k341353K87164P11734J053371K753364
$$ 12389961 11600762 6717072 1375046 -966307 -679143 32591 1085962 3839326
43826C839326L505967J264636j574790j468334O22753P69979j542099k671337
$$ 3839326 7345293 8609929 7035139 5566805 6189558 6959537 5417438 2746101
43818B746101q00410J214280M57970j734530k346492j335129j007828j894226
$$ 2746101 1945691 3159971 3617941 1883411 -463081 -1798210 -2806038 -4700264
43810d700264k064981n86376P94585L99891o72654k36424J410931J641557m55246
$$ -4700264 -6765245 -7351621 -6557036 -6157145 -6829799 -7066223 -5655292 -4013735 -4468981
43801d468981k129676n68004K775928L638828N82846l025001l292515j86523L331584
$$ -4468981 -6598657 -7166661 -4390733 -751905 -169059 -3194060 -6486575 -6673098 -3341514
43792c341514M843238L850974J170846j368808j738399R4812J661615J178979
$$ -3341514 1501724 5352698 6523544 5154736 3416337 3511149 5172764 6351743
43784F351743O2278L91293J192204n7664k894845l923001j669045J349046K176631
$$ 6351743 6414021 6805314 7997518 7939854 5045009 1122008 -547037 802009 2978640
43775B978640Q17183p56672j080196N6891J624977J638936p38432l140003k347052
$$ 2978640 3795823 3039151 1958955 2015846 3640823 5279759 4541327 1401324 -945728
43766i45728R67652K703399J286274k16705N25228J310324k68636k079528r52376
$$ -945728 21924 2725323 4011597 3794892 4320120 5630444 5361808 3282280 2329904
43757B329904J499305J150656j808396l106401j309878J24243j357736l637025
$$ 2329904 3829209 4979865 3171469 65068 -1244810 -1120567 -2478303 -6115328
43749f115328l664251j737542n272Q45429J326111J374976P82297J92714K21602
$$ -6115328 -9779579 -11517121 -11522393 -10676964 -9350853 -7975877 -7193580 -7000866 -6779264
43740f779264N27045O83439Q20461O95441m11102k094893k686440j564570l2353
$$ -6779264 -6252219 -5568780 -4748319 -4052878 -4463980 -6558873 -9245313 -10809883 -10842236
43731a0842236Q98984J764250K767300K787352J636000J195838K511613L632523
$$ -10842236 -9943252 -8179002 -5411702 -2624350 -988350 207488 2719101 6351624
43723F351624K433759J2420r46433K9421J141159J006696n24399l093578n396857
$$ 6351624 8785383 8797803 7851370 7880791 9021950 10028646 9504247 6410669 1013812
43714A013812n261839k343356L71274k5502k518639l919806l133476j213584J283414
$$ 1013812 -4248027 -6591383 -6220109 -6245611 -8764250 -12684056 -15817532 -17031116 -15747702
43705a5747702L853392M276296J090614k789191k866511N87289K842873J611304
$$ -15747702 -11894310 -7618014 -6527400 -9316591 -12183102 -11595813 -8752940 -7141636
43697g141636l55831k74452J061086J956143K404154K407633J115473o72632m35308
$$ -7141636 -7497467 -7771919 -6710833 -4754690 -2350536 57097 1172570 499938 64630
43688F4630J845140K713355M91898j950695k084744j784908l299457m423089j827115
$$ 64630 1909770 4623125 5115023 3164328 1079584 -705324 -4004781 -8427870 -10254985
43679a0254985K960447N186446L400609O11331m62001m75P11942Q70692J13830
$$ -10254985 -7294538 -2108092 1292517 1903848 1441847 1441372 2153314 3024006 3137836
43670C137836r35426o71777J059697J747323l55110l068708l239946j353164p3780
$$ 3137836 2202410 1530633 2590330 4337653 3982543 913835 -2326111 -3679275 -3753055
43661c753055M07180J832410L566707K981985K00527j419358j86839J830583K348545
$$ -3753055 -3345875 -1513465 2053242 5035227 5235754 3816396 3629557 5460140 7808685
43652G808685J545594N05071k77613k06333R78982J614906l24870l650897m808740
$$ 7808685 9354279 9859350 9581737 9375404 10354386 11969292 11644422 7993525 3184785
43643C184785k834889m74007K72330M45421R81921O83224j002329k173177j400080
$$ 3184785 349896 -124111 148219 593640 1575561 2258785 1256456 -916721 -2316801
43634b316801O8660Q56073J718358L230075L532931Q03472l615839o599771o517557
$$ -2316801 -2248141 -1392068 326290 3556365 7089296 7892768 4276929 -2322842 -8840399
43625h840399l740190M33582L848599M302481K065624J32850M91789J756552J871981
$$ -8840399 -12580589 -12147007 -8298408 -3995927 -1930303 -1797453 -1305664 450888 2322869
43616B322869J148221Q06674M70219p01824j917975j967167j285256q69015l74213
$$ 2322869 3471090 4277764 4747983 4046159 2128184 161017 -1124239 -1993254 -2367467
43607b367467Q08551J815831J555258N74648l4768l85495q04730n67399N37718
$$ -2367467 -1558916 256915 1812173 2386821 2352053 1966558 1161828 594429 1132147
43598A132147R14648m53455j746308p45152J642324K622325J354366n80001j630939
$$ 1132147 2046795 1593340 -152968 -898120 744204 3366529 4720895 4140894 2509955
43589B509955j226574O61362K883282L188798R71620j313948j487047p55116j121202
$$ 2509955 1283381 1944743 4828025 8016823 8988443 7674495 6187448 5432332 4311130
43580D311130j589899j34919K074982K098974M1796j181270n00281L23393J57886
$$ 4311130 2721231 2586312 4661294 6760268 6802064 5620794 5120513 5443906 5601792
43571E601792l35286q39814j493581j140079J147739L118729J724196j626648
$$ 5601792 5266506 4426692 2933111 1793032 2940771 6059500 7783696 6157048
43563F157048k431212j58402O59591k250078n059924l774784j84451J216974n02328
$$ 6157048 3725836 3567434 4227025 1976947 -3082977 -6857761 -7042212 -5825238 -6327566
43554f327566k666024l305421k587178j081411Q74419K516260L008160K280291
$$ -6327566 -8993590 -12299011 -14886189 -15967600 -15093181 -12576921 -9568761 -7288470
43546g288470R46496J5588N66027K346342L084547J274285q26300O8581K735387
$$ -7288470 -6341974 -6326386 -5760359 -3414017 -329470 944815 118515 187096 2922483
43537B922483K496515j527341m506054k938707N83374K153349K117698K542933
$$ 2922483 5418998 3891657 -614397 -3553104 -2969730 -816381 1301317 3844250
43529C844250K575887M27506k408583l028714j664929p53998q26049o83132l27540
$$ 3844250 6420137 6847643 4439060 1410346 -254583 -1008581 -1834630 -2517762 -2845302
43520b845302l74111J20533J825987K495457j18441l808291m304042j373245J396124
$$ -2845302 -3219413 -3098880 -1272893 1222564 1104123 -2704168 -7008210 -8381455 -6985331
43511f985331K252700K494926K402914O44687j813217j843310O14883J715417
$$ -6985331 -4732631 -2237705 165209 809896 -1003321 -2846631 -2231748 -516331
43503e16331l48167k535100j960147J07389J507085K800864M767058N457314L117030
$$ -516331 -864498 -3399598 -5359745 -5252356 -3745271 -944407 3822651 9279965 12396995
43494A2396995l40081k106188k716739m077488n054237l104291N30577J531580
$$ 12396995 12056914 9950726 7233987 3156499 -1897738 -5002029 -4471452 -2939872
43486b939872j183469l558014k040250J817210M096400L628709K313574J660847
$$ -2939872 -4123341 -7681355 -9721605 -7904395 -3807995 -179286 2134288 3795135
43478C795135J169748r7357j887292l016955k555596o57993J346159J866831O63102
$$ 3795135 4964883 4867526 2980234 -36721 -2592317 -3250310 -1904151 -37320 625782
43469F25782n30549K83470K835535M527592L431758O75966j053808q68693k03948
$$ 625782 95233 378703 3214238 7741830 11173588 11849554 10795746 9927053 9723105
43460I723105k00127m00471n45828j558290l333580l539126r43321J528681J65832
$$ 9723105 9522978 9122507 8576679 7018389 3684809 145683 -797638 731043 896875
43451H96875l708054m797709j155441L025256L268706L47817k014066k217601
$$ 896875 -2811179 -7608888 -8764329 -5739073 -2470367 -2122550 -4136616 -6354217
43443f354217j045726Q22128K530452K053158j137465l571223j565917L043985
$$ -6354217 -7399943 -6577815 -4047363 -1994205 -3131670 -6702893 -8268810 -5224825
43435e224825M740614J942232j134519j013525O61080J047117O35099J035255
$$ -5224825 -484211 1458021 323502 -690023 -28943 1018174 1653273 2688528
43427B688528J228255m37869k442516j992860L12899J317042L64411j2639J310616
$$ 2688528 3916783 3478914 1036398 -956462 -643563 673479 1037890 1025251 2335867
43418B335867K152156O54328j976362l526266l305932j672114O80264J974322
$$ 2335867 4488023 5142351 3165989 -360277 -3666209 -5338323 -4658059 -2683737
43410b683737M12796k693152l392536l66442K773596K452692j67205j920425k437159
$$ -2683737 -2270941 -4964093 -8356629 -8723071 -5949475 -3496783 -3663988 -5584413 -8021572
43401h021572k947786k612731j24655K565556K512489Q21522Q74586K199102J341565
$$ -8021572 -10969358 -13582089 -13706744 -11141188 -8628699 -7807177 -6932591 -4733489 -3391924
43392c391924j139979n83989L507363N338035J824564k172737j806684P148j549489
$$ -3391924 -4531903 -5115892 -1608529 3729506 5554070 3381333 1574649 1581797 32308
43383C2308m074877j852144L717855N375464J207415k792159k340416j95603K83180
$$ 32308 -4042569 -5894713 -2176858 3198606 4406021 1613862 -726554 -922157 -638977
43374f38977N46081K292656K828228l48715m016913l268970J093944L826936K711576
$$ -638977 -92896 2199760 5027988 4679273 662360 -2606610 -1512666 2314270 5025846
43365E025846N42351Q8432Q81932J317530Q61042m11769k074396k737964j344284
$$ 5025846 5568197 5656629 6538561 7856091 8717133 8305364 6230968 3493004 2148720
43356B148720O81777Q39239n78951o10242J545051K580720j68216m256006n086098
$$ 2148720 2830497 3669736 3090785 2480543 4025594 6606314 6438098 2182092 -2904006
43347b904006k178409M65217J69528j105639k84462K287573L691704K528206J45230
$$ -2904006 -5082415 -4617198 -4447670 -5553309 -5837771 -3550198 141506 2669712 2814942
43338B814942j636481k084432j073447Q64289J779605j46418l420547l854025
$$ 2814942 1178461 -905971 -1979418 -1115129 664476 518058 -2902489 -6756514
43330f756514J2058M081835L689039J9205j451219J473959M870051M165498j63277
$$ -6756514 -6744456 -2662621 1026418 1045623 -405596 1068363 5938414 10103912 9940635
43321I940635l820126l829538q69725K372638L584366K066100j035578l530530
$$ 9940635 6120509 2290971 1421246 3793884 7378250 9444350 8408772 4878242
43313D878242l804204j986689K19786P60942j076915l577601l913162j457616
$$ 4878242 1074038 -912651 -692865 68077 -1008838 -4586439 -8499601 -9957217
43305i957217J090234J167519j54856p5574J521186K247627J370841O58834Q59575
$$ -9957217 -8866983 -7699464 -7854320 -7929894 -6408708 -4161081 -2790240 -2131406 -1271831
43296a271831O45589j20229N07330K689523L383349R77070j631193j262097Q21545
$$ -1271831 -626242 -746471 -239141 2450382 5833731 6810801 5179608 3917511 4739056
43287D739056J470546P28668Q52327J772902J249182j067030l012548l212779
$$ 4739056 6209602 6938270 7790597 9563499 10812681 9745651 6733103 3520324
43279C520324k347028j397511r81354j772778l112491k190118K316328O670625
$$ 3520324 1173296 -224215 -1205569 -2978347 -6090838 -8280956 -5964628 705997
43271G05997N868217O84086l103561k778352j546902k172480k404279M62557M119940
$$ 705997 6574214 7258300 4154739 1376387 -170515 -2342995 -4747274 -4284717 -164777
43262a64777M125614L20557l104877l136943p94370J129000R64658j049159l208370
$$ -164777 3960837 4281394 1176517 -1960426 -2754796 -1625796 -661138 -1710297 -4918667
43253d918667l608199k055460l69755M6391J22698J507821L867495N140956M017963
$$ -4918667 -8526866 -10582326 -10952081 -10905690 -10782992 -9275171 -5407676 -266720 3751243
43244C751243J061157k110297l712375k525391R48038M292278N194193L556596
$$ 3751243 4812400 2702103 -1010272 -3535663 -2587625 1704653 6898846 10455442
43236A0455442J036477r37811j884055j698546o00484N15553O47973k67117j307408
$$ 10455442 11491919 10554108 8670053 6971507 6371023 6886576 7534549 7267432 5960024
43227E960024j455283l97768J107729J591991L54189j344179j638602p29473o56561
$$ 5960024 4504741 4106973 5214702 6806693 7160882 5816703 4178101 3448628 2792067
43218B792067j952899k437222m90107K256381L139427J923428K46536j072216
$$ 2792067 839168 -1598054 -2088161 168220 3307647 5231075 5477611 4405395
43210D405395k119877k360901j287792Q3715M88405M94531J171656J592715L61858
$$ 4405395 2285518 -75383 -1363175 -1279460 -791055 -296524 875132 2467847 2829705
43201B829705j096027j08304K470908K747596j94455k473002j228754J165677
$$ 2829705 1733678 1625374 4096282 6843878 6649423 4176421 2947667 4113344
43193D113344J127513q13262j759560j358429j529742k525303k673012j618322
$$ 4113344 5240857 4427595 2668035 1309606 -220136 -2745439 -5418451 -7036773
43185g036773p59159m58443M09661J888320K507013J917436J529259J793553J199636
$$ -7036773 -7795932 -8254375 -7844714 -5956394 -3449381 -1531945 -2686 1790867 2990503
43176B990503r38606k803095k570056r15636L36528N67735J9201j337949k931572
$$ 2990503 2051897 -751198 -3321254 -4236890 -3900362 -3332627 -3313426 -4651375 -7582947
43167g582947k983118p08680J961069K858647K719581L474338M319527K621976
$$ -7582947 -10566065 -11274745 -9313676 -6455029 -3735448 -261110 4058417 6680393
43159F680393j273055l481282j826518J340731L091415L731839M324266L207396
$$ 6680393 5407338 1926056 99538 1440269 4531684 8263523 12587789 15795185
43151A5795185j265645o093710o203529j724365J556184J89495k467556k047889
$$ 15795185 14529540 8435830 2232301 507936 2064120 2253615 -213941 -2261830
43143b261830K19846L89189j277612j037299J533292K537521M50109r17376J399201
$$ -2261830 -2041984 -1652795 -2930407 -3967706 -2434414 103107 553216 -364160 1035041
43134A035041M196115K665749k123210m536305k246492J250562K138149O32144
$$ 1035041 5231156 7896905 5773695 1237390 -1009102 241460 2379609 3011753
43126C011753j083626k077924k311921j609368o63379r59794k127096j579263
$$ 3011753 1928127 -149797 -2461718 -4071086 -4734465 -5694259 -7821355 -9400618
43118i400618J349253L319450J675559r10521P92L711722N135571K353441o85023
$$ -9400618 -8051365 -4731915 -3056356 -3966877 -3966085 -254363 4881208 7234649 6549626
43109F549626j66050K382739K934322N32324k290481l175844j986445p1199R08483
$$ 6549626 6383576 8766315 11700637 12232961 9942480 6766636 4780191 4708992 5617475
43100E617475Q562j949543k830479j429030J298469L523803M027100K252475j386762
$$ 5617475 5626037 3676494 846015 -583015 715454 4239257 8266357 10518832 9132070
43091I132070m626318m692670j689628J013459R72731m60317p55498K37035J088371
$$ 9132070 4505752 -186918 -1876546 -863087 109644 -350673 -1106171 -869136 219235
43082B19235J357921J327868P48280n7477N71242K972972M324840K107834j965797
$$ 219235 1577156 2905024 3653304 3595827 4167069 7140041 11464881 13572715 11606918
43073A1606918m212854l728853j973187N59713L430549L704415o97020n777885
$$ 11606918 7394064 3665211 1692024 2251737 5682286 9386701 8689681 2911796
43065B911796n160723N65526L892067J184370k442193j691656J176448J320731
$$ 2911796 -2248927 -1683401 2208666 3393036 950843 -740813 435635 1756366
43057A756366p58977j459198p18663p99784q32827J532138M333073L171566j214663
$$ 1756366 997389 -461809 -1180472 -1980256 -2813083 -1280945 3052128 6223694 5009031
43048E009031l034088j01562K904001J830372r95945j166950J138471K503392
$$ 5009031 1974943 1873381 4777382 6607754 5611809 4444859 5583330 8086722
43040H086722J894092J146805R64336j8333k109020l348124k286760j00569J160425
$$ 8086722 9980814 11127619 12091955 12073622 9964602 6616478 4329718 4229149 5389574
43031E389574J265722J517351K272316K114370l0541k828440l673118j825559
$$ 5389574 6655296 8172647 10444963 12559333 12528792 9700352 6027234 4201675
43023D201675N93341J082529o16122k765337l534711k103675R49276L390879K664864
$$ 4201675 4795016 5877545 5261423 2496086 -1038625 -3142300 -2193024 1197855 3862719
43014C862719j076793m193801l470693j00851K081492J750541J160076K077895
$$ 3862719 2785926 -1407875 -4878568 -4979419 -2897927 -1147386 12690 2090585
43006B090585L148696K251540l54014k490209k609417r83041Q42000J190425l15762
$$ 2090585 5239281 7490821 7136807 4646598 2037181 1054140 1896140 3086565 2770803
42997B770803k040811j881608J62061J882270J556506l02954k111249k888661
$$ 2770803 729992 -1151616 -989555 892715 2449221 2146267 35018 -2853643
42989b853643k399424r19846M93754N97986n35455j494795j367279n82737K69728
$$ -2853643 -5253067 -6172913 -5679159 -5081173 -5616628 -7111423 -8478702 -9061439 -8791711
42980h791711J107348J558198J144452P21518J785338L536767K903794r83041
$$ -8791711 -7684363 -6126165 -4981713 -4260195 -2474857 1061910 3965704 2982663
42972B982663m496042l889232k61719K421058K881425K985307L375572K293485
$$ 2982663 -1513379 -5402611 -5664330 -3243272 -361847 2623460 5999032 8292517
42964H292517o59834k833926k150777q5446P32957J36084k83853j86074n99156
$$ 8292517 7632683 4798757 2647980 2562534 3295491 3431575 3147722 2961648 2362492
42955B362492j551107j671387l86470J063623J351679O97001J47491R1048K83860
$$ 2362492 811385 -860002 -1246472 -182849 1168830 1865831 2013322 2104370 2388230
42946B388230P88550J855185K934729K820153J185194p97275k029478k939976
$$ 2388230 3176780 5031965 7966694 10786847 11972041 11174766 9145288 6205312
42938F205312m246906m861679k927388P72164K641842Q93033j564868j085823
$$ 6205312 1958406 -2903273 -5830661 -5058497 -2416655 -1523622 -3088490 -4174313
42930d174313J291635J507456r87325k218527j07648J996430O38016k100024j869549
$$ -4174313 -2882678 -1375222 -2362547 -4581074 -4688722 -2692292 -2054276 -4154300 -6023849
42921f023849J107695K703655J492182K39381N36628L74143j480975k629819r46994
$$ -6023849 -4916154 -2212499 -720317 -480936 55692 429835 -1051140 -3680959 -4627953
42912d627953J719946K400018J092387n75695k338662l955422l259041P00492
$$ -4627953 -2908007 -507989 584398 8703 -2329959 -6285381 -9544422 -8843930
42904h843930M319453L461062k21656j386815J044434K738006J072742j369482
$$ -8843930 -4524477 -1063415 -1285071 -2671886 -1627452 1110554 2183296 813814
42896H13814j685446n89140L75408J544055K864825K591980O15525l80348N09917
$$ 813814 -871632 -1460772 -1085364 458691 3323516 5915496 6531021 6150673 6660590
42887F660590L95560k032766l135237j72646L202043K109927j814851l155492
$$ 6660590 7056150 5023384 1888147 1715501 4917544 7027471 5212620 2057128
42879B057128j038329Q57386J136953J622386K080141R4479l390247m159540j475948
$$ 2057128 1018799 1876185 3013138 4635524 6715665 6810144 3419897 -739643 -2215591
42870b215591N61585j59410p61872Q49199K242931J202042k08967N27831K116982
$$ -2215591 -1654006 -1813416 -2575288 -1726089 516842 1718884 1509917 2037748 4154730
42861D154730K136723Q87713l24387j747859l192416k570020M12538K035964m34206
$$ 4154730 6291453 7179166 6854779 5106920 1914504 -655516 -242978 1792986 1358780
42852A358780m099106m503590k115940p18908j098073o71221J444591L106222
$$ 1358780 -2740326 -7243916 -9359856 -10078764 -11176837 -11848058 -10403467 -7297245
42844g297245K859670J680610Q29926N43441Q04850J251417O84904j332718l114293
$$ -7297245 -4437575 -2756965 -1927039 -1383598 -578748 672669 1357573 24855 -3089438
42835c089438l026370j900723j122314J17399K822102M943877L675324J56297
$$ -3089438 -6115808 -8016531 -9138845 -9021446 -6199344 -1255467 2419857 2576154
42827B576154j729309q66808L44087N46261R07914J695157J195332q27714j924232
$$ 2576154 846845 -19963 324124 870385 1778299 3473456 4668788 3841074 1916842
42818A916842o90223R92597R50414l12499j069863q61596j50450R18902K145243
$$ 1916842 1226619 2219216 3169630 2857131 1787268 925672 775222 1694124 3839367
42809C839367K775244K234126N72791j842962l964925l879691q65324K661822
$$ 3839367 6614611 8848737 9421528 7578566 3613641 -266050 -1131374 1530448
42801A530448L395471J196276j255504k413872k689382j694591J600562N321806
$$ 1530448 4925919 6122195 4866691 2452819 -236563 -1931154 -330592 4991214
42793D991214N223218N60548l850617l715736o76152Q75619P7259l06430J297744
$$ 4991214 10214432 10774980 6924363 3208627 2532475 3408094 3485353 3178923 4476667
42784D476667L305157L551772J791475m33179j291297k43927J301301J508212
$$ 4476667 7781824 11333596 13125071 12691892 11400595 11156668 12457969 13966181
42776A3966181M79472o7430L51479K29278j288145k929211l338418k736894j669310
$$ 13966181 14445653 14378223 14729702 14958980 13670835 10741624 7403206 4666312 2997002
42767B997002j23371J117135N55133j250481j455624P57609K127195r1858l701400
$$ 2997002 2873631 3990766 4545899 3295418 1839794 2597403 4724598 4632740 931340
42758I31340m531174k082195P79311K360329L158877L271968K138089O15328K74589
$$ 931340 -3599834 -5682029 -4902718 -2542389 616488 3888456 6026545 6641873 6916462
42749F916462N78121m31249k477320k934334q96497J309254J552212M84750k81878
$$ 6916462 7494583 7063334 4586014 1651680 755183 2064437 3616649 4101399 3819521
42740C819521l76488R9365J384432K648448J808222j330560l484310j878752J356688
$$ 3819521 3443033 3542398 4926830 7575278 9383500 8052940 4568630 2689878 4046566
42731D046566J669740j418915l506002j721510J216819J421687k44334P358K348974
$$ 4046566 5716306 4297391 791389 -930121 286698 1708385 1464051 1471409 3820383
42722C820383K600401j367151n977124o444417k390343K936190O732401P674772
$$ 3820383 6420784 5053633 -923491 -7367908 -9758251 -6822061 -89660 7585112
42714G585112N146605N21146k317295j045861J500668J064301j735367k662780
$$ 7585112 12731717 13252863 10935568 9889707 11390375 12454676 10719309 8056529
42706H056529p34426P40822K15072R1932J497634J616269j255574m033743l390050
$$ 8056529 7322103 8062925 8277997 8369929 9867563 11483832 10228258 6194515 2804465
42697B804465q19227J80220m67651k30210J504901K928834K840007J634716P1855
$$ 2804465 1985238 2165458 1697807 1467597 2972498 5901332 8741339 10376055 10447910
42688A0447910j092229j235967r96876j799765l173999k697935P2365K241060
$$ 10447910 9355681 8119714 7122838 5323073 2149074 -548861 -476496 1764564
42680A764564J809162M08466j25208o52721j771486j499755R06237K291859N12680
$$ 1764564 3573726 3982192 3856984 3204263 1432777 -66978 839259 3131118 3643798
42671C643798j352835K1720K339419J828784K12115J518751M131777K668010l076616
$$ 3643798 2290963 2312683 4652102 6480886 6693001 8211752 12343529 15011539 11934923
42662A1934923p434489p033645l871194k93820L214453M997476L012323n18384
$$ 11934923 4500434 -2533211 -6404405 -6698225 -3483772 1513704 4526027 4007643
42654D007643r45210J431044J622272j434640k911207n30426J587957M25912p75592
$$ 4007643 3062433 4493477 6115749 4681109 1769902 1239476 2827433 3253345 2477753
42645B477753J238552L647929K238292j873179m477648m048791j711065J405584
$$ 2477753 3716305 7364234 9602526 7729347 3251699 -797092 -2508157 -1102573
42637a102573L544107K399463r36457j590386K157262N261721L114619j335503
$$ -1102573 2441534 4840997 3904540 2314154 4471416 9733137 12847756 11512253
42629A1512253k293279J88147J414564k03413j844451j608302n09402L62656Q63752
$$ 11512253 9218974 9407121 10821685 10618272 8773821 7165519 6656117 7018773 7882525
42620G882525M12772j254030k567713j999026m02595P89099J894996K980628J986179
$$ 7882525 8295297 7041267 4473554 2474528 2071933 2861032 4756028 7736656 9722835
42611I722835j800443m798376l594612k78947Q59686l8021J79205J287297K01343
$$ 9722835 7922392 3124016 -470596 -749543 110143 72122 251327 1538624 1739967
42602A739967k688699l200900J4348L258214L291038J174125m83813q07962j90773
$$ 1739967 -948732 -4149632 -4135284 -877070 2413968 3588093 3104280 2296318 2105545
42593B105545O92409P29848m49873j145598K24265K212707K408638J466774J673421
$$ 2105545 2797954 3527802 3077929 1932331 2156596 4369303 6777941 8244715 9918136
42584I918136K427129J236725j260153j734368K76005J684785J195444Q62971
$$ 9918136 12345265 13581990 12321837 10587469 10863474 12548259 13743703 14606674
42576A4606674J520316J174529o79692j477231j58871N47451j474759m372136
$$ 14606674 16126990 17301519 16621827 15144596 14985725 15533176 14058417 9686281
42568I686281n394316m402294k517824q7453K246125K980553J835526K77518p88058
$$ 9686281 4291965 -110329 -2628153 -2715606 -469481 2511072 4346598 4624116 3836058
42559C836058j411277o63825K187301M432498K287942k684668m445983j237803
$$ 3836058 2424781 1760956 3948257 8380755 10668697 7984029 3538046 2300243
42551B300243J808900J066864k15203J601885M070768L341790Q54940R4009K47919
$$ 2300243 4109143 5176007 4960804 6562689 10633457 13975247 14830187 14924196 15172115
42542A5172115j378954l539921l362091k226471l372902n164466k986361K532754
$$ 15172115 13793161 10253240 6891149 4664678 1291776 -3872690 -6859051 -4326297
42534d326297N253784K285233k162857l115861q31847J184662R15455r57364k269410
$$ -4326297 927487 3212720 1049863 -2065998 -2897845 -1713183 -797728 -1755092 -4024502
42525d024502j000344K405625M476876K750042l01338l74120K298315L415895
$$ -4024502 -5024846 -2619221 1857655 4607697 4306359 3932239 6230554 9646449
42517I646449J267036j246667j772306j441476j386710m22635J801337K952926
$$ 9646449 10913485 9666818 7894512 6453036 5066326 4643691 6445028 9397954
42509I397954J795110P66305K059952L692863K502732q64386l101379l107463
$$ 9397954 11193064 11959369 14019321 17712184 20214916 19350530 16249151 13141688
42501A3141688k607003k530086j814386o2532J136948M80019j097868j792598
$$ 13141688 10534685 8004599 6190213 6127681 7264629 7744648 6646780 4854182
42493D854182j291872p16338o21095j54220J416395L047521K765856K00904k677587
$$ 4854182 3562310 2845972 2224877 2070657 3487052 6534573 9300429 9501333 6823746
42484F823746l740080k717899o21004J563975K678234J427293j652877l434419
$$ 6823746 3083666 365767 -255237 1308738 3986972 5414265 3761388 326969
42476C26969j597177J907944L146983J513484P8547O13115J246219L0887j790964
$$ 326969 -1270208 637736 3784719 5298203 5376750 5989865 7236084 7266971 5476007
42467E476007j756368K87594K207121K159506J76691j949445j951971N21625K643663
$$ 5476007 3719639 4007233 6214354 8373860 8550551 6601106 4649135 5170760 7814423
42458G814423J280054k584500m523499k468423P04213J666356J017276J005077
$$ 7814423 9094477 6509977 1986478 -481945 222268 1888624 2905900 3910977
42450C910977J255537j32015k545301l190330j227135J176088K150705K153347
$$ 3910977 5166514 5034499 2489198 -701132 -1928267 -752179 1398526 3551873
42442C551873K169102J929375Q78599m50256j030009o28467R1188L51100o1442
$$ 3551873 5720975 7650350 8528949 8078693 7048684 6420217 6511405 6862505 6801063
42433F801063n41964k23126P94666J202048J95448j086721r50758L34721P69446
$$ 6801063 6259099 6035973 6830639 8032687 8228135 7141414 6190656 6525377 7294823
42424G294823n00504j865412j438672L33884J098575n87594l369342m216953j601461
$$ 7294823 6794319 4928907 3490235 3824119 4922694 4335100 965758 -3251195 -4852656
42415d852656K492995M363134K754694L71663L54131K207961K896065J463643
$$ -4852656 -2359661 2003473 4758167 5129830 5483961 7691922 10587987 12051630
42407A2051630K34626Q77897J667409L33695k071086k552952o93960P88378J86480
$$ 12051630 12286256 13164153 14831562 15165257 13094171 10541219 9847259 10635637 10822117
42398A0822117r78660r02540m45541j252639k473350j856223M66085J868375J100108
$$ 10822117 9843457 8940917 8495376 7242737 4769387 2913164 3379249 5247624 6347732
42389F347732j92429n44267q29538j891247k241026l91284K060003K341890O59283
$$ 6347732 6155303 5611036 4781498 2890251 649225 257941 2317944 4659834 5319117
42380E319117l47920P3251K8822j144942j385767M58194K233420J639307l49331
$$ 5319117 4971197 5044448 5073270 3928328 2542561 3000755 5234175 6873482 6524151
42371F524151j438823j709356k769760m303216m281511k349762l48729P96184
$$ 6524151 5085328 3375972 606212 -3697004 -7978515 -10328277 -10677006 -9880822
42363i880822K218821M371349N435624L946097J353700J76643N51219M72767r01136
$$ -9880822 -7662001 -3290652 2144972 6091069 7444769 7621412 8172631 8645398 7744262
42354G744262k017155j287333P77629K481336K939865K329640R66900p28258j776971
$$ 7744262 5727107 4439774 5217403 7698739 10638604 12968244 13935144 13206886 11429915
42345A1429915j451776o02107r39341k609794l665403k676547p54672J47346J6421
$$ 11429915 9978139 9376032 8436691 5826897 2161494 -515053 -1269725 -1122379 -1105958
42336a105958L19536J302414J606883O92115j37967K56220J240635J576623J005343
$$ -1105958 -786422 515992 2122875 2814990 2677023 2933243 4173878 5750501 6755844
42327F755844j02345j472367k369203j509703J222669L919038M784875M240814
$$ 6755844 6653499 5181132 2811929 1302226 2524895 6443933 11228808 15469622
42319A5469622L491706K112270p74585l543216l120626M51787L075043J575051
$$ 15469622 18961328 21073598 20299013 16755797 13635171 14086958 17162001 18737052
42311A8737052k343200m770429m496832l112960j592773L90185K191398K269103
$$ 18737052 16393852 11623423 7126591 4013631 2420858 2811043 5002441 7271544
42303G271544R96092N89171J260007L62758k805703m294958p40474M752494O011824
$$ 7271544 8267636 8856807 10116814 10479572 7673869 3378911 2638437 7390931 13402755
42294A3402755K265618j143214q05511N10069o82260l022238l151815j089266
$$ 13402755 15668373 14525159 13719648 14229717 13547457 10525219 7373404 6284138
42286F284138O64819J314382J604159R79117j475842m030764l702705n09403K534433
$$ 6284138 6948957 8263339 9867498 10846615 9370773 5340009 1637304 1127901 3662334
42277C662334L439131K565561M70887k398015m089452k647160N00126J868870
$$ 3662334 7101465 9667026 10137913 7739898 3650446 1003286 1503412 3372282
42269C372282R26825M01449J265674J338868j26904n80751J262084K735899J471781
$$ 3372282 4299107 4700556 5966230 7305098 7178194 6597443 7859527 10595426 12067207
42260A2067207q77912j601231o75771Q00973K814515M421872K901140j641744
$$ 12067207 11189295 9588064 8912293 9713266 12527781 16949653 19850793 18209049
42252A8209049l948386k24796N240563M926448j675881p471405p166996k857115
$$ 18209049 14260663 14035867 19276430 24202878 22526997 15055592 7888596 5031481
42244E031481L14520K62292j456315k389502j221251J387195L404521L742105
$$ 5031481 5346001 5608293 4151978 1762476 541225 1928420 5332941 9075046
42236I075046L360183L050869J745752j071790l162570k459169n38445q5238n06931
$$ 9075046 12435229 15486098 17231850 16160060 12997490 10538321 9999876 9914638 9407707
42227I407707L59077J683191J003349q88388j000645M20508K69968j662191k245413
$$ 9407707 9766784 11449975 12453324 11564936 10564291 10984799 11254767 9592576 7347163
42218G347163p31376J20651m75165J04733K372163K953074N02847j516212o13266
$$ 7347163 6615787 6736438 6261273 6366006 8738169 11691243 12194090 10677878 10064612
42209A0064612Q48143N92477P01472L234580N704727N194783L522143L772090
$$ 10064612 10912755 11505232 12206704 15441284 21146011 26340794 29862937 33635027
42201C3635027M644473L119424M55166L80871K637496L246097O97242k469560
$$ 33635027 38279500 41398924 41854090 42234961 44872457 48118554 48815796 46346236
42193D6346236m058157m258081l347721j112151J071073Q42424j798323m270960
$$ 46346236 42288079 38029998 34682277 33570126 34641199 35483623 33685300 29414340
42185B9414340m824586l973550k674279j391296p71166r35822m42434J660010
$$ 29414340 24589754 20616204 17941925 16550629 15779463 14843641 14401207 16061217
42177A6061217L232966J296030l276713o153412m924334j609626N11546L04913
$$ 16061217 19294183 20590213 17313500 11160088 6235754 4626128 5137674 5442587
42169E442587j264754k477762j893666J84533J407747K74217j356378q55474R72206
$$ 5442587 4177833 1700071 -193595 -9062 1398685 1672902 316524 -538950 433256
42160D33256J210321k58264o37699R67091K244913J823113J207086J423471R98938
$$ 433256 1643577 1385313 747614 1714705 3959618 5782731 6989817 8413288 9412226
42151I412226j051632k967596k832492j274004R0578J032576J989504K581183
$$ 9412226 8360594 5392998 2560506 1286502 1377080 2409656 4399160 6980343
42143F980343K257396J219510r7449j145162o83009J887019M363361L522724k84720
$$ 6980343 9237739 10457249 10359800 9214638 8531629 10418648 14782009 18304733 18020013
42134A8020013l083287k699276j175275m94213O51389L622221O527255P015614
$$ 18020013 14936726 12237450 11062175 10567962 11219351 14841572 21368827 28384441
42126B8384441N838404M673697K795655o77374l278974k003858J466886K393847
$$ 28384441 34222845 38896542 41692197 41014823 37735849 35731991 37198877 39592724
42118C9592724m69854l690625m591395m123169l576951k134506M83939J831127
$$ 39592724 39122870 35432245 30840850 26717681 23140730 21006224 21490163 23321290
42110B3321290k64583m122865o053989n011093l235861k465598j711409L36457
$$ 23321290 23056707 18933842 12879853 7868760 4632899 2167301 455892 792349
42102G92349K432951K248648K03336m88310J634221L867731L319669J422140J511300
$$ 792349 3225300 5473948 5677284 5188974 6823195 10690926 14010595 15432735 16944035
42093A6944035L019808K050025k043394m923056l671352q99615O0599K88772J996684
$$ 16944035 19963843 22013868 19970474 15047418 11376066 10476451 10537050 10825822 12822506
42084A2822506L345763J283894k394406k969639o3505K006857J192580M8703K38423
$$ 12822506 16168269 17452163 15057757 12088118 12024613 14031470 15224050 15272753 15511176
42075A5511176k92623k606919l740418j484306J299514Q40289j493600j288875
$$ 15511176 15218553 12611634 8871216 7386910 8686424 9526713 8033113 6744238
42067F744238K066021M586442L641084J208755K47720M17586q41862m111896o504242
$$ 6744238 8810259 13396701 17037785 18246540 18494260 18911846 18069984 13958088 7453846
42058G453846m636925J312198O988154P846876L792828r23314k616363j820256
$$ 7453846 2816921 4129119 11117273 18964149 22756977 21833663 19217300 17397044
42050A7397044j370157k185219k550824j056327J440723L017748K734479J140534
$$ 17397044 16026887 13841668 11290844 10234517 11675240 14692988 17427467 18568001
42042A8568001n08331j254607j170022j224581k025879k763232k011980L29178
$$ 18568001 18059670 16805063 15635041 14410460 12384581 9621349 7609369 7938547
42034G938547K521710K742800J017684r35560j623211j162319o50384n24372j67395
$$ 7938547 10460257 13203057 14220741 13285181 11661970 10499651 9849267 9324895 9157500
42025I157500P28163J240247N01429o17328m10600J080409J877959R85800q858
$$ 9157500 9885663 11125910 11627339 11010011 10599411 11679820 13557779 14543579 14534721
42016A4534721O25007J980366J830605J5897j384067j146081l08533j01624j81633
$$ 14534721 15159728 17140094 18970699 18986596 17602529 16456448 16147915 16046291 15864658
42007A5864658K36466Q40561Q69474L19627m80496j574674k612103k398353o32970
$$ 15864658 16101124 16941685 17811159 18130786 17650290 16075616 13463513 11065160 10432190
41998A0432190Q05836J74992j131820k45733K513826L397475O71892k351493j837791
$$ 10432190 11238026 11413018 10281198 10035465 12549291 15946766 16618658 14267165 12429374
41989A2429374J014370J807678o55033l013526k555574p58944l75365j235995
$$ 12429374 13443744 15251422 14596389 11582863 9027289 8268345 7892980 6656985
41981F656985q94138J625483M450053N012658K638628q40309k609441j440704
$$ 6656985 5762847 7388330 11838383 16851041 19489669 18649360 16039919 14599215
41973A4599215R75706J881507P29825m25470m0036R33841R99255N50609Q99980
$$ 14599215 15574921 17456428 18186253 17760783 17720747 18654588 19653843 20204452 21104432
41964B1104432J875056K055400R52694n22123j551275k035201j779272l20887
$$ 21104432 22979488 25034888 25987582 25465459 23914184 21878983 20099711 19778824
41956A9778824K113185M255296M735181L187839O56308r60487n47956P47455N80781
$$ 19778824 21892009 26147305 30882486 34070325 34726633 33766146 33218190 33965645 34546426
41947C4546426j460415k928760j730828Q65267J868668L66973j886902l062040
$$ 34546426 33086011 30157251 28426423 29291690 31160358 31527331 29640429 26578389
41939B6578389k763230j372908M04458J427221J002816j47460r30188j424532
$$ 26578389 23815159 22442251 22846709 24273930 25276746 25129286 24199098 22774566
41931B2774566k077278k121468p01138R23310N31605j725605l340492k987798
$$ 22774566 20697288 18575820 17874682 18797992 19329597 17603992 14263500 11275702
41923A1275702j866219j122839k49446J093089J753066Q60429o11148j229610
$$ 11275702 9409483 8286644 8037198 9130287 10883353 11743782 11132634 9903024
41915I903024q63921j31152P92964J927361K897734L160801K175134m40894l704891
$$ 9903024 9039103 8907951 9700915 11628276 14526010 17686811 19861945 19421051 15716160
41906A5716160m810716k069415J868100K524108k39508j733990O97360L724816
$$ 15716160 10905444 8836029 10704129 13228237 12988729 11254739 11952099 15676915
41898A5676915L221558L88457o36790P37102J361692o8996j062679M01339K630356
$$ 15676915 18898473 19286930 18650140 19387242 20748934 20679938 19617259 20018598 22648954
41889B2648954K755247P87173n16891O72975K965738L515482J557451p89394j614416
$$ 22648954 25404201 26191374 25674483 26347458 29313196 32828678 34386129 33596735 31982319
41880C1982319j807866l041543m252246k881414M26827J594588j238402m677129
$$ 31982319 30174453 27132910 22880664 19999250 20426077 22020665 20782263 16105134
41872A6105134m526881r95881K526685L849904L048285J006561q94187j176460
$$ 16105134 11578253 10582372 13109057 16958961 20007246 21013807 20119620 18943160
41864A8943160k73622m48232k019093k077922P81903L248600J949438j301477
$$ 18943160 18669538 18221306 16202213 14124291 14906194 18154794 20104232 18802755
41856A8802755k736102k664774l595988m283050j326268L941428O024521L268555
$$ 18802755 16066653 13401879 9805891 5522841 4196573 8138001 14162522 17431077
41848A7431077r3416r48593j050355k065703k152007j66505J373471Q05505O96025
$$ 17431077 17337661 16389068 15338713 13273010 11121003 10954498 12327969 13133474 13829499
41839A3829499K998331M549857J904359k159374k090236J931633M109497J557268
$$ 13829499 16827830 21377687 23282046 21122672 19032436 20964069 25073566 26630834
41831B6630834k039774k461227p03806l84199j948748k441872l70306J799707
$$ 26630834 24591060 22129833 21426027 21041828 19093080 16651208 16280902 18080609
41823A8080609R25329k421222m481661l087881j73605J271152J046470Q50950
$$ 18080609 19005938 16584716 12103055 9015174 8841569 10112721 11159191 12010141
41815A2010141R74429M40072k82431L08519J638901J431971l48353j072074J58474
$$ 12010141 12984570 13424642 13142211 13450730 15089631 16521602 16173249 15101175 15259649
41806A5259649J004319K68318L72704L075775N692169M737879J270767p18640
$$ 15259649 16263968 16532286 16904990 19980765 25672934 30410813 31681580 30962940
41798C0962940P1941J479276K008500K600382M134706N683578N933943M846602
$$ 30962940 31034881 32514157 34522657 37123039 41257745 46941323 52875266 57721868
41790E7721868L374620K339429J772880J083295R4926l35371K46559K93595j918664
$$ 57721868 61096488 63435917 65208797 66292092 66387018 66051647 66298206 66591801 64673137
41781F4673137m994928n687617l912232l213671n018166o044117l653107l13829
$$ 64673137 59678209 53990592 50078360 46864689 41846523 35802406 32149299 31835470
41773C1835470L40864j016053j376269m08555K25000N69834J560613K124482R09447
$$ 31835470 32176334 31160281 29784012 29375457 29600457 30170291 31730904 33855386 34764833
41764C4764833n27364n4860R49886j30992k187112k065096j16911O18099q67N86269
$$ 34764833 34237469 34182609 35132495 35001503 32814391 30749295 30632384 31250483 31249616 31835885
41754C1835885K230062K104561L62005M16805K765737L806288K184322J148654
$$ 31835885 34065947 36170508 36532513 36949318 39715055 43521343 45705665 46854319
41746D6854319K652654M068792L279901K487132L994197O213390P062131P868640
$$ 46854319 49506973 53575765 56855666 59342798 63336995 69550385 76612516 84481156
41738H4481156J0631258J4324218J7034337J9162796K1606015K3217672K2807801
$$ 84481156 95112414 109436632 126470969 145633765 167239780 190457452 213265253
41731B13265253K1231855J8917539J3990191N761937k359256o395193o101019
$$ 213265253 234497108 253414647 267404838 273166775 270807519 264412326 258311307
41724B58311307l349831Q92697M990462N115987p34403r310805j6172560k0829350
$$ 258311307 254961476 255854173 260844635 265960622 265226219 255915414 239742854 218913504
41716B18913504k4295279k4643478k0127512j4532602j3440012j5873622j5434912
$$ 218913504 194618225 169974747 149847235 135314633 121874621 106000999 90566087
41709I0566087r982049m656803m084572o489979p557745o181615m068824k564919
$$ 90566087 80584038 75927235 71842663 65352684 57794939 51613324 47544500 44979581
41701D4979581k024117k308532k447376j490423l66877q52343k328321k154389
$$ 44979581 42955464 40646932 38199556 36709133 36342256 35489913 33161592 31007203
41693C1007203J24476J764554J017739m43506o37036j47830j78897j10553Q84578
$$ 31007203 31131679 32896233 33913972 33470466 32833430 32685600 32506703 32396150 33280728
41684C3280728J603738M56686j702625k317927k05390L348004N998095O023517
$$ 33280728 34884466 35341152 33638527 31320600 31115210 34463214 40461309 46484826
41676D6484826L453698M58242j28333K412292N808993P235815O176446M629535
$$ 46484826 49938524 50396766 50268433 52680725 58489718 65725533 71901979 76531514
41668G6531514M999277P825274J1086656J2092340J0721431R953007J2010530
$$ 76531514 81530791 89356065 100442721 112535061 123256492 133209499 145220029
41661A45220029J5119036J5992702J4379587J2319091R597659L678922n289503
$$ 145220029 160339065 176331767 190711354 203030445 212628104 216307026 211017523
41654B11017523j3086275j6619954j7455233j8167906j8005153j4947508j0171045
$$ 211017523 197931248 181311294 163856061 145688155 127683002 112735494 102564449
41647A02564449p302988p760723r184867q510606n107885r23356J531732J474058
$$ 102564449 95261461 87500738 78315871 69805265 64697380 63774024 65305756 66779814
41639F6779814N43010P42680J837890K104288J524384J991782L764611M390417
$$ 66779814 67322824 68065504 69903394 72007682 73532066 75523848 79288459 83678876
41631H3678876K695665J335852L026757O178247P114045N458514M390627O021053
$$ 83678876 86374541 87710393 90737150 96915397 104029442 109487956 113878583 119899636
41623A19899636R269319J2383794J5054035J7439295J9113604J9799987J9624573
$$ 119899636 129168955 141552749 156606784 174046079 193159683 212959670 232584243
41616B32584243J7785018J2267990K164044j0140098k0027282k4152325k2825313
$$ 232584243 250369261 262637251 264801295 254661197 234633915 210481590 187656277
41609A87656277j9141070j6084713j4593613j4039965j3656789j2928425j1355743
$$ 187656277 168515207 152430494 137836881 123796916 110140127 97211702 85855959
41602H5855959q954627o681931n324143m314089k804034j360859r95440j035961
$$ 85855959 76901332 70219401 64895258 60581169 57777135 56416276 55420836 54384875
41594E4384875q6830J182501Q16736p05175n34398J931610L590755K280006j03172
$$ 54384875 54298045 55480546 56297282 55592107 55057709 56989319 60580074 62860080 62756908
41585F2756908j151461j753616l610832n344811m438993j599373J11199l33087
$$ 62756908 61605447 59851831 56240999 50896188 46457195 44857822 44969021 44635934
41577D4635934j354122j951558k478229k479300o62109K569867M787981M272452
$$ 44635934 43281812 41330254 38852025 36372725 35710616 38280483 43068464 47340916
41569D7340916J600894j454119l176823k462269J55025K284529K088431N45664
$$ 47340916 48941810 47487691 44310868 41848599 42003624 44288153 46376584 46922248
41561D6922248j87080P2943n5166o65855n14989L73809M21246r14893k272493
$$ 46922248 46735168 46808111 46752945 46087090 45572101 45945910 46367156 45452263 43179770
41552D3179770k530653k154350j992515k111563k144934j749851o98801N73460
$$ 43179770 40649117 38494767 36502252 34390689 32245755 30495904 29797103 30370563
41544C0370563Q63135l75294k041481k822185k812762k679435k343667j724828
$$ 30370563 31233698 30858404 28816923 25994738 23181976 20502541 18158874 16434046
41536A6434046j394897j107888N05784K993376L096606o28371m364676l619912
$$ 16434046 15039149 13931261 14437045 17430421 20527027 19898656 15533980 11914068
41528A1914068M30418K932417K269465Q25824p6132j285922k193321q33423J889956
$$ 11914068 12344486 15276903 17546368 18372192 18296060 17010138 14816817 13983394 15873350
41519A5873350K561669O41020p03043p071M67450p18755j755878j149819J10874
$$ 15873350 18435019 19076039 18372996 18365925 18833375 18114620 16358742 15208923 15319797
41510A5319797J303142L061919M451094L019474o98710k838374j941971p97495
$$ 15319797 16622939 19684858 24135952 27155426 26456716 23618342 21676371 20878876
41502B0878876r83221m21902J517556J746644p07569j798380Q06488L014465Q25595
$$ 20878876 19895655 19473753 20991309 22737953 22030384 20232004 21038492 24052957 24878552
41493B4878552k949672l564953j943776j890929l126576k984477k237820l075304
$$ 24878552 21928880 18363927 16420151 14529222 11402646 8418169 6180349 3105045
41485C105045l478743l5888N068520O295666L300197J045646J552747J617153
$$ 3105045 -373698 -409586 4658934 10954600 14254797 15300443 16853190 18470343
41477A8470343p49502l343453m264105m230904l286981j35491L832167M544675
$$ 18470343 17720841 14377388 10113283 5882379 2595398 2459907 6292074 10836749
41469A0836749J086710k537943l121170j865412p72139M95610K090680K121485
$$ 10836749 11923459 9385516 6264346 4398934 3626795 4122405 6213085 8334570
41461H334570j05754j981847j242213O88550J225467L72180j62273J63222O55504
$$ 8334570 8228816 6246969 5004756 5693306 6918773 7290953 7128680 7291902 7947406
41452G947406Q89576P88089K06830o28760j159022j232884q07381O51553K923020
$$ 7947406 8836982 9625071 9831901 9203141 8044119 6811235 6003854 6655407 9578427
41443I578427M028679K670142P32528O54433J377725L13150j711182j755296m31744
$$ 9578427 13607106 16277248 17009776 17664209 19041934 19355084 17643902 15888606 15456862
41434A5456862j214753l840967l910971m08111J901841j3462k601044j609649
$$ 15456862 14242109 10401142 6490171 6082060 7983901 7970439 5369395 3759746
41426C759746J499121K733771J682638N87044k9929j070280k050651j810239p43509
$$ 3759746 5258867 7992638 9675276 10262320 10232391 9162111 7111460 5301221 4557712
41417D557712K8039M02269N88069L57450K05489J082669K077008J180964q20168
$$ 4557712 4585751 4988020 5576089 5933539 6139028 7221697 9298705 10479669 9659501
41408I659501q02655J315908J917813j16632j453380o84130j184922m410344n941276
$$ 9659501 8856846 10172754 12090567 11973935 10520555 9836425 8651503 4241159 -1700117
41399a700117k537246K071918L345526K845741L505564L114532p90213m108894
$$ -1700117 -4237363 -2165445 1180081 4025822 7531386 10645918 9855705 5746811
41391E746811j980878K192168J756823k000559k475368N00519J094832j138899
$$ 5746811 3765933 5958101 7714924 5714365 3238997 3739516 4834348 3695449
41383C695449m18583L854440M892648L12468l246937j215218J667141J92888k665883
$$ 3695449 3276866 7131306 12023954 12336422 9089485 7874267 9541408 9734296 7068413
41374G068413j936486N56713J39089k315565k413517J44915J819242J375318Q05837
$$ 7068413 5131927 5688640 5827729 3512164 1098647 1243562 3062804 4438122 5243959
41365E243959J147432J451029J306387J309215J572362J879042K386635K778132
$$ 5243959 6391391 7842420 9148807 10458022 12030384 13909426 16296061 19074193
41357A9074193K241376J263538J218496J438468j51331k566836k056398J463718
$$ 19074193 21315569 22579107 23797603 25236071 25084740 22517904 20461506 21925224
41349B1925224K957734p347k843543j035804K737016L246643Q21578l32894R49766
$$ 21925224 24882958 24875611 22032068 20996264 23733280 26979923 27801501 27468607 28418373
41340B8418373K793345M883482P813367R618706Q099344N127380L747541K697573
$$ 28418373 31211718 36095200 43908567 53527273 61626617 66753997 70501538 73199111
41332G3199111p99903m423233l283601J465118L099656r46697n928131p604985
$$ 73199111 72399208 67975975 64692374 66157492 69257148 68310451 62382320 54777335
41324E4777335p345235p434256o845689m648734l073392l845693m956923m124318
$$ 54777335 47432100 39997844 33152155 28503421 25430029 21584336 16627413 12503095
41316A2503095k436424j697401j026755Q36443K343884J547897j28795K32622
$$ 12503095 10066671 8369270 7342515 8178958 10522842 12070739 11941944 12174566
41308A2174566K553001M030486L239048J495935N18287P31260J670352K460600
$$ 12174566 14727567 18758053 21997101 23493036 24011323 24742583 26412935 28873535
41300B8873535K123235O74196m04403J51995J668299K474815K134716J798708
$$ 28873535 30996770 31670966 31266563 31418558 33086857 35561672 37696388 39495096
41292C9495096K658220M759292P028653P938071O527505L290670j02290k084694
$$ 39495096 42153316 46912608 53941261 61879332 68406837 71697507 71595217 69510523
41284F9510523k064070m66679J458587K364619K114930J720666J192844j115767
$$ 69510523 67446453 66979774 68438361 70802980 72917910 74638576 75831420 74715653
41276G4715653n334468p924319n736850j314978l97307m049471p230518o150225
$$ 74715653 69381185 61456866 55720016 54405038 54007731 49958260 42727742 36577517
41268C6577517l055803j769219k152904j893079r26410p53155j236772j296032
$$ 36577517 33521714 31752495 29599591 27706512 26780102 26026947 24790175 23494143
41260B3494143j473436k801144m048446l004568j3688K327263K683867J946382
$$ 23494143 22020707 19219563 15171117 12166549 12152861 14480124 17163991 19110373
41252A9110373J051316J12317m52603j13232L98699j39619j176547p49168J546387
$$ 19110373 20161689 20274006 19821403 19708171 20106870 19967251 18790704 18041536 19587923
41243A9587923L548307L061574L63897k205632k579924r38592K77669j078770
$$ 19587923 23136230 26197804 26561701 24356069 21776145 20837553 21115222 20036452
41235B0036452l901550m661896k046204Q94846Q52650j075854j207747J275515
$$ 20036452 16134902 11473006 9426802 10321648 11174298 10098444 8890697 10166212
41227A0166212L448191K933400M78940j954717l348408l343016j806012M98882
$$ 10166212 13614403 16547803 17026743 15072026 11723618 8380602 6574590 7073472
41219G073472K129845K409555J790004Q82382J52440J33695O65786N70732m41395
$$ 7073472 9203317 11612872 13402876 14285258 14437698 14571393 15237179 15807911 15366516
41210A5366516n86559J202148K490139L56314l503537m401060j600192L29896
$$ 15366516 14779957 15982105 18472244 18828558 15325021 10923961 9323769 9653665
41202I653665j612732m355538l400409Q81606M306369M353864K119969P7175o3887
$$ 9653665 8040933 3685395 284986 1166592 5472961 9826825 11946794 12023969 11960082
41193A1960082J715393L354920K366356q69832k927399j720162P83153J784902
$$ 11960082 13675475 17030395 19396751 18526919 15599520 13879358 14662511 16447413
41185A6447413J457770J356490J113609m02153k101120j969974n16640M4978n12909
$$ 16447413 17905183 19261673 20375282 19973129 17872009 15902035 15385395 15430373 14917464
41176A4917464m73489M46516P34290O6021k62097j03395p53809j976274j664061
$$ 14917464 14443975 14890491 15624781 15690802 15428705 15325310 14571501 12595227 10931166
41167A0931166N57587K121162J288995j97432J39343J993207L174915K637316
$$ 10931166 11488753 13609915 14898910 14701478 14840821 16834028 20008943 22646259
41159B2646259J136233k1538K05176J847393L139478J976224q92981j939254N13946
$$ 22646259 23782492 23760954 23966130 25813523 28953001 30929225 30036244 28096990 28610936
41150B8610936L615770L839906J834214J000237K419612M012625M337986M389182
$$ 28610936 32226706 36066612 37900826 38901063 41320675 45333300 49671286 54060468
41142E4060468N187339N989750N854195N254856N113898N472801O001373O723287
$$ 54060468 59247807 65237557 71091752 76346608 81460506 86933307 92934680 99657967
41134I9657967P329414O744075M450130J596185k93056j302924k719961m798122
$$ 99657967 106987381 113731456 118181586 119777771 119484715 118181791 115461830 110663708
41126A10663708o191225o020325n389209n811533o760528o277355m149585k846443
$$ 110663708 104472483 98452158 93062949 87251416 80490888 74213533 70063948 67217505
41118F7217505m245365o707106p102590n026085k914475k148108j458995J56525
$$ 67217505 62972140 56265034 49162444 44136359 41221884 39073776 37614781 37771306
41110C7771306J384584R16171j83630l40971j03708o95848j260420k06227J465181
$$ 37771306 39155890 40072061 39888431 39547460 39443752 38747904 37487484 37281257 38746438
41101C8746438J142214j118026k188453l25022K610551M286898M723919M654361
$$ 38746438 39888652 38770626 36582173 36257151 38867702 43154600 47878519 52532880
41093E2532880L543891J310151J17356J909566N155867O458046M918159K695537
$$ 52532880 56076771 57386922 57504278 59413844 64569711 71027757 75945916 78641453
41085G8641453J435369M36099j253152k968704l608422l259676k693759k296578
$$ 78641453 80076822 80512921 79259769 76291065 72682643 69422967 66729208 64432630
41077F4432630k422435l848136o645473r046086q650547m956066r0607L026868
$$ 64432630 62010195 58162059 51516586 42470500 33819953 28863887 28773280 31800148
41069C1800148K940266M49802k067266k270857J70660K865377K845515N0839k162502
$$ 31800148 34740414 35190216 33122950 30852093 31022753 33888130 36733645 36784484 34621982
41060C4621982r54242K306851L819964K545612J558984L483833O523668O790427
$$ 34621982 33667740 35974591 39794555 42340167 43899151 47382984 53906652 60697079
41052F0697079L486583k56733j376815J26485K215605L077768J969467o20939
$$ 60697079 64183662 63926929 62550114 62676599 64892204 67969972 69939439 69318500
41044F9318500k905026l056391j334253j27753j269478m005254o081780o135194
$$ 69318500 66413474 63357083 62022830 61895077 60625599 56620345 50538565 44403371
41036D4403371m614549l019852k536759k895777k672298j371752n36023j366579
$$ 44403371 39788822 36768970 34232211 31336434 28664136 27292384 26756361 25389782
41028B5389782k105193l01424K589596K265350j901108n025635l493833k28447
$$ 25389782 23284589 22983165 25572761 27838111 25937003 20911368 17417535 17189088
41020A7189088r277k248580k557545O4412K135823J509436P2023m7303N35995
$$ 17189088 17179811 14931231 12373686 12438098 14573921 16083357 16155380 16108077 16644072
41011A6644072L59591p36834k260065l458124k611133J286902N578211N833710
$$ 16644072 17003663 16266829 14006764 10548640 7937507 9224409 14802620 20636330
41003B0636330J711425k275585l071379k542532k759126j883947J801478N108054
$$ 20636330 22347755 20072170 17000791 14458259 11699133 9815186 11616664 16724718
40995A6724718L751992r09196l598355k712655j617373k378245k784335q01284
$$ 16724718 20476710 19567514 15969159 13256504 11639131 9260886 6476551 5675267
40987E675267J891363K757195J921257Q30401l13406j738138k538502j992197
$$ 5675267 7566630 10323825 12245082 13075483 12762077 11023939 8485437 6493240
40979F493240j114804j047796j041829J63890K007551L029308L220513L427937
$$ 6493240 5378436 4330640 3288811 3452701 5460252 8489560 11710073 15138010
40971A5138010L161958J338942j122234k028119j489863k087896m484982n533996
$$ 15138010 18299968 19638910 18516676 16488557 14998694 12910798 8425816 2891820
40963B891820k732502J530894K955462J392803P11660K648566M140572K129030
$$ 2891820 159318 1690212 4645674 6038477 6750137 9398703 13539275 15668305
40955A5668305j675040l161651j431729N04317J22795j810594l014960k451317
$$ 15668305 13993265 10831614 9399885 9904202 10026997 8216403 5201443 2750126
40947B750126p65150P59895J168644O18405M27529J549654L068099L235428J879728
$$ 2750126 1984976 2744871 3913515 4531920 4959449 6509103 9577202 12812630 14692358
40938A4692358M82346q3271l29892n55862l13770M652r76429l143457m079482
$$ 14692358 15174704 15091433 14761541 14205679 13891909 13896561 12920132 9776675 5697193
40929E697193k149241J055583K847449K679952J653901J98745j624468k515065
$$ 5697193 3547952 4603535 7450984 10130936 11784837 11983582 10359114 7844049
40921G844049j117011J466514K588645J520050k8837q85680j667351k592384k392358
$$ 7844049 6727038 8193552 10782197 12302247 12273410 11387730 9720379 7127995 4735637
40912D735637o27571Q03831J86663j186784n94934K206565M457053L949670J651567
$$ 4735637 4108066 4911897 5098560 3911776 3316842 5523407 9980460 13930130 15581697
40903A5581697Q1998J35893P00459R80870J587648K694047K578671k75024m170007
$$ 15581697 15663695 15799588 16500047 17480917 19068565 21762612 24341283 24066259 19896252
40894A9896252n390019k823011M81298J260797j80394j390866j289415m60476
$$ 19896252 14506233 11683222 12164520 13425317 13244923 11854057 10564642 10104166
40886A0104166P41995K172595K714115J345741q92058j973219j690074j452961
$$ 10104166 10846161 13018756 15732871 17078612 16186554 14213335 12523261 11070300
40878A1070300j578196r77180M50310J385965J339140J135068Q18010n57124k404783
$$ 11070300 9492104 8514924 8965234 10351199 11690339 12825407 13643417 13086293 10681510
40869A0681510k422593j37487J668426P09493j523364k054459m88565J119188
$$ 10681510 8258917 8121430 9789856 10499349 8975985 6921526 6432961 7552149
40861G552149J363193O00484l78661j219850j849790k372160k628281j576625
$$ 7552149 8915342 9515826 9137165 7917315 6067525 3695365 1067084 -509541
40853e09541J485513M607395M358725P20571j691297K30041K954949R89528m591646
$$ -509541 975972 5583367 9942092 10662663 8971366 9201407 12156356 13145884 8554238
40844H554238o826642k548424L015185L475959k79722k245554l6107K482809J495652
$$ 8554238 1727596 -820828 2194357 5670316 5390594 3145040 3108933 5591742 7087394
40835G087394j285214j505271J282486K879495N14027k898694k525885J638978
$$ 7087394 5802180 4296909 5579395 8458890 8972917 6074223 3548338 5187316
40827E187316M592673L105444j40660p77805J184107K185117P23814j087235j515089
$$ 5187316 9779989 12885433 12744773 11966968 13151075 15336192 16060006 14972771 13457682
40818A3457682j561887k287209k510754j071220O17671O11549k55159K26529J489652
$$ 13457682 11895795 9608586 7097832 6026612 6644283 7255832 7000673 7227202 8716854
40809H716854M84348l274577n834714l811879P75786L160997K087072M67213J86579
$$ 8716854 9201202 5926625 91911 -3719968 -2944182 216815 2303887 2771100 2957679
40800B957679k55054j907591k585316m13216K308708K132947j9911j06783K604288
$$ 2957679 2702625 795034 -1790282 -2203498 105210 2238157 2218246 2111463 4715751
40791D715751M208171K063949j494845k986462k361373j579625r82468K86464
$$ 4715751 8923922 10987871 9493026 6506564 4145191 2565566 1583098 1869562
40783A869562J735031J942523P56101q43225k241143k923739j895383O83601K383328
$$ 1869562 3604593 5547116 6303217 5459992 3218849 295110 -1600273 -916672 1466656
40774A466656J227944j312097k228672j029787M56844J442212K465755K788015
$$ 1466656 2694600 1382503 -846169 -1875956 -1419112 23100 2488855 5276870
40766E276870P82635k620333l893333j389882K477458M562546M352066K985355
$$ 5276870 6059505 3439172 -454161 -1844043 633415 5195961 9548027 12533382
40758A2533382J123219o95499j324251l47751R27177J126584N08987k3952n47851
$$ 12533382 13656601 12961102 11636851 11289100 12216277 13342861 13851848 13827896 13280045
40749A3280045j604714k947781l857508m006110l217199j253511J284738K755801
$$ 13280045 11675331 8727550 4870042 863932 -2353267 -3606778 -2322040 433761
40741D33761K194114N61267n80969r09694r30079n05262R05164K763847L394216
$$ 433761 2627875 3189142 2608173 1698479 768400 263138 1168302 3932149 7326365
40732G326365J778998j043714k741518j962618J69005J181762N6513j738199k429184
$$ 7326365 9105363 8061649 5320131 3357513 3526518 4708280 4764793 3026594 597410
40723E97410k090760j564327m45725J928283M254207M428718K757521J507684
$$ 597410 -1493350 -3057677 -3503402 -1575119 2679088 7107806 9865327 11373011
40715A1373011J145829k31766l146432n331450n254046m254151l570265j980276
$$ 11373011 12518840 12287074 9140642 3809192 -1444854 -5699005 -9269270 -11249546
40707a1249546J375372M234062M056132J944738R32497J581605K024411J452042
$$ -11249546 -9874174 -5640112 -1583980 360758 1293255 2874860 4899271 6351313
40699F351313P64265K36185p71877j818128j450847M36734K100528K049064M78793
$$ 6351313 7115578 7351763 6579886 4761758 3310911 3747645 5848173 7897237 8376030
40690H376030j154528j097689J186098L348892J720207l554110o938978m029862
$$ 8376030 7221502 6123813 7309911 10658803 12379010 8824900 1885922 -2143940
40682b143940K036202M459293J924699o51417k32971O85133k48819r83250P76429
$$ -2143940 -107738 4351555 6276254 5624837 5391866 6076999 5828180 4844930 5621359
40673E621359L089549K811724L06303k029681l533747m387953l259072M38357
$$ 5621359 8710908 11522632 11828935 9799254 6265507 1877554 -1381518 -943161
40665i43161L552114K449997j559334l836146k928131j583654j365586n92608
$$ -943161 2608953 5058950 3499616 -336530 -3264661 -4848315 -6213901 -6806509
40657f806509J363906J939232k66799k307370q96700K663382M426992L123756
$$ -6806509 -5442603 -3503371 -3770170 -6077540 -6974240 -4310858 116134 3239890
40649C239890P95278p51196j364924j114513j58641J99529j098846k493472j467218
$$ 3239890 4035168 3283972 1919048 804535 645894 845423 -253423 -2746895 -4214113
40640d214113J240885K005538l54445k650677k192990o08046m99189r58727L73248
$$ -4214113 -2973228 -967690 -1322135 -3972812 -6165802 -6773848 -7273037 -8231764 -7858516
40631g858516K669827L139783J904800J594991K262483J075350k049572k995637
$$ -7858516 -5188689 -2048906 -144106 1450885 3713368 4788718 2739146 -256491
40623b56491J63226L294301K072418j377603j879688P73208K002106L8308j607648
$$ -256491 -93265 3201036 5273454 3895851 2016163 2789371 4791477 4829785 3222137
40614C222137k46968J780859J236899r83632j879527j226647j172692k007198
$$ 3222137 2975169 4756028 5992927 5009295 3129768 1903121 730429 -1276769
40606a276769j650572M81073J981306R51063j089795j443474q0620P37122J60970
$$ -1276769 -2927341 -2446268 -464962 486101 -603694 -2047168 -2127788 -1390666 -1229696
40597a229696j17200J103590K387121J892038L03467l23736K26765M43102L447
$$ -1229696 -1346896 -243306 2143815 4035853 4339320 4015584 4242349 4685451 4688898
40588D688898J18455P93685M32056j037022j427205j49644Q2960k243954l943406
$$ 4688898 4807353 5601038 6033094 4996072 3568867 3419223 3502183 1258229 -2685177
40579b685177j550677K698138L558454O42738j033824J104125L340595J639235
$$ -2685177 -4235854 -1537716 2020738 2663476 1629652 2733777 6074372 7713607
40571G713607k208493l426366r92652J670734J802917K71446o25087k34790K89275
$$ 7713607 5505114 2078748 1086096 2756830 4559747 4831193 4206106 3971316 4260591
40562D260591j20058j160420j684437j190183l64519K7427J08818J75514n9577
$$ 4260591 4140533 2980113 1295676 105493 -259026 -231599 -122781 52733 -6844
40553f844m34423L79712K836523M663975L340986j17624k444558k851808l381018
$$ -6844 -441267 -61555 2774968 7438943 10779929 10662305 8217747 5365939 1984921
40544A984921m429025l643816m64645J862276R49859j027592q24959J128126K191783
$$ 1984921 -2444104 -6087920 -6552565 -4690289 -3740430 -4768022 -5592981 -4464855 -2273072
40535b273072J722172R66679K85927p07272j329761p02393M61215J149289K001072
$$ -2273072 -550900 415779 701706 -5566 -1335327 -2037720 -1576505 -427216 1573856
40526A573856L659086M419292K208186j920053m787596m895005k989486L9061
$$ 1573856 5232942 9652234 11860420 9940367 5152771 257766 -2731720 -2692659
40518b692659L180492M319769K325569n19460j181790l36013r81622l221219m075613
$$ -2692659 487833 4807602 7133171 6613711 5431921 5095908 4114286 893067 -3182546
40509c182546k383040j20840J380688K671347L143416J017780k390477k676870
$$ -3182546 -5565586 -5686426 -4305738 -1634391 1509025 2526805 136328 -2540542
40501b540542J266278M745232L852306J080362R99964L193047L552304R47133
$$ -2540542 -1274264 3470968 7323274 8403636 9403600 12596647 16148951 17096084
40493A7096084j572085j829570j178720j556007k536120k372299n24201J685560
$$ 17096084 15523999 13694429 12515709 10959702 8423582 6051283 5527082 7212642
40485G212642K443962J353463L7633J88496J003706P1806k718165m207635k218774
$$ 7212642 9656604 11010067 11047700 11236196 12239902 12311708 9593543 5385908 3167134
40476C167134J193762K648786J896474R99941M08534j217713l680864m594058
$$ 3167134 4360896 7009682 8906156 9906097 10314631 9096918 5416054 821996
40468H21996k567435R34877L455176L835179K434219M48384p34262o45296l14863
$$ 821996 -1745439 -810562 2644614 6479793 8914012 9362396 8628134 7982838 7667975
40459G667975q03282j477623j014312K34354M84148q85780k551400l231148k951611
$$ 7667975 6864693 5387070 4372758 4607112 5091260 4205480 1654080 -1577068 -4528679
40450d528679k015225k14231K230067M046612M020854K200736k69893j958249
$$ -4528679 -6543904 -6758135 -4528068 -481456 3539398 5740134 5470241 3511992
40442C511992j840597j15885J519455J274045p84032k773031l034331j503724
$$ 3511992 1671395 1555510 3074965 4349010 3564978 791947 -2242384 -3746108
40434c746108P88541K702283L447021K909887J754922P70146K27830J87369P75190
$$ -3746108 -2957567 -255284 3191737 6101624 7856546 8626692 8854522 9041891 9817081
40425I817081J505440J197765l58117j529365r89123J62145J25223o93588p81404
$$ 9817081 11322521 12520286 12162169 10632804 9643681 9805826 9931049 9237461 8456057
40416H456057p75452k614767n424126n604502k072456J667445K379284J307891
$$ 8456057 7680605 5065838 -358288 -5962790 -8035246 -6367801 -3988517 -2680626
40408b680626J342695K344057K129891N45231m72679j14098P51128J747240L021137
$$ -2680626 -1337931 1006126 3136017 3681248 3208569 3094471 3845599 5592839 8613976
40399H613976L311495Q63475l250318n314664l442398K17613K677801L406923
$$ 8613976 11925471 12788946 9538628 4223964 781566 999179 3676980 7083903
40391G083903L163258J710111j138181l552031l259083p10831J396887J694497
$$ 7083903 10247161 11957272 10819091 7267060 4007977 3297146 4694033 6388530
40383F388530J279956J147456O24302p63805j759925j203612r8005j30077r69533
$$ 6388530 7668486 8815942 9440244 8676439 6916514 5712902 5614897 5484820 4515287
40374D515287r49415j3640J72773p40356q71615P77389K205080J114907j438874
$$ 4515287 3565872 3552232 3725005 2984649 2113034 2890423 5095503 6210410 4771536
40365D771536k096262M07908L545856L939673R66007k792927m078807j982070
$$ 4771536 2675274 3083182 6629038 10568711 11534718 8741791 4662984 2680914
40357B680914J121215J991381J86208j578375j226387N7293L06579J15543J090676
$$ 2680914 3802129 5793510 5979718 4401343 3174956 3232249 3538828 3654371 4745047
40348D745047K226158J068923j810524l023597j617324o49906k135202l637925
$$ 4745047 6971205 8040128 6229604 3206007 1588683 938777 -1196425 -4834350
40340d834350k048174J845367M928531N748518M550176J491285k330819l915248
$$ -4834350 -6882524 -5037157 -108626 5639892 10190068 11681353 9350534 5435286
40332E435286j715245J245259Q90801k154991l670494k008178M30819J613309
$$ 5435286 3720041 4965300 5856101 3701110 30616 -1977562 -1546743 66566
40324F6566J934351J592350j41044k073136j342091J896850L532472J248794j981277
$$ 66566 2000917 3593267 3452223 1379087 36996 1933846 5466318 6715112 4733835
40315D733835k498726j055465m48382o64773J76701J819123K336105J618224J188097
$$ 4733835 2235109 1179644 731262 66489 243190 2062313 4398418 6016642 7204739
40306G204739J143510K14420j512896k588337k577300k032127p10643J517534
$$ 7204739 8348249 8562669 7049773 4461436 1884136 -147991 -858634 658900
40298F58900K715286J015869j694628j792715L79034P82020j664897k973657m17563
$$ 658900 3374186 4390055 2695427 902712 1281746 2063766 398869 -2574788 -2992351
40289b992351K983304L065395M71300j169560o29978N79487J397352J484035j77154
$$ -2992351 -9047 3056348 3527648 2358088 1728110 2307597 3704949 5188984 5011830
40280E011830l608596n901123m302289l86240K183568L111255M757656O542094
$$ 5011830 1403234 -4497889 -8800178 -9186418 -7002850 -3891595 866061 7408155
40272G408155M862037n38215m740495m221864j421144k96757p62787n75306J51382
$$ 7408155 12270192 11731977 6991482 2769618 1348474 1051717 288930 -286376 -134994
40263a34994n7641n21063M29903K026673K252493J459162J366574J363128l28979
$$ -134994 -192635 -713698 -283795 1742878 3995371 5454533 6821107 8184235 7855256
40254G855256k277284j062529K607210L576136k49545m209275l398252N22966
$$ 7855256 5577972 4515443 7122653 10698789 10449244 6239969 2841717 3364683
40246C364683K395682R10019r42535j250072j031803j087047o04768N60495J036846
$$ 3364683 5760365 6670384 5727849 4477777 3445974 2358927 1754159 2314654 3351500
40237C351500J64050r94336j425162j143412j56051J525701K551991J205106j646263
$$ 3351500 3515550 2521214 1096052 -47360 -203411 1322290 3874281 5079387 3433124
40228C433124k867829j294508O21234O08975l27386l14571K03956L8842N5160
$$ 3433124 565295 -729213 -107979 500996 173610 -140961 62995 101837 156997
40219A56997J435518K449147L63674l754429n484282k822215J282431L001144
$$ 156997 1592515 4041662 4405336 650907 -4833375 -7655590 -6373159 -3372015
40211c372015J813467l31228j720290j513942K28302J776712R50013j471462j766215
$$ -3372015 -1558548 -1889776 -3610066 -5124008 -4895706 -3118994 -2168981 -3640443 -5406658
40202e406658J356807L782314J380277l422524m380772j67159L812224L064850
$$ -5406658 -4049851 -267537 1112740 -2309784 -6690556 -6857715 -3045491 19359
40194A9359m10798j999018o58833J386334K751354L528441L181680J026885j560165
$$ 19359 -391439 -2390457 -3049290 -1662956 1088398 4616839 7798519 8825404 7265239
40185G265239k221117r91470j63878n85351o13664O26670J517684P54672l38026
$$ 7265239 5044122 4052652 3888774 3303423 2689759 3316429 4834113 5588785 5250759
40176E250759n5816Q55515O47892m27298p81844l44652m29771j063830p61919
$$ 5250759 5194943 6050458 6698350 6271052 5489208 5144556 4714785 3650955 2889036
40167B889036P98321J923366J272254n74784k372832l405846l022815q90020J578974
$$ 2889036 3687357 5610723 6882977 6308193 3935361 529515 -2493300 -3383320 -1804346
40158a804346K061912O53332K50696K162752L612642J864470j255729k069133
$$ -1804346 257566 910898 1161594 3324346 6936988 8801458 7545729 5476596
40150E476596p66681o02143j995814j830165P07360K017564j01814k374385r58006
$$ 5476596 4709915 4107772 2111958 281793 989153 3006717 2904903 530518 -427488
40141d27488K392076K941238R8873k194564j732336o98136j358348k469385j599690
$$ -427488 1964588 4905826 5004699 2810135 1077799 379663 -978685 -3448070 -5047760
40132e047760J159919L468607L478903J240007j613465k926067j880993k10826
$$ -5047760 -3887841 -419234 3059669 4299676 2686211 -239856 -2120849 -2331675
40124b331675k53357j577497j411013J000032K783203J628768n60943m77018J575958
$$ -2331675 -2585032 -4162529 -5573542 -4573510 -1790307 -161539 -722482 -1199500 376458
40115C76458K146051l50624l563857m409075k410683O17875K689285K815578J223848
$$ 376458 2522509 2171885 -1391972 -5801047 -8211730 -7593855 -4904570 -2088992 -865144
40106h65144q59576k128261k148833j168886M99947K151832K461264R35330q43444
$$ -865144 -1724720 -3852981 -6001814 -7170700 -6670753 -4518921 -2057657 -1122327 -1965771
40097a965771r66938J07124M03461k18144J19647J716696K124461m5602k417685
$$ -1965771 -2932709 -2825585 -2422124 -2640268 -2520621 -803925 1320536 1274934 -1142751
40088a142751k072906J55102J111561Q4834o06314L82695J561847J449766R77672
$$ -1142751 -3215657 -3060555 -1948994 -1864160 -2470474 -2087779 -525932 923834 1901506
40079A901506J674760K970738K906817Q53991j751352l117618k718411j473025
$$ 1901506 3576266 6547004 9453821 10307812 8556460 5438842 2720431 1247406
40071A247406q94329j660801k539598j389114K011510M865487M297539R99316
$$ 1247406 353077 -1307724 -3847322 -5236436 -3224926 1640561 5938100 6937416
40063F937416j479231j096743N03940O37528j047876k825829l422990k908365
$$ 6937416 5458185 4361442 4865382 5502910 4455034 1629205 -1793785 -4702150
40055d702150j585997M92086K749936L953043L350316J433761o57801k080957
$$ -4702150 -6288147 -5796061 -3046125 906918 4257234 5690995 5033194 2952237
40047B952237k611409k518415k180541j536621k17859J325064J531705k93839
$$ 2952237 340828 -2177587 -4358128 -5894749 -6112608 -4787544 -3255839 -3549678
40039c549678k226782j616214J251589L245798K611611J108561R46421J630567
$$ -3549678 -5776460 -7392674 -6141085 -2895287 -283676 824885 1771306 3401873
40031C401873J559750R97032J071004R60313j108980m276591n178654k296304
$$ 3401873 4961623 5958655 7029659 7989972 6880992 2604401 -2574253 -4870557
40023d870557J864531L743238K354145o41830k980732l190945j275565J155197
$$ -4870557 -3006026 737212 3091357 2449527 -531205 -3722150 -4997715 -3842518
40015c842518K277700J953779J381418J012755L00022n73588p05079m98006j431433
$$ -3842518 -1564818 388961 1770379 2783134 3083156 2509568 1804489 1306483 -124950
40006a24950l128191l065390l52756K595567L620598L553385L536833K365523
$$ -124950 -3253141 -6318531 -6671287 -4075720 -455122 3098263 6635096 9000619
39998I000619p31656l134683k291735l15251r31818l014599k039247K064070L803933
$$ 9000619 8268963 5134280 2842545 2527294 1595476 -1419123 -3458370 -1394300 2409633
39989B409633L91149l764313l689302j009476n89360k736648l307185n55031K458952
$$ 2409633 2800782 -963531 -4652833 -5662309 -6251669 -8988317 -12295502 -12850533 -10391581
39980a0391581K736608J197764M45848J100166J909333K051352J782237J405732
$$ -10391581 -7654973 -6457209 -6011361 -4911195 -3001862 -950510 831727 2237459
39972B237459P44392m15655j870320k992588l117533k147481p46452L63799J182977
$$ 2237459 2981851 2566196 695876 -2296712 -5414245 -7561726 -8308178 -7944379 -6761402
39963f761402K067347K705366K168472K77442j638840j976307p41827M25236L86276
$$ -6761402 -4694055 -1988689 179783 457225 -1181615 -3157922 -3899749 -3474513 -3088237
39954c088237O6186J104251L209050M105211K563165K30871o31873k54863o56449
$$ -3088237 -3022051 -1917800 1291250 5396461 7959626 8190497 7558624 7303761 6647312
39945F647312k431902m058326m289736l384890j738371P54830L303944M050011
$$ 6647312 4215410 157084 -4132652 -7517542 -9255913 -8501083 -5197139 -1147128
39937a147128K424571L05987k84370M81902J095302O69290q24351k878522m006429
$$ -1147128 1277443 1583430 1299060 1780962 2876264 3545554 2721203 -157319 -4163748
39928d163748k545582P99194K809864J712756l22368m96017M89111Q0911j680158
$$ -4163748 -6709330 -5910136 -3100272 -1387516 -1709884 -2205901 -1716790 -1635879 -3316037
39919c316037k366363j203535P0038L21341K90143O17086J145991K281359M339232
$$ -3316037 -5682400 -6885935 -6815897 -6494556 -6204413 -5587327 -4441336 -2159977 2179255
39910B179255N379989K843590j885371l842580r78030K693896K583461m04912
$$ 2179255 7559244 10402834 8517463 4674883 3696853 6390749 8974210 8569298
39902H569298k015244r68686L7092j036465k820130k796637n22612J946856K138483
$$ 8569298 6554054 5585368 5622460 4585995 1765865 -1030772 -1553384 393472 2531955
39893B531955k47009k530800j715272J598522L399318J351373j950212k417218
$$ 2531955 2284946 -245854 -1961126 -362604 3036714 4388087 2437875 20657
39885B0657K69188K879887L077900J337964r92681l115853m160955l244971p67068
$$ 20657 289845 3169732 6247632 7585596 6592915 3477062 -683893 -3928864 -4695932
39876d695932J661495K925549L095561K521913J393543J71753n70016p41932n31407
$$ -4695932 -3034437 -108888 2986673 5508586 6902129 7073882 6503866 5761934 5230527
39867E230527n5182K02586l82694j077301l8769K565477L556833J021378k282632
$$ 5230527 5175345 5377931 4995237 3917936 3879167 6444644 10001477 11022855 8740223
39858H740223k719384j261127j393523k858672k288954K37745P28638j652177
$$ 8740223 6020839 4759712 3366189 507517 -1781437 -1543692 -815054 -2467231
39850b467231k617082j26276J668694n77963l286792j609027K563066L759002
$$ -2467231 -5084313 -5210589 -3541895 -4119858 -7406650 -9015677 -6452611 -2693609
39842b693609J484746k51214l15852j108686k316572m67501M210565O399871L396280
$$ -2693609 -1208863 -1460077 -1775929 -2884615 -5201187 -5668688 -1458123 4941748 8338028
39833H338028p72726j676033n38357o67054j629824j067595L74498K42112j147568
$$ 8338028 7565302 5889269 5350912 4683858 3054034 1986439 2360937 2603049 1455481
39824A455481j344281j91976N8245j187707k011733j345684k36367O15484J815586
$$ 1455481 111200 -80776 -22531 -1210238 -3221971 -4567655 -4804022 -4188538 -2372952
39815b372952L128391K976873J172287n9083Q60224K478279K431593O65250q72524
$$ -2372952 755439 3732312 4904599 4845516 5705740 8184019 10615612 11280862 10408338
39806A0408338q82174J70602R94892N86258j058135k626799k586826j233816o72660
$$ 10408338 9526164 9696766 10691658 11277916 10219781 7592982 5006156 3772340 3099680
39797C099680j828224k623639p02765K819274M373437K630893N3423q60515q03186
$$ 3099680 1271456 -1352183 -2054948 764326 5137763 7768656 7822079 6961564 6158378
39788F158378j658052k881032k193378N86436K791287K522522J071533O44398
$$ 6158378 4500326 1619294 -574084 12352 2803639 5326161 6397694 7042092
39780G042092J220590J207239J55516r62077j586863j816920j146386Q94666K735081
$$ 7042092 8262682 9469921 9625437 8663360 7076497 5259577 4113191 5007857 7742938
39771G742938J847308j294896k762409l31588K987642K908750k22182k372348
$$ 7742938 9590246 8295350 5532941 5201353 8188995 11097745 10875563 8503215
39763H503215j836715j008673j957492l449291l535141k471827j401380j73491
$$ 8503215 6666500 5657827 3700335 251044 -3284097 -5755924 -7157304 -7330795
39755g330795J629976L066611L170588K678585K475063J466519j689431n461726
$$ -7330795 -5700819 -2634208 536380 3214965 5690028 7156547 5467116 5390
39747E390o598513m353191j266593M72774J186997J731110J716364Q88611L58165
$$ 5390 -6593123 -10946314 -12212907 -11740133 -10553136 -8822026 -7105662 -6217051 -5858886
39738e858886R18145J521084R65009l5018q1887M85087J86019j049259j676266
$$ -5858886 -4940741 -3419657 -2454648 -2489666 -2571553 -2086466 -1900447 -2949706 -4625972
39729d625972q54727M89437J078501N91591n54479j649432j793413o08905R53055
$$ -4625972 -5480699 -4991262 -3912761 -3321170 -3875649 -5525081 -7318494 -7927399 -6974344
39720f974344J453581P75379J92517N37422J308187J798643K059972K327299K347230
$$ -6974344 -5520763 -4745384 -4552867 -4015445 -2707258 -908615 1151357 3478656 5825886
39711E825886J722601L96559j264125k316304j622370N33529J813583N59966j263579
$$ 5825886 7548487 7945046 6680921 4364617 2742247 3275776 5089359 5649325 4385746
39702D385746k95722K958066M088510J035211k726739l223406j398398p61193
$$ 4385746 4090024 7048090 11136600 12171811 9445072 6221666 4823268 4062075
39694D062075j893606k565805j790724m50447J006832K278359J741134j246284
$$ 4062075 2168469 -397336 -2188060 -2638507 -1631675 646684 2387818 1141534
39686A141534l682459k534175j4717n25019k952155j855826L102632N446932J854640
$$ 1141534 -2540925 -5075100 -5089817 -5614836 -8566991 -10422817 -7320185 -1873253 -18613
39677a8613k523058k401766j47743k77192j403354O3749K230200Q96195k216213
$$ -18613 -2541671 -4943437 -5091180 -5368372 -6771726 -6707977 -4477777 -3581582 -5797795
39668e797795j924740J167459J638339q75821q67125K833526M147424j7092l980355
$$ -5797795 -7722535 -6555076 -4916737 -5792558 -6659683 -3826157 321267 304175 -3676180
39659c676180k136618K512283L880953J971386P85870P86654m34556k272581j882657
$$ -3676180 -5812798 -3300515 580438 2551824 3337694 4124348 3689792 1417211 -465446
39650d65446K53076R12543j55705m2183J782597K433446P85062n70839K09746
$$ -465446 -212370 700173 544468 502285 2284882 4718328 5503390 4932551 5142297
39641E142297J411499J021465j02786j06578R32479J545237Q76608r45528l191913
$$ 5142297 6553796 7575261 7472475 7365897 8298376 9843613 10720221 9774693 6582780
39632F582780m577737m165679k687041j730817j446946n46098J253450K502552
$$ 6582780 2005043 -2160636 -4847677 -6578494 -8025440 -8571538 -7318088 -4815536
39624d815536K168468R24631j46660o38400k47384J229526K749318K442060J014
$$ -4815536 -2647068 -1722437 -1869097 -2507497 -2754881 -1525355 1223963 3666023 3667037
39615C667037k508822k913101j114964J296130K681222K444296J400403R67492
$$ 3667037 1158215 -1754886 -2869850 -1573720 1107502 3551798 4952201 5919693
39607E919693J175557K52597k430190m226014k503299P72540J057311k167077
$$ 5919693 7095250 7347847 4917657 691643 -1811656 -1039116 18195 -2148882
39599b148882m422913k729623N42053J962352J825446K230551L132516L132135
$$ -2148882 -6571795 -9301418 -8759365 -6797013 -4971567 -2741016 391500 3523635
39591C523635K235682J175659l24946k093079k110243N44278K947231J804471
$$ 3523635 5759317 6934976 6610030 4516951 2406708 2950986 5898217 7702688
39583G702688j476383k695057j110073P4915n76855p07311J033444K025648j56816
$$ 7702688 6226305 3531248 2421175 2496090 1919235 1211924 2245368 4271016 4114200
39574D114200l428351l889563j213484J429104J990684J449237J199711J016639
$$ 4114200 685849 -3203714 -4417198 -2988094 -997410 451827 1651538 2668177
39566B668177L90118L0303O68519J368510N36101j681409l380220l440351k797168
$$ 2668177 3058295 3088598 3757117 5125627 5661728 3980319 600099 -2840252 -5637420
39557e637420k625480k494909j402265L32491J631098K425557L156093K996320
$$ -5637420 -8262900 -10757809 -12160074 -11827583 -10196485 -7770928 -4614835 -1618515
39549a618515Q02735k051328k301849P38260L534327K728074n28592k465540j618205
$$ -1618515 -815780 -2867108 -5168957 -4430697 -896370 1831704 1303112 -1162428 -2780633
39540b780633J66620Q59684L54886l41310l64678O49797K290123L349965K837440
$$ -2780633 -2614013 -1754329 -1399443 -1740753 -2105431 -1455634 834489 4184454 7021894
39531G021894R46308j298011k837107k840544j237208O19496J135497P52274J285128
$$ 7021894 7968202 6670191 3833084 992540 -244668 374828 1510325 2262599 3547727
39522C547727K457631J667388j428275l077012p46975K395931J848342j425134
$$ 3547727 6005358 7672746 6244471 3167459 2420484 4816415 6664757 5239623
39514E239623k765202j196952l16560j862149l127830j930424n0279J61846o13209
$$ 5239623 2474421 1277469 960909 -901240 -4029070 -5959494 -6009773 -5847927 -6461136
39505f461136n11819N37271J558913K228336K288069J225164j01917M30745L001729
$$ -6461136 -6972955 -6435684 -4876771 -2648435 -360366 864798 762881 1193626 4195355
39496D195355M742090L461341O38774r75383j024410j011547j565743k100310
$$ 4195355 8937445 12398786 13037560 12062177 11037767 10026220 8460477 6360167
39488F360167k199878j844491j069138l98433n97508j337578j532430j446635
$$ 6360167 4160289 2315798 1246660 848227 250719 -1086859 -2619289 -4065924
39480d065924k357541l448621j889360K441947N300471L619455J33858o23889
$$ -4065924 -6423465 -9872086 -11761446 -9319499 -4019028 -399573 -265715 -889604
39472h89604J147099J643491k10967j582451p35096M21577l90582k654576m170521
$$ -889604 257495 1900986 1690019 107568 -627528 -205951 -596533 -3251109 -7421630
39463g421630l526593p94159K762393N167682N103280L147314R68219l91950o78342
$$ -7421630 -10948223 -11742382 -8979989 -3812307 1290973 4438287 5406506 5014556 4336214
39454D336214J98915J600672J822941q5545k822190m528361m952047m337206j746872
$$ 4336214 4535129 6135801 7958742 7873197 5051007 522646 -4429401 -8766607 -10513479
39445a0513479K903173O378846N128095N41740k164378p93599J314840O43038
$$ -10513479 -7610306 -1231460 3896635 4438375 2273997 1480398 2795238 3438276
39437C438276j671376k240493m62178J168696Q27396m82213n58391J126808K550340
$$ 3438276 1766900 -473593 -935771 232925 1060321 578108 19717 1146525 3696865
39428C696865J407559j684742l361827j753983Q95004J542644P07570Q39071J637079
$$ 3696865 5104424 3419682 57855 -1696128 -801124 741520 1449090 2288161 3925240
39419C925240P63826j138824n85155K579183L517384o66755n887397o247154j889822
$$ 3925240 4689066 3550242 2965087 5544270 9061654 8394899 2507502 -3739652 -5629474
39410e629474J741961J142147j952985l859142k763406O10342L886165M477048
$$ -5629474 -3887513 -2745366 -4698351 -8557493 -11320899 -10710557 -6824392 -2347344
39402b347344J881048j343270k154453m09820J427820J480700R0348j246688j239949
$$ -2347344 -466296 -1809566 -3964019 -4373839 -2946019 -1465319 -1374971 -2621659 -3861608
39393c861608M57496K567659K791135N42788j551854p38715J747302K004438q98499
$$ -3861608 -3404112 -836453 1954682 2497470 945616 206901 1954203 3958641 3060142
39384C060142l210118j655266J902733L099999J053245r75055p47099j10250j628799
$$ 3060142 -149976 -1805242 97491 3197490 4250735 3275680 2528581 2418331 789532
39375G89532m230918m507841j563612J841435L141715K750545K253488J890721
$$ 789532 -3441386 -7949227 -9512839 -7671404 -4529689 -1779144 474344 2365065
39367B365065J210412N55853K09648o04341k069547k442292n17280J749553J667088
$$ 2365065 3575477 4131330 4340978 3736637 1667090 -775202 -1292482 457071 2124159
39358B124159l025k22187J450922K457985J755481J174393J522898R30669j350449
$$ 2124159 2121134 1898947 3349869 5807854 7563335 8737728 10260626 11191295 9840846
39349I840846k746632j188321J416734J933377K77556j294851j528437p04241
$$ 9840846 7094214 5905893 7322627 9256004 9533560 8238709 6710272 6006031
39341F006031O64133J672143R53565j350235k910402k221040p47013l46591m38188
$$ 6006031 6670164 8342307 9295872 7945637 5035235 2814195 2067182 1720591 1282403
39332A282403J30100L51132j075898k705479k147234J32229J631046J556977R95520
$$ 1282403 1412503 1763635 687737 -2017742 -4164976 -4032747 -2401701 -844724 150796
39323A50796K07977j274097k451656j786659q1237M11938m13681o01260L39258
$$ 150796 358773 -915324 -3366980 -5153639 -5234876 -4822938 -5236619 -5837879 -5498621
39314e498621R20094P90436J369915K904293L704681L027184K120121J598601
$$ -5498621 -4578527 -3788091 -2418176 486117 4190798 7217982 9338103 10936704
39306A0936704K86620k224094m056691l451760j177507N53601N51983n28199j000103
$$ 10936704 11223324 8999230 4942539 1490779 313272 866873 1418856 890657 -109446
39297a09446K13384J960579J678458r87680k884832j684840L80947K28175n89102
$$ -109446 103938 2064517 3742975 2755295 -129537 -1814377 -1433430 -1205255 -1794357
39288a794357J354347M312536K955697k583597n485919k190429K237873K077793
$$ -1794357 -440010 3872526 6828223 4244626 -1241293 -3431722 -1193849 883944
39280H83944q52009j437592M75090J361705O45814M80955O51717p82382k511106
$$ 883944 31935 -1405657 -930567 431138 1076952 1557907 2209624 1427242 -1083864
39271a083864j077140K757714L852147K57364l414199k390997J844847M227261
$$ -1083864 -2161004 596710 4448857 4706221 1292022 -1098975 745872 4973133
39263D973133K925186N99958j34908J69078m79666k369737l684679k839524l73953
$$ 4973133 7898319 8498277 8363369 8532447 8052781 5683044 1998365 -841159 -1215112
39254a215112J849934K778018K650830J768236K60886q02465k2264J769653J564941
$$ -1215112 634822 3412840 6063670 7831906 8092792 7290327 7268063 9037716 10602657
39245A0602657j647621m578025l684941j42274J885675J104715J96504J031429
$$ 10602657 8955036 4377011 692070 549796 2435471 3540186 3736690 4768119
39237D768119J883583O42656j569125j986898k70795J020705J7698j891907j918253
$$ 4768119 6651702 7294358 5725233 3738335 3467540 4488245 4505943 2614036 695783
39228F95783L19939K104029J173651j194430k032588q96786j63030j066947j855652
$$ 695783 1015722 3119751 4293402 3098972 1066384 169598 6568 -1060379 -2916031
39219b916031q29205J007309J874708J931312K196386K298585J352295o2862p71442
$$ -2916031 -3745236 -2737927 -863219 1068093 3264479 5563064 6915359 6852497 6081055
39210F081055q85654j026910p78481J98443P49251O0440l97209P53251J771802
$$ 6081055 5195401 4168491 3390010 3588453 4337704 4398144 4000935 4754186 6525988
39201F525988K14708k540294k701005J91150K465693J748048j28706n98369J93313
$$ 6525988 6740696 4200402 1499397 1690547 4156240 5904288 5775582 5177213 5370526
39192E370526P22223M44482m98914j925100k849638j983013M5868Q80226k22165
$$ 5370526 6092749 6537231 6038317 4113217 1263579 -719434 -673566 206660 -15505
39183a5505j224468m79210R95618J554840J160590K24511j676802m130023m715105
$$ -15505 -1239973 -1719183 -723565 831275 1991865 2216376 539574 -3590449 -8305554
39174h305554j687637L159618O132051N492698K439565q31121k677414k483539
$$ -8305554 -9993191 -6833573 -701522 4791176 7230741 6399620 3722206 1238667
$$ [...]
##END NTUPLES=NMR SPECTRUM
##END=
