##TITLE=31Pdec_DE-84ext3
 D2O, 64 sc
 14.3.2025
##JCAMPDX= 6.0         $$ Bruker NMR JCAMP-DX V2.0
##DATA TYPE= NMR SPECTRUM
##DATA CLASS= NTUPLES
##ORIGIN= UXNMR, Bruker Analytische Messtechnik GmbH
##OWNER= root
$$ XWIN-NMR		Version 3.5
$$ Fri Mar 14 14:12:05 2025 Russian Standard Time (UT+4h)  she@DPX200
##.OBSERVE FREQUENCY= 81.013821
##.OBSERVE NUCLEUS= ^31P
##.ACQUISITION MODE= SIMULTANEOUS
##.ACQUISITION SCHEME= undefined
##.AVERAGES= 64
##.DIGITISER RES= 17
##SPECTROMETER/DATA SYSTEM= spect
##.PULSE SEQUENCE= zgpg30
##.SOLVENT NAME= D2O
##.SHIFT REFERENCE= (INTERNAL, D2O, 0, 198.062)
##AUDIT TRAIL= $$ (NUMBER, WHEN, WHO, WHERE, WHAT)
$$ ##TITLE= Audit trail, XWIN-NMR		Version 3.5
$$ ##JCAMPDX= 5.01
$$ ##ORIGIN= Bruker BioSpin GmbH
$$ ##OWNER= she
$$ F:/spectra/data/she/nmr/P31/2/pdata/1/auditp.txt
$$ ##AUDIT TRAIL=  $$ (NUMBER, WHEN, WHO, WHERE, WHAT)
(   1,<2025-03-14 14:10:56.20 +0400>,<she>,<DPX200>,
      <created by zg, POWCHK disabled, PULCHK disabled
       configuration hash MD5:
       00 E9 B6 7A A2 85 ED C7 34 08 36 98 17 FE 4E 26
       data hash MD5: 32K
       E2 2D 76 B6 BC D1 05 A8 01 90 EA A5 8E FF ED BB>)
(   2,<2025-03-14 14:10:58.96 +0400>,<she>,<DPX200>,
      <Start of raw data processing
       efp BC_mod = 2 LB = 1.5 FT_mod = 6 PKNL = 1 PHC0 = 1817.532 PHC1 = -95.3056 SI = 64K 
       data hash MD5: 64K
       26 C6 0A A6 CD DB D8 54 67 A2 56 DF 90 E8 4C 87>)
(   3,<2025-03-14 14:11:14.84 +0400>,<she>,<DPX200>,
      <pk PHC0 = 0.1983902 PHC1 = 0 
       data hash MD5: 64K
       DC B2 A7 E7 FB F1 84 97 A7 7C AB B6 A5 62 D8 9A>)
(   4,<2025-03-14 14:11:22.25 +0400>,<she>,<DPX200>,
      <abs ABSG = 5 
       data hash MD5: 64K
       0E 7C D0 0C B4 7E E2 D8 2A 2F 74 E6 15 E2 2D BC>)
$$ ##END=
$$ 
$$ hash MD5
$$ 43 A6 52 20 F6 29 E8 06 BA 16 29 F3 7A 9C F4 23
##$RELAX= 
##$RELAX= 
##$RELAX= 
##$RELAX= 
##$RELAX= 
##$RELAX= 
##$RELAX= 
##$RELAX= 
$$ Bruker specific parameters
$$ --------------------------
##$DU= <F:/spectra>
##$EXPNO= 2
##$NAME= <P31>
##$PROCNO= 1
##$TYPE= <nmr>
##$USER= <she>
##$AMP= (0..31)
100 100 100 100 100 100 100 100 100 100 100 100 100 100 100 100 100 100 
100 100 100 100 100 100 100 100 100 100 100 100 100 100 
##$AQSEQ= 0
##$AQ_mod= 1
##$AUNM= <au_zg>
##$AUTOPOS= <>
##$BF1= 81.014009
##$BF2= 200.13
##$BF3= 200.13
##$BF4= 200.13
##$BF5= 200.13
##$BF6= 200.13
##$BF7= 200.13
##$BF8= 200.13
##$BYTORDA= 1
##$CFDGTYP= 0
##$CFRGTYP= 5
##$CHEMSTR= <none>
##$CNST= (0..31)
1 1 145 1 1 1 1 1 1 1 1 1 1 1 1 1 1 1 1 1 1 1 1 1 1 1 1 1 1 1 1 1 
##$CPDPRG= <waltz16>
##$CPDPRG1= <>
##$CPDPRG2= <waltz16>
##$CPDPRG3= <>
##$CPDPRG4= <mlev>
##$CPDPRG5= <mlev>
##$CPDPRG6= <mlev>
##$CPDPRG7= <mlev>
##$CPDPRG8= <mlev>
##$CPDPRGB= <>
##$CPDPRGT= <>
##$D= (0..31)
0 1 0 0 0 0 0 0 0 0.06 0 0.03 2e-05 3e-06 0 0 0.0002 0 0 0 0 0 0 0 0 0 
0 0 0 0 0 0 
##$DATE= 1741947055
##$DBL= (0..7)
120 120 120 11 120 120 24 19 
##$DBP= (0..7)
150 150 150 150 150 150 150 150 
##$DBP07= 0
##$DBPNAM0= <>
##$DBPNAM1= <>
##$DBPNAM2= <>
$$ [...]
##$SUBNAM3= <"">
##$SUBNAM4= <"">
##$SUBNAM5= <"">
##$SUBNAM6= <"">
##$SUBNAM7= <"">
##$SUBNAM8= <"">
##$SUBNAM9= <"">
##$SW= 400.765351723535
##$SWIBOX= (0..15)
0 1 3 0 0 0 0 0 0 0 0 0 0 0 0 0 
##$SW_h= 32467.5324675325
##$TD= 32768
##$TD0= 1
##$TE= 0
##$TE2= 300
##$TE3= 300
##$TEG= 300
##$TL= (0..7)
0 120 53 12 22 120 120 120 
##$TP= (0..7)
150 150 150 150 150 150 150 150 
##$TP07= 0
##$TPNAME0= <>
##$TPNAME1= <>
##$TPNAME2= <>
##$TPNAME3= <>
##$TPNAME4= <>
##$TPNAME5= <>
##$TPNAME6= <>
##$TPNAME7= <>
##$TPOAL= (0..7)
0.5 0.5 0.5 0.5 0.5 0.5 0.5 0.5 
##$TPOFFS= (0..7)
0 0 0 0 0 0 0 0 
##$TUNHIN= 0
##$TUNHOUT= 0
##$TUNXOUT= 0
##$USERA1= <user>
##$USERA2= <user>
##$USERA3= <user>
##$USERA4= <user>
##$USERA5= <user>
##$V9= 5
##$VALIST= <valist>
##$VCLIST= <CCCCCCCCCCCCCCC>
##$VD= 0
##$VDLIST= <DDDDDDDDDDDDDDD>
##$VPLIST= <PPPPPPPPPPPPPPP>
##$VTLIST= <TTTTTTTTTTTTTTT>
##$WBST= 1024
##$WBSW= 4
##$XGAIN= (0..3)
0 0 0 0 
##$XL= 0
##$YL= 0
##$YMAX_a= 39782
##$YMIN_a= -40799
##$ZGOPTNS= <>
##$ZL1= 120
##$ZL2= 120
##$ZL3= 120
##$ZL4= 120
##$ABSF1= 198.0616
##$ABSF2= -202.7028
##$ABSG= 5
##$ABSL= 3
##$ALPHA= 0
##$AQORDER= 0
##$ASSFAC= 0
##$ASSFACI= 0
##$ASSFACX= 0
##$ASSWID= 0
##$AUNMP= <proc_1d>
##$AZFE= 0.1
##$AZFW= 0.5
##$BCFW= 0
##$BC_mod= 2
##$BYTORDP= 0
##$COROFFS= 0
##$CY= -3
##$DATMOD= 1
##$DC= 0
##$DFILT= <>
##$DTYPP= 0
##$F1P= 0
##$F2P= 0
##$FCOR= 1
##$FTSIZE= 65536
##$FT_mod= 6
##$GAMMA= 0
##$GB= 0
##$INTBC= 1
##$INTSCL= 9.790993e-09
##$ISEN= 30
##$LB= 1.5
##$LEV0= 0
##$LPBIN= 0
##$MAXI= 10000
##$MC2= 0
##$MEAN= 0
##$ME_mod= 0
##$MI= 50
##$NCOEF= 0
##$NC_proc= -4
##$NLEV= 6
##$NOISF1= 182.463
##$NOISF2= 159.3651
##$NSP= 0
##$NTH_PI= 0
##$NZP= 0
##$OFFSET= 198.0616
##$PC= 4
##$PHC0= 1817.73
##$PHC1= -95.3056
##$PH_mod= 1
##$PKNL= yes
##$PPARMOD= 0
##$PSCAL= 0
##$PSIGN= 0
##$REVERSE= no
##$SF= 81.0140089999434
##$SI= 65536
##$SIGF1= 159.3651
##$SIGF2= -187.1042
##$SINO= 113.3802
##$SIOLD= 16384
##$SREGLST= <1H.CDCl3>
##$SSB= 0
##$STSI= 65536
##$STSR= 0
##$SW_p= 32467.5324675325
##$SYMM= 0
##$S_DEV= 0
##$TDeff= 32768
##$TDoff= 0
##$TI= <>
##$TILT= no
##$TM1= 0
##$TM2= 0
##$TOPLEV= 0
##$USERP1= <user>
##$USERP2= <user>
##$USERP3= <user>
##$USERP4= <user>
##$USERP5= <user>
##$WDW= 1
##$XDIM= 65536
##$YMAX_p= 448140191
##$YMIN_p= -16588471
$$ End of Bruker specific parameters
$$ ---------------------------------
##NTUPLES= NMR SPECTRUM
##VAR_NAME=  FREQUENCY,     SPECTRUM/REAL,   SPECTRUM/IMAG
##SYMBOL=    X,             R,               I
##VAR_TYPE=  INDEPENDENT,   DEPENDENT,       DEPENDENT
##VAR_FORM=  AFFN,          ASDF,            ASDF
##VAR_DIM=   65536,         65536,           65536
##UNITS=     HZ,            ARBITRARY UNITS, ARBITRARY UNITS
##FACTOR=    0.49542278885378, 1,            1
##FIRST=     16045.7642231865, 0,            0
##LAST=      -16421.768244346, 0,            0
##MIN=       -16421.768244346, -16588471,    0
##MAX=       16045.7642231865, 448140191,    0
$$ Real data points
##PAGE= N=1
##DATA TABLE= (X++(R..R)), XYDATA
$$ [...]
41833b24858O3894R5178O3968O5464N1607n3357j71399j54946P602J89568K79496
41822B12217K35872N3547j96357l37018k42373j9796R4474L0755n6765m9115j8639
41811b93198m7420m4320J03741K90779K89660P6059j18867j14191J2894Q9877
41801B45014Q2377N9321K8166o0026j87883k74503k82116k26071j05121P6645
41791f44197K36976K73290J93895R5359J3378r6155k21479k61018j65745k0035
41781e95731O6663P7134O1756O2078Q4556R8032N9190m084K0287J59114K36751
41770C25746R2557j33327j59389j390L4457j35417j93285O1816L29401K43690
41760D64859m0619q4316J39990K15603m6635l16510k58841m903J04036P052r0927
$$ plain form
41833 -224858 -160964 -65786 -1818 63646 115253 61896 -109503 -264449 -256847 -67279 212217
41822 212217 448089 501636 305279 -31739 -274112 -293908 -199434 -168679 -225444 -274559 -293198
41811 -293198 -340618 -384938 -281197 9582 299242 375301 256434 142243 155137 245014
41801 245014 327391 386712 414878 354852 166969 -107534 -389650 -615721 -720842 -644197
41791 -644197 -407221 -133931 59964 155323 168701 72546 -148933 -409951 -575696 -595731
41781 -595731 -529068 -451934 -390178 -328100 -243544 -145512 -86322 -90406 -70119 88995 325746
41770 325746 418303 284976 125587 124197 158654 23237 -170048 -108232 221169 464859
41760 464859 424240 339924 479914 695517 648882 332372 73531 68628 172664 179716 88789
41749H8789q2743n4196n9634k5491Q1769J48350O3964r4624j32138R946J49807
41738I3799Q5372j24579k18070q7100O7883L4295j00590j05204K3135P2626j2134
41727b70567l1825J14209K11457M1638k46811l05010o5982J62698J28484l2906
41717b94615k3308J70937K54584O1620j75332j37056J18782K27361L4888j98724
41707C9137j99081m5547K8784R053K9957O7510j6558j74911k02276o9178L4486
41696d98624K2484J9417Q5092R8996K5505L2239J84664K60033P5597j89339k42611
41685a26547j12609o8445j81276k35854q7381J23603J80067N7058r0006j07856
41675f49246L2739K27089L18168K38868P9479k8997p2478j26427j99379k04859
$$ plain form
41749 88789 6046 -48150 -107784 -133275 -51506 96844 160808 66184 -65954 -56008 93799
41738 93799 179171 54592 -163478 -250578 -182695 -148400 -248990 -354194 -331059 -258433 -270567
41727 -270567 -302392 -188183 23274 64912 -181899 -486909 -552891 -390193 -261709 -294615
41717 -294615 -317923 -146986 107598 169218 -6114 -143170 -24388 202973 237861 39137
41707 39137 -159944 -205491 -176707 -167654 -137697 -70187 -86745 -261656 -463932 -533110 -498624
41696 -498624 -476140 -456723 -371631 -272635 -247130 -214891 -30227 229806 305403 116064 -126547
41685 -126547 -239156 -307601 -488877 -724731 -812112 -688509 -508442 -451384 -541390 -649246
41675 -649246 -616507 -389418 -71250 167618 247097 218100 145622 19195 -180184 -385043
41665c85043j03476J4875L8951j6700k0102J22191L37764M41920L34662J14563
41655H79605n0300j29635k13190k94233k14997R5038M34504N03944K29996j63882
41645A076850l83467l07616n6301J16777L9279k04910l44035k11710O5140K16253
41635F260J17930j15609k75908k37620m2330J35572J47379L4046k5913L8347R6226
41624a21620L2089n8026o858J60293K40152J08162j45703l27623l08926j06987
41614e35047J29497K35354J80745P6783P967n0793j03690n9014R6565J73713Q550
41603A60630k56681l14110q8667J84625K84074K26545J39701P9263M6648N5214
41593E17242Q0753K9909j42317l19103l11791p9917J79063K04290m5795l21684
$$ plain form
41665 -385043 -488519 -473644 -434693 -451393 -471495 -349304 -11540 430380 765042 879605
41655 879605 829305 699670 486480 192247 -22750 72288 506792 1010736 1240732 1076850
41645 1076850 693383 385767 329466 446243 485522 280612 -63423 -275133 -209993 6260
41635 6260 124190 8581 -267327 -504947 -547277 -411705 -264326 -230280 -256193 -217846 -121620
41624 -121620 -89531 -147557 -154415 5878 246030 354192 208489 -119134 -428060 -535047
41614 -535047 -405550 -170196 10549 87332 95299 44506 -59184 -118198 -21633 152080 160630
41603 160630 -96051 -410161 -498828 -314203 -30129 196416 336117 415380 462028 517242
41593 517242 597995 627904 485587 166484 -145307 -225224 -46161 158129 112334 -209350
41583b09350l48832j34930P7960J37202J06957P1060J1843m6733L118J21974P5595
41572a34136j90550l52767j50861J67131J82491n1441j09717J12684K55637J08232
41562a63297o0784K9463K25537K12642j2802j97560j93646m9455J29258K20928
41552A40284J10504j49029k95817j45540J59484L23303K34996J6337j66154k07655
41542B0713q3902R9969J62510O3079l1102N8M3581l5837j46726j28243l7044m4439
41530a17383j21947q3238P8170J46821K6418j01028n4840P7404Q3252o7917j94311
41519c28599j42840M0447J89803K08416J42797Q8318P0453M9896O742m2512r0188
41508A92733j25989j03887j7055K2057q3870k14612j50471P8118J80045L3123
$$ plain form
41583 -209350 -558182 -693112 -615152 -477950 -370993 -299933 -288090 -334823 -331705 -209731 -134136
41572 -134136 -324686 -677453 -828314 -661183 -478692 -530133 -639850 -527166 -271529 -163297
41562 -163297 -224081 -194618 30919 243561 230759 33199 -160447 -209902 -80644 140284
41552 140284 250788 101759 -194058 -339598 -180114 143189 378185 394522 228368 20713
41542 20713 -63189 36780 199290 262369 231267 231325 274906 239069 92343 -35900 -72944 -117383
41530 -117383 -239330 -322568 -244398 -97577 -71159 -172187 -227027 -149623 -66371 -134288 -328599
41519 -328599 -471439 -430992 -241189 -32773 110024 198342 268795 318691 325433 282921 192733
41508 192733 66744 -37143 -54198 -32141 -116011 -330623 -481094 -402976 -222931 -189808
41498a89808j08888k405K05562K14006K5860r9950o0336M826Q43j1847n980m5245
41486g3362j12333r0647K4267Q1971J2615o3625l8501K6280L1776J77r65J0058
41474a92289j9685o1837l9712N2871J36158J37779O1436l2294r0550j05863q9809
41463b43795l7178L7301N2988m7268j60489j13885O7400J46384J4731j30944r0962
41452e05717M0300P4658O1269J60620L05865K83815R9190l2194l7280n1511j25222
41441B73793j45402q3151m8163n0292K4753J46180J24143n4416j54906o3871M5528
41430A4196L5586R292M5106J2454j52657k50019j21563O9873J03620L7419L7896
41419a58797P3950M8414N5895K06753L32061J86930j32240k86403j75572l4293
$$ plain form
41498 -189808 -298696 -301101 -95539 118467 144327 44377 -15959 -11133 -10290 -22137 -28117 -73362
41486 -73362 -185695 -276342 -252075 -170104 -157489 -221114 -259615 -233335 -201559 -201382 -202347 -192289
41474 -192289 -211974 -273811 -313523 -260652 -124494 13285 74721 42427 -48123 -153986 -243795
41463 -243795 -280973 -243672 -190684 -237952 -398441 -512326 -444926 -298542 -283811 -414755 -505717
41452 -505717 -465417 -390759 -329490 -168870 136995 420810 520000 487806 450526 399015 273793
41441 273793 128391 45240 -2923 -53215 -28462 117718 241861 187445 32539 -31332 14196
41430 14196 49782 59074 104180 116634 -36023 -286042 -407605 -337732 -234112 -196693 -158797
41419 -158797 -84847 -36433 19462 226215 558276 745206 612966 326563 150991 116698
41409A16698m8226j36994j48526n5562P5655J50802Q3673q8052j67812m1275J20028
41398a39591R1449m7653l1293J68134K99469K14299L2465r5037j46733j24834
41388B20675k7089L6509o4382k24836j82303Q9820L14538L15595K29750K03297
41378I11574J45002m3342k21796k18464j16155j13047k12236k55844j87651r1496
41368d03455j8205N8097J36960J80719J90351J90053J61377P8656k0074o9850
41358D84629n5280l776M4657K6818r9388k54628k86491j81955j16187k01224l01865
41347i44690k20515K7248K51453L34422L10271K41951J41150N238j37749k16243
41337b07464j43467O5004K03742O0087k64253l98875j83142R3258J01294n9175
$$ plain form
41409 116698 68472 -68522 -217048 -272610 -196955 -46153 37520 -50532 -218344 -259619 -139591
41398 -139591 -48142 -95795 -127088 41046 340515 554814 587279 492242 345509 220675
41388 220675 193586 230095 165713 -59123 -241426 -151606 162932 478527 708277 911574
41378 911574 1056576 1013234 791438 572974 456819 343772 131536 -124308 -311959 -403455
41368 -403455 -421660 -363563 -226603 -45884 144467 334520 495897 574553 554479 484629
41358 484629 429349 425573 470230 497048 397660 143032 -143459 -325414 -441601 -642825 -944690
41347 -944690 -1165205 -1137957 -886504 -552082 -241811 140 141290 146528 8779 -207464
41337 -207464 -350931 -285927 -82185 -22098 -286351 -685226 -868368 -775110 -673816 -732991
41327g32991n1607J64504K98309J93770L0369K432N1229K6929o9040j30521j12921
41316c29538m1288O7458J99813L06998L23866K04128n3598l54637n09898l93872
41306e80568j07068J13962J52707Q5277J1077n5982j07046q9995p541M2136o29
41295e43670n7083j7792R9270J67213J10299n18k5744P1328J59233J02890j8734
41284D6692J4318K22480L21400R6756k55543l68327j89634O181M2285J0762J6411
41273c6219J6270k3895m5259m3343r1464j54004r5948N7084J13229M9221P1510
41262a82818K19998K21523n8326l16232k44881j4581J3155j39978j59322J3006
41252f48456J13000J7034r2440o5402J7874N6494Q0222J17082J21802R2783P4165
$$ plain form
41327 -732991 -784598 -620094 -321785 -128015 -97646 -95214 -43985 -17056 -86096 -216617 -329538
41316 -329538 -370826 -303368 -103555 203443 527309 731437 677839 323202 -186696 -580568
41306 -580568 -687636 -573674 -420967 -335690 -324613 -380595 -487641 -577636 -585177 -543041 -543670
41295 -543670 -600753 -618545 -519275 -352062 -241763 -242281 -268025 -196697 -37464 65426 46692
41284 46692 61010 283490 604890 701646 446103 77776 -111858 -105677 -63392 -52630 -36219
41273 -36219 -19949 -43844 -89103 -132446 -223910 -377914 -473862 -416778 -303549 -254328 -182818
41262 -182818 37180 258703 200377 -115855 -360736 -375317 -362162 -502140 -661462 -648456
41252 -648456 -535456 -518422 -610862 -676264 -658390 -601896 -521674 -404592 -282790 -190007 -115842
41241a15842K2334j26930k55617j67606P9669K01821R6078l3438k7021J9976l004
41230c09580l1132J673M0586Q6453K39091M25448L71496M1259j87366n0570J64349
41219G91707M3787l05446m29711k18918R50L1216L2471J24686J41456m6327k48349
41208h2478k06534M6894K62553K86502J53112m2593k23531l17172k68294q5984
41198d77525J33022K32041J08881j36925k49785j14105Q2636J20563O6750J08031
41188a26416J70448K6616k36462k38025J01401L55417J98900r7877q6585J84737
41178B52154K83817O0815j77675j64649j3898K7535p0810j52102j17097k9614
41168a01524k5980j51300k60479j38530K05242M55592L45925J8249j53827n0928
$$ plain form
41241 -115842 -93508 -220438 -476055 -643661 -563992 -362171 -266093 -299531 -326552 -306576 -309580
41230 -309580 -340712 -339039 -298453 -212000 27091 452539 824035 865294 677928 627358 791707
41219 791707 835494 530048 100337 -118581 -117631 -86415 -53944 70742 212198 165871 -82478
41208 -82478 -289012 -242118 20435 306937 460049 417456 193925 -123247 -391541 -477525
41198 -477525 -344503 -112462 -3581 -140506 -390291 -504396 -421760 -301197 -234447 -126416
41188 -126416 44032 70648 -165814 -403839 -302438 52979 251879 154002 67417 252154
41178 252154 535971 596786 419111 254462 240564 268099 197289 45187 -71910 -101524
41168 -101524 -127504 -278804 -539283 -677813 -472571 -16979 328946 347195 193368 142440
41158A42440R6862Q5870k6376j01415j07495m6428J00192K43092J90472q3003
41148D94211l24475l02722r5222N8474O9233J9241j8037j6179O0581J87147K15406
41137C47658M4557j94031k77325j74770l8827M2738J07086J50954J02884j1105
41127I9819n1749K5650R6021O2166o013q431K4222J001p7997j31756j14536n6743
41115a38346j7466k7280m7321J1159J65657K77394J89235m7639k06194j70247
41105a1048o0198k5462n0677n1718l6528n5789q9075r6122j03796j29082q9126
41094g98621Q6497L05346L94784L01589J11248q1455k12472k14340p6568Q2276
41084a01716J24036O0327J0325J8119K5609J091k7730n3273q3474p8027j0388
$$ plain form
41158 142440 239302 325172 298796 197381 89886 43458 143650 386742 577214 494211
41148 494211 169736 -132986 -228208 -169734 -100501 -81260 -99297 -115476 -54895 132252 347658
41137 347658 392215 198184 -79141 -253911 -292738 -250000 -142914 8040 110924 99819
41127 99819 48070 73720 169741 231907 225894 217463 241685 242686 164689 32933 -81603 -138346
41115 -138346 -155812 -183092 -230413 -219254 -53597 223797 413032 365393 159199 -11048
41105 -11048 -71246 -96708 -147385 -199103 -235631 -291420 -380495 -476617 -580413 -709495 -798621
41094 -798621 -712124 -406778 -11994 289595 400843 319388 106916 -107424 -183992 -101716
41084 -101716 22320 82647 92972 111091 136700 137791 110061 56788 -26686 -104713 -115101
41073a15101L3527m3686j73162j93935r0560N419M1242Q7557J52806J54803J04217
41062c6873J01968J10992k5549k57227k89555k6340K12819J35340r4322j40916
41052c09663k3446j6062j37600j20350J09829K80006J93202J1982k8248L6335
41042d015J5827j23460k37949k08838l6052J99526L60722L08721M4595k39081
41032G9996l32975k13810k1322J17758J76418J79890J48896Q5795k1358j67744
41022C1544k88550k88126j44618N0737J88737K38622K21450J38862j5068j92780
41012e9190k97459k60078j03461O5428J36548R8928N5297R5868J68885J41597
41002D2363k949j12796o0231P4457R1897o9371k39969k12758J2588K29223K65509
$$ plain form
41073 -115101 -81574 -125260 -298422 -492357 -582917 -577498 -536256 -448699 -295893 -141090 -36873
41062 -36873 65095 176087 150538 -106689 -396244 -422584 -209765 -74425 -168747 -309663
41052 -309663 -333109 -349171 -486771 -607121 -497292 -217286 -24084 -12102 -40350 -4015
41042 -4015 11812 -111648 -349597 -558435 -594487 -394961 -34239 274482 319077 79996
41032 79996 -252979 -466789 -488111 -370353 -193935 -14045 134851 220646 199288 31544
41022 31544 -257006 -545132 -689750 -639013 -450276 -211654 9796 148658 133590 -59190
41012 -59190 -356649 -616727 -720188 -654760 -518212 -419284 -363987 -268119 -99234 42363
41002 42363 39414 -73382 -133613 -59156 32741 -36630 -276599 -489357 -476769 -247546 17963
40991A7963J67288R1722P3513P714j32463k01414q6190J02512J62138N0613j11874
40980A41522k25830k56268j53984Q3109K83809K36072j4608j76478q6683Q9429
40970g9910J24429L7983M016N9986P3145l6285j73653j94559q0775M1612M9437
40959a74574k8027m3879O4221J80154J84316J28990J11434O6105j14819l06260
40949F7661k50619M8999K93264L02243K04420J24952j9006k51146l55092k03085
40939c7409k8975r0842k50138j99173L3588J48247O9448K7925J40148K25296J17889
40928A56004q2053j68246p3330J05707K03968J02689j30388k47473j08299J03580
40918a37841J28099P437j5656R2776J38831O9926M9826J28288J43559L4053m4207
$$ plain form
40991 17963 185251 276973 350486 358200 225737 24323 -61867 40645 202783 253396 141522
40980 141522 -84308 -340576 -494560 -411451 -127642 108430 93822 -82656 -169339 -79910
40970 -79910 44519 82502 86518 146504 219649 183364 9711 -184848 -265623 -224011 -174574
40959 -174574 -202601 -246480 -182259 -2105 182211 311201 422635 488740 373921 67661
40949 67661 -182958 -133959 159305 461548 665968 790920 771914 520768 165676 -37409
40939 -37409 -66384 -157226 -407364 -606537 -572949 -424702 -355254 -327329 -187181 38115 156004
40928 156004 73951 -94295 -167625 -61918 142050 244739 114351 -133122 -241421 -137841
40918 -137841 -9742 -2305 -17961 74815 213646 283572 333398 461686 605245 639298 595091
40907E95091j7458l0788j53587k19623j22437j6528l7219n7327N8503J67850P2138
40896B38615j34051j96424p9808L0772L8219J3917O348k4650q3580j09421p7576
40885c77639k1306L3380O8469N2568J39p368O2148J27742J21953Q6199O2252Q768
40873B17305p6351q7070R638N9893n5378k10478k20237j21668p6537q5178r994
40862f56055J64911K94350K73326J27985n6084j67492j08366N5126Q2851j23500
40852a12948l08004j83193J37032K92122J95738J01450J55267J94687O7418j17154
40842D22415j77669j08512k0891K6140M7795Q5189J70719K52252J81929q3416
40832G95951l25588l01895r6204j75o6021n4383J41708L11800K60749P1385q0124
$$ plain form
40907 595091 577633 546845 393258 173635 51198 34670 -2549 -59876 -1373 166477 238615
40896 238615 104564 -91860 -171668 -140896 -102677 -88760 -82412 -107062 -190642 -300063 -377639
40885 -377639 -398945 -365565 -297096 -244528 -244389 -251757 -189609 -61867 60086 146285 208537 217305
40873 217305 140954 53884 63522 123415 68037 -142441 -362678 -484346 -560883 -646061 -656055
40862 -656055 -491144 -196794 76532 204517 148433 -19059 -127425 -72299 10552 -112948
40852 -112948 -420952 -604145 -467113 -174991 20747 122197 277464 472151 539569 422415
40842 422415 244746 136234 115343 141483 189278 274467 445186 697438 879367 795951
40832 795951 470363 168468 72264 72089 6068 -48315 93393 405193 665942 737327 657203
40821F57203j47779j43827n7904M0919K6322o5845o2357J7922o4905l39657m68569
40810f08477k35263R0841J44027k1291j02614l7987J3264L5902J46844K83300
40800b91454K42773L3619j04697n4089N7759J06126J08158Q2637n600j07516r1495
40789b3779N0435J55633J11027o291n4252J1242J22434J64772O3274j19251k14505
40778B60739j60928r5180j22729j31944j3445Q0311m4411k43265j90227J17358
40768e43721L35946K83282J47309J17797J23833N8724j8656n4554j17998j98368
40758A33594j38871N8817J23109p9567k67507j37679J64529K67928J17320l0022
40748B11651n7738j00128k08356k27146p7448Q7169J09625L5045o413J7861O2064
$$ plain form
40821 657203 509424 365597 307693 348612 374934 309089 246732 264654 199749 -139908 -608477
40810 -608477 -843740 -752899 -608872 -630163 -732777 -770764 -757500 -721598 -574754 -291454
40800 -291454 -48681 -15062 -119759 -173848 -116089 -9963 98195 180832 175232 67716 -23779
40789 -23779 26656 182289 293316 287025 232773 244015 366449 531221 594495 475244 260739
40778 260739 99811 4631 -118098 -250042 -263487 -183176 -227587 -470852 -661079 -543721
40768 -543721 -207775 75507 222816 340613 464446 523170 504514 449960 331962 133594
40758 133594 -5277 53540 176649 97082 -170425 -308104 -143575 124353 241673 211651
40748 211651 153913 53785 -154571 -381717 -459165 -371996 -262371 -227326 -233739 -215878 -153814
40737a53814R4060R5495N2199m272j4612K0087L8369J9878N344K306l7263j16629
40725A148j56184r8377R738P5053N7039j1248o2165m5603K2762O9936N3621J5389
40713f8891L659j0693p1125j30626j04509m936P4996R9934J17642J50971J63189
40702B19611J35062Q5821J9030o0049q7571j8766M4057n4049k72191l71280k23050
40691e83375J5876J24890R0690M8055N2075M6646O600j9828m18M2578P9251R0948
40679f012N8276q012m4063l251O5428O7605j7406j15715j47198r8088k3395n381
40667b77212p4757j41250n9086J79843L76742L40485J33809o497J2658L3188r6458
40656D21465k75126k76574p4078J01483O4433p6044p3217J02439K11430Q0260
$$ plain form
40737 -153814 -59754 35741 87940 83668 69056 89143 127512 147390 152734 155040 117777 1148
40725 1148 -155036 -253413 -243675 -168622 -111583 -122831 -184996 -230599 -207837 -137901 -84280 -68891
40713 -68891 -65232 -75925 -147050 -277676 -382185 -387121 -312125 -212191 -94549 56422 219611
40702 219611 354673 440494 459524 399475 311904 293138 337195 283146 10955 -360325 -583375
40691 -583375 -567499 -442609 -351919 -303864 -251789 -205143 -198543 -218371 -218789 -176211 -96960 -6012
40679 -6012 52264 44252 189 -3062 62366 129971 112565 -3150 -150348 -248436 -271831 -277212
40667 -277212 -351969 -493219 -552305 -372462 4280 344765 478574 472077 484735 517923 421465
40656 421465 146339 -130235 -204313 -102830 -38397 -114441 -187658 -85219 126211 206471
40646B06471j50377k14994o0047J48706K81567L22762K25475p4048m36878n42579
40636b93942k72010R8066K40766J73967J27591J53295J11676j9717r2216n1163
40626A76313j9243o3722q8264l0394K3012J2586K3779J07170J38744J3357j43010
40615A50328j32160J4850P6808l3520j52808j12288L0020Q0339l2801j73506j68298
40604d53036p732J56344J97692J40931P4206Q377r1627j81737j71346q1150l5533
40593d44611o3903m3993Q9761K08713J64468M858j00017q0567n220N1439O5550
40582a53522K6140n0703q9720l3216O5864J09379Q8908P0585O9971L8045l3905
40571A07826q4380o9010j6891Q619k7190q8863p4796P6392K53157K46991L3565
$$ plain form
40646 206471 56094 -158900 -218947 -70241 211326 534088 759563 685515 248637 -293942
40636 -293942 -565952 -467886 -227120 -53153 74438 227733 339409 319692 227476 176313
40626 176313 157070 93348 5084 -25310 -2298 10288 34067 141237 279981 293338 150328
40615 150328 18168 33018 109826 76306 -76502 -188790 -158770 -78431 -111232 -284738 -453036
40604 -453036 -460768 -304424 -106732 34199 108405 116782 25155 -156582 -327928 -409078 -444611
40593 -444611 -508514 -552507 -462746 -254033 -89565 -84707 -184724 -265291 -270511 -219072 -153522
40582 -153522 -127382 -178085 -267805 -301021 -235157 -125778 -36870 33715 103686 141731 107826
40571 107826 23446 -45564 -62455 -53836 -81026 -169889 -244685 -168293 84864 331855 365420
40560C65420j41804q1650Q0641R3235k0291k5808R6367P8761k04325m84378m30612
40549f74444p2337K68670L59195K23037J2535j36623j56945q0503j6487k2960
40539b96862k3107Q2715K51662L24828K13371l227j68567j97254j26377m6778
40529A0404J37M5629J12551J53442J14487K6466l4280n0199n3820m6102j8419
40518B60296k4345j05927j68910q6514O7032O9823j09137k14854n7718K04448
40508a65806K81936J27591o3899j43285j26558p4144q434M7410O1147L4223q336
40497c8155n4072q7367q6018p5506j12349j64609j14339M1685J14814k5871k27636
40486h29423k32586j6746K04107K62867J82665O1071k9418k7175Q7271K19063
$$ plain form
40560 365420 223616 141966 222607 315842 295551 269743 366110 444871 240546 -243832 -674444
40549 -674444 -746781 -478111 -118916 104121 116656 -19967 -176912 -257415 -273902 -296862
40539 -296862 -319969 -237254 14408 339236 552607 549380 380813 183559 57182 10404
40529 10404 10541 56170 168721 322163 436650 463116 428836 378637 324817 278715 260296
40518 260296 235951 130024 -38886 -125400 -58368 11455 -97682 -312536 -370254 -165806
40508 -165806 116130 243721 179822 36537 -90021 -164165 -172599 -125189 -64042 -29819 -38155
40497 -38155 -92227 -179594 -265612 -341118 -453467 -618076 -732415 -690730 -575916 -601787 -829423
40486 -829423 -1062009 -1078755 -874648 -611781 -429116 -368045 -397463 -424638 -337367 -118304
40476a18304K23432O8309j31539k34958j76856L763J68685J71354J9408j19561
40466a26267j39033j09621r2163l299J75922K37360L3125k15004j85761N7663
40456c67078J78604R9429M8189P7056l5558k91620l14101P5530M71373L98006
40446C39830l0034l02644k10062j259P7821O9182R7901J46849J30625M2428n3495
40435C07142j01809r5080p2541p2164o6666m450O8923L8393q5481j35993l8851
40424b58577N5298R196p3447k1940J16158J51638M0446q6456j27861q2975L0990
40413b47530J69195K14035R9776o2241j33712j55825k29318k70809j27226J03847
40403f39808J40055o3896k14844r0365J69230K99428K60878J98233J73426J05293
$$ plain form
40476 -118304 105128 173437 41898 -193060 -369916 -366153 -197468 -26114 -6706 -126267
40466 -126267 -265300 -374921 -467084 -470383 -294461 -57101 -23976 -238980 -424741 -367078
40456 -367078 -188474 -89045 -40856 36200 642 -290978 -605079 -529549 -58176 339830
40446 339830 309796 7152 -202910 -204169 -126348 -57166 40735 187584 318209 360637 307142
40435 307142 205333 110253 37712 -34452 -101118 -105568 -36645 1748 -83733 -219726 -258577
40424 -258577 -203279 -194083 -267530 -289470 -173312 -21674 18772 -67684 -195545 -278520 -247530
40413 -247530 -78335 135700 235476 173235 39523 -116302 -345620 -616429 -743655 -639808
40403 -639808 -499753 -563649 -778493 -868858 -699628 -400200 -139322 58911 232337 337630
40393C37630o2268k46292k93251j37784J01211K16265J49154O7465J14510J79726
40383D26366Q5766p9436o7529J08374J45800p9902l00031k50313m3538M8506q498
40372a4435n4706l3690j5614j3535R375J2329m8906q1084J4758J23119M2554j85791
40360b45626k98121j72384L2252J36799J45573J25447O8989k2324o4647r555P0203
40349b33394R7613R5641J04356J01408P7935P9240R0939J3276j51202k25481j12599
40338f2268J3936m1055j69281j16746R9070J99887P9027n2815k6964L9854k481
40327c9836p1932k9493O0965O4160K4695N1443O3284p5525k29231j13762K29131
40316f6101L90185J38390k50349l71089j87840L4428J26004J18077N9626l7167
$$ plain form
40393 337630 275362 29070 -264181 -401965 -300754 -84489 64665 132130 246640 426366
40383 426366 512132 432696 365167 473541 619341 539439 239408 -10905 -54443 -5937 -14435
40372 -14435 -69141 -102831 -118445 -131980 -122605 -110276 -159182 -240266 -225508 -102389 -59835 -245626
40360 -245626 -543747 -716131 -683879 -547080 -401507 -276060 -207071 -229395 -294042 -303597 -233394
40349 -233394 -135781 -40140 64216 165624 243559 322799 413738 427014 275812 50331 -62268
40338 -62268 -48332 -89387 -258668 -375414 -276344 -76457 2570 -50245 -77209 -37355 -39836
40327 -39836 -111768 -141261 -80296 -16136 8559 60002 123286 47761 -181470 -295232 -66101
40316 -66101 324084 462474 212125 -158964 -346804 -312376 -186372 -68295 -8669 -45836
40306d5836r9495l6747J11060K05710J85513R2127m0429j83845k37367j21667
40296a70976M8661O0436r6733j92017q0270R0615J04799j4311o3926L4356J37288
40285a42078R4629m8523j22507n9745K4818K151q3484q1801K5209Q2722J2873
40274b95736l6748P7726K33362J94940k5262j75596j29791k3281K0960P8528K21696
40263A40798L22093K25747Q591j14737p6926n458j6540q8345j31527q9481K9032
40252B03247J46674J56361K3007j60855k59399k17890q7997K6036L1761p2824
40242b11879j61679j05127M1227Q3759k4867r1437K5473J71618J12869j00209
40232b60252j85587k1515K04119K60165J34782j4511n7185J2504R2406N7456j06135
$$ plain form
40306 -45836 -145331 -182078 -71018 134692 320205 412332 371903 188058 -49309 -170976
40296 -170976 -122315 -61879 -158612 -350629 -430899 -340284 -235485 -249796 -313722 -279366 -142078
40285 -142078 -47449 -95972 -218479 -278224 -253406 -251255 -334739 -416540 -391331 -308609 -295736
40274 -295736 -332484 -254758 -21396 173544 148282 -27314 -157105 -180386 -159426 -80898 140798
40263 140798 462891 688638 697229 582492 505566 500108 483568 395223 263696 174215 203247
40252 203247 349921 506282 529289 368434 109035 -108855 -196852 -170816 -139055 -211879
40242 -211879 -373558 -478685 -437458 -353699 -378566 -470003 -444530 -272912 -160043 -260252
40232 -260252 -445839 -467354 -263235 -3070 131712 117201 60016 72520 164926 222382 116247
40221A16247k49234k16976m4915R3188J11455O6040m88j09811k16706j96155l5246
40210f82601J10749J46648J74659K78598L16928J22560j79055k75363q0423J60430
40200I3130K10737R9132k7595j20565j79731j44022N462J31599J03328J0614M2297
40189B24386J85280K35591J10826m1925q7935o7520n5327m4827o0172j86381l62883
40178a50887l49560p5968J66552J09670q7014r7632M8644O1078p7133p7979J19703
40167d10526K04485R379j99712j49108N2112J72748K13488K39161J36885j38540
40157A30372l08283j20366K08725K75078Q6445j0970P4365Q5189p7961j72827
40147A69767l4373J74167K51820J99189N4461k03188m47754m12044q8292J51689
$$ plain form
40221 116247 -132987 -349963 -394878 -301690 -190235 -124195 -124683 -234494 -451200 -647355 -682601
40210 -682601 -571852 -425204 -250545 28053 344981 467541 288486 13123 -67300 93130
40200 93130 303867 402999 375404 254839 75108 -68914 -63452 68147 171475 182089 224386
40189 224386 409666 645257 756083 714158 626223 558703 503376 458549 398377 211996 -150887
40178 -150887 -500447 -576415 -409863 -300193 -387207 -484839 -436195 -375117 -452250 -530229 -410526
40167 -410526 -206041 -196662 -396374 -545482 -493370 -320622 -107134 132027 268912 130372
40157 130372 -177911 -298277 -89552 185526 271971 261001 335366 420555 342594 169767
40147 169767 135394 309561 561381 760570 815031 611843 164089 -247955 -336247 -184558
40137a84558N3621j51267j20363Q6462J64274O5067J0092Q1200J21838M6742k2161
40126A50947K0506J10622J42432R4423j0579j36587k01816j43576l5308j4703
40116b3639p9308q3105L7683J62803J53159R774j67161k73914k29750k7140J97353
40105c23245K57573J42727L7432N3858P5206k7485j52729j16976K7303L5109j55053
40094a46280k90762j44874J66370L43387K86743J56708Q4923P040j66052l48721
40084e1518l61454j57838J14845K65538K21972O7689m1319j7404P4747J04357
40074B19615N0686J9399N5966N4229o1692j69925j09599N6979J12960P18j13391
40063A15945j14281r5763j60793k19553j20050J08999K79016K71404J47140M2073
$$ plain form
40137 -184558 -130937 -282204 -402567 -316105 -151831 -86764 -76672 4528 126366 173108 150947
40126 150947 171453 282075 424507 518930 508351 371764 169948 26372 -8936 -23639
40116 -23639 -102947 -186052 -148369 14434 167593 177367 10206 -263708 -493458 -520598 -323245
40105 -323245 -65672 77055 114487 168345 243551 216066 63337 -53639 -26336 8773 -146280
40094 -146280 -437042 -581916 -415546 -72159 214584 371292 456215 463255 297203 -51518
40084 -51518 -412972 -570810 -455965 -190427 31545 99234 57915 40511 115258 219615
40074 219615 270301 289700 345666 399895 338203 168278 58679 115658 228618 229336 115945
40063 115945 1664 -94099 -254892 -474445 -594495 -485496 -206480 64924 212064 254137
40053B54137K5943N8273L6509r8081k70805l21208j80487K9091J20539N2382l3510
40042c27217J1255J59933K36961J33107m5404j06064k9023K2169k0688p423J54486
40031A82092K70178J24463j37528j84998j1558O0770p6525j31986Q6477L23163
40021E04548K69363L9830m4591L9686N9361m4939r7520k5025L6734q313r3412
40010F35722j35919j14455k759J82369K84393J65353n2598j22487l6610r725r5356
39999F97928j04257L5217J29846N7342k0440N1836J55863J24765L5132M6088J03902
39988A313222N1796p6504j20931q4051j13106k22342k62236j70571m8584L3774
39978C00467J15662J93900J80218O6792l5272q5661j69509k82365k53423k4604
$$ plain form
40053 254137 280080 338353 374862 276781 5976 -315232 -495719 -466628 -346089 -293707 -327217
40042 -327217 -315962 -156029 80932 214039 168635 62571 33548 55717 35029 27606 182092
40031 182092 452270 576733 439205 254207 242649 303419 226894 94908 181385 504548
40021 504548 773911 813741 769150 808836 868197 823258 725738 700713 737447 729134 635722
40010 635722 499803 385348 382589 564958 849351 1014704 962106 839619 803009 793284 697928
39999 697928 593671 628888 758734 816076 795636 847472 1003335 1128100 1163232 1209320 1313222
39988 1313222 1365018 1288514 1167583 1083532 970426 748084 485848 315277 266693 300467
39978 300467 416129 610029 790247 857039 821767 736106 566597 284232 30809 6205
39968F205J67013Q8310j27472j56777L5214J59534O5154m3294L4544J62984J05260
39957D96675p7214j19050K6017J17202m505k06184k82715j98299l1128J48282
39947a30919K42873J38525j15217k68430j69735O993M509j39722j59695L4856
39937e55962K34578K40588J18002O1537J28359J97863J47039K151q6125k0194
39927D67836J00382Q1208r4021k06673j05397N8363M4194j31082k51830k35826
39917b72846j84390j35644j8266J29742J49706L9297N021J34249K32876J24906
39907B04651p8892j65906j06170J1252J64377L25818L40296J05772j97298k81373
39897C22527j26201K3239J9413l1064M24O8314O7895M302n2553q9738j28231j30749
$$ plain form
39968 6205 173218 261528 134056 -22721 12493 172027 237181 193887 228431 391415 496675
39957 496675 419461 300411 326428 443630 439125 232941 -49774 -248073 -279201 -130919
39947 -130919 111954 250479 135262 -133168 -302903 -295910 -291401 -431123 -590818 -555962
39937 -555962 -321384 -80796 37206 98743 227102 424965 572004 574155 488030 467836
39927 467836 568218 649426 555405 348732 243335 301698 345892 214810 -37020 -272846
39917 -272846 -457236 -592880 -611146 -481404 -331698 -292401 -287380 -153131 79745 204651
39907 204651 125759 -40147 -146317 -135065 29312 355130 695426 801198 603900 322527
39897 322527 196326 219565 238978 207914 208338 276652 344547 348849 296296 206558 78327 -52422
39885e2422l4343J24684J96824P4947j67696l48198l73956k99825j75187M1767
39875a013405L24266M61103K93846M576p5433N9415Q5396j12061k13466L3205
39865a52558L72665M01731J69105N6400J57412J66495q6118l46530l19403p1662
39855C47537J14883J07045k5671j71534k24637q6423K03146M01078K98903K610
39845I66937j78247j24276l4260j08562k52730k27858j5236J47351J07244L49
39835B80712J7178J11810J11342K0816m68O0108L5413j13870k06836j55320j21646
39824C9239k04887k08368M4907L54140L82814J38531p8165j20447q8779l0269
39814B28716J21771K89765K58249J9425j68316j63447j18393j61997j73720l8394
$$ plain form
39885 -52422 -86765 37919 234743 309690 141994 -206204 -580160 -879985 -1055172 -1013405
39875 -1013405 -689139 -228036 65810 70386 -5047 54368 139764 27703 -185763 -152558
39865 -152558 220107 621838 790943 847343 1004755 1171250 1085132 738602 419199 347537
39855 347537 462420 569465 543794 372260 147623 61200 264346 665424 964327 966937
39845 966937 788690 664414 630154 521592 268862 41004 25768 173119 280363 280712
39835 280712 297890 409700 521042 541858 541390 601498 636911 523041 316205 160885 39239
39824 39239 -165648 -374016 -329109 25031 407845 546376 468211 347764 258985 228716
39814 228716 350487 640252 898501 917926 749610 586163 467770 305773 132053 93659
39804I3659J07382Q4088m8665j11177o8324j887N7527J03879P1376o3012j86429
39793C8417j95637j34248o8600L3972J67187J93930P2796N751J31795K36541N7153
39782E39057k47636k79414j299K11057J43949J61j8471j7304j09814j38499L0771
39771A12558J81573M1188k50734l13880j03851L1004j02359k62621j65781J06572
39761g26331K76086K63578K05938J83532J44603O8124J5770Q479m082l0400k1051
39750C84246J0905j7519j06655j41259p0130J714k1773q2489q2363l8687j6055
39739a80065o00L1387J2752r4207j57978m1930J44848J66310J1582q9333k2437
39728b19671O1351K2035n2696j5579J21801K49045K91467J93114o5565l19137
$$ plain form
39804 93659 201041 285129 236464 125287 56963 55076 112603 216482 287858 224846 38417
39793 38417 -157220 -291468 -360068 -326096 -158909 35021 107817 113568 245363 481904 539057
39782 539057 291421 12007 10708 221765 365714 365875 347404 330100 220286 81787 112558
39771 112558 294131 335319 84585 -229295 -333146 -302142 -404501 -667122 -832903 -726331
39761 -726331 -450245 -186667 19271 202803 347406 415530 431300 439779 435697 405297 384246
39750 384246 395151 377632 270977 129718 59588 61302 39529 -42960 -125323 -164010 -180065
39739 -180065 -180665 -149278 -136526 -230733 -388711 -430641 -285793 -119483 -107901 -197234 -219671
39728 -219671 -158320 -136285 -188981 -204560 -82759 166286 457753 650867 585302 266165
39718B66165k77514R0652M02964L12364j9757j59574k4456M1934j65966l93596
39708G3216l15770j5352J52909O6089m0205M4052K05090K09404P0430J3943J00691
39697E64497J12687q3545k69409j82479N3224R7551o8686j24934L6290J16531
39687B51727p4556k69020j64447R3245J71232O7085N187j3396j56112l45005l12924
39676g46984o9947P1904j1295r3527n517J29177J74234J87914K14472J50989j7875
39665a6455r9554K4883K10098K84905K72084K29245R6707j24642k55339j87348
39655D34584o8286n6639q1228l1997Q439n4059r6246J8502J57836J06074q5108
39644B51872j93009j75579j65916j91031j58897q0298n6375p2725k7332P1293
$$ plain form
39718 266165 -11349 79303 482267 794631 774874 615300 590844 632778 466812 73216
39708 73216 -242554 -257906 -104997 -38908 -79113 -35061 170029 379433 449863 463806 564497
39697 564497 677184 593639 324230 141751 194975 292526 223840 98906 135196 251727
39687 251727 177171 -91849 -256296 -163051 8181 75266 80453 67057 -89055 -434060 -746984
39676 -746984 -816931 -745027 -756322 -849849 -855366 -726189 -551955 -364041 -149569 1420 -16455
39665 -16455 -116009 -91126 118972 403877 675961 905206 1001913 877271 621932 434584
39655 434584 366298 309659 228431 196434 204873 150814 54568 73070 230906 336980 251872
39644 251872 58863 -116716 -282632 -473663 -632560 -712858 -769233 -841958 -869290 -797997
39634g97997J43497K17932L42521L81931J73411j47847k61083j01342Q0315J09919
39624A41257O8221M4588j587o5533n0680J6657k3906j73775k18042o1098J23393
39613b00505J84421J87485J97094J25635m6499j48723r3486l4835p1670m7087
39603E1830J30741K24260J7460k77736k97188n4252J45140J94980K29981K49961
39593F15177J05918j25998j48916P9350K19871N3186j86517j72803M7843J78065
39583F65176J05515j0697k2994K5037N503j17536k40331k22395n3839R8672Q2339
39572C14450l5049o6622O712K0073q5128j52761p3968L0130J5324n4282l6247
39561a17368N4350J06629J13074J30667J17229l532j50775j51411j322J06817
$$ plain form
39634 -797997 -654500 -436568 -94047 287884 461295 313448 52365 -48977 31338 141257
39624 141257 209478 254066 252479 186946 136266 152923 129017 -44758 -262800 -323898 -200505
39613 -200505 -16084 171401 368495 494130 447631 298908 205422 170587 98917 51830
39603 51830 182571 406831 424291 146555 -150633 -204885 -59745 135235 365216 615177
39593 615177 721095 595097 446181 525531 745402 798588 612071 439268 487111 665176
39583 665176 770691 759994 737000 762037 767540 650004 409673 187278 133439 232111 314450
39572 314450 279401 212779 219491 239564 154436 1675 -72293 -42163 -26839 -81121 -117368
39561 -117368 -63018 43611 156685 287352 404581 401049 250274 98863 97541 204358
39551B04358M6159r6918j75087j50017o1062N9777J75164K28845K05868J48693
39541E85780Q2693l430p9277o8010L4642J26985J42081J29320J29953P9954n6408
39530A104283j55967r2178M1210M0476r5871j62623p8879q164o0705r1953L5967
39519D75596J74164J03712q8375j29991r239J1386j46826k30648q3994P9659L5311
39508A90755q6036n4979M5685k727j15996k9020J96745J96942j06163l22671j57342
39497b44807J70939K81956J45973J362l6495k1079L1027J30429J81695R3534l4960
39486F99574m9892r522r5395k89551l69800k37136l7733P7506J25758J68506J83541
39475A65856J42193Q9540O7879M7795k752m6917k4277O7605J48718J01686j01156
$$ plain form
39551 204358 250517 153599 -21488 -171505 -232567 -172790 2374 231219 437087 585780
39541 585780 668473 665043 585766 517756 552398 679383 821464 950784 1080737 1160691 1104283
39530 1104283 948316 856138 897348 937824 841953 679330 600451 592287 531582 439629 475596
39519 475596 649760 753472 665097 535106 525867 537253 390427 159779 75785 155444 190755
39508 190755 104719 49740 95425 92698 -23298 -52318 144427 341369 235206 -87465 -244807
39497 -244807 -73868 208088 354061 355423 318928 297849 328876 459305 641000 734534 699574
39486 699574 649682 640160 544765 255214 -114586 -351722 -389455 -311949 -186191 -17685 165856
39475 165856 308049 397589 465468 513263 510511 463594 439317 506922 655640 757326 656170
39464F56170k79651j76766J82425M03259J87945k23564l40609q6306J39175P0281
39454E32359r2858p5370P0047J47001J48832J73497J86175J02897j3718n4085
39444A124777n4860j00926j35509o2710N1093P4752L0534J9503J1326p6775j60911
39433G20294q7708Q6496J53153P4318N574p664r2916k55732k84428o9443J94158
39422D36102K69066J79241J06895J16932J31031Q3432k8878j82115l05230k93157
39412E13319j40176O283J9202m7566o4673j7914J7779K9281N8443Q1611L4037
39401D89626m9241m7940N9468J37021O9725q3041j80890j89639j86286j97065
39391a78262j36577M1554K10471J93361R731j19592n7835O7788O0434o8621j49881
$$ plain form
39464 656170 376519 199753 382178 785437 973382 749818 409209 322903 462078 532359
39454 532359 439501 364131 434178 581179 730011 903508 1089683 1192580 1178862 1124777
39444 1124777 1069917 968991 833482 770772 821865 896617 927151 946654 957980 881205 720294
39433 720294 632586 719082 872235 946553 952127 944463 851547 595815 311387 241944 436102
39422 436102 705168 884409 991304 1108236 1239267 1322699 1293821 1111706 806476 513319
39412 513319 373143 379426 398628 351062 286389 268475 286254 315535 373978 455589 489626
39401 489626 440385 392445 451913 588934 658659 575618 394728 205089 18803 -178262
39391 -178262 -314839 -273285 -62814 130547 140278 20686 -37149 30639 91073 22452 -127429
39380a27429j16860m9462J6811J31276K51020K22500K6114j33616j02784J813
39370A19383j1475j17880j48450o1319M2259J14887J86037K15770J23870k0248
39360D42834k7167J38918K82236K44686J01366n962q1951j84689k37224j21142
39350E51905Q2213J35666l3614k11318j74304J5391J02720l0052k41862l36139
39340a39394k75954j53342l0275J00177K23473K72651K17265J19525N3975J0090
39330C98191o7534j59203j60754k0871J57761K04698O4369j43794k55044k16240
39320a98421r3484L9098J59856K50793K58586J53723l217j06660j10551n2927
39310B96796J0256N3705P1472O0517K2359m3679j40142k37785k66836j89371o3504
$$ plain form
39380 -127429 -244289 -293751 -276940 -145664 105356 327856 353970 220354 117570 119383
39370 119383 107908 -9972 -158422 -219741 -177482 -62595 123442 339212 463082 442834
39360 442834 415667 554585 836821 1081507 1182873 1176911 1094960 910271 673047 551905
39350 551905 634118 769784 736170 524852 350548 365939 468659 438607 196745 -139394
39340 -139394 -415348 -568690 -598965 -498788 -275315 -2664 214601 334126 388101 398191
39330 398191 330657 171454 10700 -10171 147590 352288 416657 272863 17819 -198421
39320 -198421 -291905 -252807 -92951 157842 416428 570151 566934 460274 349723 296796
39310 296796 307052 360757 432229 492746 515105 471426 331284 93499 -173337 -362708 -426212
39299d26212J8449M1549N9105Q9092R4971O3956K1667l3890j22673j95279j56324
39288e45589o661J35168J92419K09464K24766J84645O8138j4152L1692J12034
39278E91924N6645j37952k97895k89089j45385N549N6615j9214j39386j63785
39268d81973n3948N8883N2714J149N1277J66171J66757L1137m0413P5820K28064
39257B55638J93734l5467k81871m01936l65142j90444O1720K62618L00774K05385
39247E009J09614R0158J06849R4830M4611k0687q5395j32191j33865q3262j3149
39236a7478L1776L6865K8557M7556J02541J45268J13568J6904m9880j8825M2554
39225D79406k916j71275k94101k04057M3573K10158J49308k5211r3880O79J16446
$$ plain form
39299 -426212 -407763 -366214 -307109 -218017 -123046 -59090 -37423 -71313 -193986 -389265 -545589
39288 -545589 -552250 -417082 -224663 -15199 209567 394212 462350 448198 479890 591924
39278 591924 648569 510617 212722 -76367 -221752 -216203 -159588 -178802 -318188 -481973
39268 -481973 -535921 -477038 -424324 -423175 -371898 -205727 -38970 -7833 -48246 27574 255638
39257 255638 449372 413905 132034 -269902 -635044 -825488 -763768 -501150 -200376 5009
39247 5009 114623 204781 311630 406460 451071 430384 344989 212798 78933 -4329 -17478
39236 -17478 14298 51163 79720 127276 229817 375085 488653 505557 455677 436852 479406
39225 479406 476490 305215 11114 -192943 -149370 60788 210096 184885 91005 91684 208130
39214B08130J14011k021j49249k65683k92909j66208P8273K50824J84609m9299
39204h9522k07603j55429J6815J59479K25333K24344J40872p636j11982q9782
39194A04889j9350k9673p5498K1372K61113L61901J12136k74955l68559q0291
39184A3085K02766J36759j27964j99165k535J71180J33138K2215K928N334q0044
39173B77697j54546p0418Q3841P5442j38479l45135l34034r6382K06129L65439
39163a30446K71362M5012l6113J32846L16218K47525K756j41611j33924j62500
39153D11125k77552l00119j57303k0954m453K1898J64916K81124J99072K511r2800
39142B27465k4466J11754K28668K68722J69056l7885j81129j54726p4868r3278
$$ plain form
39214 208130 322141 320120 170871 -94812 -387721 -553929 -475656 -224832 -40223 -89522
39204 -89522 -297125 -452554 -435739 -276260 -50927 173417 314289 306653 194671 104889
39194 104889 85539 55866 -19632 1740 262853 624754 736890 461935 93376 13085
39184 13085 215851 352610 224646 25481 22946 194126 327264 349479 352407 357741 277697
39173 277697 123151 52733 136574 212016 73537 -271598 -605632 -702014 -495885 -130446
39163 -130446 140916 185928 149815 282661 598879 846404 849160 707549 573625 411125
39153 411125 133573 -166546 -323849 -344803 -349256 -327358 -162442 118682 317754 320265 227465
39142 227465 202999 314753 543421 812143 981199 943314 762185 607459 532591 439313
39132D39313j54204r9201P1198K11620K44067J94821Q2359o4458j32900m9146
39122G43469O3509K5197j29945k02758j30724n0543m9513m4230M3602J48517J64782
39111E81363P5844o2242j67618j47356J8056J87458J81755K0527r0368l8285O5146
39100F24280Q0429K5958j3601m0120r2169j27913p8843J7846M7368k1131p6869
39089C45235j9J78856K87341J96041k3769j76969j80447j40813j62409j86426
39079A36621j13211J4097Q3698R9839J34442J48201M7967r7823j08284K1520Q5847
39068D52914j8711j41235j28106m2829j0744o835M4634Q3551O049j28455j55348
39057d5115m5405O0353O1940K6890P2191J93469K53948J31567j24417k97278k15424
$$ plain form
39132 439313 285109 185908 257106 468726 712793 907614 989973 925515 792615 743469
39122 743469 806978 832175 702230 499472 368748 318205 268692 224462 268064 416581 581363
39111 581363 657207 594965 427347 279991 298047 485505 667260 687787 597419 559134 624280
39100 624280 704709 730667 717066 676946 584777 456864 378021 395867 443235 422104 345235
39089 345235 345216 524072 811413 1007454 983685 806716 626269 485456 323047 136621
39079 136621 23410 37507 121205 221044 355486 503687 551654 453831 345547 367067 452914
39068 452914 434203 292968 164862 122033 111289 104454 149088 232639 238688 110233 -45115
39057 -45115 -90520 -30167 31773 58663 130854 324323 578271 709838 585421 288143 72719
39046G2719L1142J59657J2453k62167l84491k30943Q8069L55252L99756K08798
39036D50245l8217j07288M9242K36129K46883Q8615p3787j21350o1842K5084N1860
39025G45574j5417j06118j14497n1438l1106o6483j7401J68156L07641K23311
39015A042222J0927j01134o9738k4422q134M7714J12815N8530r4380j47554k7289
39004G99557P7826K434j34292j14297M2535J15197J4147j10216j20784r1496j51620
38993C28991k38818j62117R8576L04890K45370Q235j42136j00649N455N6955Q6230
38982D90982J34556J28262J0447j13286r5804L8661J19881M5392j17286k17964
38972D23841j49251P2742K89338L13497J30800p0075j28074q9829q4007j17438
$$ plain form
39046 72719 103861 263518 275971 13804 -370687 -601630 -513561 -158309 241447 450245
39036 450245 412028 304740 353982 590111 836994 925609 851822 730472 668630 693714 745574
39025 745574 730157 624039 509542 458104 426998 360515 343114 511270 818911 1042222
39015 1042222 1053149 952015 882277 857855 849721 897435 1010250 1068780 974400 826846 799557
39004 799557 877383 879817 745525 631228 673763 788960 803107 692891 572107 480611 328991
38993 328991 90173 -71944 26632 331522 576892 585127 442991 342342 347797 404752 490982
38982 490982 625538 753800 764247 650961 555157 593818 713699 759091 641805 423841
38972 423841 274590 347332 636670 950167 1080967 1010892 882818 792989 708982 591544
38962E91544j08674l7747N8451J58130K06008J03930j03418j64364N5229L03367
38952A062456K54166l965j01597L6178J08003l4413j54077n6976R8690J22306
38942A330771J06078J63429J29381j50368m32222l48240L1565K69278J64915m2778
38932A221809j04871o6701m9059j0973J05148J94505J36506o388r2163j07475
38922A220338j27316j37704n3573J04825J87525R5797r3523k17681j95182p8025
38912G05481K9589O9258M7656r880q6628j47182j25772R827J92844L00982K70294
38901A256469J37292k1168j44133j87398j31154j6967O1491L9830n7629j50632
38891G86001j72720j02194L5736J68495K09626J38894M1727K7449J03220J67610
$$ plain form
38962 591544 482870 445123 503574 661704 867712 971642 868224 703860 759089 1062456
38952 1062456 1316622 1312657 1211060 1247238 1355241 1320828 1166751 1109775 1208465 1330771
38942 1330771 1436849 1600278 1729659 1579291 1147069 798829 830394 1099672 1264587 1221809
38932 1221809 1116938 1050237 1001178 990205 1095353 1289858 1426364 1419976 1327813 1220338
38922 1220338 1093022 955318 901745 1006570 1194095 1289892 1196369 978688 783506 705481
38912 705481 735070 804328 851984 842104 755476 608294 482522 492349 685193 986175 1256469
38901 1256469 1393761 1372593 1228460 1041062 909908 892941 954432 994262 936633 786001
38891 786001 613281 511087 546823 715318 924944 1063838 1105565 1133014 1236234 1403844
38881A403844J44369P9172O1746Q4342N1677o1059j42108q9815L2798P4218K571
38870A641755n7398j1192P1729P1346J1409N4296K84598N49308N77474K86642
38860C479967p0876j46976J07300L80071L83705J94989R8581J81486K59795J81408
38850E049450P748j35813k07968j88929m9432J21692J29570n4484j83950o2055
38840D425829J55675J79829R502r2410k905J19803J14735J5736r4104k29972l97073
38829D204645m83095l95177k16960j02360o3484J4744J62898K48317J56796j6844
38819C509480n1510J15869K74220J88913p9214k39239j59850k4292k0128n7716
38809C456533L4446J80783J67706J3775l4751J14330K76700L09136L07496L79064
$$ plain form
38881 1403844 1548213 1627385 1689131 1773473 1825150 1764091 1621983 1532168 1564966 1639184 1641755
38870 1641755 1584357 1573165 1644894 1716240 1727649 1781945 2066543 2615851 3193325 3479967
38860 3479967 3409091 3262115 3369415 3749486 4133191 4328180 4426761 4608247 4868042 5049450
38850 5049450 5057198 4921385 4713417 4524488 4475056 4596748 4726318 4671834 4487884 4425829
38840 4425829 4581504 4761333 4770835 4678425 4675520 4795323 4910058 4925794 4831690 4601718 4204645
38829 4204645 3721550 3326373 3109413 3007053 2943569 2958313 3121211 3369528 3526324 3509480
38819 3509480 3457970 3573839 3848059 4036972 3957758 3718519 3558669 3534377 3514249 3456533
38809 3456533 3490979 3671762 3839468 3853243 3818492 3932822 4209522 4518658 4826154 5205218
38799E205218M35034L67180K63040K67887L50360L76091L25339K74777K37381
38790H102307J87064J87408L20856N09787N72570M68887L53426L69341N09686
38781A1581332P00600Q97193J057431J132847J149192J220279J421279J700480
38773B0860633J963066K192229K435633K710386K981552L220725L427115L576924
38765D3368263L602387L475293L304927L292475L559837M082742M848758O007565
38757G5542247P735713R974616J2470393J5135094J8235189K2128458K6900426
38750A88122136L2294034L7769645M2366305M4541562M2461714L4788024K1499616
38743D43843036M297155j3658722k8774964l8504953m2357969m1642657l8260027
$$ plain form
38799 5205218 5640252 6007432 6270472 6538359 6888719 7264810 7590149 7864926 8102307
38790 8102307 8289371 8476779 8797635 9307422 9879992 10348879 10702305 11071646 11581332
38781 11581332 12281932 13179125 14236556 15369403 16518595 17738874 19160153 20860633
38773 20860633 22823699 25015928 27451561 30161947 33143499 36364224 39791339 43368263
38765 43368263 46970650 50445943 53750870 57043345 60603182 64685924 69534682 75542247
38757 75542247 83277960 93252576 105722969 120858063 139093252 161221710 188122136
38750 188122136 220416170 258185815 300552120 345093682 387555396 422343420 443843036
38743 443843036 448140191 434481469 405706505 367201552 324843583 283200926 244940899
38736B44940899l3696354k8855192k4312552k0407263j7199035j4572907j2412143
38729I3485453j0620579r080259p725055o611275n793675n162914m529041l856371
38721D0106284l292905k946329k737408k517389k242044j967322j736051j545551
38713B1121285j395677j288496j177517r87078p14294m68096l67754m25577n57573
38704A3739223o76319p32838p06546o20529n40955m88068l82553j84599m5365
38695I361451j45235l69583l68073l6996K78013K37900k6878j52403p9352m1838
38685H657006j14716j39151r4654j63032l41650l69204j89483j20843l30830m91454
38675F301989k88638J7243l6287l69342m66461j72700R4351Q51k58758l39340
$$ plain form
38736 244940899 211244545 182389353 158076801 137669538 120470503 105897596 93485453
38729 93485453 82864874 73784615 66059560 59448285 53654610 48491696 43962655 40106284
38721 40106284 36813379 33867050 31129642 28612253 26370209 24402887 22666836 21121285
38713 21121285 19725608 18437112 17259595 16272517 15558223 15090127 14722373 14296796 13739223
38704 13739223 13062904 12330066 11623520 11002991 10462036 9973968 9591415 9406816 9361451
38695 9361451 9216216 8846633 8478560 8441564 8719577 8957477 8930599 8778196 8698844 8657006
38685 8657006 8542290 8403139 8308485 8145453 7803803 7434599 7245116 7124273 6793443 6301989
38675 6301989 6013351 6030594 5994307 5624965 5158504 4985804 5080155 5081006 4822248 4482908
38665D482908k24912j12487p0847m9684n6181j06589j17940k4002R8177J59639
38655C978082K05586K86844L07413J72141j3573p7452m1559o4022j72211k42352
38645D338897k15407j49702p6127J1820L0381j23936l45209l70630j36148J16846
38635C080785J93256K07922L44986N32341N80542N34971O21125Q53092R57028
38626G906048P54920M05304J38653o4262l50254o73787q24245p45743o20884n97545
38616E328205o09684n47519m49984m02790l57975k12746j3451P9527K6601l5073
38606B805111n69O0432K5961j07126k39185k87937k35979j18229j8029j7312q8342
38595A778796r0894M8569K05440J98656L2686j12344j30382j05669j33608j44986
$$ plain form
38665 4482908 4257996 4145509 4074662 4024978 3968797 3862208 3744268 3720266 3818443 3978082
38655 3978082 4183668 4470512 4777925 4950066 4936493 4859041 4817482 4753460 4581249 4338897
38645 4338897 4123490 3973788 3897661 3909481 3939862 3815926 3470717 3100087 2963939 3080785
38635 3080785 3274041 3481963 3826949 4359290 4939832 5474803 6095928 6949020 7906048
38626 7906048 8660968 9066272 9204925 9140663 8790409 8116622 7292377 6546634 5925750 5328205
38616 5328205 4718521 4171002 3721018 3318228 2960253 2747507 2734056 2813583 2840184 2805111
38606 2805111 2804542 2864974 2890935 2783809 2544624 2256687 2020708 1902479 1884450 1867138 1778796
38595 1778796 1687902 1736471 1941911 2140567 2173253 2060909 1930527 1824858 1691250 1546264
38585A546264k3731J60924J92183K166k01549j97146m4909J4874q1430j43802
38575A223844m3275Q3381O7508o809M8202J76450J27452j36685l26166k10525
38565A003377P0263K13682J28079m7283j77095k17903j48376J3869J51724J47235
38555A137572L0024p9107j32642j46097q3156Q2075K16538J36977j06823k42029
38545H13332j28970O0036J08694N0047O0424J71236K41147J67306p003j76526
38535A359723k59262k09061m5701J14645J42012L5239p2980p9336k8938k9774
38525I26567q0106n1188J28392L23639L16377R1214r7088j6400K53167M31805
38515B226379L95545K73872J98986J35899K9866m2133l472M8594l3833k05058
$$ plain form
38585 1546264 1522533 1683457 1875640 1877806 1676257 1479111 1434202 1449076 1367646 1223844
38575 1223844 1180569 1263950 1331458 1324649 1372851 1549301 1676753 1540068 1213902 1003377
38565 1003377 1073640 1287322 1415401 1368118 1191023 973120 824744 838613 990337 1137572
38555 1137572 1167596 1088489 955847 809750 726594 808669 1025207 1162184 1055361 813332
38545 813332 684362 744398 853092 903139 963563 1134799 1375946 1543252 1536249 1359723
38535 1359723 1100461 891400 845699 960344 1102356 1137595 1064615 985279 956341 926567
38525 926567 846461 795273 923665 1247304 1563681 1654895 1557807 1541407 1794574 2226379
38515 2226379 2621924 2895796 3094782 3230681 3260547 3218414 3214942 3263536 3229703 3024645
38505C024645k73135j87840j19658k04045l43585l56103k28817j11745r8595j30193
38495I70929j22820q7318o7761l7911N4698J72020K04660J14522j7327r9009j06684
38484I77999m0729R1167J99990J45831o1357k00759j13131N9775P5529m5632p0426
38473A018257O8313J86997J69953J16733Q7888l9481l05771m80556l57299q5359
38463C79675K0192r5806k10297j65133j9569J04728J37508L7468j64446l07006
38453b82686k47055n5526Q6274J48951K29206K99146K21351L5639k2756J18375
38443E30919K17173O2237k13172l23306k02319j7184R5710J35579J29043P6363
38433D91043O167k9452l0082m8178j08236j67655j57265m5154J18041K18930J94639
$$ plain form
38505 3024645 2751510 2563670 2444012 2239967 1896382 1540279 1311462 1199717 1101122 970929
38495 970929 848109 760791 693030 655119 709817 881837 1086497 1201019 1183692 1084683 977999
38484 977999 937270 1028437 1228427 1374258 1312901 1112142 999011 1058786 1134315 1088683 1018257
38473 1018257 1086570 1273567 1443520 1560253 1648141 1608660 1302889 822333 465034 379675
38463 379675 399867 304061 93764 -71369 -90938 13790 151298 188766 24320 -282686
38453 -282686 -529741 -585267 -498993 -350042 -120836 178310 399661 435300 412544 530919
38443 530919 748092 810329 597157 273851 71532 54348 150058 285637 414680 491043
38433 491043 497210 467758 437676 389498 281262 113607 -43658 -88812 29229 248159 442798
38422D42798J18381R6681R4586j2789j95251k32579j1576K75463L52927J89222
38412A117863k1193j24017j20049p2570m0173p4074j58770j75725m0858J42376
38402D32810J87778P5026k9914j1994N4916M0660o8122j72740j75978o1154R2894
38391C64182J67054J21586N1077N9926J09479Q0044l2619j00584n5735K2302M6606
38380H33318L5553L0755J4373j7181n81P9428J15929L5868n1053l757J06016P8441
38368A257109r1644j71711l4292J36970J13128m2773q1488N7325J72304J08790
38358A423718l8469r4134l6231K8015K4765l6761j07644j18442k5646R2592P6217
38347A187980r1816j98634o5198J86971K85171J58010k9667j43085j83861j55947
$$ plain form
38422 442798 561179 657860 752446 739657 544406 311827 300251 575714 928641 1117863
38412 1117863 1096670 972653 852604 780034 739861 665787 507017 331292 290434 432810
38402 432810 620588 695614 665700 653706 708622 749282 681160 508420 332442 271288 364182
38391 364182 531236 652822 703899 763825 873304 953348 920729 820145 764410 786712 833318
38380 833318 868871 899626 913999 896818 896237 975665 1091594 1127462 1076409 1072652 1178668 1257109
38368 1257109 1165465 993754 959462 1096432 1209560 1166787 1085299 1142624 1314928 1423718
38358 1423718 1385249 1291115 1254884 1282899 1307664 1270903 1163259 1044817 1019171 1111763 1187980
38347 1187980 1096164 897530 832332 1019303 1304474 1462484 1432817 1289732 1105871 949924
38337I49924m3618O1642K7162r4775j23069o0820r3373k13355j63046J06680K55940
38326F09292P8416j11289M2602L30112K86330n1754j95129K5950K40955J71146
38316A426631J5417K2907Q3829L96j50239j97329j72354j58595o6438J61303L09794
38305A275322J60765j35805k50996j29479K8590J28399K11922K12688K5954k02375
38295A324985k06551l5834m127j55968j71284O6782K07998j5522l20729k93121
38285C96629k1235Q3056n3073j07503O2465K05966J25302j8325j4571N4927P61
38274G14399j38150j76088r3545n0855j25722k14165j93800n6334J24742K54801
38264D5283K53117J27077O694J0691Q6812Q7414n160n6706n958K8609n9287j77889
$$ plain form
38337 949924 906306 967948 995110 900335 777266 716446 623073 409718 246672 353352 609292
38326 609292 687708 576419 619021 949133 1235463 1183709 988580 1014530 1255485 1426631
38316 1426631 1442048 1464955 1548784 1549180 1398941 1201612 1029258 870663 804225 965528 1275322
38305 1275322 1436087 1300282 1049286 919807 948397 1076796 1288718 1501406 1527360 1324985
38295 1324985 1118434 1082600 1078473 922505 751221 818003 1026001 1010479 689750 396629
38285 396629 375394 458450 405377 297874 360339 566305 691607 673282 658711 713638 714399
38274 714399 576249 400161 306616 255761 130039 -84126 -277926 -334260 -209518 45283
38264 45283 298400 425477 432171 442862 529674 617088 611928 555222 549264 577873 518586 340697
38252C40697j55003J9208J78896J93330R7484O354k6673l9072q7688j72780k23150
38241A31603j60565N830J63905K04154J32395M9864K7982L6998P915o3636j05680
38230D30765o3099K5827P5725O4185M4953M4342J7847m7529p2506j4673K2039
38219E27876n7464j38243m0310J54826J63317n9785k01270o0358J09772k1774
38209C76587l29832l94689j14991J75789K17319J30106J24897J77618J46620J8761
38199E28185j16983k00747j82047r896K30857L13940J47283o9784j14485m1158
38189D85165l8826j04587q0443N0043J39829J40190J49999J72564N9263k06533
38179G66664l74582k38677M9623J59588J0389j55783j26722J7204N9495m5069
$$ plain form
38252 340697 185694 204902 383798 577128 674612 680966 654293 615221 527533 354753 131603
38241 131603 -28962 -23132 140773 344927 477322 527186 555168 592166 600081 536445 430765
38230 430765 367666 393493 469218 533403 578356 622698 640545 593016 520510 505837 527876
38219 527876 470412 332169 291859 446685 610002 550217 348947 288589 398361 376587
38209 376587 46755 -347934 -462925 -287136 -69817 60289 185186 362804 509424 528185
38199 528185 411202 210455 28408 18512 249369 563309 710592 640808 526323 485165
38189 485165 446339 341752 261309 311352 451181 591371 741370 913934 973197 766664
38179 766664 392082 153405 203028 362616 373005 217222 90500 107704 167199 122130
38169A22130j31663o5033Q6935J57307R5641R418M238N9391R3097Q8310Q5778
38158F05549Q1676J9237j00275j73560j16675J2731Q3857O9492P4388J62761K37381
38147I56562J66955q987j07493m2432O4599O0299m0303j04985p1242R599P5394
38136I57966J03276P5727o956p9877o6683R181M1944j3271q1909p2935J1196Q0893
38124I58552M7175q1604j69842q1275J23639K16898J12590J7009J21198K82877
38114A547217K48048Q2772P1821K21794K27715l631j65535l7543J79219K26453
38104B598330J81198K15080K30125O1257j56484j68764j8812M3644l2352j03320
38094B849902j50828k65007l71034l09350j55455j27281j96557j38460L8510Q5611
$$ plain form
38169 122130 -9533 -74566 12369 169676 265317 274735 278973 338364 431461 519771 605549
38158 605549 687225 706462 606187 432627 315952 328683 412540 482032 556420 719181 956562
38147 956562 1123517 1114530 1007037 964605 1029204 1089503 1049200 944215 872973 882572 957966
38136 957966 1061242 1136969 1130013 1050136 983453 992634 1034578 1021307 939398 866463 877659 958552
38124 958552 1005727 924123 754281 673006 796645 1013543 1126133 1143142 1264340 1547217
38114 1547217 1795265 1878037 1949858 2171652 2399367 2395736 2230201 2192658 2371877 2598330
38104 2598330 2779528 2994608 3224733 3285990 3129506 2960742 2941930 2985574 2953222 2849902
38094 2849902 2699074 2434067 2063033 1753683 1598228 1470947 1274390 1135930 1174440 1260051
38084A260051l2304o5975N7432R9839l1044q6466P0320J90733O8267j00439p4380
38073A356034J3806o3566j83969q7998J37438J80955J2374j07963q0836p0841
38063A105434j47937j60184l5420O5943K244j49976k36121j99811n8380J39239
38053C25031K70298K04563j5465j80769j61223l8468M9708Q1417J02873J05141
38043G43106L4528j08444k30393k08222j0132K27119K96234J44457o4151j72938
38033F51164k21562l02541l36495j72206J35187L40049L11490J62409N3445J7941
38023F38881J8239M3661R7735J71473K50037K80494J69065q3883k96095k97144
38013I92463j70727j29843j80436j25981P9216K19732J41257k7332r0472n2505
$$ plain form
38084 1260051 1227747 1161772 1219204 1319043 1287999 1201533 1271853 1462586 1530853 1430414 1356034
38073 1356034 1369840 1306274 1122305 1034307 1171745 1352700 1365074 1257111 1176275 1105434
38063 1105434 957497 797313 761893 827836 830080 680104 443983 244172 185792 325031
38053 325031 595329 799892 784427 603658 442435 403967 453675 535092 637965 743106
38043 743106 777634 669190 438797 230575 220443 447562 743796 888253 824102 651164
38033 651164 429602 127061 -209434 -381640 -246453 93596 405086 567495 620940 638881
38023 638881 657120 700781 798516 969989 1220026 1500520 1669585 1585702 1289607 992463
38013 992463 821736 691893 511457 385476 464692 684424 825681 798349 707877 655372
38003F55372l6260o8791q3477n0903m857O045m9416j26210q7232J16027K71668
37992E41966J33045j73632k48612k493J80360K8697j95743j37125Q8174J32454
37982C47091J3553L9893K37118K89084O0724k12232l17030k95816k01443L2183
37972f875L38976M50621K55928j7061j38732j58198j85539j51574K791J26824
37962E17161R4582M8762J54842K82506K12481K0203n1704k711l3913j53936j58641
37951I29632p748R6696N6423J0160M9746P7133L3218K461j7207j73203m37843
37940F19468n00927j96911J83538K57247N5669r0364m5720K6211o158p2548o4886
37929A64619K6871J52530K30791J70754K761p8560L3885J51577M4110j82400k28021
$$ plain form
38003 655372 619112 550321 466844 415941 411084 417129 367713 241503 154271 270298 541966
37992 541966 675011 501379 252767 250274 430634 459331 263588 126463 214637 347091
37982 347091 360644 400537 637655 926739 987463 775231 458201 162385 -39058 -6875
37972 -6875 332101 782722 1038650 1021589 882857 724659 539120 387546 390337 517161
37962 517161 611743 660505 815347 1097853 1310334 1330537 1278833 1276122 1242209 1088273 929632
37951 929632 921884 1018580 1075003 1085163 1134909 1212042 1245260 1247721 1230514 1057311 619468
37940 619468 118541 -78370 105168 362415 418084 327720 282000 308211 302053 229505 164619
37929 164619 191490 344020 574811 745565 748326 669766 703651 855228 899338 716938 488917
37918D88917p4899n225j20912j82615l7948J09359M8244q8133o2191P7431J15890
37907B67918M8820N3502J42851J26456n9162k11315j35856Q8397K14951J22567
37897F59129p0013j55280o2794P6070R5222k584p2622m2943R237J7590K8429P6743
37885E56184R2741L0253k8728r617K3963m793m1187j6273M249m7891o7908O9051
37873E60044K56693K75026J16209k3278n3914p0495j10983p4192N9918J35618
37863A070646M6917r7508j35033o0895N356j6858r4281j07861M6262L04194M22579
37852A383518K52056j8737p2279J07281K34571J70237J11144K43583M46447M91165
37842C348986L52516J55480m4687k63818m69497n98379o20663n08058k51204J8286
$$ plain form
37918 488917 414018 408793 287881 105266 67318 176677 224921 136788 74597 152028 267918
37907 267918 316738 370240 513091 639547 580385 369070 233214 321611 536562 659129
37897 659129 589116 433836 371042 447112 542334 539750 467128 424185 433422 451012 479441 556184
37885 556184 648925 679178 650450 640833 664796 660003 618816 602543 606792 558901 490993 560044
37873 560044 816737 1091763 1207972 1184694 1130780 1060285 949302 875110 935028 1070646
37863 1070646 1117563 1020055 885022 824127 829483 812625 718344 610483 656745 960939 1383518
37852 1383518 1635574 1616837 1544558 1651839 1886410 2056647 2167791 2411374 2857821 3348986
37842 3348986 3701502 3856982 3812295 3548477 3078980 2480601 1859938 1351880 1100676 1118962
37832A118962Q1459q2184k21490j52531j635L9683J5375N3537Q3390l1528j86428
37821G16610j47666O8861J98629J09665n4093j29800j16808o4660J7069Q1143
37811F78950M7678n7701j18145j11657j27515j68236j13198O2960K09886K21141
37801E24163J75717J65043J29203j1228j80482k42994j95567j38854j11745p0756
37791D2500l805L8145J9871l5160p9712q3522n1024j6314M176N0152J52107K34236
37779B71650J81590L0750k4825J04072K39450J51137j27409l28162k74567n7664
37769A66022J24107J87488J77332J42097P8885k0190j28754k01623k03833j28279
37759A93252j0766P6002P7342J5109l8474n5111p4721j10832r4857J4475J14547
$$ plain form
37832 1118962 1200421 1118237 896747 744216 742581 782264 797639 851176 934566 903038 716610
37821 716610 568944 637805 836434 946099 892006 762206 645398 580738 597807 678950
37811 678950 726628 668927 550782 439125 311610 143374 30176 93136 303022 524163
37801 524163 699880 864923 994126 982898 802416 559422 363855 225001 113256 42500
37791 42500 38695 76840 96711 61551 -18161 -101683 -152707 -169021 -164845 -114693 37414 271650
37779 271650 453240 483990 459165 563237 802687 953824 826415 498253 223686 166022
37769 166022 290129 477617 654949 797046 875931 855741 726987 525364 321531 193252
37759 193252 182486 258488 335830 350939 312465 257354 182633 71801 -23056 -8581 105966
37748A05966O2462j11745k15321j42167N859R2702J18342J38623J36873Q7394
37738B78988M7810O2107N5819l7215j24812q8988M508J2118k8945L3378J60846
37727C75614J35003p9340k23384j09451J05399J57355K6357j15482j79131j98095
37717a05155j72238o2525P8708J32895Q3395L5844N1591O6770J1846p1536q5989
37706c6394j0033P1000O3509k1043o8017M260J22671J27178k3293j73270j46903
37695i0335L7760J89431J64399J1898j10824j26110r8648j14321j50771j26837
37685d14358n3598k9440n7450L923K14991L97065L49993J45562K2613L8881L4671
37674F52853o9132j64743j80627j78960j61619j7816K17836K87869O3416k23812
$$ plain form
37748 105966 168428 56683 -158638 -300805 -294946 -202244 -83902 54721 191594 278988
37738 278988 326798 388905 444724 407509 282697 193709 198217 210335 181390 214768 375614
37727 375614 510617 431277 207893 98442 203841 361196 387553 272071 92940 -105155
37717 -105155 -277393 -339918 -261210 -128315 -44920 -9076 42515 109285 121131 49595 -36394
37706 -36394 -46427 24573 88082 67039 -978 3282 125953 253131 229838 56568 -90335
37695 -90335 -52575 136856 301255 313153 202329 76219 -22429 -136750 -287521 -414358
37685 -414358 -467956 -497396 -554846 -550923 -335932 61133 411126 556688 579301 618182 652853
37674 652853 583721 418978 238351 59391 -102228 -120044 97792 385661 449077 225265
37664B25265k95290j95012j25698q4116N9125K25270J93315j6365j21370J4846
37654a20030K09183K62914K06569J42604N7071p2307j50061j07782n5128j20700
37644B52333k24249j80359O666J25154N7204n1926o778J55898K21000J01318m8896
37633D07365p3743m1134j01701k07081j67525J0209P4220q3408k06712l7849K64742
37622a62617L30661J17143m7752L2172J65151J12794o1411j48011j17369r7088
37612A23673j29182j39026j02800q3041r9814r2502k5250O1516J20314J45899
37602b20213J44909J20123R6488J01158R8415P599j68110k77948j68876R7952
37592a68503K54923J15789j86821l41359k23644j0888R4543J11164J48810J65983
$$ plain form
37664 225265 -70025 -265037 -390735 -474851 -415726 -190456 2859 -13506 -134876 -120030
37654 -120030 89153 352067 558636 701240 758311 686004 535943 428161 373033 252333
37644 252333 28084 -152275 -145609 -20455 36749 -15177 -21955 133943 354943 456261 407365
37633 407365 333622 292488 190787 -16294 -183819 -173610 -99390 -182798 -389510 -427359 -162617
37622 -162617 168044 285187 237435 269607 434758 547552 486141 338130 220761 123673
37612 123673 -5509 -144535 -247335 -330376 -430190 -522692 -547942 -486426 -366112 -220213
37602 -220213 -75304 44819 141307 242465 340880 348479 180369 -97579 -266455 -168503
37592 -168503 86420 202209 15388 -325971 -549615 -560503 -465960 -354796 -205986 -40003
37582d0003M1064j68769k47046j20416L7699O5276J3863N621L2449K0228j4572
37571c74606j2744p350o9152j54990j49943n3471P355k7710n9691J7766J60651
37560g23885K34822J83407P0763j6294n5230p5212r3427p8840J9400J93759L28658
37549a2079K73362R309k78009l59312k03480R66Q5180Q0436J03121J48665J22987
37538b8854L6290J0994Q1445J34801J00432N2863M7939M319j28480k13267j02461
37527c979J11687K00777J08472j3808n0868l3079j0288J5546J9092l4780r2106
37516B16666o9609j4980m2983j07336l5166J70686K76930J55479k4894o3671m265
37505D56857O570k2345P556O9374N2945l5225q1138m1623K3223O8354R4382Q8112
$$ plain form
37582 -40003 1061 -167708 -414754 -535170 -497471 -432195 -418332 -412711 -380262 -360034 -374606
37571 -374606 -387350 -394700 -463852 -618842 -768785 -822256 -814901 -842611 -902302 -884536 -723885
37560 -723885 -489063 -305656 -234893 -251187 -306417 -381629 -475056 -553896 -534496 -340737 -12079
37549 -12079 261283 270592 -7417 -366729 -570209 -569243 -484063 -403627 -300506 -151841 -28854
37538 -28854 7436 18430 99875 234676 335108 387971 435910 440229 311749 98482 -3979
37527 -3979 107708 308485 416957 403149 352281 319202 308914 324460 343552 308772 216666
37516 216666 147057 132077 89094 -18242 -53408 117278 394208 549687 524793 461122 456857
37505 456857 463427 441082 448638 518012 570957 535732 454594 412971 436194 504548 598930 687042
37493F87042M4907K5334Q4748J67807J67757O9697m7399j20710j36278r2681j8306
37482H31918J3541k8575p1991m3707J6454L3003J9669K0300p713j13820k04266
37471D64813j28930Q7399K45334K20729R0331j5016o2990q2216p2551j7780O2836
37460G91959J18845J02542l100j56198k62777k48473j19670N4618J79929J52869
37450F10544o0086l10086l46965j11594J50849J87153M9923k7577K3135P4057
37440B39353N8710M6569N5723n358j53712k49169j72043J7211J48945J12986m7062
37429E2153j49378l0948K27354L22621J11985j41232j13704Q8033Q0460j90810
37419B56534l50883j69566J11837J85714J05022Q2390J08081L6857j02315j45536
$$ plain form
37493 687042 731949 757283 842031 1009838 1177595 1247292 1199893 1079183 942905 850224 831918
37482 831918 845459 816884 744893 701186 717640 750643 770312 790612 782899 669079 464813
37471 464813 335883 423282 668616 889345 979676 964660 901670 819454 746903 729123 791959
37460 791959 910804 1013346 1010246 854048 591271 342798 223128 277746 457675 610544
37450 610544 550458 240372 -106593 -218187 -67338 119815 169738 142161 165296 239353
37440 239353 298063 344632 400355 394997 241285 -7884 -179927 -162716 -13771 99215 52153
37429 52153 -97225 -128173 99181 421802 533787 392555 278851 366884 447344 256534
37419 256534 -94349 -263915 -152078 33636 138658 221048 329129 365986 263671 118135
37409A18135n8232M8377R8949Q8163J3564p8624p8963J1839J9688j34551k53574
37398b05229j51852K7598L9202n4346o491J60230J77702M330q6127L5947J44377
37387H5341M8848r8063q3969J6553J8865k8351N2059K15185K19918n039k48460
37376A92887l11489k36361j68569j30379m3627R1118J58725Q6340l7219n3503
37366d52077O8326J80986J31661n3940k06165k06893r5041J3114M9268L2485L0186
37355e08090Q5328J53090J36005K8855k2990R4577K63313K53057M6416j15855
37345D13706o7991N8360N0063p9082j43721p0599L5577Q0392P8057N0312l3914
37334C71160j67392k55692k26318j24662m3085J938O6310J78019K92329L44326
$$ plain form
37409 118135 59903 108280 207229 295392 308956 230332 151369 163208 182896 48345 -205229
37398 -205229 -357081 -329483 -290281 -344627 -351118 -190888 -13186 -8856 -94983 -59036 85341
37387 85341 134189 36126 -47843 -31290 -12425 -40776 11283 226468 446386 441347 192887
37376 192887 -118602 -354963 -523532 -653911 -697538 -606420 -447695 -361355 -398574 -452077
37366 -452077 -383751 -202765 -71104 -125044 -331209 -538102 -633143 -620029 -570761 -538276 -508090
37355 -508090 -422762 -269672 -133667 -104812 -127802 -33225 230088 483145 529561 413706
37345 413706 345715 404075 454138 375056 231335 160736 196313 276705 354762 405074 371160
37334 371160 203768 -51924 -278242 -402904 -445989 -444051 -377741 -199722 92607 436933
37324D36933L12943K27686J30177L9641m1954r6806q8987k2149J6291p8016k90206
37313E45553m53914m02784j50758J17613K44254K43316K22700K04959J04630j05768
37303E69801k90017k81152r0345R3273J13978l929j30029j71632j05313N7257
37293b38108K47791L21514J67982j30141l26840k57486j5827J62411J61696P1788
37283A64780K8848N6568R3678J02460P8225m759j60102l01321k85823r6184R0468
37272b33162Q4259r7706k54225k23446k8168J85594K90634K54917J33209Q551
37262A20457p7076j36114j72139j41935k5186J05022J52262J18449P9501N6264
37252G9505N950n8726n7769J6587O1721K1982k2094N481N2212N1564N8748J37566
$$ plain form
37324 436933 749876 977562 1107739 1147380 1105426 1008620 919633 897484 913775 835759 545553
37313 545553 91639 -311145 -461903 -344290 -100036 143280 365980 570939 675569 569801
37303 569801 279784 -1368 -91713 1560 115538 111609 -18420 -190052 -295365 -238108
37293 -238108 9683 331197 499179 369038 42198 -215288 -231115 -68704 92992 164780
37283 164780 193628 250196 343874 446334 524559 519800 359698 58377 -227446 -323630 -233162
37272 -233162 -148903 -246609 -500834 -724280 -752448 -566854 -276220 -21303 111906 120457
37262 120457 43381 -92733 -264872 -406807 -431993 -326971 -174709 -56260 23241 79505
37252 79505 85455 26729 -31040 -14453 47268 69250 47156 52637 104849 156413 215161 352727
37240C52727J90572P2055j58130k67065j51661M3657J45640J40134Q6108r215
37230D44822j29717j79069r1676M9300J07846O4551Q066K131L3293M4027l9326
37219C14248k37563m11517l32272K5536L62113L77493J36057o7337j19177j31924
37209h4343j31504l837K04131K40634L8706j24872m4202Q8806O199k01441k57652
37198b69375j43512m8796M811J38936K75215J98045k3262o1409J34434K14909
37188D19996p03k04915r6594J36036J51417R125k41R7429J7401k38986l27751
37177c7786r9852J84791K91663L14627L69610K96846n7276m60459n10249j71206
37167A20709J63488J65413p1301k22586j39159L6981R2778j2404j30456j07984
$$ plain form
37240 352727 543299 615354 457224 190159 38498 82155 227795 367929 454037 444822
37230 444822 315105 136036 44360 93660 201506 266057 274123 276254 309547 353574 314248
37219 314248 76685 -334832 -667104 -641568 -279455 98038 234095 166758 47581 -84343
37209 -84343 -215847 -219684 -15553 225081 263787 138915 94713 183519 189718 -11723 -269375
37198 -269375 -412887 -461683 -456872 -317936 -42721 155324 132062 70653 205087 419996
37188 419996 419293 214378 117784 253820 405237 414362 414121 511550 528951 289965 -37786
37177 -37786 -137638 47153 338816 653443 1023053 1319899 1262623 802164 291915 120709
37167 120709 284197 449610 378309 155723 16564 53545 146323 133919 3463 -104521
37157a04521M8667J96755K14387J00602n9768j74946j90522j14770j7182M2038
37147e9260Q4840J62216K29939J67712l8225k18023k02394l2926R8759R5732L9879
37136C28249J9913j5286j46448k88626k44013J8405K60780K55591P8958k1987
37126B45536J477l0852j77125k37409q3657R7417Q4369l1322j7466J08423J39162
37115I8553N1090J2000L6007m7029k30653k61659m9467J42002Q0806r5798j25360
37104c89508k064R4370R2519M3190l1643j02257n6397J37512K88764K06300j9395
37093B61391j51552j43690j31935j57792j28289k7291N2826R3658J66419K51385
37083H5130K31560J00525N795L3440Q8713M5308r0648k04306j87384l1333J28128
$$ plain form
37157 -104521 -55854 140901 355288 455890 396122 221176 30654 -84116 -101298 -59260
37147 -59260 25580 187796 417735 585447 547222 329199 126805 93879 192638 288370 328249
37136 328249 348162 332876 186428 -102198 -346211 -327806 -67026 188565 267523 245536
37126 245536 247013 216161 39036 -198373 -282030 -184613 -100244 -131566 -149032 -40609 98553
37115 98553 149643 161643 197650 150621 -80032 -341691 -391158 -249156 -168350 -264148 -389508
37104 -389508 -391572 -297202 -204683 -161493 -193136 -295393 -351790 -214278 74486 280786 261391
37093 261391 109839 -33851 -165786 -323578 -451867 -479158 -426332 -332674 -166255 85130
37083 85130 316690 417215 423010 456450 545163 590471 499823 295517 108133 76800 204928
37072B04928J05381j05852k68504j87892K3431J20761P3098L0367K3664m6950
37062b7568j53119j37838J245Q4264N3210N6317J61482K28012J53775K4248p6301
37051C67727j75522k41005j44642P6832J73229M4340r1142n8288K487n8688r0419
37040a95091P2131K33619J11175j64428k03672M7243K42404J72911J0945n0077
37030B77160o8007j29712j33042J9433J96139J98642L8848j03262j26725q3017
37020H6457m8582l7427k9446q931L0707Q3225J26162J30988Q0141o457n7999j6354
37008C32484O1508L6202j24970k70643k56003j29695l0132J7964O9192R8805N1271
36997a44017J552P6842K25181K51885J06081n3190j14240j48295k19630k42302
$$ plain form
37072 204928 310309 204457 -64047 -251939 -228508 -107747 -34649 -4282 19382 -27568
37062 -27568 -180687 -318525 -317280 -233016 -179806 -123489 37993 266005 419780 444028 367727
37051 367727 192205 -48800 -193442 -116610 56619 100959 9817 -48471 -45984 -104672 -195091
37040 -195091 -122960 110659 221834 57406 -146266 -99023 143381 316292 327237 277160
37030 277160 209153 79441 -53601 -34168 161971 360613 399461 296199 169474 86457
37020 86457 37875 448 -28998 -37929 -7222 76003 202165 333153 413294 406837 348838 332484
37008 332484 393992 430194 305224 34581 -221422 -351117 -381249 -363285 -294093 -195288 -144017
36997 -144017 -142465 -65623 159558 411443 517524 464334 350094 201799 -17831 -260133
36987b60133j39274k907L3474j1518k3036K8623P1934N9956K1961M291J7442L9108
36975a60079N1551Q0798J66951K56983J97138o1702l10574k92811m4393J56309
36965D0171J76401J50373J75688J37690l9131j94663j75428r4607j31318k05937
36955a60761j07201J27449K20605N5160j54702j55700L7302J96693J42474j01657
36945I9662l34811l36658p4896K28656L13061J66986K2282N3259J83788K33188
36935E54517J58423O7514M0110L4821r139n8208m5120j3041r0074k80048l90835
36924c1080k81153r2133o5874j78328j68907M3901K17757J59367J8362L8072J89292
36913a50724K59918J84147O4203m8849j73432k48850j85418m3720K8099J6593
$$ plain form
36987 -260133 -399407 -402314 -368840 -380358 -403394 -374771 -302837 -242881 -220920 -216629 -199187 -160079
36975 -160079 -108528 -27730 139221 396204 593342 531640 221066 -71745 -116138 40171
36965 40171 216572 366945 542633 680323 641192 446529 271101 176494 45176 -160761
36955 -160761 -267962 -140513 80092 135252 -19450 -175150 -137848 58845 201319 99662
36945 99662 -235149 -571807 -646703 -418047 -104986 62000 84282 137541 321329 554517
36935 554517 712940 780454 820564 855385 846246 788038 742918 729877 639803 359755 -31080
36924 -31080 -312233 -404366 -470240 -648568 -817475 -773574 -555817 -396450 -378088 -340016 -150724
36913 -150724 109194 293341 357544 308695 135263 -113587 -299005 -342725 -314626 -298033
36903b98033J8427K7478l9407j19724n1384J27619J70515o771j68022q9763J31487
36892b97578K42865J66528L1394k6128K1409R9158P6694j04480k95058k50383
36882c35579M7613L10948K85491M8681j41639j75706j33991r9750q7073j04935
36872c85940j51538j63922q0140O3552J74615K12221J88268J12858J6185k7295
36862d1136J6575O9384K7525j07812k38553k62293j24652J35315L41123K91237
36852A06713M862k44736k43766q4128J6119K0767M2879R9209R9223M4086M1681
36841i7091J16336J70189J53793J25927J16470O8434m2819j48715j84673j52694
36831A25157o6517O4113J72989J63878K9826j32270k35382k51351j67247j1872
$$ plain form
36903 -298033 -279606 -252128 -291535 -411259 -462643 -335024 -164509 -171280 -339302 -429065 -297578
36892 -297578 -54713 111815 143209 117081 138490 237648 314342 209862 -85196 -335579
36882 -335579 -287966 22982 308473 357154 215515 39809 -94182 -193932 -281005 -385940
36872 -385940 -537478 -701400 -781540 -717988 -543373 -331152 -142884 -30026 -13841 -41136
36862 -41136 -24561 44823 72348 -35464 -274017 -536310 -660962 -525647 -184524 106713
36852 106713 111575 -133161 -376927 -461055 -444936 -424169 -381290 -282081 -182858 -138772 -97091
36841 -97091 19245 189434 343227 469154 585624 654058 611239 462524 277851 125157
36831 125157 58640 122753 295742 459620 489446 357176 121794 -129557 -296804 -308676
36821c08676Q3616l35j71962j91944R538K19500K21506O1501o1663o3414j0964
36810b13297L8048J06058K11418K97550K67296P5165j95586l55497k74522m4982
36800h8349R0721J0108j55081j94770o9365P3309R3324J5779j0992R8226K38337
36789A01247K25774N4655o0269J8142J22886K1257k04306k49805m8878J28596
36779A09299R6196j052J1119M1727m9555j44904m1624J85333K64922J28763j7847
36768E82377k4566K3293o641j00311j54096j07198K0401J30609Q7985j33547l49973
36757c1667l35911r9827J28420J85929J19640L4855l9236q4500m7297N4284R2859
36746b2451N20j10750r5022K7836J19188J24398J20852J65413J86846P9734j25129
$$ plain form
36821 -308676 -225060 -225395 -397357 -589301 -579763 -360263 -138757 -77256 -138919 -202333 -213297
36810 -213297 -175249 -69191 142227 439777 707073 782238 586652 231155 -43367 -88349
36800 -88349 2372 12480 -142601 -337371 -406736 -333427 -240103 -224324 -235316 -137090 101247
36789 101247 327021 381676 321407 339549 462435 483692 279386 29581 -19297 109299
36779 109299 205495 204443 215562 257289 207734 62830 21206 206539 471461 600224 582377
36768 582377 557811 581104 574463 474152 320056 212858 233259 363868 451853 318306 -31667
36757 -31667 -367578 -467405 -338985 -153056 -33416 1439 -37797 -122297 -169594 -115310 -22451
36746 -22451 -21931 -132681 -227703 -199867 -80679 43719 164571 329984 516830 596564 471435
36735D71435k42202j25842J24905K28859M2999k40323l11321j22731P5145Q4551
36725a4525k135J3692J39818K09614J38123K1184l1262m4553j01108j83813j88213
36714d3178p9950M7170J05208J29211J84195K11940R7445j15702k26116j48455
36704A61768m5746q4481j86152j76337q2354p8693j72866j69333J5099K01225
36694f17870K06674R7902N9004J19574J54282R5984J1078l1804n1762p4777m3354
36683g5069J09345L06133L42738J32915j20987j38021N8295J39962o6379l09500
36673C79432k70773k9177Q2157j0271n3843Q4724K17390J68056M1433J4656O6459
36662F90243P2031J1916n7600j12704j22255l4150R2161R3514m1381r8340L7042
$$ plain form
36735 471435 229233 103391 228296 457155 500154 259831 -51490 -174221 -99076 -14525
36725 -14525 -16660 -2968 136850 346464 484587 505771 474509 429956 328848 145035 -43178
36714 -43178 -123128 -75958 29250 158461 342656 554596 652041 536339 310223 161768
36704 161768 116022 31541 -154611 -330948 -413302 -491995 -664861 -834194 -819095 -617870
36694 -617870 -411196 -313294 -254290 -134716 19566 115550 126628 94824 43062 -31715 -75069
36683 -75069 34276 340409 683147 816062 695075 557054 615349 755311 688932 379432
36673 379432 108659 79482 161639 151368 97525 182249 399639 567695 609128 623784 690243
36662 690243 762274 774190 716590 603886 481631 447481 539642 633156 591775 493435 530477
36651E30477J64469O5563j55065k48965j98376j53530j05417Q1673L43290M09634
36641G33753J75230j43986k85280k10490o0172K6685Q140m9279m7889p827o4674
36630G4211k23319k47826J8400L39811L45326L4660k35971k45347j10902k195
36620b53152O0145P4554N021o6090J6927K07354K70391J44907K6622J0883m3506
36609D54056j69748j47079R2748K27265k543l50276l99363j54035L9746L0023
36599c79206k9913l1899l5304m8689J1541J18013J38138O8198L6363N5669J686
36588i5403j33862j91455r7360L2680R7312J27395J45301R7219j703l1388L9008
36577a2256P5568j7946j60229k30172k11898j34349l031J34827J89775J67226
$$ plain form
36651 530477 694946 760509 605444 356479 158103 4573 -100844 -19171 324119 733753
36641 733753 908983 764997 479717 269227 209055 235740 243880 194601 146712 138885 74211
36630 74211 -149108 -396934 -378534 -38723 306603 341263 105292 -140055 -250957 -253152
36620 -253152 -193007 -118453 -113432 -179522 -162595 44759 315150 460057 486679 497562 454056
36609 454056 284308 137229 229977 457242 454699 104423 -294940 -448975 -409229 -379206
36599 -379206 -409119 -441018 -476322 -525011 -513470 -395457 -257319 -189121 -152758 -97089 -95403
36588 -95403 -229265 -420720 -518080 -485400 -388088 -260693 -115392 -18173 -19876 -51264 -12256
36577 -12256 63312 45366 -114863 -345035 -556933 -691282 -694313 -559486 -369711 -202485
36567b02485J72751K15047J58442l7733j91747j36250N0976J82962K06656J70939
36557E89558P2786r3149k15638j77331m3303J6750l2329p0776k2807N7029Q9688
36546A70478N1749l9730j25046j13304L22O9504k7874j87799j98767l9698J02038
36535c38127J11233P3315R2233J48383J96698K49295K81204J99807O725j42047
36525H78719j50410j32400k15544l10640k49257p0576K4772k1715o3537l882P0531
36514b43939O5463L0406M8223R4961J02370O7226J2337p6344j84663k22613j41646
36503d48219l0318J3294L7713J39653K63422K54606J00848l9900p2727p3485j10284
36492C4603j03542L7356K38600L31231K42209M0626j52318k35610j78910p5947
$$ plain form
36567 -202485 -29734 185313 343755 306022 114275 -21975 29001 211963 418619 589558
36557 589558 662344 569195 353557 176226 132923 149673 117344 46568 23761 80790 170478
36546 170478 222227 182497 57451 -55853 -55531 13973 -13901 -201700 -400467 -440165 -338127
36535 -338127 -226894 -153579 -61346 87037 283735 533030 814234 1014041 1020766 878719
36525 878719 728309 595909 380365 69725 -179532 -250108 -225336 -247051 -310588 -314470 -243939
36514 -243939 -178476 -148070 -99847 -4886 97484 164710 177047 100703 -83960 -306573 -448219
36503 -448219 -478537 -465243 -427530 -287877 -24455 230151 330999 291099 218372 144887 34603
36492 34603 -68939 -31583 207017 538248 780457 821083 668765 433155 254245 178298
36482A78298p9760k01838k51165q3267J57769J94235j0299j86686j03053J53031
36472b32735K98338J82410o9076k04917j10662O8815Q8272r0279k15506n9600
36462c44940K52137L76036J99320k4044l4268J07879J60133L4405j39500k07939
36452C79219j28457L6407J50102P2717j85330m07923l80993j43917O2420Q4318
36442d61437q958o8333k7480R5577K44119L19912K28633r88k03302k44848j60129
36431b87234o2470J9649J24137K10215J63391j8361j55907r8944O0181J01568
36421E6225j2586q1700L8572K18464K35272P8214o9866j06592j01133j09152o8583
36410G7135N6340J68219J69108R5560K4953n5972j72753k35761j36816O2213J75610
$$ plain form
36482 178298 98538 -103300 -354465 -437732 -279963 -85728 -96027 -282713 -385766 -232735
36472 -232735 65603 248013 178937 -25980 -136642 -67827 20445 -69834 -285340 -344940
36462 -344940 -92803 283233 482553 458509 424241 532120 692253 726658 587158 379219
36452 379219 250762 287169 437271 509988 324658 -83265 -464258 -608175 -545755 -461437
36442 -461437 -470395 -538728 -566208 -470631 -226512 93400 322033 321045 117743 -127105 -287234
36431 -287234 -349704 -330055 -205918 4297 167688 149327 -6580 -105524 -45343 56225
36421 56225 43639 -38061 511 218975 454247 532461 462595 356003 254870 145718 77135
36410 77135 133475 301694 470802 566362 591315 535343 362590 126829 -9987 52226 227836
36399B27836J24438M714p4269j02422j03413p1557j7564J1733Q641K9717R7311
36388A35165J34955N7678j04267k15676j61028N0976K82889L65999K39253N762
36378G91706j67391j99462j28691l3427K2651k491r2712j47156p4160P5263J44989
36367A89119O3465p8277j58298j54328j13105o9423l9285k6540K539Q3666J63280
36356a37187J34537J3450l1610Q1537J85145P7653j60790k43049o6054J41052
36346e316J20323r4817k56907k13115k7361J55854K49575K27035R6598p5098j78791
36335b020j62209q6832l9515j4811N5504J68627K21495J38091l2346j77067k29098
36324a60181j79122l8749J43357K70208K75580J92973Q7465l6451j73413k16798
$$ plain form
36399 227836 352274 356988 282719 180297 76884 5327 -12237 -504 8137 37854 135165
36388 135165 270120 327798 223531 7855 -153173 -102197 180692 546691 785944 791706
36378 791706 624315 424853 296162 262735 285386 282895 190183 43027 -31133 44130 189119
36367 189119 252584 174307 16009 -138319 -251424 -320847 -360132 -386672 -384133 -300467 -137187
36356 -137187 -2650 10800 -20810 60727 245872 323525 162735 -80314 -146368 -5316
36346 -5316 115007 20190 -236717 -449832 -477193 -321339 -71764 155271 251869 176771 -2020
36335 -2020 -164229 -251061 -290576 -305387 -249883 -81256 140239 278330 245984 68917 -160181
36324 -160181 -339303 -378052 -234695 35513 311093 504066 591531 555080 381667 164869
36314A64869o4791J73472K39554N2377j68841j98730q9834k8352j7921R2256K91884
36303D45943L39378Q7726k69906m09217k56540l3951N0418K0250J196l019q3988
36292a11710k23758k64587j26208O3671J43714J36107J69361K42431K20163N9596
36282C08780j13183j86858j84403j45948l9510J19348J93219J00679k7393j4034
36272A0697J06578J48456N1854n5447p5029o8251j27397k24714k50905j50778
36262f34936J5628J22512R1415j9747p1312j7514L5518O295j6480Q0364K17101
36251a91156K10496N2357p4390p0315l8121p6020j13238m8384O3519P7529m1303
36240b49026j71409j70710k0943J49359J90613J08670O6045J40406J71788k48
$$ plain form
36314 164869 100078 273550 513104 565481 396640 197910 108076 79724 61803 154059 445943
36303 445943 785321 873047 603141 193924 -62616 -96567 -46149 -25899 -24703 -27722 -111710
36292 -111710 -335468 -600055 -726263 -662592 -518878 -382771 -213410 29021 249184 308780
36282 308780 195597 8739 -175664 -321612 -361122 -241774 -48555 52124 24731 10697
36272 10697 117275 265731 317585 262138 187109 118858 -8539 -233253 -484158 -634936
36262 -634936 -619308 -496796 -405381 -425128 -496440 -513954 -478436 -472141 -488621 -408257 -191156
36251 -191156 19340 71697 -2693 -73008 -111129 -187149 -300387 -348771 -285252 -207723 -249026
36240 -249026 -420435 -591145 -612088 -462729 -272116 -163446 -97401 43005 214793 214545
36230B14545k27525k19029k175P3798j22724k68676p8755K33567K73356N8267
36220f5351m6142R3919K17428J13780q2986j55800j13762q3874o9792L419J02958
36209h6203J15721L1560l0671R184Q2320O0704p4863j87300j21627J07151K98967
36198B04943K72090N1505j80538k76519k10658l1189J73863K84517K28516O9317
36188E85847n3912p3999k6534L3546N9277r496j78273l22567l03583j58015m5604
36177d93313p086P3330K35719L40503K74213J23788M8573P4686R9120K1925j76775
36166F14683m02379m62641k51783M7269J20148n1873j34570O6294K94717K42438
36156H2303L5783J0377J46463J13948j49844l03192j25839J65544K81568K44087
$$ plain form
36230 214545 -12980 -232009 -234184 -160386 -283110 -551786 -630541 -396974 -123618 -65351
36220 -65351 -111493 -17574 199854 313634 230648 74848 -38914 -122788 -192580 -189161 -86203
36209 -86203 29518 61078 30407 39591 121911 182615 107752 -79548 -201175 -94024 204943
36198 204943 477033 528538 348000 71481 -139177 -170366 3497 288014 516530 585847
36188 585847 531935 457936 431402 464948 524225 514729 336456 13889 -289694 -447709 -493313
36177 -493313 -500399 -427069 -191350 149153 423366 547154 595727 670413 769533 791458 614683
36166 614683 212304 -250337 -502120 -454851 -334703 -386576 -521146 -454852 -160135 82303
36156 82303 118086 128463 274926 388874 239030 -64162 -190001 -24457 257111 501198
36146E01198K06488J43685k6383j94634k05724j34913j58089k27881j53475L5758
36136b13970R6759l1306j19286k3671R1819O0531R855J31884L14479K71871j1124
36125E77841k30862j92487n4330m9593j53400j79805q5533P341L9873Q1418J52039
36114h7498J46943J1127j34222j42794m0225M1560P1837J29109K13918K00732
36104D10487L1753j52844j71503k9251J00104Q9304k6571j35871j73238j49680
36094b07310j20196j29576j45349o1038J62205L72853L60693J38028l6952N655
36084C39013J12039L9105j67101k26238m6634J24273N9967j12809j02622J25359
36074A44352L02007K13369n0433k40831k30187r0184L1873N2934K945l1993k5976
$$ plain form
36146 501198 707686 851371 824988 630354 424630 289717 131628 -96253 -249728 -213970
36136 -213970 -117211 -148517 -267803 -291474 -199655 -139124 -129269 2615 317094 588965 577841
36125 577841 346979 154492 100162 50569 -102831 -282636 -368169 -360828 -320955 -239537 -87498
36114 -87498 59445 70572 -63650 -206444 -246669 -205109 -133272 -4163 209755 410487
36104 410487 442240 289396 117893 88642 188746 278050 251479 115608 -57630 -207310
36094 -207310 -327506 -457082 -602431 -663469 -501264 -128411 232282 370310 333358 339013
36084 339013 451052 490157 323056 96818 50184 174457 234424 121615 18993 144352
36074 144352 446359 659728 609295 368464 138277 48093 79966 132900 135845 103852 77876
36063G7876n3816j67120k64374j91113K3238J55884P6622p3154q5827K4483P8657
36052c98644K3530j359R7926K19779K27959J48967J03985J09868O8533n5852j61334
36041C83358j50555p1024m2602q1157p8915K7947J47471J40391k387j57100k23043
36030a07616k07504j54882p7747M253L2231j8505p7764o0765J9607Q4676J09189
36019d54827J36224J83111K06985J74111J04139L3120j8240l4778j8160j1703
36009B99982n5683j13337j09795n4237l7641p8526p1544L7337J14466m60k36124
35998c05562l31374j58619J09786K18978J29588J2296j276N0837Q1699R4751J34075
35987C5179J59747P3743j25586k96250l03325j72213m2361N201J4202M8024Q3065
$$ plain form
36063 77876 24060 -143060 -407434 -598547 -575309 -419425 -342803 -415957 -501784 -477301 -398644
36052 -398644 -375114 -376473 -278547 -58768 169191 318158 422143 532011 600544 544692 383358
36041 383358 232803 161779 119177 38020 -40895 -12948 134523 274914 272527 115427 -107616
36030 -107616 -315120 -470002 -547749 -543496 -511265 -529770 -607534 -668299 -648692 -564016 -454827
36019 -454827 -318603 -135492 71493 245604 349743 382863 364623 329845 311685 299982
36009 299982 244299 130962 21167 -33070 -70711 -149237 -220781 -183444 -68978 -69438 -305562
35998 -305562 -636936 -795555 -685769 -466791 -337203 -324907 -326183 -275346 -193647 -98896 35179
35987 35179 194926 268669 143083 -153167 -456492 -628705 -671066 -665865 -651663 -603639 -520574
35976e20574N0693m2697r6567l5378R1365J69898J66826J53892J75704J65425
35966B78587N1953j03794j71634j26815o0216k4095Q687J8762p0460k09264j87963
35955e96252P8015L53230L46640R4951j01317p6379O1928J67373K07278J56358
35945F91825k7030k32485k21726L7644K38118J05909k22799l89683k82939j05636
35935d08802k1060L7835J61686K62896J99510J882j45336j28509l0997j0471r0166
35924a71532j28741j9923J36162J47829j565j21870p6780N4428J39426J77363
35914A34797K06494J56710l2076k21421k03725o339J18951L7652j00664r6876
35904f497L1622J07146L3262j00561j27297J6825K02224K16666J2260k01348j92418
$$ plain form
35976 -520574 -469881 -512578 -609145 -644523 -553158 -383260 -216434 -62542 113162 278587
35966 278587 330540 226746 55112 -71703 -131919 -156014 -147327 -128565 -199025 -408289 -596252
35955 -596252 -518237 -165007 181633 276584 175267 98888 160816 328189 535467 691825
35945 691825 664795 432310 210584 248228 486346 592255 369456 -20227 -303166 -408802
35935 -408802 -429862 -392027 -230341 32555 232065 233947 88611 -39898 -70895 -81366 -171532
35924 -171532 -300273 -320196 -184034 -36205 -37770 -159640 -236420 -181992 -42566 134797
35914 134797 341291 498001 465925 244504 40779 34440 153391 191043 90379 -6497
35904 -6497 25125 132271 165533 64972 -62325 -45500 156724 373390 385650 184302 -8116
35893h116R753J78165J90328J17473L4951o6698j50015j06907M2555R5987n7223
35882B80253k34068j78586R0916K94928K22468n5876k88186k86400r0603P4535
35872a70619M2743r0899r4279P2895K00805J49114M6214N1239Q9491J0634j20592
35861A86746j22927j5001J6001n2570l1318J44036K63128J46043q1944j71299
35851B80895q4784M822j1851o3575m6295L6513J14107J49880J52049J17926K1133
35840F70820j31707k60969k73628j71562o1272l1733o0720p5832o2416n1953l4638
35829e45610M3307J94630L50346M04777K87527L3504j92782k18723o9168L3918
35819C21726l9473j43551r2071L7541M2703m0060J2622J92224K06500m4886k43149
$$ plain form
35893 -8116 1637 179802 370130 487603 522554 455856 305841 198934 241489 337476 280253
35882 280253 46185 -132401 -41485 253443 475911 420035 131849 -154551 -245154 -170619
35872 -170619 -127876 -218775 -313054 -240159 -39354 109760 155974 207213 296704 307338 186746
35861 186746 63819 48818 64819 12249 -19069 124967 388095 534138 452194 280895
35851 280895 196111 200933 189082 125507 79212 115725 229832 379712 531761 649687 670820
35840 670820 539113 278144 4516 -167046 -228318 -260051 -320771 -396603 -459019 -510972 -545610
35829 -545610 -502303 -307673 42673 447450 734977 768481 575699 356976 287808 321726
35819 321726 282253 138702 46631 84172 126875 86815 99437 291661 498161 453275 210126
35808B10126j07949J61044J84922j4224p2528J24554K55373M5744l34182n08761
35798e5881l55713o7570J31337J74059J18305O5592J00074K07140K57349J51220
35788G25912k8138r4434Q47J01906O8740k6466k2311O4465M3018j52111l17835
35777C63593k51150m8269L6150k8551k2892J46826K76103J74851m2165j44698
35767D59798j20356j18029j58046j23735k158Q2605P6699M5631J1202o6610j28705
35756d1704m8218J28020J79252L3011j11153q1804L2493P3077M2828j734j05571
35745I8497k74910l40916j78039O4129J61472J35901J51801K05496J79854J19853
35735C23138J57436K10820P8134j72824k42013o9385O6351J1353m1907N6434J36592
$$ plain form
35808 210126 102177 263221 448143 433919 361391 485945 741318 787062 452880 -55881
35798 -55881 -411594 -479164 -347827 -173768 -55463 10129 110203 317343 574692 725912
35788 725912 697774 603340 604187 706093 774833 748367 726056 790521 833539 681428 363593
35777 363593 112443 64174 100324 71773 48881 195707 471810 646661 604496 459798
35767 459798 339442 221413 63367 -60368 -62526 20079 96778 142409 153611 87001 -41704
35756 -41704 -89922 38098 217350 250361 139208 57404 89897 162974 205802 204068 98497
35745 98497 -176413 -517329 -695368 -631239 -469767 -333866 -182065 23431 203285 323138
35735 323138 480574 691394 769528 596704 354691 285306 351657 363010 321103 377537 514129
35724E14129L4212j02294q6047k1326p7912j57754r6818q375q0903j84506n7491
35713c25085K07636K61115M8524j26924j14527r3761j62934j36803R0869L16781
35703c5109L48861K74214K14918Q9072j58186l27861k33782j2822Q4366N3962
35693B97633L7858J5205j14623k45198j67792P1615K02225J23529K1307N4661
35683B96420J47116J50948M8643o9740j07373j5706J40342J86581L6603j49938
35673F63896j61477m6598l8325j87722k98970k50181j43531p4211J5487J43973
35663c77659J70644K4292j20881p5364Q0762J18693j5542j62893j85316r1212
35653f34476M2350J43587J56613Q5238J7705K4244N4102K3141k5551L5845K10107
$$ plain form
35724 514129 548341 446047 360000 338674 260762 103008 6190 -2185 -83088 -267594 -325085
35713 -325085 -117449 143666 192190 65266 -49261 -143022 -305956 -442759 -351890 -35109
35703 -35109 313752 587966 802884 891956 733770 405909 172127 159305 243671 297633
35693 297633 335491 350696 236073 -9125 -176917 -105302 96923 220452 241759 296420
35683 296420 443536 594484 643127 573387 466014 450308 590650 777231 813834 663896
35673 663896 502419 455821 417496 229774 -69196 -319377 -462908 -537119 -521632 -377659
35663 -377659 -207015 -182723 -303604 -378968 -298206 -179513 -195055 -357948 -543264 -634476
35653 -634476 -592126 -448539 -291926 -206688 -188983 -164739 -110637 -87496 -113047 -77202 132905
$$ [...]
##END NTUPLES=NMR SPECTRUM
##END=
