##TITLE=31Pdec_DE-84_ext4
 D2O, 64 sc
 14.3.2025
##JCAMPDX= 6.0         $$ Bruker NMR JCAMP-DX V2.0
##DATA TYPE= NMR SPECTRUM
##DATA CLASS= NTUPLES
##ORIGIN= UXNMR, Bruker Analytische Messtechnik GmbH
##OWNER= root
$$ XWIN-NMR		Version 3.5
$$ Fri Mar 14 14:02:50 2025 Russian Standard Time (UT+4h)  she@DPX200
##.OBSERVE FREQUENCY= 81.013821
##.OBSERVE NUCLEUS= ^31P
##.ACQUISITION MODE= SIMULTANEOUS
##.ACQUISITION SCHEME= undefined
##.AVERAGES= 64
##.DIGITISER RES= 17
##SPECTROMETER/DATA SYSTEM= spect
##.PULSE SEQUENCE= zgpg30
##.SOLVENT NAME= D2O
##.SHIFT REFERENCE= (INTERNAL, D2O, 0, 198.062)
##AUDIT TRAIL= $$ (NUMBER, WHEN, WHO, WHERE, WHAT)
$$ ##TITLE= Audit trail, XWIN-NMR		Version 3.5
$$ ##JCAMPDX= 5.01
$$ ##ORIGIN= Bruker BioSpin GmbH
$$ ##OWNER= she
$$ F:/spectra/data/she/nmr/P31/2/pdata/1/auditp.txt
$$ ##AUDIT TRAIL=  $$ (NUMBER, WHEN, WHO, WHERE, WHAT)
(   1,<2025-03-14 14:01:49.18 +0400>,<she>,<DPX200>,
      <created by zg, POWCHK disabled, PULCHK disabled
       configuration hash MD5:
       00 E9 B6 7A A2 85 ED C7 34 08 36 98 17 FE 4E 26
       data hash MD5: 32K
       10 55 57 19 78 D9 82 38 17 86 F3 7A 2D C2 CB C6>)
(   2,<2025-03-14 14:01:55.00 +0400>,<she>,<DPX200>,
      <Start of raw data processing
       efp BC_mod = 2 LB = 1.5 FT_mod = 6 PKNL = 1 PHC0 = 1842.659 PHC1 = -95.3056 SI = 64K 
       data hash MD5: 64K
       F0 1B 2E 94 EC BB 9A E6 7D A7 20 68 C5 28 D8 5D>)
(   3,<2025-03-14 14:02:12.98 +0400>,<she>,<DPX200>,
      <pk PHC0 = -25.12665 PHC1 = 0 
       data hash MD5: 64K
       4D A8 AA 24 9F 77 7A 27 24 F5 6B A1 FE A0 E7 02>)
(   4,<2025-03-14 14:02:18.42 +0400>,<she>,<DPX200>,
      <abs ABSG = 5 
       data hash MD5: 64K
       75 66 0C 0C 0A 75 05 01 81 BD 49 BA 49 67 43 15>)
$$ ##END=
$$ 
$$ hash MD5
$$ 32 92 FE E1 8E 80 4B 8A BA 8D 77 15 07 02 CD D3
##$RELAX= 
##$RELAX= 
##$RELAX= 
##$RELAX= 
##$RELAX= 
##$RELAX= 
##$RELAX= 
##$RELAX= 
$$ Bruker specific parameters
$$ --------------------------
##$DU= <F:/spectra>
##$EXPNO= 2
##$NAME= <P31>
##$PROCNO= 1
##$TYPE= <nmr>
##$USER= <she>
##$AMP= (0..31)
100 100 100 100 100 100 100 100 100 100 100 100 100 100 100 100 100 100 
100 100 100 100 100 100 100 100 100 100 100 100 100 100 
##$AQSEQ= 0
##$AQ_mod= 1
##$AUNM= <au_zg>
##$AUTOPOS= <>
##$BF1= 81.014009
##$BF2= 200.13
##$BF3= 200.13
##$BF4= 200.13
##$BF5= 200.13
##$BF6= 200.13
##$BF7= 200.13
##$BF8= 200.13
##$BYTORDA= 1
##$CFDGTYP= 0
##$CFRGTYP= 5
##$CHEMSTR= <none>
##$CNST= (0..31)
1 1 145 1 1 1 1 1 1 1 1 1 1 1 1 1 1 1 1 1 1 1 1 1 1 1 1 1 1 1 1 1 
##$CPDPRG= <waltz16>
##$CPDPRG1= <>
##$CPDPRG2= <waltz16>
##$CPDPRG3= <>
##$CPDPRG4= <mlev>
##$CPDPRG5= <mlev>
##$CPDPRG6= <mlev>
##$CPDPRG7= <mlev>
##$CPDPRG8= <mlev>
##$CPDPRGB= <>
##$CPDPRGT= <>
##$D= (0..31)
0 1 0 0 0 0 0 0 0 0.06 0 0.03 2e-05 3e-06 0 0 0.0002 0 0 0 0 0 0 0 0 0 
0 0 0 0 0 0 
##$DATE= 1741946508
##$DBL= (0..7)
120 120 120 11 120 120 24 19 
##$DBP= (0..7)
150 150 150 150 150 150 150 150 
##$DBP07= 0
##$DBPNAM0= <>
##$DBPNAM1= <>
##$DBPNAM2= <>
$$ [...]
##$SUBNAM3= <"">
##$SUBNAM4= <"">
##$SUBNAM5= <"">
##$SUBNAM6= <"">
##$SUBNAM7= <"">
##$SUBNAM8= <"">
##$SUBNAM9= <"">
##$SW= 400.765351723535
##$SWIBOX= (0..15)
0 1 3 0 0 0 0 0 0 0 0 0 0 0 0 0 
##$SW_h= 32467.5324675325
##$TD= 32768
##$TD0= 1
##$TE= 0
##$TE2= 300
##$TE3= 300
##$TEG= 300
##$TL= (0..7)
0 120 53 12 22 120 120 120 
##$TP= (0..7)
150 150 150 150 150 150 150 150 
##$TP07= 0
##$TPNAME0= <>
##$TPNAME1= <>
##$TPNAME2= <>
##$TPNAME3= <>
##$TPNAME4= <>
##$TPNAME5= <>
##$TPNAME6= <>
##$TPNAME7= <>
##$TPOAL= (0..7)
0.5 0.5 0.5 0.5 0.5 0.5 0.5 0.5 
##$TPOFFS= (0..7)
0 0 0 0 0 0 0 0 
##$TUNHIN= 0
##$TUNHOUT= 0
##$TUNXOUT= 0
##$USERA1= <user>
##$USERA2= <user>
##$USERA3= <user>
##$USERA4= <user>
##$USERA5= <user>
##$V9= 5
##$VALIST= <valist>
##$VCLIST= <CCCCCCCCCCCCCCC>
##$VD= 0
##$VDLIST= <DDDDDDDDDDDDDDD>
##$VPLIST= <PPPPPPPPPPPPPPP>
##$VTLIST= <TTTTTTTTTTTTTTT>
##$WBST= 1024
##$WBSW= 4
##$XGAIN= (0..3)
0 0 0 0 
##$XL= 0
##$YL= 0
##$YMAX_a= 57884
##$YMIN_a= -63452
##$ZGOPTNS= <>
##$ZL1= 120
##$ZL2= 120
##$ZL3= 120
##$ZL4= 120
##$ABSF1= 198.0616
##$ABSF2= -202.7028
##$ABSG= 5
##$ABSL= 3
##$ALPHA= 0
##$AQORDER= 0
##$ASSFAC= 0
##$ASSFACI= 0
##$ASSFACX= 0
##$ASSWID= 0
##$AUNMP= <proc_1d>
##$AZFE= 0.1
##$AZFW= 0.5
##$BCFW= 0
##$BC_mod= 2
##$BYTORDP= 0
##$COROFFS= 0
##$CY= -3
##$DATMOD= 1
##$DC= 0
##$DFILT= <>
##$DTYPP= 0
##$F1P= 0
##$F2P= 0
##$FCOR= 1
##$FTSIZE= 65536
##$FT_mod= 6
##$GAMMA= 0
##$GB= 0
##$INTBC= 1
##$INTSCL= 9.790993e-09
##$ISEN= 30
##$LB= 1.5
##$LEV0= 0
##$LPBIN= 0
##$MAXI= 10000
##$MC2= 0
##$MEAN= 0
##$ME_mod= 0
##$MI= 50
##$NCOEF= 0
##$NC_proc= -5
##$NLEV= 6
##$NOISF1= 182.463
##$NOISF2= 159.3651
##$NSP= 0
##$NTH_PI= 0
##$NZP= 0
##$OFFSET= 198.0616
##$PC= 4
##$PHC0= 1817.532
##$PHC1= -95.3056
##$PH_mod= 1
##$PKNL= yes
##$PPARMOD= 0
##$PSCAL= 0
##$PSIGN= 0
##$REVERSE= no
##$SF= 81.0140089999434
##$SI= 65536
##$SIGF1= 159.3651
##$SIGF2= -187.1042
##$SINO= 113.3802
##$SIOLD= 16384
##$SREGLST= <1H.CDCl3>
##$SSB= 0
##$STSI= 65536
##$STSR= 0
##$SW_p= 32467.5324675325
##$SYMM= 0
##$S_DEV= 0
##$TDeff= 32768
##$TDoff= 0
##$TI= <>
##$TILT= no
##$TM1= 0
##$TM2= 0
##$TOPLEV= 0
##$USERP1= <user>
##$USERP2= <user>
##$USERP3= <user>
##$USERP4= <user>
##$USERP5= <user>
##$WDW= 1
##$XDIM= 65536
##$YMAX_p= 588850806
##$YMIN_p= -14633858
$$ End of Bruker specific parameters
$$ ---------------------------------
##NTUPLES= NMR SPECTRUM
##VAR_NAME=  FREQUENCY,     SPECTRUM/REAL,   SPECTRUM/IMAG
##SYMBOL=    X,             R,               I
##VAR_TYPE=  INDEPENDENT,   DEPENDENT,       DEPENDENT
##VAR_FORM=  AFFN,          ASDF,            ASDF
##VAR_DIM=   65536,         65536,           65536
##UNITS=     HZ,            ARBITRARY UNITS, ARBITRARY UNITS
##FACTOR=    0.49542278885378, 1,            1
##FIRST=     16045.7642231865, 0,            0
##LAST=      -16421.768244346, 0,            0
##MIN=       -16421.768244346, -14633858,    0
##MAX=       16045.7642231865, 588850806,    0
$$ Real data points
##PAGE= N=1
##DATA TABLE= (X++(R..R)), XYDATA
$$ [...]
44032 -91162 -349358 -580385 -460004 -65936 245276 223380 -81227 -436405 -633191 -588012
44022 -588012 -360924 -122557 -27678 -70208 -119182 -116264 -129791 -167311 -87088 181342 460369
44011 460369 531892 417249 275226 140016 -5900 -3815 317787 764591 884159 511052
44001 511052 -77328 -596408 -1015434 -1283702 -1177921 -669143 -148828 11488 -70117 -33030
43991 -33030 187933 376704 455915 557889 716932 791508 717331 607796 573166 625140 772615
43980 772615 1024994 1259455 1240085 842576 199837 -381971 -617220 -425677 -18507 258356
43970 258356 257856 155105 182576 354260 531954 618801 569013 363017 123706 96849 338665
43959 338665 584737 622744 603704 732092 850791 682558 342542 206227 320575 350726
43949 350726 118783 -201148 -471684 -766687 -1042804 -1039921 -724787 -514224 -796551 -1440724
43939 -1440724 -1994808 -2194042 -2090353 -1860706 -1686944 -1684581 -1768891 -1699738 -1387660 -1018694
43929 -1018694 -759962 -520899 -160525 251283 572297 825182 1081229 1253216 1255108 1257416
43919 1257416 1490528 1826184 1850747 1413486 853378 560446 503065 369852 77670 -87185
43909 -87185 111677 455029 442988 -134135 -937819 -1444268 -1444054 -1105626 -701856 -447763
43899 -447763 -477334 -711285 -783077 -382138 292475 691609 597041 361998 361051 506111 513344
43888 513344 374420 268350 194535 22782 -189272 -250607 -186016 -242103 -513964 -811774
43878 -811774 -958897 -1007681 -1065796 -1086541 -970187 -779293 -718209 -900489 -1196350 -1328395
43868 -1328395 -1119738 -652802 -180034 98504 128263 -71892 -431718 -767253 -875891 -787756
43858 -787756 -768514 -948754 -1103560 -969777 -645436 -452311 -491119 -582162 -608038 -646952
43848 -646952 -740661 -794708 -803881 -947935 -1317746 -1724617 -1952190 -2052837 -2176792 -2191371
43838 -2191371 -1746352 -787099 204034 639929 424673 -13445 -237209 -203172 -154602 -281933
43828 -281933 -571601 -871327 -995601 -851378 -569427 -427662 -518378 -584104 -349152 76229
43818 76229 342969 348703 296691 284531 180022 7129 106456 674751 1383376 1709609 1484005
43807 1484005 898393 176552 -473226 -750623 -499833 -42215 65182 -319137 -753964
43798 -753964 -772823 -394834 13340 194853 176142 87427 -32203 -220354 -431570 -476030
43788 -476030 -227624 110304 133089 -261753 -681224 -738990 -588853 -673241 -1028381 -1192734
43778 -1192734 -857020 -286079 57066 71299 10985 79669 247397 417422 585332 788444
43768 788444 983194 1031886 823773 411233 -6869 -279894 -455168 -670093 -919883 -1029635
43758 -1029635 -884752 -619336 -512944 -692068 -955367 -946994 -552583 -76488 75981 -136469
43748 -136469 -383583 -399821 -222318 34409 375153 762081 999737 982949 873571 836739
43738 836739 797945 679909 658118 886368 1158491 1186510 1063609 1068986 1126900 896103 372424
43727 372424 -26861 -26652 230779 509730 697069 651869 270010 -182539 -224823 162073
43717 162073 395171 55455 -548341 -843063 -725401 -554232 -646296 -1048458 -1610735 -2022163
43707 -2022163 -1934785 -1297219 -460183 197764 586780 735269 575324 121803 -366438 -662826
43697 -662826 -834979 -1015455 -1126434 -1082713 -1043045 -1150553 -1211464 -972681 -577595 -394758
43687 -394758 -488630 -600266 -578274 -482496 -310440 9311 336437 383213 136759 -69763
43677 -69763 9068 271195 504664 630966 620348 407288 25828 -354426 -649894 -951704
43667 -951704 -1263041 -1318524 -873303 -108775 451283 473783 144400 -113156 -163280 -261437
43657 -261437 -628014 -1111067 -1417718 -1521920 -1581964 -1544171 -1198561 -675915 -485879 -857062
43647 -857062 -1373310 -1532676 -1375701 -1239916 -1159934 -927066 -582413 -411471 -497042 -652153
43637 -652153 -766364 -870031 -894023 -740851 -583901 -695067 -928124 -775093 -53393 814902
43627 814902 1337083 1425558 1203935 715137 78944 -351620 -309660 55118 402210 626528
43617 626528 841483 1057166 1129324 1013169 880621 939871 1203412 1433912 1317332 773339
43607 773339 121142 -171041 45086 472720 746095 799532 791422 805304 782821 709497 715347
43596 715347 920818 1225987 1346451 1121307 724891 448560 318818 148009 -33286 74951
43586 74951 509340 801707 560630 11170 -395330 -640404 -969982 -1307146 -1382803 -1308865
43576 -1308865 -1415686 -1578183 -1358250 -844822 -643681 -883089 -958802 -546741 -144860 -185155
43566 -185155 -283240 63127 597929 783989 707144 803455 1025041 1011332 855823 943175
43556 943175 1139980 908786 241331 -236242 -202064 -32084 -72060 -113550 125640 481762
43546 481762 619235 466489 111389 -422650 -1035582 -1447871 -1487534 -1295835 -1084927 -892643
43536 -892643 -702542 -560720 -419433 -103902 394958 807617 920218 811080 618053 326785
43526 326785 -16377 -132262 175687 681485 959762 856733 542055 187084 -201496 -665167
43516 -665167 -1169008 -1592898 -1789437 -1709784 -1500029 -1363664 -1307181 -1168834 -907595 -653707
43506 -653707 -449137 -219228 -79837 -325340 -915691 -1308865 -1101911 -579646 -302371 -383415
43496 -383415 -550888 -713892 -984953 -1225495 -1083782 -558627 -95679 9651 -57423 -41929
43486 -41929 -8092 -109846 -275292 -381089 -515141 -783429 -1004958 -882382 -415305 78494
43476 78494 314675 240660 -49251 -387135 -540144 -353228 67692 441584 606256 626581
43466 626581 615821 571881 413330 91312 -331526 -636192 -538837 22781 716019 1096931
43456 1096931 1072043 900031 739522 465477 36887 -241762 -75053 381133 699149 690812
43446 690812 471449 112541 -424965 -1003043 -1298764 -1195195 -907101 -609573 -238711 173328
43436 173328 289940 -95359 -633290 -783395 -496158 -198566 -172363 -303298 -431536 -555599
43426 -555599 -592757 -313392 271463 739629 743841 492102 472979 793272 1036880 769462
43416 769462 8971 -799930 -1152711 -859108 -191845 334329 418403 186601 -91947 -372210
43406 -372210 -759637 -1166818 -1278734 -892366 -144712 607540 1011520 873012 311957 -204433
43396 -204433 -209432 276035 762893 876673 731629 626435 614393 593921 619886 798411
43386 798411 953170 741867 147323 -429740 -650208 -570036 -412165 -262011 -126731 -52163
43376 -52163 9561 230308 577803 672194 274750 -249423 -340073 -32080 98664 -186243
43366 -186243 -425186 -166968 351885 561005 325709 7021 -97625 -17129 135368 324872
43356 324872 460370 363373 -10040 -461214 -750123 -820783 -792789 -807717 -900869 -965206 -855586
43345 -855586 -579207 -324171 -226551 -197962 -93506 51005 100901 46722 -36783 -170177
43335 -170177 -390821 -565487 -537641 -420585 -449222 -539026 -333582 219122 679929 697270
43325 697270 494370 534869 901505 1259423 1300059 986062 464438 -26209 -230476 -84628
43315 -84628 169940 244870 125038 -25027 -175228 -413134 -657845 -667319 -388818 -75146
43305 -75146 50127 66135 173735 383364 530158 509837 339803 22237 -474562 -1032524
43295 -1032524 -1310766 -1014750 -250569 504577 850748 809744 658996 541453 408804 279366
43285 279366 288161 415877 411883 147543 -134698 -130553 84627 144446 -136450 -588776 -961135
43274 -961135 -1155809 -1178099 -1053601 -865040 -722692 -630229 -500498 -348043 -309630 -382179
43264 -382179 -301012 136479 694509 861513 446098 -144889 -349880 -87415 226083 278646
43254 278646 239725 379920 517743 186451 -643822 -1358820 -1393648 -889122 -417965 -238846
43244 -238846 -135278 72349 195203 -49007 -644745 -1280891 -1630104 -1564900 -1206758 -823981
43234 -823981 -607913 -523518 -440743 -370159 -425491 -560070 -523092 -152433 410007 859982
43224 859982 991682 786262 375014 -14039 -188736 -166904 -153848 -297359 -543738 -760452
43214 -760452 -870229 -804454 -484556 9238 358452 271929 -190435 -683968 -951362 -1011204
43204 -1011204 -981009 -849054 -499966 82471 711303 1117811 1165604 921260 511605 -23251
43194 -23251 -656346 -1196221 -1338796 -980792 -403933 -45369 -84095 -291177 -281228 95600
43184 95600 588479 783915 550223 206002 160241 431985 678219 681193 590850 614902 698409
43173 698409 675675 555115 432314 257634 -36893 -246763 -43684 531732 985303 895591
43163 895591 348074 -254011 -631810 -749633 -654660 -399059 -70185 248322 527846 732618
43153 732618 781104 663692 503783 376362 170365 -194840 -512158 -488472 -173014 81201
43143 81201 110882 118352 272753 438350 473077 505426 639300 623710 188178 -423182 -656642
43132 -656642 -365093 58691 282637 366458 404032 271362 -38156 -196784 19743 348215
43122 348215 427228 345543 427236 641084 654190 407343 205877 208315 219975 92194 -25850
43111 -25850 13244 92110 38717 -127230 -314737 -517797 -686517 -631500 -239480 348423
43101 348423 906004 1319815 1510356 1373989 988901 676727 617104 563447 220386 -223388
43091 -223388 -275920 178115 717652 961766 993325 1066004 1147535 981532 472361 -199627
43081 -199627 -785671 -1123537 -1140648 -903041 -677772 -754718 -1110548 -1381616 -1289410 -993596
43071 -993596 -880325 -1077985 -1365423 -1514850 -1488525 -1274347 -808818 -196755 250416 404031
43061 404031 518729 780465 879868 421449 -378068 -865459 -821380 -687112 -827103 -1033228
43051 -1033228 -971185 -690673 -384615 -2724 509725 855290 700533 211992 -115914 -95664
43041 -95664 36268 74376 58947 39949 -39669 -172061 -265005 -341404 -513141 -708952 -669882
43030 -669882 -302360 142695 310965 40833 -565844 -1197403 -1483354 -1305710 -967866 -858475
43020 -858475 -963052 -930561 -594574 -139806 268061 688729 1135856 1403648 1346673 1114673
43010 1114673 942696 893260 943681 1114676 1335955 1390725 1222154 1138242 1451863 1995968
43000 1995968 2246750 1928239 1301593 818138 628779 516813 262832 -17264 11044 420659
42990 420659 799390 685701 161358 -229858 -155909 175645 412249 474034 432617 257957
42980 257957 -80879 -458399 -759037 -1037536 -1311473 -1378917 -1085350 -608517 -216060 104649
42970 104649 477812 742895 594408 72707 -433427 -681924 -757204 -740488 -547289 -191143
42960 -191143 90387 118424 -29135 -196069 -312371 -308731 -110887 185399 386159 552117
42950 552117 984951 1684651 2124075 1852153 1109974 537288 413999 497724 481004 250901
42940 250901 -240805 -966849 -1630897 -1842163 -1610059 -1366101 -1345245 -1245567 -732882 -23505
42930 -23505 364321 299150 127175 114861 157199 120999 155418 444929 840003 982605 752112
42919 752112 403856 260180 384113 568002 561366 306986 2167 -106241 -33607 -78128
42909 -78128 -428356 -849914 -943623 -662027 -346219 -252363 -305375 -393858 -610116 -986947
42899 -986947 -1229862 -1022074 -497964 -116721 -94471 -240972 -359806 -492196 -661435 -673665
42889 -673665 -389132 -4522 163638 61252 -151591 -429484 -852512 -1317109 -1495763 -1230848
42879 -1230848 -798204 -626709 -835973 -1173170 -1352193 -1325598 -1223879 -1140019 -1033249 -806708
42869 -806708 -433449 -5340 319651 402622 173474 -335279 -936641 -1309100 -1203632 -701377
42859 -701377 -185022 34757 14605 21163 153749 270716 265629 230153 278623 363574 377324
42848 377324 330739 300965 264913 117820 -159987 -456248 -638765 -642091 -470162 -192585
42838 -192585 79728 274756 379679 343232 64868 -413808 -820307 -923434 -820189 -767715
42828 -767715 -802946 -761182 -622671 -548474 -554554 -467380 -287932 -266288 -445605 -457593 -40282
42817 -40282 502646 684815 482677 236553 52053 -265876 -701928 -903261 -704602 -430789
42807 -430789 -452827 -669802 -666218 -258488 319933 720673 803250 659336 425889 130574
42797 130574 -257539 -628366 -700821 -347418 103743 125636 -379078 -906746 -944532 -581582
42787 -581582 -351863 -552831 -916999 -962589 -507807 218742 845899 1108757 892107 237827
42777 237827 -560141 -996781 -745574 -50034 485898 585929 554040 706662 857013 685969
42767 685969 386681 451976 870265 1046474 638403 14035 -330192 -392166 -417259 -393891
42757 -393891 -179887 116946 289569 408551 663332 933440 903469 552800 155839 -188015
42747 -188015 -637214 -1177895 -1496554 -1414021 -1128718 -875672 -633304 -352797 -206081 -345172
42737 -345172 -587431 -598740 -302093 92090 368610 424545 202487 -239340 -603066 -543080
42727 -543080 -60048 461397 689599 681262 683806 744582 702739 521588 404596 494559 631859
42716 631859 592098 471768 594049 1008884 1338824 1262962 957154 838267 996781 1144223
42706 1144223 1083172 951292 931728 945255 766339 325857 -210578 -596711 -675533 -467048
42696 -467048 -149948 69339 76945 -159593 -609576 -1082127 -1255420 -1029062 -758801 -857826
42686 -857826 -1215458 -1358858 -1184192 -1074397 -1165059 -1006303 -292612 501993 706932 395294
42676 395294 202535 357548 457652 182984 -317269 -828825 -1331465 -1675852 -1491769 -710939
42666 -710939 193154 785814 1153842 1483723 1509200 866748 -178253 -882455 -913597 -670416
42656 -670416 -637919 -791019 -803270 -575427 -334599 -327965 -567243 -812829 -743069 -232358
42646 -232358 470787 927779 934000 690566 524542 546707 650154 735818 811103 893431 926668
42635 926668 839038 660823 545271 624669 825598 889099 649774 260991 51896 175815
42625 175815 494500 792488 972605 1014522 892410 645389 449632 486437 721248 876268
42615 876268 659963 36465 -716554 -1222588 -1305290 -1087258 -813121 -631035 -554692 -528877
42605 -528877 -444552 -180555 238134 579195 636464 482471 356649 371186 500574 776836
42595 776836 1231077 1664930 1787487 1628209 1499383 1456585 1154926 440055 -263757 -470393
42585 -470393 -286197 -203009 -421254 -733922 -938410 -979031 -771434 -286812 221060 462472
42575 462472 572868 917177 1423335 1590299 1272174 950901 990065 1098681 908514 667834
42565 667834 838618 1249963 1241941 628585 4529 -23735 477593 1008983 1235385 1123927
42555 1123927 719006 73367 -635603 -1122025 -1190395 -879598 -403986 31987 359201 580804
42545 580804 622714 363374 -138008 -581633 -729775 -670362 -624741 -601454 -466573 -285323
42535 -285323 -288368 -459453 -462657 -124649 255900 276472 -74765 -506952 -861430 -1199226
42525 -1199226 -1524771 -1694642 -1632466 -1431312 -1194132 -938370 -700351 -558669 -481085 -317500
42515 -317500 -52527 94155 -27985 -228869 -213925 -11006 83358 -18589 -35934 260626
42505 260626 690298 906166 852177 760905 773394 801524 776002 798098 941055 1061295 956334
42494 956334 649321 400668 444930 772339 1156046 1360101 1333033 1206912 1098641 963085
42484 963085 711905 411561 210540 88305 -121020 -402702 -481639 -211457 145273 238661
42474 238661 112336 119942 411930 752367 868711 769625 648595 643778 779417 1005314
42464 1005314 1186009 1142925 819863 376297 45807 -92973 -180490 -414513 -803706 -1070873
42454 -1070873 -887711 -292341 220801 197629 -228147 -487713 -286087 81202 208347 124529
42444 124529 149070 372487 563059 542224 377867 163077 -134822 -458237 -501102 -28424
42434 -28424 702066 1105733 930967 535768 366163 372351 222746 -26752 97443 736814
42424 736814 1312672 1197371 535993 30611 32724 253676 348517 342001 350569 284942 81096
42413 81096 -69650 -16694 42498 -125876 -331568 -187849 247215 443887 107075 -407276
42403 -407276 -569027 -355178 -217800 -456172 -850184 -962545 -655422 -187330 160205 404027
42393 404027 717118 1054560 1112606 714335 78964 -414027 -620667 -658128 -647609 -642356
42383 -642356 -766112 -1159007 -1693195 -1940449 -1597461 -876733 -339617 -343651 -722116 -998002
42373 -998002 -860151 -426391 -69283 -6285 -95863 -58441 168674 399222 496976 561324
42363 561324 751235 1027629 1167821 994041 525830 -46557 -481635 -639868 -603499 -610138
42353 -610138 -790392 -1006906 -1037006 -871308 -708907 -666831 -637599 -480117 -227754 -24555
42343 -24555 59054 61300 45042 56065 98155 72567 -162400 -545894 -723133 -400374 233455
42332 233455 659026 634420 428037 361484 367655 204386 -70135 -115216 234536 751114
42322 751114 1069057 1004338 623947 159001 -132850 -151183 -18694 120274 300715 586228
42312 586228 807444 709958 358155 108619 114954 141282 -6099 -148361 -56857 119389
42302 119389 39322 -328633 -661009 -692722 -450253 -96736 233898 420487 353608 26126
42292 26126 -445807 -891537 -1125505 -1013267 -643960 -374741 -516444 -969324 -1319050 -1298165
42282 -1298165 -1014524 -735627 -622831 -704003 -915868 -1072402 -931531 -434423 168757 529352
42272 529352 527987 351789 274299 405547 651553 874320 1039589 1174159 1223934 1070164
42262 1070164 721861 376548 198323 117728 -42799 -310410 -548253 -659684 -685396 -702896
42252 -702896 -717939 -664768 -490847 -283815 -295834 -679458 -1147870 -1136112 -496824 155445
42242 155445 81508 -692851 -1418762 -1527021 -1193252 -957769 -1045993 -1189406 -978306 -312419
42232 -312419 427313 679913 278694 -350145 -691335 -700995 -659799 -660191 -599637 -572180 -827145
42221 -827145 -1334722 -1809751 -2187810 -2617407 -2922842 -2630189 -1739900 -943809 -744727 -819809
42211 -819809 -641423 -296609 -203995 -354479 -380077 -178113 35580 151735 186118 15602
42201 15602 -438186 -888664 -1023209 -1032096 -1273357 -1528136 -1225887 -412795 184104 206015
42191 206015 120618 363391 630152 431636 -129422 -598870 -832171 -959698 -977311 -837834
42181 -837834 -744632 -896083 -1078232 -952490 -650012 -627396 -952712 -1170017 -935252 -417939
42171 -417939 16359 193645 103354 -190954 -460599 -422888 -144895 -96691 -561508 -1173544
42161 -1173544 -1318759 -894688 -386103 -212688 -302275 -391007 -454956 -602376 -698554 -434553
42151 -434553 181943 679118 635900 170932 -290967 -606693 -975948 -1446972 -1709810 -1521789
42141 -1521789 -1074919 -733133 -589723 -507211 -440438 -447481 -466036 -374559 -274258 -434419
42131 -434419 -889046 -1310893 -1382746 -1122506 -759385 -468315 -343343 -465452 -810802 -1156470
42121 -1156470 -1234043 -989908 -638307 -473674 -634677 -971027 -1120981 -833023 -263318 155582
42111 155582 192020 27502 -62334 -38833 28362 207078 550753 818015 665743 135465
42101 135465 -318273 -337554 23061 522271 998406 1302929 1249786 854250 444859 307385
42091 307385 332029 223453 -47297 -241433 -237864 -160184 -113740 -32502 154507 391726 602980
42080 602980 780901 905646 899686 723290 420837 55867 -291819 -487239 -468009 -402325
42070 -402325 -499329 -634784 -437223 145754 645750 627444 200457 -255354 -629696 -1004105
42060 -1004105 -1206042 -888177 -75949 738596 1153514 1211158 1092362 775957 217543 -370959
42050 -370959 -703084 -778708 -825481 -920129 -876360 -530990 6177 433398 510790 227733
42040 227733 -200040 -479859 -455026 -217464 -14290 -46149 -333715 -710754 -918595 -782267
42030 -782267 -370093 47603 250719 249884 173411 44096 -216874 -576086 -815100 -751334
42020 -751334 -463970 -200680 -72140 60471 352738 714979 878707 702821 322724 -3305
42010 -3305 -97707 91578 503910 942820 1165595 1126160 1050203 1140910 1289233 1235641 958250
41999 958250 704556 650243 721935 774716 749349 613526 352143 97374 79258 334826
41989 334826 618217 695826 574666 359423 99657 -87046 6327 333852 447704 18078
41979 18078 -629702 -866705 -604959 -404568 -688490 -1229829 -1566732 -1586447 -1467032 -1318599
41969 -1318599 -1185866 -1222473 -1524041 -1860755 -1887662 -1613898 -1379440 -1332985 -1216970 -779085
41959 -779085 -152459 341146 584438 668131 634692 443224 141058 -128883 -292975 -368028
41949 -368028 -327779 -109086 234043 531676 675769 658744 440513 -16484 -527107 -734994
41939 -734994 -531252 -232693 -162622 -227328 -145148 45540 27603 -270901 -517089 -435273
41929 -435273 -189694 -159425 -472080 -884539 -1045392 -809161 -370734 -114456 -221983 -421463
41919 -421463 -278012 244544 706900 750017 521033 414763 576163 831301 956025 806113
41909 806113 300580 -476833 -1198370 -1540157 -1526112 -1455277 -1484752 -1468102 -1241931 -885191
41899 -885191 -592026 -417120 -276926 -137118 -58446 -42957 49424 331972 671112 771474
41889 771474 549009 292875 295188 409243 237484 -229221 -479351 -150018 447669 736325
41879 736325 594787 335283 101838 -269553 -764840 -1005378 -757823 -331591 -206585 -446071
41869 -446071 -723450 -796719 -692745 -491698 -211447 54355 101743 -181606 -688361 -1195599
41859 -1195599 -1474647 -1306239 -619640 263025 736992 512230 4041 -119541 269119
41850 269119 694869 808741 818573 1026638 1265970 1127967 584355 31658 -236339 -289941
41840 -289941 -295611 -277376 -202773 -72717 128960 377479 495142 342581 126806 214683
41830 214683 584168 791418 595272 277745 180359 256639 302096 309460 329456 264391 88708
41819 88708 11497 124075 159744 -68106 -282066 -192140 -44577 -231139 -587552 -659016
41809 -659016 -520686 -689223 -1220541 -1535124 -1271266 -745841 -377575 -174201 -42773 -130815
41799 -130815 -515601 -897457 -934589 -653093 -290267 26816 238208 246282 78759 -68691
41789 -68691 -139814 -319381 -642549 -788713 -513276 -39819 240787 258625 211076 224245
41779 224245 316622 516192 764441 859709 717939 534143 490261 491758 402774 335061 458393
41768 458393 706885 916040 1075040 1206072 1177819 887304 458717 49231 -325498 -562315
41758 -562315 -385881 171233 507471 119186 -673067 -1115408 -972493 -622421 -353636 -113251
41748 -113251 89976 89001 -62012 -86818 36602 23992 -201868 -373219 -363204 -377464 -509820
41737 -509820 -536282 -358005 -239453 -335968 -351755 -5742 441619 494773 87301 -391479
41727 -391479 -628568 -646503 -583856 -493478 -392699 -330127 -338650 -395833 -446128 -433222 -336584
41716 -336584 -189811 -22224 194976 462342 647773 595933 330876 29305 -174950 -225750
41706 -225750 -63953 271266 510725 392001 31488 -207139 -226909 -276574 -479187 -641429
41696 -641429 -651743 -690807 -823059 -726716 -162703 531233 791855 553951 272540 269570
41686 269570 391144 358844 176859 43792 18924 -43436 -231280 -367449 -177646 327414
41676 327414 778557 877339 780026 849485 1109306 1232780 1065315 821245 679725 534744
41666 534744 323460 273181 547721 897904 972914 798117 629494 483313 173348 -246266
41656 -246266 -451370 -319908 -131126 -168262 -337287 -333114 -56166 289819 471202 470352 430013
41645 430013 431483 427723 405589 484147 736261 1009089 1102472 1071855 1130009 1258451 1178188
41634 1178188 762814 230091 -159672 -345538 -316120 -9809 473705 829955 912791 905733
41624 905733 952799 895149 606117 302043 217410 219774 87685 -48794 73445 366479
41614 366479 532289 564581 695672 922344 1003444 894617 775477 651187 337902 -130048
41604 -130048 -487569 -686369 -944112 -1263624 -1335059 -1072036 -829046 -857791 -917102 -706298
41594 -706298 -374568 -265576 -375403 -407966 -246700 -66274 -32371 -133441 -273060 -329363
41584 -329363 -160649 259989 728117 977257 953619 799850 601517 307540 -77060 -355016
41574 -355016 -281299 179675 780834 1196101 1311892 1296892 1351447 1441092 1382153 1167811
41564 1167811 1045835 1201553 1493499 1627134 1514472 1308730 1093422 719592 81028
41555 81028 -545082 -662058 -142672 529890 801476 705142 710387 976411 1128773 866202
41545 866202 399058 51516 -231087 -636370 -1004451 -1005235 -658740 -288883 -45685 154687
41535 154687 295490 274056 220347 385014 692174 809041 698025 675130 839448 884728
41525 884728 625065 286015 71898 -164638 -573094 -968614 -1119863 -1093005 -1049953 -955509
41515 -955509 -726830 -431039 -107100 349724 887148 1157869 969258 624524 515368 605401
41505 605401 633681 602753 696213 881598 969503 947072 903249 742546 346647 -66393 -138778
41494 -138778 96597 257105 193220 160397 336786 512499 411462 76575 -233507 -386953
41484 -386953 -493888 -756284 -1249271 -1781883 -1986140 -1644163 -918229 -181162 328083 595562
41474 595562 680518 621473 442406 136557 -295438 -711640 -862503 -685129 -436741 -401667
41464 -401667 -597804 -883554 -1151061 -1254499 -995803 -424716 72192 247043 310734 472233
41454 472233 461041 -28311 -649125 -747308 -324900 -74164 -393640 -905196 -1083040 -881878
41444 -881878 -554332 -267097 -122214 -211254 -419084 -439052 -155855 219625 485471 631891
41434 631891 625139 369566 920 -156200 -72420 -82186 -317641 -490398 -430223 -373733 -427351
41423 -427351 -222185 468132 1156216 1190000 608717 -23481 -403182 -604437 -606019 -280274
41413 -280274 189299 408413 345333 374540 686264 1039934 1176429 1111873 934178 652386
41403 652386 362938 252718 298668 229398 -79291 -398557 -456583 -260311 -27603 5446
41393 5446 -324100 -945540 -1427611 -1319977 -738763 -296677 -293500 -333703 -15405 357926
41383 357926 195071 -460043 -941612 -890254 -685513 -797259 -1091038 -1057702 -519815 175073
41373 175073 585833 581007 333907 91119 -26072 -88542 -246860 -514816 -721456 -747995
41363 -747995 -720879 -832836 -1044219 -1149864 -1107643 -1063735 -1023310 -776629 -298416 29955
41353 29955 -149243 -658495 -964303 -795029 -343734 72233 272390 159690 -265059 -742978
41343 -742978 -883883 -602377 -236359 -110142 -175055 -222025 -241717 -357151 -534591 -600635
41333 -600635 -505165 -384571 -380624 -536180 -843327 -1247302 -1592648 -1691319 -1502186 -1196781
41323 -1196781 -1009166 -1016427 -1068868 -962858 -698643 -498608 -508994 -585190 -505427 -299980
41313 -299980 -177537 -207856 -313728 -491391 -722054 -728765 -250294 403589 551011 44632
41303 44632 -500334 -602415 -511097 -573477 -575897 -264438 -34183 -373621 -938159 -988153 -601033
41292 -601033 -586944 -1163782 -1579718 -1285957 -698261 -410223 -330335 -99209 184771 228500
41282 228500 131438 125256 7458 -572414 -1403651 -1837631 -1596600 -1027704 -561127 -301150
41272 -301150 -171879 -120742 -108620 -135040 -286846 -569988 -763317 -671939 -430341 -285010
41262 -285010 -195031 14880 219484 145007 -88253 -77983 146147 76153 -390684 -577486
41252 -577486 36355 921846 1105531 458879 -200188 -264130 -31632 -90718 -468518 -711364
41242 -711364 -556444 -197804 30986 -3559 -203147 -391396 -486218 -577869 -782953 -977502
41232 -977502 -814723 -153849 627154 938351 574598 -138411 -738936 -982680 -857174 -524323
41222 -524323 -308040 -469913 -855762 -985330 -659758 -268153 -276687 -614878 -859031 -871697
41212 -871697 -892311 -1045960 -1161643 -1148402 -1183414 -1358428 -1438480 -1194705 -754741 -387127
41202 -387127 -112083 216970 562437 704676 563633 300003 99246 29831 106726 321879
41192 321879 590629 797989 903038 893618 694299 292705 -77636 -115049 136360 268839
41182 268839 25893 -342104 -402078 -95040 230123 294016 197407 209487 388652 516033
41172 516033 366331 -22890 -365275 -408521 -202547 -43818 -119747 -285594 -308679 -272865
41162 -272865 -511122 -1055766 -1393380 -1012173 -83973 682525 851919 633053 403019 220505
41152 220505 12458 -78791 105822 369504 378172 197549 233030 612956 1004411 1134204
41142 1134204 1125471 1139351 1023439 598312 52613 -262965 -292485 -238561 -187470 -82188
41132 -82188 -11257 -188907 -590091 -871570 -770045 -405931 -96284 -4177 -64253 -139695
41122 -139695 -139643 -29910 182934 460627 730281 877647 798101 501983 124600 -213356
41112 -213356 -490543 -687106 -723986 -605995 -494732 -468845 -327139 130983 692295 888076
41102 888076 593362 181684 -12476 -97849 -302199 -490380 -316619 231668 749927 917921
41092 917921 850228 840056 927310 894219 624312 286537 122019 168632 282449 359095 419952
41081 419952 502033 581121 619001 581736 399715 49096 -284615 -300134 44188 401042
41071 401042 440221 254511 174145 306867 511461 726579 995893 1174432 971458 396544
41061 396544 -151975 -410812 -575363 -871832 -1075637 -806734 -170091 282034 247442 18199
41051 18199 26072 289713 484050 416258 241183 228675 452168 741137 870254 745268
41041 745268 433778 87219 -138814 -161462 -66026 -94679 -406707 -827427 -980747 -745090
41031 -745090 -434069 -392780 -530853 -442529 60271 733630 1229828 1448554 1483089 1366530
41021 1366530 1014279 385187 -390200 -1050661 -1355633 -1231755 -814907 -351109 -40583
41012 -40583 48917 -24686 -133860 -181253 -197898 -290861 -434249 -405535 -62078 394046 621438
41001 621438 579862 525088 538972 370420 -100206 -537967 -595664 -476194 -662320 -1157273
40991 -1157273 -1416123 -1095777 -479229 1029 287483 486875 468184 66514 -491983 -785643
40981 -785643 -756691 -687165 -624516 -252536 537926 1308514 1527618 1144313 533381 71554
40971 71554 -67547 79347 241065 75516 -407351 -741663 -576015 -200101 -189829 -610686
40961 -610686 -929598 -751698 -324057 -177069 -484370 -928267 -1079350 -803743 -362413 -147741
40951 -147741 -265304 -414062 -289164 -19785 9991 -252341 -399084 -103665 445677 787013
40941 787013 678244 219512 -336358 -717283 -708262 -305708 233520 629914 841175 1002028
40931 1002028 1180038 1312164 1338918 1282751 1202509 1143480 1106621 1013674 767339 433338
40921 433338 298545 607509 1226517 1679543 1586476 1037197 493836 337551 549441 833979
40911 833979 975000 983464 947880 912479 946222 1145809 1446376 1591262 1451369 1217053
40901 1217053 1079391 912409 563428 278855 420316 835165 995463 798914 718840 1011805
40891 1011805 1303345 1244485 1087849 1187120 1316664 1025056 444896 204018 578880 1178495
40881 1178495 1485498 1371627 1070734 922983 1121659 1462515 1425066 779572 -3560 -286558
40871 -286558 -92478 4086 -261633 -572568 -643747 -604235 -611438 -528727 -227151 137701 401289
40860 401289 659236 1009804 1266255 1193222 869772 586978 494976 520891 527653 423123
40850 423123 224375 98040 183511 314282 142161 -347168 -690943 -498492 72720 582837
40840 582837 838189 919269 866480 632557 275448 -40502 -216605 -256185 -204773 -170624
40830 -170624 -277695 -458247 -437823 -86369 374421 689305 901014 1125206 1190060 840129
40820 840129 205426 -275973 -386712 -286940 -162559 -35835 42580 -58936 -290404 -359919
40810 -359919 -94618 301644 477660 303136 -73517 -417217 -585111 -612620 -664205 -811651
40800 -811651 -875404 -625666 -125617 307288 487775 506884 475818 382611 277530 317096
40790 317096 466147 430677 129567 -11243 412604 1099412 1303366 796710 167124 6042
40780 6042 159356 77050 -341855 -663838 -622439 -481322 -551384 -675492 -483066 11241
40770 11241 395430 436093 375683 551920 923105 1127465 922956 452136 111847 208164
40760 208164 672331 1089139 1100694 800569 592960 642904 683330 468833 169146 83151
40750 83151 156306 99443 -103351 -152947 79200 346636 418805 409287 539024 758729 811074
40739 811074 575057 170542 -235597 -564227 -755580 -710992 -403668 -13137 160437 -1545
40729 -1545 -244855 -158695 379061 1055489 1457674 1447992 1157670 770166 445903 318919
40719 318919 373759 409746 302659 200416 264420 358670 285479 216120 496116 1028537 1269701
40708 1269701 939339 344270 -157442 -609787 -1125327 -1482527 -1442930 -1216764 -1184837 -1287395
40698 -1287395 -1113342 -580211 -142044 -226469 -729819 -1185040 -1263519 -1021546 -752509 -657633
40688 -657633 -645144 -495970 -228056 -121988 -291927 -458265 -352112 -132119 -103906 -194401
40678 -194401 -71983 304117 644817 800171 856937 769103 360141 -201340 -405034 -102330
40668 -102330 212409 113925 -139143 -70662 247020 351052 132084 -42927 102692 460886
40658 460886 797840 955992 802474 332620 -138359 -232734 -29354 13380 -252833 -430789
40648 -430789 -223616 53740 -60091 -458875 -638472 -470094 -358870 -558166 -710461 -322235
40638 -322235 497746 1065447 890512 226527 -229807 -87570 401362 718847 652592 422031
40628 422031 333760 462234 678430 857457 970938 1032694 1040023 976108 843602 687657
40618 687657 564167 459231 278257 -26090 -359669 -612680 -828818 -1098640 -1309410 -1220120
40608 -1220120 -853199 -592017 -731670 -1092798 -1265537 -1113587 -829989 -586173 -368107
40599 -368107 -132435 112433 403072 782406 1113742 1140492 826062 461549 316303 319826
40589 319826 225049 -21065 -231078 -259511 -189846 -220941 -445980 -768550 -1003253 -1044469
40579 -1044469 -938775 -792868 -642421 -452219 -218370 -7601 97622 53542 -102375 -211450
40569 -211450 -87815 225853 381515 89471 -482637 -887039 -964124 -988894 -1201716 -1449758
40559 -1449758 -1421428 -1035866 -467136 43624 285843 190152 -17777 21736 325511 470498
40549 470498 178956 -223436 -213270 236490 672838 751872 503184 102081 -287939 -481795
40539 -481795 -398491 -226615 -208607 -298895 -306193 -290631 -460181 -721675 -766929 -636365 -725745
40528 -725745 -1095777 -1241581 -800771 -99755 303787 292301 86548 -214592 -605527 -915073
40518 -915073 -989062 -994358 -1157637 -1305346 -1057203 -433608 114354 298370 267683 245978
40508 245978 241258 238335 383717 784401 1286340 1598576 1542831 1132663 551825 105097
40498 105097 20000 205777 336412 232935 18055 -163175 -374866 -697711 -966780 -920940
40488 -920940 -573059 -246859 -214144 -413424 -575721 -548622 -423299 -364309 -390431 -373269
40478 -373269 -228662 -36849 59532 28672 -26753 4233 126081 232503 208155 67884
40468 67884 -20162 66853 188009 51960 -402062 -876351 -1054963 -936487 -715564 -479153
40458 -479153 -192956 110846 324462 404878 389020 326388 299466 390157 494973 349728
40448 349728 -58809 -305782 -58168 369653 376374 -101376 -557440 -688761 -725603 -912745
40438 -912745 -1137501 -1248013 -1299323 -1245894 -810405 18050 702913 746369 310503 -70563
40428 -70563 -160122 -85782 2818 -19894 -314144 -782968 -934711 -467041 194482 392388
40418 392388 93200 -255653 -544125 -1033084 -1621612 -1791110 -1415050 -975040 -747334 -392853
40408 -392853 328805 1021948 1254302 1198146 1194269 1109235 684561 193267 127520 410139
40398 410139 503540 221896 -103189 -239748 -329523 -506074 -680206 -771066 -787014 -660202
40388 -660202 -361583 -149579 -281725 -502418 -314734 202031 398995 12958 -450640 -520960
40378 -520960 -396374 -447656 -601862 -647107 -705643 -902859 -925898 -466080 159726 400433
40368 400433 309162 417553 866602 1235617 1240680 1074360 978102 940426 916633 935702 894388
40357 894388 633752 307638 282569 569455 744966 552401 189991 -112347 -366748 -508658
40347 -508658 -269136 349335 853989 839609 490077 234900 212705 337180 543971 646567
40337 646567 301064 -472836 -1024403 -770869 57757 799808 1249920 1662405 2053492 2099078
40327 2099078 1719334 1234264 864141 524055 199482 94930 259332 408960 281080
40318 281080 -82866 -477686 -702966 -575402 -93838 354498 282036 -312310 -933286 -1226615
40308 -1226615 -1311431 -1417893 -1561692 -1706631 -1893380 -2027614 -1861278 -1387350 -970040 -876173
40298 -876173 -932132 -843894 -608724 -400987 -277025 -202507 -175835 -149804 -36037 67833
40288 67833 -90116 -491602 -741438 -594050 -293277 -136191 1605 383176 908576 1258456
40278 1258456 1347390 1277512 1014366 506187 25609 -3870 480657 1132661 1616294 1801743
40268 1801743 1617099 1042179 274515 -355798 -678166 -742599 -662905 -576169 -638095 -834237
40258 -834237 -916837 -760500 -616593 -728100 -882596 -735302 -429799 -425953 -754019 -929619
40248 -929619 -671619 -255651 -35813 -25270 -112304 -315016 -601504 -753318 -639794 -425311
40238 -425311 -330342 -361987 -406995 -412639 -366077 -254210 -109717 56822 352516 797402 1071492
40227 1071492 817567 225162 -81314 157271 541397 671124 676814 836996 1038906 959241
40217 959241 540584 6116 -390990 -426702 -4779 554294 643808 105710 -477597 -583943
40207 -583943 -498341 -772172 -1239103 -1227630 -650883 -193998 -314808 -672354 -778170 -675564
40197 -675564 -615318 -485632 -50094 468736 552286 133485 -228018 -56336 445156 731034
40187 731034 665841 625255 852066 1055550 877189 528704 589029 1187015 1763822 1779750
40177 1779750 1349085 973645 909079 1057476 1283587 1516696 1630431 1509568 1219628 922989
40167 922989 692987 574819 681854 981125 1121050 801562 253211 2512 159892 291728
40157 291728 79739 -217514 -134833 380367 905712 1015060 704066 366162 343746 497036
40147 497036 363478 -155080 -500264 -123571 744404 1373636 1476586 1420765 1512570 1570677
40137 1570677 1353163 964048 602961 263063 -74872 -243382 -131267 116982 346341
40128 346341 572097 724463 544077 21682 -361761 -200252 256845 462123 315378 147083
40118 147083 108173 39736 -88327 -68949 131368 234072 62685 -187983 -237704 -53903
40108 -53903 227528 522557 799885 988384 1001287 794645 379464 -124752 -446124 -319315
40098 -319315 239914 890336 1233795 1114054 714251 423034 507197 820938 971626 899187
40088 899187 1072945 1834937 2730859 2922239 2246832 1439320 1201315 1451028 1675706 1654726
40078 1654726 1531011 1416204 1274985 1116239 1034835 1074577 1193212 1320341 1369265 1301856
40068 1301856 1261898 1474280 1885927 2101464 1868377 1455977 1316189 1500258 1677229 1644307
40058 1644307 1533167 1531281 1666181 1890950 2146420 2285054 2140652 1753212 1367584 1144725
40048 1144725 1015254 874660 776642 841671 1067401 1307835 1399588 1300429 1161499 1224604
40038 1224604 1534105 1785734 1626525 1117381 726410 803765 1201976 1483167 1382629 1000384
40028 1000384 642068 547301 708831 920178 1046839 1198094 1494195 1727412 1519866 884475
40018 884475 368769 467506 1060670 1606125 1754142 1591653 1385108 1283583 1251014 1159991
40008 1159991 966648 835293 980482 1323628 1481636 1227432 782596 485089 374970
39999 374970 357101 555040 1104800 1687667 1724925 1121082 439546 197017 300688 354541
39989 354541 219507 25124 -141507 -273216 -309253 -226909 -178214 -296965 -431880 -305518
39979 -305518 85971 446526 552102 452791 296737 159971 98743 165026 258977 125317
39969 125317 -351529 -932706 -1237780 -1120421 -721767 -224739 264325 601886 613374 354328
39959 354328 204473 471976 945573 1079343 674388 156964 57811 409901 850706 1161426
39949 1161426 1430451 1731278 1918543 1809067 1388378 800408 288811 140866 463861
39940 463861 962099 1150988 880248 462047 224918 180027 222269 366097 572260 596511
39930 596511 306104 -18660 -15759 215368 223613 -142563 -478443 -295656 431513 1263591
39920 1263591 1728544 1724317 1554680 1544587 1603223 1325150 626245 48352 168133 852531
39910 852531 1419504 1458555 1155825 843796 617650 476358 492752 672812 875785 1002145
39900 1002145 1073516 1071320 940218 808204 901211 1134461 1127319 802044 613076 896699
39890 896699 1307295 1286192 871616 592329 648576 667501 332852 -148731 -385733 -313106
39880 -313106 -139283 35524 294029 642541 894639 886250 692112 512632 378227 118139
39870 118139 -304955 -587410 -421816 21125 219025 -51740 -462766 -633750 -593677 -545317
39860 -545317 -452828 -184596 119117 198654 127734 256665 693868 1158829 1393085 1422645
39850 1422645 1339066 1106916 725254 360570 169696 132179 144555 135679 43443 -135474
39840 -135474 -225625 -26288 351827 565558 546264 604656 853983 897250 427956 -153907
39830 -153907 -181645 388419 1012764 1400056 1756338 2135606 2156397 1665037 1191547 1299902
39820 1299902 1799853 2073779 1963584 1811090 1739834 1498911 1089365 957508 1302913 1669511
39810 1669511 1595526 1304726 1302665 1542137 1519839 1113536 784321 859853 1075135 1027464
39800 1027464 744266 550286 605187 813475 1026722 1110129 927572 476046 -19845 -298569
39790 -298569 -294941 -88040 270407 735437 1167445 1402131 1380150 1125978 694479 233013
39780 233013 -26156 31728 293743 591232 841649 943554 764870 409666 255481 472622
39770 472622 729857 688857 564141 768343 1167848 1230416 895740 730863 1078979 1571382
39760 1571382 1733072 1619019 1515001 1385497 1038523 596557 381162 449640 591815 683847
39750 683847 722134 605380 234796 -206374 -405154 -351562 -316178 -387975 -352147 -81471
39740 -81471 265200 543720 839140 1230372 1587130 1778162 1872244 1940230 1850280 1496026
39730 1496026 1083492 923774 1016771 1101074 1072082 1060578 1072746 864026 316191 -301294
39720 -301294 -646202 -700883 -624843 -363787 260622 1085367 1584709 1471912 1086112 981179
39710 981179 1291788 1715428 1980571 2053473 1937933 1594235 1145630 909706 1055760 1377240
39700 1377240 1550675 1501846 1368378 1215304 991806 728027 561550 526278 484011 349355
39690 349355 250335 341207 535080 573961 356529 58892 -103250 -97511 15101 243708
39680 243708 567962 768994 611155 207758 -47844 -2654 60636 -97751 -273016 -163840
39670 -163840 104830 188569 126407 285084 693265 895999 620610 182606 1770 60912
39660 60912 125208 195510 395598 632872 751539 878151 1226081 1635834 1705980 1378001
39650 1378001 1013645 838234 676177 366822 100629 119650 334519 502811 629512 902784
39640 902784 1275135 1381264 978515 336330 44225 416192 1155201 1667753 1674145 1400334
39630 1400334 1176783 1054162 944644 933294 1154431 1431995 1383431 955226 572258 607768
39620 607768 918760 1081657 928992 662309 532926 591900 716190 757135 694603 708080
39610 708080 999646 1463880 1676056 1370760 828377 585906 810709 1159578 1250367 1076879
39600 1076879 917364 1001755 1342629 1769266 2047138 2045619 1849368 1648978 1507973 1328332
39590 1328332 1060651 821737 746804 842235 1062755 1420705 1907300 2389969 2709492 2823755
39580 2823755 2754913 2478131 2007516 1523756 1229627 1101868 979956 892011 1048174 1449872
39570 1449872 1773325 1803135 1750032 1898280 2111789 1999260 1496377 964662 700144 646811
39560 646811 671638 823444 1139978 1418054 1412510 1171325 987129 1057350 1321558 1592015
39550 1592015 1728810 1707849 1603247 1506159 1451979 1469885 1656523 2047465 2422975 2466300
39540 2466300 2191530 1986221 2106851 2375260 2550876 2728533 3070625 3368499 3271433 2859388
39530 2859388 2583267 2625408 2679346 2424985 1903517 1340338 893750 677169 742103 911798
39520 911798 893802 692552 661610 1014157 1548316 2012539 2440974 2887161 3109644 2868445
39510 2868445 2370133 2074009 2135444 2341946 2534219 2764704 3029934 3151830 3021302 2753153
39500 2753153 2508938 2312926 2103975 1843294 1525812 1192689 954799 896561 946013 948489
39490 948489 871684 828810 906139 1082303 1300166 1490656 1554435 1477499 1441167 1623884 1888715
39479 1888715 1885480 1511074 1047380 764118 623465 511634 514355 731323 1001836 1099972
39469 1099972 1099588 1249012 1529602 1660997 1580789 1589314 1872031 2158083 2087359 1725923 1445246
39458 1445246 1399489 1411739 1344249 1281684 1288866 1252408 1085435 874964 685567 429530 132436
39447 132436 132180 709733 1598460 2174885 2163980 1888297 1759214 1792639 1764281 1610364 1459632
39436 1459632 1392202 1361437 1298087 1161698 960900 832356 986514 1422551 1806283 1828105
39426 1828105 1605286 1507181 1633781 1737317 1672589 1617199 1714186 1765815 1520818 1105812
39416 1105812 900648 1037590 1273113 1373136 1398046 1519165 1732334 1891548 1918185 1835342
39406 1835342 1662661 1429134 1267896 1341947 1632408 1902885 1918980 1635582 1168896 709759
39396 709759 498770 720369 1286921 1821079 1987197 1786187 1434085 1074610 777208 686106
39386 686106 884028 1127404 1025067 567290 206208 264581 509118 524016 310916 231335
39376 231335 445767 717457 812998 858406 1170549 1844667 2616783 3111866 3181186 2984465
39366 2984465 2735765 2413340 1827848 990616 253224 -33628 109755 383377 554673
39357 554673 563587 406751 153467 30780 238796 645304 872080 739333 443768 254335
39347 254335 242464 385497 684399 1002745 1003216 515589 -128612 -399203 -191858 85336
39337 85336 63897 -193604 -426985 -543510 -566117 -416497 -22647 437038 675179 685397
39327 685397 730793 895755 936912 722962 538354 673669 902347 716357 30475 -682044
39317 -682044 -985087 -900520 -642348 -228764 431207 1225490 1819475 1927476 1555776 1048354
39307 1048354 870720 1176465 1578520 1562016 1149744 889436 1106151 1485979 1570413 1350661
39297 1350661 1114737 974977 875552 879929 1094271 1389097 1492034 1305812 923907 460405
39287 460405 102340 149003 661079 1194225 1243879 874934 549218 414042 194703 -216867
39277 -216867 -532140 -533070 -371773 -245529 -98946 178990 520437 787964 908814 824650
39267 824650 551213 350046 560488 1166671 1785424 2139215 2250491 2141601 1750727 1278236
39257 1278236 1182545 1567092 1921676 1781157 1364545 1239935 1569917 2009677 2204741 2094038
39247 2094038 1808804 1520479 1361615 1355941 1453447 1638460 1864134 1935588 1741675 1566697
39237 1566697 1761865 2084363 1898819 1182859 713462 938950 1305167 1192068 898893
39228 898893 1003732 1261897 1035339 520132 557990 1264748 1811556 1751902 1677479 2166976
39218 2166976 2819754 2887541 2379456 1961836 2013124 2270678 2323118 2090325 1807952 1730952
39208 1730952 1872545 2006928 1986821 1976289 2177064 2431207 2425575 2238886 2262458 2535572
39198 2535572 2624632 2311563 1953637 1937204 2194842 2535059 3027765 3686357 4119866 3962414
39188 3962414 3445450 3128895 3204065 3422079 3556797 3541216 3254522 2608123 1852067 1435773
39178 1435773 1510332 1835587 2179933 2521528 2835138 2988509 2942989 2822607 2709445 2586266
39168 2586266 2533651 2722026 3088355 3266260 3028111 2617615 2421577 2429638 2278083 1810877
39158 1810877 1343010 1270385 1593201 1967233 2108500 1969757 1598330 1081958 680084 736552
39148 736552 1279063 1888103 2175075 2238883 2405796 2676931 2781232 2682789 2602030 2512715
39138 2512715 2094186 1345475 791826 792220 1025446 1028119 911587 1078387 1450063 1522343
39128 1522343 1145251 743769 683050 846853 1002231 1208373 1606212 2037441 2156352 1858763
39118 1858763 1429415 1267775 1516402 1917031 2036135 1720028 1303911 1241721 1566441 1916876
39108 1916876 2093261 2300154 2708387 3041704 2873841 2227527 1602077 1395855 1517717
39099 1517717 1630814 1593907 1527269 1549998 1617209 1605436 1439619 1131878 803275 663842
39089 663842 818428 1060803 1063306 875562 985581 1645779 2370100 2497497 2130384 2004458
39079 2004458 2396979 2738167 2536066 2133734 2118203 2416477 2544713 2464964 2542551 2768199
39069 2768199 2703750 2280143 2031444 2309473 2766893 2914855 2790663 2732495 2800219 2793910
39059 2793910 2665665 2575525 2624219 2777334 2980017 3157051 3193106 3083301 2994322 3014044
39049 3014044 2973993 2705011 2332878 2107819 2062456 2069933 2126667 2303092 2487060 2487066 2398533
39038 2398533 2571403 3131746 3772960 4128696 4161972 4076832 4029077 4082897 4321367 4789653
39028 4789653 5328263 5609243 5424471 4926346 4530784 4521041 4741462 4772043 4454829 4118929
39018 4118929 4145931 4429790 4509021 4210256 3886100 3937474 4345528 4807294 5105464 5154460
39008 5154460 4890194 4393133 4007598 4045785 4403363 4718307 4870098 5026511 5202633 5146905
38998 5146905 4795730 4495808 4535074 4717697 4687266 4458650 4302708 4267602 4200807 4166672
38988 4166672 4415089 4892807 5184998 5078687 4851625 4834611 4993366 5156312 5373645 5758330
38978 5758330 6156390 6279677 6084776 5789551 5586229 5527747 5601678 5718856 5722454 5602858
38968 5602858 5596011 5857328 6158786 6168887 5943305 5855038 6089045 6487063 6856563 7134430
38958 7134430 7248504 7126787 6894241 6792010 6851536 6892711 6856407 6852109 6861495 6741239 6587891
38947 6587891 6719648 7151124 7465855 7431168 7382007 7694096 8178808 8368449 8194030 7998119
38937 7998119 7998574 8108062 8234750 8431006 8741892 9172437 9794011 10621096 11383028 11695802
38927 11695802 11525979 11263793 11269080 11546591 11946146 12460919 13140828 13815976 14124781 13894885
38917 13894885 13425008 13278947 13740743 14521303 15088017 15232909 15164648 15076790 14891699 14535704
38907 14535704 14211926 14178698 14412516 14712311 15018653 15397814 15799793 16088596 16288633
38898 16288633 16570728 16972898 17316106 17432586 17352363 17245758 17264984 17428729 17616049 17740133
38888 17740133 17940383 18424719 19059548 19381195 19186058 18837091 18742118 18827242 18880928 19119867
38878 19119867 19885358 20936569 21642917 21884100 22195142 22918214 23742229 24268200 24560964
38869 24560964 24911708 25460230 26275907 27414388 28648281 29531400 30005568 30570540 31566029
38860 31566029 32687209 33566358 34424812 35677665 37230811 38722897 40227837 42113254
38852 42113254 44312721 46353877 48144555 50182958 52858613 56003464 59303037 62749699
38844 62749699 66467607 70410110 74495744 78855626 83725174 89180221 95094278 101275073
38836 101275073 107617424 114270598 121695599 130399642 140551275 151963010 164450793
38829 164450793 178081071 193109416 209869575 228699244 249755804 272896821 297934867
38822 297934867 324970497 354213315 385469096 418040606 451066712 483578018 514182691
38815 514182691 541137601 562950706 578665740 587521079 588850806 582690099 570171441
38808 570171441 552943130 532357652 509456951 485399358 461371654 438116030 415901388
38801 415901388 394924898 375427506 357469111 340956859 325955260 312700263 301258763
38794 301258763 291404713 282867738 275496584 269166643 263752840 259224813 255556981 252514059
38786 252514059 249724859 246971854 244173842 241080700 237297498 232715242 227622923 222202724
38778 222202724 216138221 208949939 200575590 191401287 181818566 171981439 161987833 152105745
38770 152105745 142728886 134130686 126252538 118736379 111256748 103875888 96993003 90888571
38762 90888571 85418573 80250428 75312561 70873806 67192488 64190126 61494386 58756126
38754 58756126 55907852 53129427 50590353 48287674 46167798 44295575 42746939 41378507
38746 41378507 39909464 38271331 36684163 35310199 34033859 32722493 31513526 30612316
38738 30612316 29897331 28973695 27640297 26134840 24872475 24057724 23591742 23257539 22915782
38729 22915782 22542710 22139854 21672918 21146984 20697320 20490100 20512441 20565891 20494924 20302250
38719 20302250 20008949 19568186 19002146 18452993 17969743 17412351 16738430 16219838 16126539
38710 16126539 16290646 16259527 15866646 15395536 15139275 15027121 14786963 14319729 13794462
38701 13794462 13438334 13303173 13231524 13064056 12874177 12884325 13100685 13213497 13008400 12690538
38691 12690538 12577448 12656251 12755167 12980468 13541047 14204909 14450578 14248511 14185832 14616729
38681 14616729 15179673 15470558 15732365 16407656 17343618 18015075 18388642 18993518 20120942
38672 20120942 21466616 22706033 24004837 25729781 27937907 30387991 32871153 35305193
38664 35305193 37599969 39615686 41230706 42349800 42874789 42743584 41997949 40794956
38656 40794956 39351502 37824382 36191156 34327110 32304272 30519072 29333280 28625956
38648 28625956 27921614 26977580 26009077 25264290 24631341 23839287 22856657 21854286 20868960
38639 20868960 19755714 18487456 17301095 16454496 15931202 15454988 14753367 13776673 12707349
38630 12707349 11796099 11166783 10747599 10383092 9993997 9595124 9174652 8645890 7988023
38621 7988023 7382940 7082169 7093777 7111808 6867996 6491281 6365413 6623698 6939183 6885405
38611 6885405 6391952 5760664 5327741 5205312 5270821 5290049 5098393 4774779 4610960 4809907
38601 4809907 5230502 5514046 5451141 5164854 4969151 5110360 5592191 6163062 6504957 6507311
38591 6507311 6329115 6170107 6091805 6129326 6410268 6978961 7604780 7981114 8083242 8142693
38581 8142693 8289672 8410736 8366191 8175106 7956402 7811414 7762964 7711988 7524353 7288032
38571 7288032 7339282 7790554 8165932 7871742 7002922 6279117 6112204 6154059 5936218 5541108
38561 5541108 5329886 5325719 5267927 5112633 5093501 5331198 5694277 6044735 6357822 6568586
38551 6568586 6525710 6180618 5694284 5295829 5093808 5024463 4931275 4718619 4457993 4281612
38541 4281612 4160956 3924999 3547961 3248329 3199056 3305981 3397278 3449145 3462118 3310838
38531 3310838 2945616 2586112 2464775 2515719 2589011 2827933 3468196 4308238 4763709 4529655
38521 4529655 3907696 3404529 3254443 3384787 3564382 3481116 2946490 2186467 1723639 1817490
38511 1817490 2197448 2479345 2635245 2856603 3129029 3206995 2961726 2550881 2245646 2225483
38501 2225483 2520775 3010752 3453438 3626440 3497667 3228793 2992751 2804477 2545294
38492 2545294 2163018 1828404 1811540 2150381 2538351 2667451 2611312 2687337 2974032 3202297
38482 3202297 3171700 3024369 2963739 2906898 2628277 2130548 1654660 1373513 1274295 1323871
38472 1323871 1540154 1845317 2022919 1941561 1735767 1653807 1767995 1940210 2054884 2151250
38462 2151250 2272739 2320310 2204973 2075832 2185602 2508628 2719968 2653234 2541808 2612914
38452 2612914 2671118 2404216 1962906 1834917 2150619 2518303 2636739 2665756 2797381 2851599
38442 2851599 2632045 2395599 2544437 2981677 3186713 2916308 2467898 2203236 2153075 2214364
38432 2214364 2431944 2859910 3325782 3570828 3559291 3475788 3457396 3478368 3472469 3407249 3217531
38421 3217531 2830297 2352947 2116100 2360542 2897066 3234977 3103348 2728726 2531885
38412 2531885 2682107 3066000 3549009 4040424 4363573 4345355 4093541 3938680 3983164 3926219
38402 3926219 3504470 2918940 2599860 2670611 2891576 3066038 3225393 3393217 3436696 3284763
38392 3284763 3114238 3138422 3282422 3239970 2872059 2421985 2246610 2389811 2543280 2447747
38382 2447747 2197811 2048119 2040834 2024282 1991833 2146668 2567178 3031356 3287651 3318203
38372 3318203 3227005 3076334 2978417 3113850 3433777 3552691 3222344 2741252 2559606 2613628
38362 2613628 2458804 2008272 1671967 1676319 1689927 1343483 780137 420198 420234 626531 876098
38351 876098 1082791 1164568 1136831 1182681 1409731 1622919 1548085 1200555 826537 567453
38341 567453 414507 416241 644179 960628 1115423 1147985 1437893 2215183 3189242 3803342
38331 3803342 3757999 3199559 2508373 1998242 1730580 1528289 1225351 927500 904459 1176748
38321 1176748 1382796 1193771 730899 400023 401253 593084 787436 956037 1125366 1278101
38311 1278101 1442152 1704679 2007160 2047701 1560973 683141 -75747 -249957 217392 980003
38301 980003 1588471 1818056 1790771 1795786 1961034 2124057 2063795 1800649 1563716 1481458
38291 1481458 1446197 1341066 1271095 1423446 1742477 1929129 1848575 1802275 2199842 2962955
38281 2962955 3468817 3229089 2495975 1992153 2096215 2533513 2872367 3011144 3019229 2789794
38271 2789794 2181321 1392907 878389 880981 1272664 1807551 2264113 2374503 1977243 1327085
38261 1327085 912115 815169 594398 13020 -463791 -254187 516220 1202008 1493977 1615489
38251 1615489 1717440 1609587 1233446 932365 957809 1036434 782951 345917 266560 755690
38241 755690 1448459 1916028 2138183 2347986 2611731 2747274 2588175 2188300 1772791 1563552
38231 1563552 1631199 1837368 1929660 1777064 1520310 1401144 1428830 1351795 1042171 756063
38221 756063 823921 1179450 1457385 1540203 1689842 2045925 2336057 2320243 2232634 2428238
38211 2428238 2779810 2850192 2596035 2451084 2655251 2933120 3003239 3019556 3241709 3564831
38201 3564831 3697375 3610699 3493356 3395815 3250953 3172298 3381841 3810355 4067277 3902535
38191 3902535 3476984 3085460 2827137 2684937 2743266 3114164 3713906 4295486 4708718 5005511
38181 5005511 5276886 5513300 5697100 5941972 6406478 7065277 7696668 8180433 8708872
38172 8708872 9549333 10634969 11592589 12228563 12774255 13493731 14226701 14588000 14559879
38163 14559879 14579005 14948560 15412069 15487111 15059379 14425743 13828440 13203064 12437767 11671369
38153 11671369 11176833 11028604 11024573 10920119 10629799 10200017 9712635 9286632 9082656 9173821
38143 9173821 9402615 9460458 9169125 8659377 8240576 8112442 8227533 8403863 8506945 8501719
38133 8501719 8387793 8167371 7882619 7599310 7294601 6826057 6114602 5338313 4829806
38124 4829806 4755898 4985173 5278704 5486665 5524981 5328241 4949185 4579747 4318019 4000247
38114 4000247 3432757 2736085 2281037 2295013 2674048 3148985 3471904 3479252 3196231 2908381
38104 2908381 2918720 3169167 3289482 3083893 2758452 2564287 2443399 2216182 1947919 1887584
38094 1887584 2117332 2480154 2831368 3166493 3481031 3674820 3670540 3529586 3376272 3251850
38084 3251850 3101143 2893908 2711337 2668622 2749806 2784330 2647012 2429761 2318047 2326095
38074 2326095 2276819 2052978 1759025 1615067 1772272 2206088 2672742 2814074 2483712 1964395
38064 1964395 1680708 1708550 1781278 1751241 1739042 1795449 1786458 1741100 1919800 2304560 2403529
38053 2403529 1907864 1227695 963829 1098436 1174843 1084283 1124208 1345076 1421226 1263847
38043 1263847 1246723 1618126 2085942 2215399 1936641 1466714 1015424 761030 837193 1119964
38033 1119964 1263883 1162696 1140778 1460040 1879432 1995600 1828054 1735070 1873013 2082787
38023 2082787 2253287 2445108 2628826 2629856 2442874 2336344 2487611 2711862 2735958 2602389
38013 2602389 2595175 2835516 3168962 3455938 3745739 4048483 4117311 3688908 2904510 2261489
38003 2261489 2070303 2130010 2058216 1796602 1612319 1678817 1864183 1954753 1931920 1959238
37993 1959238 2168982 2508192 2777907 2832738 2742180 2688861 2706939 2660939 2521648 2447356
37983 2447356 2460007 2289102 1791499 1310361 1255226 1459655 1383341 913667 502736 442345
37973 442345 483046 375720 361842 791517 1531294 2093849 2207176 1992868 1708651 1546633
37963 1546633 1579805 1703521 1706138 1526393 1318024 1170305 985436 778241 821513 1239540
37953 1239540 1694337 1789325 1604472 1502911 1568750 1615130 1637726 1826289 2128948 2227979
37943 2227979 2049231 1939484 2177697 2584067 2789270 2684494 2433721 2199445 2032345
37934 2032345 1945447 1955405 2072501 2297983 2579259 2755329 2647559 2256209 1796733 1493417
37924 1493417 1374644 1290194 1103663 864940 780008 946884 1140506 1017714 586523 273127
37914 273127 395418 772314 1041947 1156165 1288784 1436380 1464744 1444456 1548974 1657648
37904 1657648 1479400 1114229 1059636 1504464 1994279 2023284 1654108 1297582 1135574 1068985
37894 1068985 1077152 1301442 1781827 2325815 2679553 2743565 2627721 2525262 2489214 2358637
37884 2358637 2018477 1668380 1597929 1703115 1551973 1048468 709263 1048524 1921157 2723536
37874 2723536 3058577 2961473 2665449 2456214 2628539 3242764 3946919 4317937 4371363 4485923
37864 4485923 4841976 5215777 5375636 5413898 5557292 5825810 6025631 6002301 5807525 5644636
37854 5644636 5676466 5861002 5993545 5937687 5744673 5486904 5086307 4444549 3676719 3068568
37844 3068568 2819768 2909432 3136883 3203054 2882892 2273895 1759545 1565735 1503585 1351649
37834 1351649 1280761 1554315 1959908 1994485 1594531 1216449 1123598 1069908 853215 707344
37824 707344 864142 1135993 1279631 1419699 1709281 1881839 1628172 1204874 1132323 1386553
37814 1386553 1432233 1061308 669063 597022 701927 769056 896798 1176196 1345297 1115851
37804 1115851 627559 274339 243921 485978 950855 1550369 2003820 2045246 1755062 1444805
37794 1444805 1259341 1123895 1018830 1018779 1048518 874883 436693 5699 -72052 292426
37784 292426 863207 1249723 1195263 829177 575324 672588 887999 884033 712943 648792
37774 648792 662771 491905 211619 252415 710300 1091335 979157 566090 234591 -17521
37764 -17521 -355274 -611855 -473925 -1538 452033 723588 851281 735162 264793 -249887
37754 -249887 -288365 140269 427079 207892 -143332 -123762 165180 264978 112239 127233
37744 127233 590587 1264996 1705446 1728597 1480451 1179784 922353 712593 590442 641224
37734 641224 847988 998185 847176 395050 -77883 -287784 -213340 -70857 -71858 -221706
37724 -221706 -332871 -243658 -30738 54417 -107066 -346311 -424157 -303119 -113891 26958
37714 26958 35550 -171694 -540881 -803857 -736207 -424679 -111511 102367 190139 17561
37704 17561 -433710 -789990 -656550 -234149 -123967 -482041 -827935 -797963 -605184 -544636
37694 -544636 -500085 -245732 141093 500742 897966 1364665 1640743 1555756 1407323 1536250
37684 1536250 1724729 1466651 722886 -17831 -371548 -364959 -152560 180309 509916 706687
37674 706687 822175 977214 1064523 848418 377304 15802 13340 260230 490550 523677
37664 523677 326419 61234 41754 397645 814408 852994 478898 7266 -389189 -757733
37654 -757733 -1006838 -929817 -669515 -704373 -1156366 -1481539 -1135517 -293359 377997 496680
37644 496680 260202 78112 150794 384319 557243 547082 432212 349906 293263 163146
37634 163146 -14649 -100393 -68463 -34147 -33878 22717 148218 225885 205235 154759 89036
37623 89036 -44664 -176229 -142695 44408 193663 232379 258728 274718 178492 72649 215892
37612 215892 556566 702275 526942 402553 574298 712534 449873 18011 -99638 93541
37602 93541 204161 153079 290944 802206 1397477 1679034 1530990 1097646 611404 278438
37592 278438 145153 74481 628 112489 563467 1104484 1311028 1146551 991774 1088445
37582 1088445 1254105 1240525 1121619 1173525 1503472 1902160 2005251 1606939 910183 417671
37572 417671 431242 710820 798425 618249 532785 825442 1370472 1852860 2102188 2143557
37562 2143557 2087810 2039889 2006134 1884683 1652757 1496560 1580518 1765299 1801462 1757408
37552 1757408 1952241 2442340 2894916 3063044 3074924 3089696 2943959 2384239 1492884 669757
37542 669757 276368 422576 969307 1588498 1939778 1962593 1936248 2138671 2528374 2866136
37532 2866136 3037256 3106389 3130724 3073427 2883108 2566266 2208055 1963358 1943056 2057195
37522 2057195 2089046 1994761 1972724 2116470 2184659 1940972 1598812 1631573 2138616 2666232
37512 2666232 2740682 2371724 1915081 1612187 1429170 1238266 965639 586675 149309 -162151
37502 -162151 -126485 265666 740748 1003128 1016462 951903 923809 904813 879445 922631 1070605
37491 1070605 1229063 1276789 1171723 909228 499830 66782 -173211 -156427 -85171 -149602
37481 -149602 -254975 -214125 -98480 -129980 -262226 -176680 231617 636852 697244 474668
37471 474668 249934 74592 -246252 -755885 -1157476 -1124660 -708302 -316909 -271036 -450272
37461 -450272 -470753 -188789 120103 142491 -80221 -288817 -389283 -467119 -504173 -364799
37451 -364799 -68231 197829 383594 623710 885500 858896 386570 -218729 -521092 -482125
37441 -482125 -401977 -433932 -408267 -144931 253555 495819 406117 89661 -181013 -230753
37431 -230753 -116451 23247 185435 460738 817288 1088072 1175074 1103340 876542 488353
37421 488353 99606 -51897 -479 -46440 -275643 -373597 -122380 200102 222192 67115
37411 67115 165604 577778 881404 755351 357075 38769 -64351 -52748 -49933 -93583 -144317
37400 -144317 -121337 23117 232157 373066 325787 33627 -454743 -949046 -1224010 -1228128
37390 -1228128 -1079547 -813128 -330063 282213 619078 394842 -143601 -501271 -518250 -399615
37380 -399615 -271325 -37663 333525 690168 907711 989031 928435 694427 368716 105033
37370 105033 -51174 -125420 -66158 127844 221462 10015 -267380 -150660 384629 874586
37360 874586 1029098 1036482 1087556 1034991 761608 501651 486260 567953 512839 413371 488967
37349 488967 695348 859995 1009516 1218002 1307634 1083177 733972 591379 557406 208819
37339 208819 -518297 -1173982 -1414899 -1382637 -1300095 -1062345 -512806 122802 418111 284435
37329 284435 64906 97504 380051 688712 854982 842906 663295 341747 -29985 -305550
37319 -305550 -407288 -406100 -421990 -466600 -458417 -386400 -356624 -440440 -563455 -597466 -498156
37308 -498156 -320559 -175858 -186402 -360050 -477476 -274658 173759 436481 247171 -109326
37298 -109326 -128158 314281 898837 1297313 1416735 1279443 961723 686325 708734 1005874
37288 1005874 1255031 1199832 884661 482975 84886 -259486 -465287 -506167 -462417 -387577
37278 -387577 -252681 -101627 -106593 -344675 -648667 -823202 -913945 -1119456 -1499364 -1889722
37268 -1889722 -2055509 -1847266 -1308594 -734531 -491104 -608184 -667744 -318582 186238 258489
37258 258489 -225742 -733830 -802574 -627649 -665358 -891238 -846442 -358347 182974 360378
37248 360378 217655 48781 -18299 10918 207627 561632 746407 423493 -231448 -666404
37238 -666404 -662306 -544736 -598529 -688173 -679947 -816678 -1267242 -1611432 -1303338 -529252 -69697
37227 -69697 -272795 -646687 -606137 -196284 146728 206991 81633 -93822 -232064 -256588
37217 -256588 -207066 -268229 -524494 -828097 -1069568 -1383740 -1852090 -2168453 -1910669 -1100233
37207 -1100233 -244378 168166 40646 -387641 -754704 -786627 -524369 -326292 -456854 -724820
37197 -724820 -747459 -507075 -357333 -489152 -712960 -834665 -921700 -1042487 -1022784 -689799
37187 -689799 -179523 220579 423528 553113 694481 806421 819098 678316 356844 -52817
37177 -52817 -333220 -358023 -230302 -75550 176628 590701 903905 724575 103313 -390606
37167 -390606 -341618 -30771 -65091 -580903 -1117038 -1296512 -1307967 -1499472 -1725446 -1477557
37157 -1477557 -665052 119939 325191 156757 255797 794910 1266204 1172362 575123 -148816
37147 -148816 -774598 -1244929 -1461371 -1335684 -959291 -533027 -196090 -33601 -102862 -294806
37137 -294806 -333223 -116241 85819 -12506 -322769 -606239 -880658 -1218145 -1298967 -712436
37127 -712436 260893 723551 236998 -632320 -1123947 -1211134 -1320476 -1486286 -1340083 -807025
37117 -807025 -273764 -24028 59012 126770 77742 -188042 -499132 -590841 -391084 -13870
37107 -13870 357274 484264 197351 -326389 -596047 -338253 127195 268319 10641 -231724
37097 -231724 -178530 -54794 -224285 -659059 -978161 -937306 -672044 -424603 -216118 57256
37087 57256 291862 180104 -351071 -869115 -823173 -194747 435347 547935 257835 91940
37077 91940 307805 632420 668555 358792 -48224 -348059 -530495 -624215 -569825 -318831
37067 -318831 29042 263234 205524 -196512 -815642 -1314435 -1297366 -676913 143182 630499
37057 630499 677943 620108 696839 761022 618076 367946 181168 -27477 -379291 -650018
37047 -650018 -512531 -120356 -23310 -420270 -895360 -1067425 -1122568 -1413054 -1821480 -1901376
37037 -1901376 -1508634 -948818 -563232 -471848 -678757 -1106898 -1494924 -1547328 -1276657 -986809
37027 -986809 -860623 -784884 -646327 -541457 -550634 -532322 -344167 -104596 -16801 -54931 -60034
37016 -60034 -55404 -182800 -346649 -253134 79708 152841 -410409 -1264083 -1663704 -1352531
37006 -1352531 -806528 -543032 -528347 -474767 -414480 -583629 -863683 -799562 -258996 312270
36996 312270 482959 366769 304840 295029 108584 -171904 -153455 299685 835302 1053163
36986 1053163 938172 763279 766606 1011127 1363572 1511764 1204671 615892 292210 558617
36976 558617 1087339 1238560 772769 79683 -259953 -11946 583387 1089010 1241339 1105313
36966 1105313 922700 868325 986133 1254346 1552766 1624620 1305054 807476 531930 520872
36956 520872 387404 -76306 -520254 -507858 -110176 275449 486510 609289 597907 328850
36946 328850 -9737 -42561 217290 338919 136557 -50806 67214 270985 218290 -41911
36936 -41911 -278745 -518539 -862271 -1059886 -755328 -129568 157728 -216442 -823507 -1034173
36926 -1034173 -717279 -223948 103315 200007 189363 210891 290905 285902 27427 -408107
36916 -408107 -692692 -614379 -337909 -166155 -139071 -31264 310918 800110 1254935 1553104
36906 1553104 1625744 1452866 1122765 797183 570044 428958 359755 377031 423310 369059
36896 369059 188059 21984 -26973 -63669 -215738 -346556 -147212 443368 1063793 1281027
36886 1281027 1039376 659653 443436 408362 423510 460279 590894 797719 934302 912188
36876 912188 815307 757178 714489 608770 491098 508867 708404 1008892 1366669 1793965
36866 1793965 2172498 2239674 1883995 1317445 825255 477164 237433 205647 499257 973818
36856 973818 1337926 1543816 1789403 2086017 2118595 1686143 1050293 643573 578506 635293
36846 635293 618670 525039 422474 353334 335116 320710 192514 -77219 -307101 -288228 -57327
36835 -57327 139745 133127 -34710 -214270 -268463 -139821 61246 88829 -156662 -426734
36825 -426734 -390501 -70706 193279 209373 128414 145220 245570 332814 380419 338524 93200
36814 93200 -324893 -653874 -688583 -533333 -422624 -415785 -427384 -438948 -487877 -520708 -444519
36803 -444519 -287328 -153018 -57178 43722 104767 39715 -104230 -181250 -162132 -168480 -269311
36792 -269311 -370573 -348383 -205286 -64841 -68670 -276885 -609348 -888480 -978765 -866397
36782 -866397 -613490 -344561 -289867 -631732 -1178816 -1405359 -1042327 -468889 -249949 -430686
36772 -430686 -622361 -667335 -774130 -989523 -1028271 -794827 -641158 -830940 -1087206 -996012
36762 -996012 -605239 -285743 -190228 -194352 -233789 -340550 -411691 -277720 8174 227729
36752 227729 334591 480391 722725 956824 1113429 1170539 1013885 588057 155499 48348
36742 48348 148018 13295 -401238 -618174 -420971 -280761 -630302 -1105509 -1013812 -319057
36732 -319057 391956 822215 1259060 1888909 2372212 2356517 2008531 1714634 1529396 1260087
36722 1260087 918176 732601 775385 873844 891946 850451 752314 526307 207176 -22228
36712 -22228 -50699 44696 153194 240651 251672 99629 -136357 -200787 -9499 173205 115438
36701 115438 4402 160064 481760 563235 362951 342393 776298 1283282 1312344 841379
36691 841379 291133 -60852 -237020 -254765 -52643 269201 462124 450835 391470 365932
36681 365932 281538 137221 109500 255415 384559 374875 384045 577329 861341 1080385 1268960
36670 1268960 1475679 1520631 1216431 721963 390609 321092 319076 262419 230194 268150 300252
36659 300252 334640 524921 929900 1380108 1661781 1699888 1520724 1189757 835986 586246
36649 586246 424695 258110 138265 224062 473213 606866 509748 450561 707023 1125432
36639 1125432 1286539 1038752 649600 440897 460653 546998 573267 569871 678868 1014331
36629 1014331 1504340 1865482 1819906 1384669 898047 703595 812222 913430 737156 372200
36619 372200 169419 332890 698894 963388 1009782 896395 643628 259795 -63566 -68051
36609 -68051 178145 263642 -19192 -320622 -167609 376301 764542 661978 325597 210226
36599 210226 382534 475999 161620 -465023 -987293 -1092999 -839762 -508992 -290540 -188539
36589 -188539 -156572 -156462 -85993 152997 434845 436804 22355 -531501 -833115 -792071 -591550
36578 -591550 -371383 -148527 15559 7003 -157965 -323197 -406038 -472490 -550182 -504754 -205803
36567 -205803 238223 507746 381379 14156 -168864 47638 355736 280473 -155234 -400231
36557 -400231 -120403 334237 455481 301089 326695 660079 965482 984254 804182 569181
36547 569181 309580 131808 200833 414657 447499 260358 214542 488282 742010 642003
36537 642003 402738 450406 764417 942208 807339 575819 428491 246424 -144018 -671925
36527 -671925 -1063602 -1094111 -774784 -340138 -13215 240147 615692 1103150 1412022 1367767
36517 1367767 1162176 1043215 978695 844242 710157 645599 452187 -23008 -453715 -358284
36507 -358284 181413 563951 462782 147456 -70693 -257100 -516133 -644002 -437137 -76515
36497 -76515 114602 115289 120581 159040 103179 -8786 46443 350093 696605 825811 686794
36486 686794 450404 325914 355381 362955 166727 -154887 -339358 -309949 -276199 -377665
36476 -377665 -456025 -355617 -232308 -306601 -477924 -498808 -430612 -567993 -914665 -1090245
36466 -1090245 -857597 -453387 -248974 -303899 -408782 -394225 -237939 6729 246279 401255
36456 401255 520512 738145 1042137 1223777 1152558 953047 792964 656874 484326 373578
36446 373578 440452 588065 634383 581941 543109 492658 360160 289973 464258 659564 376460
36435 376460 -429109 -1086757 -959138 -226289 381551 504727 481975 769125 1324155 1691882
36425 1691882 1555855 1086518 763703 885629 1262990 1443192 1231689 871571 660652
36416 660652 555397 292515 -222124 -815297 -1250219 -1373697 -1157478 -761194 -444636 -232550
36406 -232550 178270 909334 1463669 1215264 302743 -414025 -372761 141462 599753 913818
36396 913818 1234428 1486377 1535394 1558565 1793203 2046305 1879751 1248548 591191 275729
36386 275729 255920 280366 157049 -204067 -737262 -1173726 -1281567 -1161530 -1072910 -1005111
36376 -1005111 -736979 -323346 -136670 -304183 -467534 -317421 -64363 -94141 -370494 -503157
36366 -503157 -309910 -13159 112324 46258 -68548 -150263 -225723 -334860 -454666 -507111
36356 -507111 -426950 -216343 72229 371247 579314 574963 351894 89817 -47405 -142627
36346 -142627 -371473 -636168 -598630 -150579 382291 639992 637636 611555 626883 553616 337713
36335 337713 79138 -139255 -332604 -516233 -650838 -707622 -712044 -702881 -676446 -571935 -329710
36324 -329710 -7933 208642 230955 254451 540084 996483 1200462 910570 356296 -81567
36314 -81567 -266944 -259867 -103479 139727 311955 328408 291644 271568 141734 -169843 -456838
36303 -456838 -513344 -470746 -575034 -778467 -874288 -911586 -1097946 -1344346 -1303298 -889025
36293 -889025 -405219 -101828 60116 143079 89927 -45364 -71423 -11792 -144592 -501408
36283 -501408 -669184 -368082 57864 67426 -344614 -677493 -576978 -147632 312780 582187
36273 582187 535210 184365 -247376 -496668 -533679 -508088 -459273 -306940 -117369 -89947
36263 -89947 -198121 -131398 225927 499959 284530 -242923 -482564 -184177 243958 305583
36253 305583 46570 -89999 117496 461512 682478 781337 860641 866101 681968 401587
36243 401587 307661 553335 976400 1281453 1352644 1344121 1477506 1780468 2051120 2084131
36233 2084131 1872423 1525837 1073255 510405 22114 -80632 247619 645081 740227 543234
36223 543234 299619 135740 60564 149460 428960 665766 585681 285994 131429 221541
36213 221541 258351 3659 -416604 -762022 -972360 -1094626 -1153637 -1229894 -1450166 -1758667
36203 -1758667 -1900004 -1775785 -1616900 -1637431 -1714613 -1610548 -1346922 -1143079 -1096081 -1114485
36193 -1114485 -1075648 -889848 -523054 -119822 23795 -200866 -513842 -579952 -445208 -436576
36183 -436576 -706141 -1078209 -1289068 -1195097 -818465 -381627 -217390 -430405 -719077 -755859
36173 -755859 -650805 -744591 -1000565 -985022 -535924 -92993 -146491 -596568 -911198 -784240
36163 -784240 -391218 -53338 101770 94823 -87737 -464018 -892805 -1104996 -978653 -702194
36153 -702194 -559440 -598800 -645046 -611059 -618337 -776252 -1025265 -1263290 -1437598 -1436615 -1136643
36142 -1136643 -705843 -595052 -971444 -1376239 -1253346 -653367 -79718 211069 345572
36133 345572 365820 124604 -281553 -434358 -146025 241640 302844 4440 -415462 -755086
36123 -755086 -852128 -573583 -52629 294616 248413 99158 241324 634081 924710 937618
36113 937618 744309 390480 -93938 -473883 -467081 -169081 -9396 -190755 -446254 -493076
36103 -493076 -475829 -719080 -1171940 -1378073 -1034011 -385348 53412 90415 29174 245756
36093 245756 727945 1130398 1205545 1030925 819060 661940 527693 388354 248124 104088
36083 104088 -38952 -146662 -199777 -225588 -243615 -210637 -52763 255388 626901 855528
36073 855528 745301 340968 -34333 -105169 42580 129813 100722 145091 332324 504135
36063 504135 573798 640131 709830 608397 322078 139255 251018 483525 654616 898608
36053 898608 1313787 1552120 1196032 419251 -152359 -202892 26333 225974 350637 405529
36043 405529 291671 29430 -137929 -34306 233425 453439 537672 505392 409186 330622
36033 330622 287436 135486 -233267 -599392 -593981 -215741 120734 153342 99124 259747
36023 259747 565521 711991 547378 140893 -345936 -683796 -674225 -422059 -321276 -561705
36013 -561705 -839155 -788170 -510595 -387498 -519588 -676743 -703107 -635702 -469147 -145246
36003 -145246 211361 367658 344179 414320 683019 958166 1124440 1328870 1639633 1823092
35993 1823092 1699819 1485369 1489294 1635847 1589071 1259157 868322 545178 185238 -225332
35983 -225332 -459228 -377835 -179419 -130240 -224650 -310180 -378941 -461862 -347299 233918 1101893
35972 1101893 1639533 1472284 899568 472344 358361 354122 326084 303866 215426 -103432
35962 -103432 -571883 -830831 -675942 -318909 -99160 -110526 -224672 -307462 -270284 -55223
35952 -55223 270342 503891 525282 437070 387702 375181 345137 350304 456305 596319 676082
35941 676082 722845 775727 746061 572587 402637 399235 457047 350501 101382 -50906 2395
35930 2395 184579 482016 932363 1354337 1427720 1125464 755270 476196 117953 -363377
35920 -363377 -627280 -433356 -76131 28571 -32867 122430 482221 621648 382565 126497
35910 126497 181481 410774 546754 664156 1030515 1630654 2111287 2172135 1838648 1365041
35900 1365041 999380 831284 768282 668211 540904 539866 673032 650861 219732 -405300
35890 -405300 -687299 -411113 26418 101446 -216535 -506814 -465473 -216842 -57173 -80766
35880 -80766 -143385 -84233 104085 277881 276122 99815 -50577 -16677 52585 -143620 -583916
35869 -583916 -828593 -561563 -34862 276265 318391 432239 739994 955172 887491 753329
35859 753329 766101 735665 400461 -44830 -133992 216233 583988 618028 452963 446536 709079
35848 709079 1023236 1113735 904501 583658 456321 658961 1009451 1218052 1208330 1098280
35838 1098280 919281 577073 115732 -212377 -231616 -12428 317404 709986 1037677 1055815
35828 1055815 732675 403776 340800 339759 38675 -488506 -817430 -803795 -740470 -837059
35818 -837059 -928389 -854101 -781120 -892900 -1011707 -837293 -415564 -71242 46124 55998
35808 55998 14636 -197389 -565353 -769614 -511115 94641 596644 656798 342533 -3863
35798 -3863 -121804 -43887 30984 36297 129304 451234 908691 1312346 1639310 1967791 2200331
35787 2200331 2112107 1726651 1378349 1258132 1133522 731484 190546 -160929 -324521 -555752
35777 -555752 -824493 -790927 -414399 -141510 -224933 -232290 352497 1279751 1796030 1689128
35767 1689128 1526785 1722473 1873712 1373298 332222 -547436 -848775 -740187 -456787
35758 -456787 24916 654389 1078151 1059273 871243 918131 1099443 948939 406958 44236
35748 44236 326693 962366 1283640 1107744 855518 849321 889259 676028 320221 128619
35738 128619 81776 -97505 -404829 -482548 -190953 103800 38617 -221869 -273868 -104770
35728 -104770 -70121 -306193 -540286 -533971 -379259 -238357 -91484 81584 132748 -11711
35718 -11711 -142984 -55484 119710 136244 53402 118977 299436 273315 -77438 -486290 -701687
35707 -701687 -785954 -876977 -893945 -673196 -245419 191486 474382 540454 423276 295367
35697 295367 361407 568289 573537 171301 -391246 -713263 -720726 -626010 -538683 -409177 -296946
35686 -296946 -362445 -548162 -562142 -289383 12905 62132 -89675 -175756 -54820 183620
35676 183620 336275 223625 -153275 -504988 -456740 18168 498896 572951 262160 -129906
35666 -129906 -435548 -691927 -901139 -953081 -780082 -432997 -12956 359154 549437 512518
35656 512518 350434 168681 -61009 -388486 -731844 -968995 -1077821 -1043580 -778301 -341996
35646 -341996 -81529 -246921 -579745 -631200 -411710 -306368 -360304 -154639 468969 1055735
35636 1055735 1173233 961248 705384 282593 -470573 -1131572 -1054179 -312578 260094 79722
35626 79722 -551158 -941980 -805991 -386631 -62849 -28992 -216429 -376998 -300743 9436
35616 9436 425651 859061 1178628 1108684 519502 -227992 -583538 -484991 -381703 -524646
35606 -524646 -644493 -491862 -269732 -237318 -240207 -13262 299900 341183 109683 -45144
35596 -45144 71357 338959 608024 810558 821662 558832 244075 240721 555990 787439
35586 787439 649938 297925 26971 -94644 -164331 -230130 -287639 -324484 -235742 139072
35576 139072 741482 1198842 1184680 798896 442313 371906 514353 673262 770375 854840
35566 854840 960100 1002974 829022 371799 -233212 -715728 -845150 -540998 95626 777359
35556 777359 1161228 1157417 1068645 1240399 1599615 1762680 1600626 1402844 1370913 1249553
35546 1249553 711948 -75325 -580419 -560485 -331916 -334446 -597553 -746468 -487989 -4601
35536 -4601 203767 -101204 -574668 -692901 -413138 -183407 -282809 -476754 -477891 -424364 -605448
35525 -605448 -946343 -1128681 -1083474 -980839 -813179 -429570 -15743 -79101 -760714 -1519537
35515 -1519537 -1764171 -1538951 -1303413 -1246085 -1170451 -972949 -867355 -1055953 -1420709 -1663877
35505 -1663877 -1622383 -1351117 -997911 -699499 -549503 -563160 -644835 -629113 -404801 -35459
35495 -35459 250059 239761 -60801 -441141 -706052 -818071 -801039 -623375 -297133 -18808
35485 -18808 -31273 -320263 -596444 -643242 -553439 -524291 -539429 -416485 -115660 180662 308503
35474 308503 282711 182325 48152 -21747 144506 542534 845994 722642 242458 -240482
35464 -240482 -584365 -985206 -1561216 -2074444 -2214516 -1966529 -1522834 -989544 -396965 104332
35454 104332 307351 196842 -62246 -381632 -800678 -1258471 -1522449 -1440683 -1119257 -747253
35444 -747253 -371699 28789 352900 440429 315166 204989 266812 402719 424940 311079
35434 311079 179311 75608 -38234 -85330 104721 449787 512099 6272 -704260 -942176
35424 -942176 -544384 -36389 73852 -172595 -498119 -851856 -1261485 -1513497 -1380656 -1023117
35414 -1023117 -780132 -641986 -315045 204576 524094 416943 163149 173311 505546 898059
35404 898059 1104072 1071647 921087 828726 847697 850480 758975 730275 890783 1001042 738682
35393 738682 269435 94571 269423 268253 -172719 -570331 -410931 43952 124973 -333167
35383 -333167 -917016 -1297285 -1478833 -1469882 -1204543 -853161 -780121 -1044966 -1260220 -1096236
35373 -1096236 -680581 -354701 -244864 -228884 -174608 -62220 41979 30090 -168889 -492890
35363 -492890 -772178 -869715 -764546 -547211 -414098 -588846 -1099969 -1670300 -1969974 -1946775
35353 -1946775 -1770165 -1526078 -1181440 -812327 -600386 -546713 -418559 -79692 305875 505776
35343 505776 511548 494605 572780 698839 703795 421592 -131135 -688836 -965925 -946274 -810379
35332 -810379 -620517 -303841 55001 202056 102336 66603 311060 615801 645644 444922
35322 444922 368908 615442 1029945 1299630 1166294 556741 -270285 -779625 -621212 -46904
35312 -46904 333107 211790 -188147 -524804 -700408 -735944 -556328 -122345 347134 507464
35302 507464 250543 -177024 -422562 -338294 -82065 22563 -231808 -705458 -983014 -765998
35292 -765998 -192475 313419 498658 477262 457110 431148 267367 10431 -98018 70607
35282 70607 336905 400548 150535 -260620 -581482 -643283 -441317 -109726 206907 483278
35272 483278 765746 997658 1031925 900423 916039 1308412 1818526 1884073 1278286 397646
35262 397646 -167662 -226652 -59078 1838 -85665 -136001 -22652 188729 378809 543843
35252 543843 728482 830428 644405 177179 -234203 -277474 -51781 74922 -57090 -261026
35242 -261026 -335126 -321069 -363590 -481534 -589974 -648927 -681052 -682656 -592957 -355998 -3938
35231 -3938 322439 479360 468493 408433 334992 173097 -17044 22544 370295 687906 654864
35220 654864 471980 534181 700992 408580 -418147 -1087896 -1015268 -435713 63920 344390
35210 344390 627600 893343 871216 562945 344090 499729 944047 1418868 1726145 1759111
35200 1759111 1538451 1249113 1067543 963211 832032 750291 850330 977550 770912 171798
35190 171798 -373425 -350464 302621 1180156 1793674 1909259 1620890 1201539 873503 691868
35180 691868 620024 627184 657755 608393 444956 268109 156900 34286 -184295 -396696
35170 -396696 -423406 -250927 -23198 148916 235918 231050 197765 293975 587077 925756 1144116
35159 1144116 1264720 1317074 1139402 660552 240235 343758 907722 1402408 1541225 1543133
35149 1543133 1619944 1619156 1376294 1080936 1014456 1143179 1240867 1275522 1421314 1736432 2016339
35138 2016339 1978697 1528601 875136 402713 344919 571872 778982 838654 828789 799648
35128 799648 755631 825556 1139882 1508136 1554152 1271413 1101684 1290578 1498053 1309293
35118 1309293 860048 629023 777944 1028249 1123164 1118153 1188820 1345691 1404821 1192272
35108 1192272 789936 550509 731384 1120928 1248867 1013897 833183 1055441 1509517
35099 1509517 1810351 1834047 1661634 1319479 872466 574036 616226 866253 1096515 1301317
35089 1301317 1535828 1667649 1612512 1601244 1828574 2025916 1827104 1412800 1282454 1451595
35079 1451595 1429248 1040800 725657 856302 1248613 1571982 1810236 2037335 2116536 1961111
35069 1961111 1813799 1935362 2225170 2441178 2583628 2753201 2839709 2724255 2635313 2869341
35059 2869341 3206957 3073482 2383459 1804403 1930366 2487460 2684793 2198060 1459265
35050 1459265 1007323 912428 960963 1091216 1360680 1644405 1709995 1594045 1604417 1863348
35040 1863348 2105402 2063524 1827778 1643774 1555471 1466643 1393052 1400584 1401528 1262140 1040115
35029 1040115 891801 828178 791174 861049 1105266 1314628 1222343 943136 851489 1036940
35019 1036940 1241302 1349201 1538487 1857659 2052861 1970240 1779806 1636637 1465781 1264492
35009 1264492 1253725 1484022 1624465 1427792 1110215 972963 934853 779828 606877 638702
34999 638702 766865 685615 373079 101157 63020 273985 683768 1075534 1058410 561709
34989 561709 159746 438369 1165919 1603913 1546142 1449913 1534764 1437100 962550 546535
34979 546535 604891 929806 1148225 1362771 1852413 2433334 2631315 2340291 1866640 1420815
34969 1420815 979724 596010 440518 516845 649370 753466 824655 703516 218981 -410106
34959 -410106 -700172 -534257 -314675 -335675 -360359 -73104 346820 455050 186738 -79207
34949 -79207 -55719 154486 313519 337615 258750 107642 -51049 -104484 -21347 90894 133251
34938 133251 132897 145870 147701 129813 217788 534891 962307 1188928 1050294 711669 451487
34927 451487 355637 317868 266414 241054 243539 164248 -56747 -295219 -391343 -385990 -470346
34916 -470346 -691083 -837312 -677365 -209435 381690 906802 1218987 1199767 873083 487300
34906 487300 303049 297042 245909 115037 153091 515801 995463 1274330 1295956 1215489 1111959
34895 1111959 956355 774368 612331 392395 40431 -272752 -303939 -185178 -370475 -967144
34885 -967144 -1402322 -1051010 -61758 750018 821930 406298 165214 424127 954335 1357739
34875 1357739 1490952 1515702 1649085 1925628 2181050 2229637 2040439 1742312 1471745 1239722
34865 1239722 970539 666137 473511 519096 693527 709430 420940 -8923 -331927 -500185
34855 -500185 -603584 -616288 -407293 -4630 334614 380218 143309 -189694 -420029 -421254
34845 -421254 -204311 60640 203870 251944 338564 450839 474795 495936 768537 1277217
34835 1277217 1603078 1419047 911471 508973 380690 426665 588527 883625 1216637 1417108
34825 1417108 1436162 1324413 1085117 731139 394842 182564 22062 -133107 -84856 332699
34815 332699 859685 1048772 883748 804942 1057217 1347008 1286101 915326 621095 703209
34805 703209 1143859 1651021 1836731 1510436 907062 512276 575635 869948 954608 590620
34795 590620 -83796 -673851 -862509 -743474 -730029 -987799 -1140787 -815450 -283223 -130120
34785 -130120 -388247 -525890 -328515 -208795 -453553 -715449 -583218 -205671 44390 167175
34775 167175 374342 603176 616716 411323 168949 -26955 -115318 85821 588646 994354
34765 994354 914932 474593 49114 -279916 -605079 -749938 -457983 90378 451040 533556
34755 533556 559091 498358 132943 -338830 -402318 -53353 100764 -208529 -460932 -194264
34745 -194264 230358 182960 -295651 -624312 -529464 -269116 -96818 60176 340865 670332
34735 670332 841956 746546 478932 264877 251929 362888 435439 459771 496350 410314 -4445
34724 -4445 -593672 -880373 -667908 -286562 -81222 6161 131273 180883 18920 -188134
34714 -188134 -220198 -137748 -52591 178923 670319 1147082 1284828 1223728 1326245 1577695
34704 1577695 1671527 1568079 1497400 1483400 1350615 1166819 1172470 1257193 1035659 532333
34694 532333 266729 493538 846111 940455 856077 756174 509335 63388 -209205 -5820
34684 -5820 332762 218335 -357298 -823520 -797620 -463668 -183136 -66033 -3921 115202
34674 115202 323521 563743 698790 602306 252604 -276483 -834581 -1183439 -1145317 -872594
34664 -872594 -784904 -1060387 -1342219 -1164494 -560382 -25097 59434 -234264 -549719 -564964
34654 -564964 -195094 323779 567029 295482 -302690 -817162 -976664 -739796 -224745 274107
34644 274107 400219 134223 -61373 217001 750227 992939 832002 669097 771931 942928
34634 942928 907097 681864 443511 309572 362065 630257 953282 1096206 1066021 1061984
34624 1061984 1090020 958807 713431 667060 856717 894306 596474 337444 429166 538165
34614 538165 189743 -420751 -662519 -393856 -114552 -175968 -323519 -168756 251726 585088
34604 585088 592909 308285 -73021 -327264 -340700 -208006 -138572 -257730 -565747 -1022984
34594 -1022984 -1531287 -1890789 -1960232 -1836387 -1704463 -1552370 -1226264 -722397 -193243 306192
34584 306192 813495 1200238 1219373 886154 537130 398794 346022 210995 74226 71684
34574 71684 136946 150360 171202 292615 395021 287733 33517 -89206 61974 355456
34564 355456 611137 818026 1072586 1373420 1544204 1400531 1013293 723785 770478 958655
34554 958655 902780 576873 338715 334866 216062 -337684 -1089687 -1554901 -1643851 -1654524
34544 -1654524 -1747130 -1804394 -1768312 -1721450 -1589600 -1149142 -468700 -3187 -30660 -257450
34534 -257450 -234212 36204 183295 13655 -342837 -759908 -1235468 -1628099 -1600961 -1028613
34524 -1028613 -265084 215193 337420 382666 514758 616379 592172 536289 480960 249630
34514 249630 -214404 -576753 -474992 -46947 241470 269096 384791 781372 1135790 1104603
34504 1104603 867998 854380 1118517 1351288 1413425 1488945 1680832 1772227 1511222 934642
34494 934642 301420 -160933 -373967 -397909 -375688 -409072 -463829 -461233 -420561 -390932 -301751
34483 -301751 -68543 179132 203853 18945 -99581 -29231 25321 -86651 -150783 107921
34473 107921 560280 777294 559853 154191 -62458 51517 352973 575327 507877 153299
34463 153299 -221788 -283476 33104 410492 437173 18066 -539024 -863210 -901368 -890661
34453 -890661 -977035 -1014971 -833541 -541988 -360987 -237560 84218 589362 902014 805350
34443 805350 571997 555156 682859 655359 482787 465093 688523 911205 1000443 1136786
34433 1136786 1434401 1644098 1458909 937435 404127 45098 -189665 -360108 -423481 -335706
34423 -335706 -107262 239864 648873 980493 1108357 1043550 863257 578449 216827 -43207
34413 -43207 -49516 36879 -98808 -437631 -593920 -387388 -138193 -171680 -319688 -248233 -57142
34402 -57142 -115632 -404411 -516598 -355391 -331234 -672928 -988674 -829960 -345158 17789
34392 17789 203560 484961 836823 876174 484554 71679 46828 316035 496749 429944
34382 429944 276004 212249 218746 154211 -46895 -276351 -367576 -325104 -345631 -509362 -570389
34371 -570389 -265986 232553 458568 259392 -28892 -112028 -136551 -349063 -609671 -566359
34361 -566359 -210342 68760 10039 -205830 -287392 -270942 -408684 -680745 -679049 -119406
34351 -119406 676370 1047511 735933 120005 -353734 -677296 -1015235 -1214503 -965850 -342208
34341 -342208 229076 539959 782629 1098900 1300226 1161334 709748 116078 -438365 -721328
34331 -721328 -605606 -353269 -368829 -544616 -292666 561268 1403045 1688808 1696585 1933286
34321 1933286 2214941 1993989 1358896 986249 1130055 1315989 1132946 748467 460394
34312 460394 234314 -66224 -362307 -509790 -499037 -354675 -99602 89511 8659 -188113
34302 -188113 -82204 391446 789449 805419 685787 749056 861358 728175 406985 153708
34292 153708 -10508 -195894 -292239 -122982 165657 261783 169077 160107 289287 331143 212152
34281 212152 128472 169088 173694 72409 39419 167934 300812 351597 471714 655175 499667
34270 499667 -245467 -1088295 -1224407 -550730 175640 288634 -61360 -314223 -266165 -104931
34260 -104931 68507 336025 657441 855706 929194 1043906 1161344 1021500 625091 398103
34250 398103 657714 1175982 1509349 1527352 1359241 1055942 643217 338280 337042 474497
34240 474497 447273 298565 311930 475798 470394 211094 -6363 19046 165289 336836
34230 336836 636394 1022816 1192118 1030843 840979 858222 875767 645375 349864 320589
34220 320589 517698 662713 715006 845143 1053945 1174122 1172317 1126614 986512 689258
34210 689258 441839 515801 777439 799199 482261 200022 214057 293731 109878 -260288
34200 -260288 -461117 -330292 -17180 289125 550040 793709 974632 983347 791727 566852
34190 566852 569042 861682 1170036 1149282 795191 473339 505068 813470 1030626 899393
34180 899393 512467 166855 33019 23233 -9036 -52333 -34186 -28254 -127934 -139368 276203
34169 276203 1038887 1542308 1334242 657741 61339 -277404 -501174 -576151 -325020 106346
34159 106346 300036 162479 51839 163278 167587 -291105 -1011371 -1438085 -1310863 -865750
34149 -865750 -462981 -233807 -116521 -95627 -295349 -797542 -1395552 -1662513 -1374335 -771147
34139 -771147 -254640 71643 353211 571478 491216 51567 -474227 -802005 -887056 -769791
34129 -769791 -435561 14812 285902 212905 53172 247657 922892 1756233 2312283 2433667
34119 2433667 2317182 2235541 2172801 1801818 930702 -108597 -725931 -715895 -407938 -155281
34109 -155281 50772 350017 664440 790556 688797 486980 275431 35881 -282623 -687552
34099 -687552 -1058698 -1125149 -707991 -57427 263984 -17465 -567827 -878392 -848919 -745527
34089 -745527 -721500 -642689 -369517 2867 251442 272434 169437 119355 174326 241118 285489
34078 285489 439691 754472 952759 708243 158819 -177464 -76639 128177 108648 29089
34068 29089 206620 554739 717978 619742 532080 642578 846120 987398 1077627 1199970
34058 1199970 1328857 1301030 943691 278325 -380465 -640959 -407070 70530 525849 867606
34048 867606 1009608 812143 364660 72444 224934 644003 945056 960972 742105 390000
34038 390000 121038 228855 686814 1026990 940371 758411 956374 1402301 1564379 1320395
34028 1320395 1060235 1030872 1059593 953603 751922 533475 340455 303030 477233 588299
34018 588299 346296 -23656 -56363 153313 6928 -629122 -1122951 -999552 -599559 -453168
34008 -453168 -486190 -309162 68065 306098 293916 191467 67460 -111521 -245845 -214829
33998 -214829 -140095 -223858 -405346 -467413 -396166 -337934 -274352 -53870 278592 474879 423740
33987 423740 262569 136852 54908 -11724 -76048 -191844 -389466 -553302 -524157 -323175
33977 -323175 -125831 -22995 43172 113163 135526 84227 34664 85001 248787 411460 376150
33966 376150 42880 -405636 -613113 -421594 -14381 367770 653665 777488 561656 22272
33956 22272 -418364 -367445 -11923 95549 -244632 -686111 -839495 -649097 -257168 172457
33946 172457 417772 298644 -47902 -239635 -136491 -36754 -235210 -582847 -671919 -334552
33936 -334552 196914 536026 442595 -12738 -474000 -584747 -338254 -50073 69618 152110
33926 152110 374074 614824 619571 405305 274531 426494 725233 879870 731579 338226
33916 338226 -114298 -437506 -552107 -533204 -528623 -620270 -778404 -931037 -1031372 -1056959
33906 -1056959 -996946 -884569 -829077 -948926 -1212019 -1378379 -1228429 -888436 -775618 -1085337
33896 -1085337 -1471037 -1465270 -1137298 -1006992 -1267301 -1466211 -1173101 -645185 -478085 -773318
33886 -773318 -1060810 -1003645 -766924 -605837 -467863 -206084 96114 267750 331903 400982
33876 400982 434182 348666 256481 313036 398201 248812 -97066 -292788 -181964 -25050
33866 -25050 -113509 -393038 -596559 -533715 -120978 626611 1436933 1838227 1626781 1116434
33856 1116434 688919 286039 -347528 -1089229 -1512223 -1478980 -1255921 -1018595 -659108 -200865
33846 -200865 -10833 -360896 -1028247 -1545319 -1672607 -1481714 -1165660 -908063 -754537 -505345
33836 -505345 46161 685814 906647 626232 411081 703096 1168447 1213546 867449 649138
33826 649138 712819 675553 293647 -210129 -617174 -1059147 -1666123 -2194725 -2274684 -1855601
33816 -1855601 -1225968 -718910 -517888 -604988 -771442 -786210 -648802 -584146 -737614 -988010
33806 -988010 -1103954 -971230 -644692 -302378 -147596 -197658 -174084 201220 788023 1131096
33796 1131096 1025755 740941 602249 609553 601178 549328 493826 375544 163162 13066
33786 13066 69884 178879 20583 -460374 -917617 -943092 -491437 44336 178990 -202576
33776 -202576 -738895 -998141 -916118 -704716 -448074 -75695 295334 371942 165566 113092
33766 113092 486239 949374 973885 490541 -131705 -575699 -776160 -798149 -802964 -989382
33756 -989382 -1274193 -1185798 -433221 528991 914266 563838 94114 48682 314060 512358
33746 512358 589327 744427 1002493 1126855 896053 340121 -235659 -432664 -102862 452532
33736 452532 776419 752453 614293 484273 225224 -165973 -383598 -260456 -96716 -245047
33726 -245047 -580168 -701970 -513768 -259713 -83272 92921 267754 295177 177974 123652
33716 123652 199939 188537 -87925 -505778 -843882 -1053035 -1158773 -1066605 -686552 -180732
33706 -180732 114822 31570 -273866 -505215 -511240 -413750 -492447 -881019 -1334410 -1395829 -882620
33695 -882620 -126258 366943 426323 304132 342969 662039 1078947 1215509 786014 -48829
33685 -48829 -701943 -732689 -334469 -40563 -34904 -65185 -13558 -149423 -661785 -1270086 -1539871
33674 -1539871 -1370525 -968583 -557094 -333017 -477007 -900276 -1152140 -910180 -447201
33665 -447201 -282431 -476267 -651577 -647797 -692841 -863464 -844757 -447479 -656 66166
33655 66166 -203415 -415010 -347836 -84472 267936 704667 1177378 1515125 1530791 1145778
33645 1145778 464505 -214825 -574171 -570176 -472889 -526147 -682907 -778382 -822783 -953410
33635 -953410 -1183501 -1369234 -1387495 -1218361 -892206 -467478 -30308 356400 655450 785243
33625 785243 680864 478727 452101 641995 742378 518635 155041 -15757 57371 229898
33615 229898 482239 817940 978706 672997 75482 -292243 -237864 -98199 -171331 -311951
33605 -311951 -267691 -96795 1241 38374 143025 252870 167052 -151414 -530285 -816450
33595 -816450 -988690 -1057966 -986519 -721154 -257893 289313 665921 644948 304168 18803
33585 18803 52153 242623 235332 -48255 -330736 -337190 -86535 172831 200321 -58634 -419319
$$ [...]
##END NTUPLES=NMR SPECTRUM
##END=
