##TITLE=31Pdec_DE-84_ext1.2
 D2O, 64 sc
 13.3.2025
##JCAMPDX= 6.0         $$ Bruker NMR JCAMP-DX V2.0
##DATA TYPE= NMR SPECTRUM
##DATA CLASS= NTUPLES
##ORIGIN= UXNMR, Bruker Analytische Messtechnik GmbH
##OWNER= root
$$ XWIN-NMR		Version 3.5
$$ Thu Mar 13 16:05:20 2025 Russian Standard Time (UT+4h)  she@DPX200
##.OBSERVE FREQUENCY= 81.013821
##.OBSERVE NUCLEUS= ^31P
##.ACQUISITION MODE= SIMULTANEOUS
##.ACQUISITION SCHEME= undefined
##.AVERAGES= 64
##.DIGITISER RES= 17
##SPECTROMETER/DATA SYSTEM= spect
##.PULSE SEQUENCE= zgpg30
##.SOLVENT NAME= DMSO
##.SHIFT REFERENCE= (INTERNAL, DMSO, 0, 198.062)
##AUDIT TRAIL= $$ (NUMBER, WHEN, WHO, WHERE, WHAT)
$$ ##TITLE= Audit trail, XWIN-NMR		Version 3.5
$$ ##JCAMPDX= 5.01
$$ ##ORIGIN= Bruker BioSpin GmbH
$$ ##OWNER= she
$$ F:/spectra/data/she/nmr/P31/2/pdata/1/auditp.txt
$$ ##AUDIT TRAIL=  $$ (NUMBER, WHEN, WHO, WHERE, WHAT)
(   1,<2025-03-13 16:03:54.62 +0400>,<she>,<DPX200>,
      <created by zg, POWCHK disabled, PULCHK disabled
       configuration hash MD5:
       00 E9 B6 7A A2 85 ED C7 34 08 36 98 17 FE 4E 26
       data hash MD5: 32K
       5E 7D ED B0 BF 9E AE 6C C5 CC DC D0 88 62 53 99>)
(   2,<2025-03-13 16:03:59.95 +0400>,<she>,<DPX200>,
      <Start of raw data processing
       efp BC_mod = 2 LB = 1.5 FT_mod = 6 PKNL = 1 PHC0 = 1808.899 PHC1 = -10.1056 SI = 64K 
       data hash MD5: 64K
       69 89 F7 8A 93 D1 E3 CB 59 A8 2F 90 3F B9 B1 D5>)
(   3,<2025-03-13 16:04:30.46 +0400>,<she>,<DPX200>,
      <pk PHC0 = -78.68954 PHC1 = 124.2 
       data hash MD5: 64K
       5B C7 1D 8A B0 AB A3 2B DA 6F 6A 4C 56 97 B2 26>)
(   4,<2025-03-13 16:04:35.90 +0400>,<she>,<DPX200>,
      <abs ABSG = 5 
       data hash MD5: 64K
       1E AD 48 63 F4 05 8A 93 A3 BA B0 84 BB ED 7B E8>)
$$ ##END=
$$ 
$$ hash MD5
$$ 59 13 25 5F AA 7B A7 65 FF 0E D6 96 7D 50 69 B3
##$RELAX= 
##$RELAX= 
##$RELAX= 
##$RELAX= 
##$RELAX= 
##$RELAX= 
##$RELAX= 
##$RELAX= 
$$ Bruker specific parameters
$$ --------------------------
##$DU= <F:/spectra>
##$EXPNO= 2
##$NAME= <P31>
##$PROCNO= 1
##$TYPE= <nmr>
##$USER= <she>
##$AMP= (0..31)
100 100 100 100 100 100 100 100 100 100 100 100 100 100 100 100 100 100 
100 100 100 100 100 100 100 100 100 100 100 100 100 100 
##$AQSEQ= 0
##$AQ_mod= 1
##$AUNM= <au_zg>
##$AUTOPOS= <>
##$BF1= 81.014009
##$BF2= 200.13
##$BF3= 200.13
##$BF4= 200.13
##$BF5= 200.13
##$BF6= 200.13
##$BF7= 200.13
##$BF8= 200.13
##$BYTORDA= 1
##$CFDGTYP= 0
##$CFRGTYP= 5
##$CHEMSTR= <none>
##$CNST= (0..31)
1 1 145 1 1 1 1 1 1 1 1 1 1 1 1 1 1 1 1 1 1 1 1 1 1 1 1 1 1 1 1 1 
##$CPDPRG= <waltz16>
##$CPDPRG1= <>
##$CPDPRG2= <waltz16>
##$CPDPRG3= <>
##$CPDPRG4= <mlev>
##$CPDPRG5= <mlev>
##$CPDPRG6= <mlev>
##$CPDPRG7= <mlev>
##$CPDPRG8= <mlev>
##$CPDPRGB= <>
##$CPDPRGT= <>
##$D= (0..31)
0 1 0 0 0 0 0 0 0 0.06 0 0.03 2e-05 3e-06 0 0 0.0002 0 0 0 0 0 0 0 0 0 
0 0 0 0 0 0 
##$DATE= 1741867434
##$DBL= (0..7)
120 120 120 11 120 120 24 19 
##$DBP= (0..7)
150 150 150 150 150 150 150 150 
##$DBP07= 0
##$DBPNAM0= <>
##$DBPNAM1= <>
$$ [...]
##$SUBNAM3= <"">
##$SUBNAM4= <"">
##$SUBNAM5= <"">
##$SUBNAM6= <"">
##$SUBNAM7= <"">
##$SUBNAM8= <"">
##$SUBNAM9= <"">
##$SW= 400.765351723535
##$SWIBOX= (0..15)
0 1 3 0 0 0 0 0 0 0 0 0 0 0 0 0 
##$SW_h= 32467.5324675325
##$TD= 32768
##$TD0= 1
##$TE= 0
##$TE2= 300
##$TE3= 300
##$TEG= 300
##$TL= (0..7)
0 120 53 12 22 120 120 120 
##$TP= (0..7)
150 150 150 150 150 150 150 150 
##$TP07= 0
##$TPNAME0= <>
##$TPNAME1= <>
##$TPNAME2= <>
##$TPNAME3= <>
##$TPNAME4= <>
##$TPNAME5= <>
##$TPNAME6= <>
##$TPNAME7= <>
##$TPOAL= (0..7)
0.5 0.5 0.5 0.5 0.5 0.5 0.5 0.5 
##$TPOFFS= (0..7)
0 0 0 0 0 0 0 0 
##$TUNHIN= 0
##$TUNHOUT= 0
##$TUNXOUT= 0
##$USERA1= <user>
##$USERA2= <user>
##$USERA3= <user>
##$USERA4= <user>
##$USERA5= <user>
##$V9= 5
##$VALIST= <valist>
##$VCLIST= <CCCCCCCCCCCCCCC>
##$VD= 0
##$VDLIST= <DDDDDDDDDDDDDDD>
##$VPLIST= <PPPPPPPPPPPPPPP>
##$VTLIST= <TTTTTTTTTTTTTTT>
##$WBST= 1024
##$WBSW= 4
##$XGAIN= (0..3)
0 0 0 0 
##$XL= 0
##$YL= 0
##$YMAX_a= 51714
##$YMIN_a= -55766
##$ZGOPTNS= <>
##$ZL1= 120
##$ZL2= 120
##$ZL3= 120
##$ZL4= 120
##$ABSF1= 198.0616
##$ABSF2= -202.7028
##$ABSG= 5
##$ABSL= 3
##$ALPHA= 0
##$AQORDER= 0
##$ASSFAC= 0
##$ASSFACI= 0
##$ASSFACX= 0
##$ASSWID= 0
##$AUNMP= <proc_1d>
##$AZFE= 0.1
##$AZFW= 0.5
##$BCFW= 0
##$BC_mod= 2
##$BYTORDP= 0
##$COROFFS= 0
##$CY= -3
##$DATMOD= 1
##$DC= 0
##$DFILT= <>
##$DTYPP= 0
##$F1P= 0
##$F2P= 0
##$FCOR= 1
##$FTSIZE= 65536
##$FT_mod= 6
##$GAMMA= 0
##$GB= 0
##$INTBC= 1
##$INTSCL= 9.790993e-09
##$ISEN= 30
##$LB= 1.5
##$LEV0= 0
##$LPBIN= 0
##$MAXI= 10000
##$MC2= 0
##$MEAN= 0
##$ME_mod= 0
##$MI= 50
##$NCOEF= 0
##$NC_proc= -3
##$NLEV= 6
##$NOISF1= 182.463
##$NOISF2= 159.3651
##$NSP= 0
##$NTH_PI= 0
##$NZP= 0
##$OFFSET= 198.0616
##$PC= 4
##$PHC0= 1730.209
##$PHC1= 114.0944
##$PH_mod= 1
##$PKNL= yes
##$PPARMOD= 0
##$PSCAL= 0
##$PSIGN= 0
##$REVERSE= no
##$SF= 81.0140089999434
##$SI= 65536
##$SIGF1= 159.3651
##$SIGF2= -187.1042
##$SINO= 113.3802
##$SIOLD= 16384
##$SREGLST= <1H.CDCl3>
##$SSB= 0
##$STSI= 65536
##$STSR= 0
##$SW_p= 32467.5324675325
##$SYMM= 0
##$S_DEV= 0
##$TDeff= 32768
##$TDoff= 0
##$TI= <>
##$TILT= no
##$TM1= 0
##$TM2= 0
##$TOPLEV= 0
##$USERP1= <user>
##$USERP2= <user>
##$USERP3= <user>
##$USERP4= <user>
##$USERP5= <user>
##$WDW= 1
##$XDIM= 65536
##$YMAX_p= 317562981
##$YMIN_p= -8228579
$$ End of Bruker specific parameters
$$ ---------------------------------
##NTUPLES= NMR SPECTRUM
##VAR_NAME=  FREQUENCY,     SPECTRUM/REAL,   SPECTRUM/IMAG
##SYMBOL=    X,             R,               I
##VAR_TYPE=  INDEPENDENT,   DEPENDENT,       DEPENDENT
##VAR_FORM=  AFFN,          ASDF,            ASDF
##VAR_DIM=   65536,         65536,           65536
##UNITS=     HZ,            ARBITRARY UNITS, ARBITRARY UNITS
##FACTOR=    0.49542278885378, 1,            1
##FIRST=     16045.7642231865, 0,            0
##LAST=      -16421.768244346, 0,            0
##MIN=       -16421.768244346, -8228579,     0
##MAX=       16045.7642231865, 317562981,    0
$$ Real data points
##PAGE= N=1
##DATA TABLE= (X++(R..R)), XYDATA
$$ [...]
41903D565757p63072m85188m94240n69281m92035l14786j80932j15203q2664q6795
41893I81561j22472j41896j27502j18804j32592j27744p6005j0512J6653j1161
41883A29526o6030r6620p4950l7619m1330o5923l2872N4157Q5288J7461l4688
41872a63600L0237J35977J48143P7398L5971N2091O0122L3398q27m6063j13618
41861B49229j46086q6955J747J6759j9253j815O5055O8195k5791j20876j42116
41850a41907j06949l8111O0917J28825Q3196l5802q7321k8550L3122K0129j1536
41839a23987O536N1314P6069P4481L8886l4612p2850J0457J44109J44042j7920
41828B96525j49435j15946j8776L235j7188M063K7752m050k0837M1790P2989n0503
$$ y = [4565757, 3802685, 3317497, 2823257, 2253976, 1761941, 1447155, 1266223, 1151020, 1068356, 981561, 859089, 717193, 589691, 470887, 338295, 210551, 134546, 124034, 140687, 129526, 63496, -33124, -108074, -145693, -187023, -252946, -285818, -231661, -146373, -128912, -163600, -133363, 2614, 150757, 228155, 264126, 316217, 376339, 409737, 408910, 362847, 249229, 103143, 16188, 17935, 34694, 15441, 13626, 78681, 146876, 121085, 209, -141907, -248856, -286967, -226050, -97225, -14029, -49831, -137152, -165702, -132580, -112451, -123987, -117451, -66137, 9932, 84413, 123299, 88687, 15837, 26294, 170403, 314445, 296525, 147090, 31144, 12368, 15603, -1585, 2478, 30230, 26180, 5343, 47133, 120122, 69619]
41816F9619k16110k02056p585J50821J55817R8962O7356K2885n9525j10491r2579
41805a22886o5264n7127n293J04671J63837R7581k490n681P0941J01842L1852
41794C11983p4763j38221j39185r9068m3629O034L5975M0237J9795n378N768O9526
41782a0926J34670J29605N2225l2153p8246r2792q4458m8447o216P211L767K0581
41770e179L4323j5652j04955j26645n0105K7838M1059N0574J06006J25431L1607
41759A14302q2563p3444K0061K5404q9881j57410o2296Q3509J04872J842p5602
41748a91206l9031M8757Q4632M9996O166O050L7432M8733J7281k4628m0625m3582
41736d0025o5825r3541q2556l7398j1281j0846K6335J13992J49394M8568r5444
$$ y = [69619, -146491, -348547, -356132, -205311, -49494, 49468, 116824, 139709, 80184, -30307, -122886, -188150, -245277, -250570, -145899, 17938, 115519, 113029, 107348, 178289, 280131, 311983, 237220, 98999, -40186, -139254, -182883, -176849, -140874, -100637, -80842, -86220, -80452, -10926, 123744, 253349, 305574, 273421, 195175, 102383, 17925, -30522, -36738, -29527, -25760, -5179, 29144, 13492, -91463, -218108, -268213, -240375, -199316, -148742, -42736, 82695, 114302, 31739, -41705, -21644, 3760, -86121, -243531, -305827, -222318, -117446, -115604, -191206, -230237, -181480, -96848, -46852, -40686, -34636, 2796, 51529, 68810, 44182, 3557, -40025, -105850, -199391, -281947, -319345, -330626, -341472, -315137, -201145, -51751, -3183, -98627]
41725i8627j03499L9019J41556O6923p6369r4381J5620Q0549J8975n3597k2133
41714h5964N8095P3665L5556L4127P0572O1387p909n7687n1749m3420n5665k9468
41702A540N4300J06466O1868p187o340K2070k6385j26209j38894k5344Q3286O7530
41690F6701k7427q1792o7503m4993l8576o666O1282R4259K9353q0856j04800J0836
41678a90182J56556J73303M1409r3774j00319j0354M8753K5249k5383n4282p4850
41667a03874r2733o6836J3536P6869N8954N447J3320Q5056J17627N2338l3713
41656A25991l3817L6158O2932K371o1047n2446k7029p4553j51138j19643L8617
41645b53604J70869J61070Q4926P0900R5064L9668r1141j58184r4065O180L6528
$$ y = [-98627, -202126, -163107, -21551, 45372, -30997, -125378, -109758, -29209, -10234, -63831, -85964, -27869, 45796, 81352, 115479, 186051, 247438, 239529, 181842, 130093, 86673, 31008, 1540, 55840, 162306, 224174, 216987, 210647, 232717, 206332, 80123, -58771, -84115, -829, 66701, 39274, -42518, -110021, -155014, -193590, -200256, -138974, -44715, -15362, -96218, -201018, -190182, -33626, 139677, 181086, 87312, -13007, -23361, 25392, 50641, 25258, -29024, -103874, -196607, -263443, -249907, -173038, -114084, -108637, -95317, -10261, 107366, 159704, 125991, 92174, 128332, 191264, 193635, 132588, 80142, 53113, -21440, -172578, -292221, -253604, -82735, 78335, 163261, 234161, 329225, 368893, 277752, 119568, 25503, 31683, 68211]
41634F8211J2837J881R156M485p559j0257j9182m4923n3219j7724K4568K4192
41622g534o215j7254O758M7169Q8420J10910Q0901j819p5532q4305m5834q206
41610H7459K1364N0478M7985j0338p2539o5832m220L6073L5121L9088N4293K3840
41598B42772o6635j40311j27503n5841j055J0306P908J3635J0334k4981p3051
41587b04422p2297J1003J12819J19148J0364r5894r2757j5394M4037Q5044J53801
41576E5452K00462J27516k6573j03375n0885J0909k882j9620K5426M4982n3279
41565B08133j80134j70219j7649J24534J48285Q0690l418n0512k6929M9630Q6071
41554B48482J3888r7056j16501l4915L1598J4582l2305m4552l1381k1376j2873
$$ y = [68211, 81048, 82929, 92085, 96570, 89011, 78754, 59572, 14649, -38570, -56294, -31726, -7534, -13749, -31003, -24245, 22924, 111344, 222254, 303155, 301336, 225804, 141499, 95665, 87459, 108823, 159301, 207286, 196948, 124409, 58577, 54357, 90430, 125551, 164639, 218932, 242772, 176137, 35826, -91677, -147518, -148573, -138267, -130359, -116724, -106390, -131371, -204422, -276719, -265716, -152897, -33749, -23385, -119279, -212036, -227430, -183393, -98349, 55452, 255914, 383430, 356857, 253482, 202597, 213506, 210624, 191004, 216430, 261412, 208133, 27999, -142220, -159869, -35335, 112950, 193640, 190222, 139710, 112781, 162411, 248482, 262370, 165314, 48813, 13898, 45496, 60078, 27773, -16779, -48160, -69536, -82409]
41543h2409j2115m1250p4578m4115N2419J23041J05467M9774K6703K1928j2209
41532A12656n5558n1226p866Q705j8688k9687K0737Q8744R0947Q230q6344j08848
41520b8198n9218j1434o344N971P9989J64355J47172J2986j15322j20502k4815
41509D4640N6056N4122L648k2842K923M2241L5426k4978p5552n9007k795K2572
41497G6454Q340N496K1067K74o4167r1601l2447M6297N9293K5540J8021L8928
41485A11495K9764k0639o0102n6023k6490M644K4037J1718k9292l8380L5000J31882
41473A17614J32578K1130p6538n4382L9883Q3252M1180j0666q342J9209L867o4496
41461B44289j21536j02560j6574O0643O3021k747o7774o6105N903Q1616Q2136
$$ y = [-82409, -94524, -135774, -210352, -254467, -202048, -79007, 26460, 76234, 102937, 124865, 112656, 57098, 5872, -1994, 6711, -11977, -41664, -20927, 67817, 158764, 166994, 80650, -28198, -87416, -98850, -105194, -99223, -19234, 145121, 292293, 305279, 189957, 69455, 44640, 100696, 154818, 158466, 135624, 138547, 180788, 216214, 191236, 115684, 56677, 53882, 76454, 84794, 90290, 111357, 111631, 47464, -44137, -76584, -30287, 29006, 54546, 72567, 111495, 141259, 120620, 60518, 4495, -21995, -17351, 6686, 18404, -10888, -49268, -14268, 117614, 250192, 271322, 194784, 140402, 180285, 263537, 304717, 294051, 285709, 304918, 308785, 244289, 122753, 20193, 3619, 64262, 127283, 124536, 56762, -9343, -3440, 78176, 160312]
41450A60312K690o8711n0991K2984M9741P05m8759n0165m8484o8502l4504R9622
41438c4062K18109J75069K2026m3219M0450J13234L8596j02752j48427q2909k1922
41427A74193k6715m4330j5515M9454J07509J27446Q8506q504j10776j39165p3359
41416A28744J0583J4507p1294j46589j02981M8971J70752J38871r275j09263n8978
41405A4048O6342J16764N0688l5554n1876k7650m7147j07840j07675R089J47820
41394B7009J64349N0138n7176n8134n824M194k3138k6285j1140k8140n8247l3268
41382e5662L6580O4364K6348n074R707K0733m554k2167q956j7983p1991r5908
41370a24563l4303M6822O2834M0739N0205O9894L4018l1970l9751J4508L7788
$$ y = [160312, 163002, 94291, 43300, 66284, 116025, 116730, 67971, 17806, -30678, -99180, -133684, -34062, 184047, 359116, 381142, 337923, 378373, 491607, 530203, 427451, 279024, 196115, 174193, 147478, 103148, 87633, 137087, 244596, 372042, 460548, 452044, 341268, 202103, 128744, 139327, 153834, 82540, -64049, -167030, -118059, 52693, 191564, 182289, 73026, 14048, 80390, 197154, 247842, 212288, 160412, 132762, 85615, -22225, -129900, -120811, 27009, 191358, 241496, 184320, 126186, 120362, 124556, 101418, 75133, 63993, 35853, -22394, -55662, -19082, 45282, 71630, 66556, 76263, 96996, 92442, 70275, 61319, 43336, -28655, -124563, -158866, -112044, -49210, -8471, 41734, 111628, 145646, 113676, 73925, 88433, 126221]
41359A26221k1563j07780j37119q0108L0965J21341J18044L2099l0538r32N1047
41348A01677K5456m3235l7738N2324J13371Q1266J5833j5522k0195j6736J0730
41337B67231N1566M6699k3647r4313r8420m6615K195L082n0932j15245j07443
41326a65842K355J25030J49436Q6289K5227k0684j00222j72244j31934q181L8148
41315a72622l5492p9460o145O1168Q465p0157m5516K1022L049n6437l0871N4290
41303c48706P2435K6682L0109Q6099Q3672L840n2284m3844k6815j0334M6097Q9351
41291d3698K0088r8560q8966M1302P1187q0530k00486j11832M8349O2444k7012
41280d07714k4873Q4906J43831R7002N0171O0600O0859R476l9617m7853m4194
$$ y = [126221, 104658, -3122, -140241, -220349, -189384, -68043, 50001, 82100, 51562, 50630, 101677, 127133, 83898, 46160, 98484, 211855, 293121, 308954, 293432, 273237, 256501, 267231, 318797, 365496, 341849, 247536, 149116, 102501, 104696, 107778, 56846, -58399, -165842, -163487, -38457, 110979, 197268, 222495, 201811, 101589, -70655, -202589, -210770, -172622, -208114, -287574, -293719, -232551, -224086, -294243, -339759, -318737, -315688, -372125, -402996, -348706, -276271, -249589, -219480, -133381, -49709, -45869, -98153, -141997, -168812, -179146, -133049, -43698, -23610, -122170, -211136, -169834, -98647, -179177, -379663, -491495, -443146, -380702, -407714, -432587, -347681, -203850, -106848, -56677, 3923, 64782, 74258, 34641, -13212, -57406]
41269e7406m0927j0437L4061M2893L0843O0891J08148O5393p2913j55491p5085
41258g0030P5164J30363O1651l3160q5271j00984q4953k0288O7306J03085N0402
41247I3285l6837p3725l6519K0650L3635K715r574L7130R3571P1005l9861j41813
41235A3662j42949n8784K7066P0143Q7309R1034N9488j5092q9929j12003p8141
41224a48196l2739j3575j8764k4391j3720J7275O2304R3992O6672l6515j57403
41213b05060j98231j21726P414R7761J21496J06424P0250R037o0194r3608o6724
41202c33161K205P7716J29707J33379Q1119J956n6762p2627n4939j8117K0831
41191h8693L0217n607m6227l6386R581K2393j1107j9649L6691Q9560N8621k5383
$$ y = [-57406, -98333, -108770, -74709, -31816, -973, 59918, 168066, 233459, 160546, 5055, -70030, 5134, 135497, 197148, 163988, 78717, -22267, -107220, -127508, -60202, 42883, 93285, 56448, -17277, -53796, -33146, 489, 3204, -6370, 30760, 124331, 195336, 155475, 13662, -129287, -188071, -161005, -90862, -3553, 87481, 146969, 131877, 41948, -70055, -148196, -180935, -194510, -213274, -237665, -251385, -234110, -171806, -77814, -11142, -47657, -205060, -403291, -525017, -517603, -419842, -298346, -191922, -121672, -112635, -172829, -266437, -333161, -330956, -253240, -123533, 9846, 90965, 92921, 36159, -36468, -91407, -109524, -88693, -58476, -64083, -110310, -146696, -137115, -114722, -125829, -145478, -108787, -19227, 39394, 14011]
41179A4011o4285k9818J5633K3451J0754J113j9065n7690q0393n4534k949K0954
41167b22818K572j4460J8598R2401J36698R0786j8999r0598n4744M1671Q8476
41156F9583M0113m2919p9520n5964j5007Q217J2024Q660P997J8009M2350P2938
41144H6481R1595Q1622M0395j4164n3211o3260o0272o5407p1567n3080p503L5912
41132e2459N4273N2939M0411R431l8231p2867p0091m6222l1140j8497K1518Q3146
41120f7789J16728Q9321K3807l5105o5876o5310k9390L0370P0129N0290j2388
41109A04787n6512m3267O990M3630L2415k1082p0063n4341L7059J30567J34158
41098B44341M7617l3679l9832n262j755m4242j04889j69051k13567j73716k1704
$$ y = [14011, -50274, -80092, -64459, -41008, -30254, -29141, -48206, -105896, -186289, -240823, -243772, -222818, -220246, -234706, -216108, -123707, 12991, 103777, 84778, -5820, -60564, -18893, 69583, 109696, 66777, -12743, -68707, -83714, -75497, -63473, -54813, -46816, -28807, 13543, 86481, 178076, 259698, 300093, 285929, 232718, 169458, 109186, 43779, -27788, -80868, -88371, -52459, 1814, 54753, 95164, 104595, 66364, -6503, -76594, -122816, -153956, -172453, -150935, -67789, 48939, 138260, 162067, 126962, 61086, -4224, -33614, -3244, 66885, 117175, 104787, 48275, 5008, 11998, 55628, 88043, 66961, -3102, -57443, -20384, 110183, 244341, 291958, 258279, 218447, 213185, 211430, 167188, 62299, -106752, -320319, -494035, -515739]
41087e15739J39821J64366N4172l2251P71N9243J9158p4335p4850L9043J23382
41076i7219O7131o0509j03591p820J28367J68955P6159o2046j23688p0362K6124
41065e8499O8938K8560n4039j21648j32551p0914L0882R7900Q5574L7127K5061
41054f3609M6304K9754m9209j18602r8131p45P9833O5658l1761j19924j11040
41043c71472j8380M7981J2367o3019n8354L7250J13424R8171M8453M7559Q2969
41032b3051Q2289K5610l6107n3192k5059J0168Q046l9705p7755l5136P7857J59769
41020G3734J33677L5337m3278n7650k6305J0397O721o5556j62160j80305q2292
41009c57680L9848Q3120O6385O8523Q3636M1517n0960j01565p2990l1123k9824
$$ y = [-515739, -375918, -211552, -157380, -189631, -188860, -129617, -110459, -184794, -259644, -220601, -97219, -30088, -90597, -194188, -202008, -73641, 95314, 171473, 109427, -14261, -84623, -58499, 10439, 38999, -15040, -136688, -269239, -340153, -309271, -211371, -125797, -88670, -63609, -17305, 12449, -36760, -155362, -253493, -254238, -174405, -108747, -140508, -260432, -371472, -389852, -341871, -329504, -392523, -450877, -413627, -300203, -202032, -153579, -106020, -23051, 59238, 84848, 48741, -4451, -29510, -19342, -11296, -51001, -128756, -163892, -86035, 73734, 207411, 242748, 199470, 141820, 115515, 125912, 132633, 67077, -95083, -275388, -357680, -317832, -234712, -168327, -99804, -16168, 25349, -25611, -127176, -200166, -231289, -261113]
40998b61113l4495N941Q0474J42261J58965J17215L1707l8335m1472q874j0204
40987A42070l7193j9590L9393N5751J6844J2859O2924M6869r5285k21511j77347
40976a74216l0712L5799M26J097Q9365J59109J31312N3101k0156r8784j66993
40965b0652j50849m6048L6939L1403J4642O5187J18347P2204l6766q5019m5677
40954d6289k586j31P208M7866P3354L4200m9077j13804j09388k2564R7764J43376
40942E9929M2437j32861k18143j42105o114M9737Q318l6235j1678N9909J07971
40931b18835R3858M2798Q583P636L00m2214p4495l1866N9273R7242M8009m728
40919a4439O961K9788j2127p8621p2399j66L6543N565j5224J6177L1647k0500
$$ y = [-261113, -295608, -289667, -209193, -66932, 92033, 209248, 240955, 202620, 161148, 152274, 142070, 104877, 85287, 124680, 180431, 197275, 210134, 273058, 319927, 224642, 3131, -174216, -204928, -169129, -168703, -167606, -78241, 80868, 212180, 265281, 245125, 146341, -20652, -171501, -217549, -180610, -149207, -134565, -69378, 48969, 121173, 84407, -612, -46289, -48875, -49006, -41798, 6068, 79422, 113622, 64545, -49259, -158647, -181211, -83447, 59929, 102366, -30495, -248638, -390743, -396857, -347120, -338802, -375037, -386715, -326806, -218835, -124977, -82179, -73596, -65960, -65660, -107874, -182369, -214235, -154962, -57720, -9711, -14439, -7478, 22310, 10183, -68438, -140837, -141003, -104460, -98895, -114119, -97942, -66295, -86795]
40907h6795p1632l7507M3744P2696M0842K1026L2515K3707j2160j3196L3149M7661
40895I4050j7748r8701j18959r8573r0716p6039r913P0695Q8059M8781K7643L5200
40883a46221Q268n5778o7032J1635Q4848N5695l7065q3563m8448J7591O4510P0189
40871a25371K1990n4917q4285k9320L3700J3298n2936m6959M8697J21994R4745
40860e9364J6663l1646l9882l2002q338K5322L3072K976k2836r303L1265Q7170
40848f903J66597K31184J92283L8156j06587j26240n9062j6068j5351J587L4975
40837C34571K7051k0265m2879l0298l6151o4004n1929N638K9756p842k5912K8096
40825A45832P3922J6571r9329j46912q9500n897L8123N8653Q9138J15948J01460
$$ y = [-86795, -158427, -195934, -152190, -79494, -38652, -17626, 14889, 38596, 26436, 13240, 46389, 94050, 76302, -22399, -141358, -239931, -330647, -406686, -416599, -345904, -257845, -209064, -181421, -146221, -137953, -193731, -260763, -249128, -164280, -108585, -145650, -229213, -277661, -260070, -195560, -125371, -103381, -158298, -242583, -271903, -238203, -224905, -277841, -324800, -276103, -154109, -59364, -42701, -74347, -114229, -146231, -154569, -129247, -96175, -93199, -116035, -125338, -94073, -6903, 159694, 390878, 583161, 621317, 514730, 388490, 329428, 313360, 298009, 299596, 334571, 361622, 341357, 298478, 268180, 232029, 168025, 116096, 121734, 151490, 143648, 117736, 145832, 219754, 236325, 136996, -9916, -99416, -105313, -67190, -8537, 80601, 196549, 298009]
40814B98009L3267o3148j35373j29592m0831N6708O6051k6305j23997j23755l1779
40803b20745M9530N0230J4438K7989Q9046J04904K6852o9631q1289j2360M3741
40792B2705L4140n097k2037q960J3386J9584j1610o1742n8430L5584J30736R9440
40780A87699l5599j05842k3502J01374J29016P5588M4963N5516M2102j5965p3655
40769C81695j04657j15547q8367M264J23872J77268J15214k3659j60219k25032
40759H4832j84278p1837J8473K3841j8399l4229j3614O602K3553O0508J03446
40748a102J18426J12860J10052Q7258J5340o4526q7278o4532n0989l7441J8346
40737A56414P5299M7321m2537p3127o001O9364R2359R9682J01708L4894r7431
$$ y = [298009, 331276, 268128, 132755, 3163, -37668, 19040, 85091, 58786, -65211, -188966, -220745, -171215, -120985, -106547, -78558, 10488, 115392, 142244, 72613, -8676, -21036, 22705, 56845, 51748, 29711, 20751, 34137, 53721, 42111, -19631, -78061, -42477, 88259, 187699, 152100, 46258, 22756, 124130, 253146, 328734, 373697, 429213, 471315, 455350, 381695, 277038, 161491, 73124, 77388, 201260, 378528, 493742, 470083, 309864, 84832, -99446, -171283, -152810, -128969, -147368, -181597, -195211, -188609, -165056, -104548, -1102, 117324, 230184, 340236, 427494, 442834, 378308, 291030, 226498, 175509, 138068, 156414, 231713, 279034, 236497, 163370, 157369, 226733, 319092, 418774, 520482, 555376, 457945]
40726D57945j73263j27678n8199n7123n7143L4831J51779J58301O0084k1858m2491
40715C25185n9490r4623j02660p3255m5143j8243L9280R6932Q7009L0773K3881
40704B09646P4821P5119k6678j29924j24793m1919J6026K3832L0343M9691M4423
40693B00587N929k2474j4361j280k4264p3380r7458o4439K436M9787M8330J4759
40681B4172j8411m0188n9719q0805r2861q1440l9579K0246O0402M8052N907L847
40669b50377P0646J39394J22562K7352n1022n0652r460N600o186O761N3949O7138
40657A25705j6578j54289k20647j46700j492R6381J16329J12352J08127O8151
40647H7339q615n2824k1871L4786N3453M0816L2795K6320P610l630K874r137n4247
$$ y = [457945, 284682, 157004, 98805, 41682, -15461, 19370, 171149, 329450, 389534, 367676, 325185, 265695, 171072, 68412, -4843, -49986, -68229, -28949, 67983, 154992, 185765, 209646, 284467, 359586, 332908, 202984, 78191, 36272, 52298, 76130, 106473, 156164, 200587, 206516, 184042, 169681, 168401, 144137, 70757, -26701, -91140, -88704, -38917, 9413, 24172, 5761, -34427, -94146, -174951, -267812, -349252, -388831, -368585, -308183, -260131, -254224, -250377, -179731, -40337, 82225, 109577, 58555, 7903, -1557, 4043, -2143, 4618, 58567, 125705, 109127, -45162, -265809, -412509, -414001, -317620, -201291, -88939, 19188, 87339, 78724, 25900, 4029, 38815, 92268, 133084, 165879, 192199, 199809, 196179, 199053, 189916, 135669]
40634A35669p0671n159R2082J32105J04537N3103j7617j14460j73293j18962K064
40623A9398N6607K93p3561p1344l696N8345O1538J450o3118m3634O0794J17199
40611A20271K7089j02181q9706M0977Q5816k3592j13345m2620Q9226J22661P9749
40600A94345P9644J13203O6436p1472j69965j32852j2295O7093L5310p4098j57292
40589f1943j31295k4578M5931J5208n2361o0810r584K8126J6343r118K563O2419
40577a79099J26477J23233L3524n5440m0227M7285O7887j9970r1293m6117M1406
40566G666N2712M868r911J3252J4723J645K6757O4799L4627o1424j27868j08529
40554h6683l8779L3177R0931J14480Q2311J9287k1305k6756k4780k8198l3558
$$ y = [135669, 64998, 59839, 151921, 284026, 388563, 441666, 424049, 309589, 136296, 17334, 19398, 76005, 76298, 2737, -68607, -72303, -13958, 47580, 49030, -14088, -57722, 3072, 120271, 147360, 45179, -44527, -3550, 82266, 58674, -54671, -97291, -8065, 114596, 194345, 273989, 387192, 453628, 382156, 212191, 79339, 67044, 134137, 169447, 95349, -61943, -193238, -217816, -171885, -156677, -209038, -269848, -279432, -251306, -234963, -244081, -241518, -179099, -52622, 70611, 104135, 48695, 8468, 55753, 123640, 103670, 12377, -33740, 7666, 60378, 65246, 55335, 68587, 83310, 84955, 111712, 176511, 211138, 149714, 21846, -86683, -125462, -92285, -1354, 113126, 195437, 214724, 193419, 166663, 141883, 113685, 80127]
40543H0127n1049p6898o6571k67O1693O1123L6130M8700O6742K3179m8273n8236
40531G6400j5853o786l0497j335Q0592J05785L5994k8282j3102J8741j1822p5227
40519A34608j00880q2529m5895J3170Q8247J22794P8590n87m3256k8850J7040
40508A52452N5392M1682l5250j04170p8273R189L0008m7043r9698m3758L4062
40497h5407K4557k4288L828R2434J12363J8408r0665j12014m8285L4895Q9679
40486A5505J03382Q0659K9225m7458j34337j80568j35799l1757K8631L808k3130
40475b91839K9103J07018R7446L29o5809k6388O2637J05208P7671K4829j1581
40464A08624k7810l8652m6484l6610o306J2735j0983n0904l9563L8742J11520
$$ y = [80127, 29078, -47820, -114391, -114658, -52965, 8158, 44288, 92988, 159730, 182909, 134636, 76400, 60547, 53761, 23264, 21929, 102521, 208306, 244300, 216018, 202916, 221657, 209835, 134608, 33728, -48801, -94696, -81526, 6721, 129515, 208105, 207518, 164262, 135412, 152452, 207844, 249526, 214276, 110106, 31833, 41022, 71030, 23987, -75711, -119469, -85407, -60850, -85138, -81310, 11124, 123487, 141895, 51230, -60784, -109069, -74174, 15505, 118887, 199546, 228771, 181313, 46976, -133592, -269391, -301148, -272517, -268709, -291839, -262736, -155718, -58272, -57943, -123752, -150140, -87503, 17705, 95376, 120205, 108624, 80814, 42162, -4322, -40932, -47238, -34503, -45486, -96390, -135953, -97211, 14309]
40453A4309J03223K6290m3138n6265k8973n747j0891k7047j4288L7733Q5592Q5134
40441A65932N0141J8067j4353n7718o4784M039O7786M212j45654j93714p1255
40430b37301O5520P3878K4847M8994J07967P4737l9336r9695n3291K2944N6941
40419D6205M3247q429p1262p0907K7794J26182J03104q6l4775K6679N9799l028
40407B44523p4187o2855m546J8075q539m5269o1298l7143L1730J03818J18441
40396B22750P0406O796m5999q6885q8024k6842L8036K2625m9617p5049l2596k225
40384d6624r764J3388Q0689R7410J8490o4620o9173l9876m0064l3990K2026O6692
40372e416K7740m2639m4450R474K5500j1724k6263J4439N3979M3450L024k6168
$$ y = [14309, 117532, 143822, 100684, 44419, 15446, 9699, -1192, -28239, -42527, -4794, 80798, 165932, 216073, 234140, 219787, 162069, 97285, 101324, 169110, 173322, 27668, -166046, -237301, -171781, -97903, -73056, -24062, 83905, 158642, 119306, 19611, -33680, -10736, 46205, 89452, 81023, 9761, -61146, -33352, 92830, 195934, 195848, 161073, 187752, 247551, 244523, 170336, 107481, 102935, 121010, 112471, 67202, 5904, -31239, 491, 104309, 222750, 293156, 299952, 253953, 167068, 79044, 52202, 90238, 112863, 63246, -11803, -44399, -46624, -56388, -43000, 37689, 135099, 153589, 88969, 19796, -20080, -60144, -94134, -72108, -5416, 22324, -20315, -64765, -55291, -29791, -41515, -67778, -53339, 640, 44090, 47114, 20946]
40360B0946l0177r928K9750O4119N5008j1721j04962j63745j37707l5444O8240
40349b55621J04513Q4730O2078L8479j7119o7622k8286Q9779J63181J26136N2744
40338C52992J6922j5511p8292j05697n1140k701m7888j05392m4350Q4088J02169
40327A05200k3478j27784q2536N3072J50699J61036J00111o999j11434j46685
40317G1202j03147m5654k6321l0284k5239o844K2495O1458Q0049M0672l5709q2609
40305g9931p8861o3434m9288K225R5103J59793J41552P2142J5674r636k2983l9058
40293A43298o5394j02176j22230r3124l6507j5532m3148n7379j3356N5175R5257
40282b55116R8194O9191m696j04739j49855q0468N1919J31490J00959L532p6483
$$ y = [20946, -9231, -19159, 10591, 74710, 129718, 117997, 13035, -150710, -288417, -323861, -255621, -151108, -66378, -4300, 34179, 17060, -50562, -78848, 10931, 174112, 300248, 352992, 369914, 354403, 276111, 170414, 119274, 116573, 68685, -36707, -81057, 3031, 105200, 81722, -46062, -128598, -75526, 75173, 236209, 336320, 329321, 217887, 71202, -31945, -77599, -103920, -134204, -159443, -166287, -143792, -82334, -2285, 38387, 2678, -79931, -158792, -222226, -271514, -269289, -174186, -14393, 127159, 199301, 214975, 205339, 182356, 143298, 77904, -24272, -146502, -239626, -276133, -291665, -334813, -392192, -405548, -350373, -255116, -156922, -87731, -92427, -197166, -347021, -427489, -375570, -244080, -143121, -139589, -216072]
40271b16072q2129j4827O9072J05536Q5383N2077L4259K1612J5436M0987P9192
40260A90526N2615o5097j77353j68658m8511O8578R9265N1128k2620o2755k3017
40249a05899P8496J40136P9582n0681j19399q1686j2280K4683M7249P4209O6014
40238A40424K266n4129m0591N881N714l9325n5188j4024L2961M5628M5793N4775
40226A30185M4630m674m7106k8838J8594P982p7512j47425j18932k2458M8472
40215a97082N9548N1279M6860J6780m2998o5230k122P8191O3260m1492j02568
40204a35574l6730P2616R3023K2524k9453j5119l354m5022p8770l1954N1384O7686
40192f8743Q298l0438J0844Q2953J15037R8276M9154m0683j58367k21666j53255
$$ y = [-216072, -298201, -313028, -243956, -138420, -53037, -960, 33299, 54911, 70347, 111334, 190526, 243141, 178044, 691, -167967, -216478, -147900, -48635, 2493, -20127, -82882, -105899, -27403, 112733, 192315, 141634, 22235, -59451, -71731, -47048, 201, 74410, 140424, 142690, 88561, 47970, 53851, 59565, 20240, -34948, -48972, -16011, 29617, 75410, 130185, 174815, 170141, 123035, 94197, 112791, 120773, 43261, -104164, -223096, -245554, -197082, -137534, -86255, -39395, -22615, -65613, -130843, -132965, -54774, 8486, -33006, -135574, -172304, -99688, -6665, 15859, -13594, -28713, -32067, -77089, -155859, -187813, -136429, -68743, -60445, -90883, -80039, 2914, 117951, 216227, 265381, 224698, 66331, -155335, -308590]
40181c08590O783J23564J09653M622q8974j08424o2240O40K9872M658m9403p7290
40169d15129m0391M9009J33829J54058R7948J9018j4025O062J8680k2360q8924
40158a02225j23136j09712o7852j761Q6854J52428J34088L8507n4996q4113n6942
40147a88860q751M4262Q7787R3559N5797J3859P069K8596M8929N9926O4879M7770
40135C54822n969o5221p2588k0545K3987j866o8615q0042N089J11235J35527P2665
40123C88479O61m2662r1924j47924j33838k2704P1050L0359q3175j08705k6101
40112a66484K2818l0795p4570o490R7741J15352P3994Q5010J39657J19658j674
40101C74217j06909j05689m1034J5391O5506J16041J01012k6113j72755j88975
$$ y = [-308590, -301807, -178243, -68590, -63968, -152942, -261366, -323606, -322966, -293094, -288436, -337839, -415129, -455520, -406511, -272682, -118624, -20676, -1658, -15683, -9621, 9059, -13301, -102225, -225361, -335073, -402925, -404686, -317832, -165404, -31316, 7191, -47805, -131918, -188860, -197611, -153349, -65562, 27997, 83794, 97653, 104722, 133318, 182247, 242173, 307052, 354822, 348853, 283632, 211044, 190499, 214486, 212620, 144005, 63963, 69052, 180287, 315814, 388479, 389140, 346478, 254554, 106630, -27208, -49912, 21138, 51497, -31678, -140383, -166484, -143666, -174461, -249031, -255521, -157780, -42428, 31566, 116576, 256233, 375891, 374217, 267308, 161619, 120585, 135976, 201482, 317523, 418535, 392422, 219667, 30692]
40091C0692o3079N8437O3281K90k6560j3853l2238q7640j03204m0845M2062Q3954
40079h8703R7646J15827J17139O6334j0554n5894o3827p3373r2375q9128n4789
40068a31697j8080J217M598r722k9314k477R5456J78965J26097m9818j91273j87732
40056b13780q8925P480Q1855J41782J39390M2196o7502p1931J9804P9178K9825
40045I9372o2267q5203j4873O9258P6397P54o9772n0312L9980J05602R8057N4159
40033B61152O718n7932j19587r8780J5582R6805L6809q8294j15408j4077J00384
40022B3372J40754J19141O3605j4351o8598n1415q426k8382q6534o2487N7299
40011H3978J29639O7796k2172j0906N2371K6319r7353j78515j19307K7748J41392
$$ y = [30692, -32387, 26050, 89331, 89621, 63061, 49208, 16970, -70670, -173874, -214719, -172657, -88703, 8943, 124770, 241909, 308243, 297689, 241795, 177968, 104595, 12220, -76908, -131697, -149777, -148560, -143962, -153684, -182998, -185475, -90019, 88946, 215043, 165225, -26048, -213780, -302705, -295225, -213370, -71588, 67802, 109998, 42496, -29435, -9631, 69547, 99372, 37105, -48098, -62971, 6287, 82684, 83438, 13666, -36646, 3334, 108936, 206993, 261152, 267870, 209938, 90351, -8429, 7153, 103958, 140767, 52473, -62935, -77012, 23372, 164126, 283267, 346872, 332521, 263923, 212508, 204082, 175700, 89166, 26679, 83978, 213617, 281413, 259241, 248335, 300706, 327025, 229672, 51157, -68150, -40402, 100990]
40000A00990J49136O3939l6878o8476j9039L3010J7784l5216n3542l7468m6096
39989F8144q2246p8166j1355M6972L9048J0197L4931R9509J24757Q2180J9028
39978C52999k7563p2755j24571j44816j05888m1310J779K4866M8686N6964K6130
39967e479j5628k4328j5370k7583k7631N1343J66456J73140K5646j29157j33378
39956C8031j7578O5169M4917j7683n0284m2477j5183R695J4733Q463J9584L8113
39944I5500J5268l8195l5389L8247N9504m3238j33906n1528J27264J88629R8868
39933C21024K1477K9623J8206o3100j02462l2132M2316K2454k7943j6632K4999
39922B37830L4649L9875P2776P8260K2060j8684J0708K7678m1629j09127o1633
$$ y = [100990, 250126, 314065, 277187, 208711, 189672, 222682, 240466, 205250, 151708, 114240, 68144, -14102, -92268, -103623, -56651, -17603, -7406, 27525, 127034, 251791, 333971, 352999, 325436, 252681, 128110, -16706, -122594, -163904, -162125, -137259, -88573, -31609, -5479, -21107, -45435, -60805, -88388, -116019, -64676, 101780, 274920, 300566, 171409, 38031, 20453, 85622, 130539, 112856, 62572, 20095, 4912, 14607, 29340, 37803, 57387, 95500, 110768, 72573, 37184, 75431, 134935, 91697, -42209, -93737, 33527, 222156, 321024, 342501, 372124, 390330, 327230, 224768, 192636, 234952, 257406, 229463, 212831, 237830, 272479, 312354, 385130, 463390, 485450, 466766, 477474, 505152, 463523, 354396, 292763]
39911B92763M2647O9054J9830o880m166l3960o8691l1169L7105K3056n4217n9863
39899B25509L0866R3129O3936K9833N6149P6317J9489o9762j10464r3376n1140
39888B70486L045N8018R0930J05567J26143J38816J06109M1600r129n5959j34262
39877G41364j93114j38230m302M8575m4699j59468j62215p1727K1493Q3220J08885
39866B29782P4404j881l7493m204K0566o590j1361M7998O1635o5293k16852j99393
39854a08682k3444J09573Q9083J0498n802L0891N2114M2549K3076J533o954K5851
39842B40286P8770O8241m7802j87588k17128r3100R3046K02758J68110L9545o6509
39831B78629p5191j5095L0387J9657k1070n3515o6641n4335R75Q9797J44632R1992
$$ y = [292763, 335410, 404464, 424294, 417414, 413248, 379288, 310597, 279428, 316533, 339589, 285372, 225509, 256375, 349504, 413440, 443273, 499422, 575739, 595228, 525466, 415002, 321626, 270486, 273531, 331549, 422479, 528046, 654189, 793005, 899114, 940714, 931585, 875626, 741364, 548250, 410020, 405718, 454293, 409594, 250126, 87911, 16184, 37677, 120897, 229782, 304186, 302305, 264812, 260608, 281174, 274584, 263223, 311221, 372856, 307563, 90711, -108682, -132126, -22553, 66530, 77028, 71226, 102117, 154231, 196780, 219856, 221389, 214435, 240286, 319056, 387297, 339495, 151907, -65221, -158321, -65275, 137483, 305593, 345138, 278629, 203438, 188343, 218730, 238387, 217317, 163802, 97161, 42826, 43801, 133598, 278230, 370222]
39819C70222n5433j87814k04576j20994l9812j9450j3640L7135J00828R2625n272
39808d6181j19969j74022j41571l3147J05515J84204J40942L8346O017O6508J08253
39797A34895O1485m733j7301j9627o6386r7525m1059L1897m6j00893j17242k0558
39785b57093M6736P60n2521J1900J46674K06362J44841M4060k0856n9853j09681
39774A01329j55941j39429l1140J08747J66781R5492j9906n5329K536N5113L7744
39763A65997k186P063O0025R6970Q1959K4160m0032o0940j5447M2630K3932p3769
39751C10362j42255j03924j5029K7614J8942O554k1328r7417j54172p4152J17687
39740a27118K34238J57411p230q4046n6208l7534o5050m9378N7108J58140J38841
$$ y = [370222, 314789, 126975, -77601, -198595, -238407, -257857, -271497, -234362, -133534, -40909, -46181, -166150, -340172, -481743, -514890, -409375, -225171, -84229, -45883, -39866, 26642, 134895, 196380, 191647, 174346, 154719, 88333, -9192, -50251, -18354, -18400, -119293, -236535, -257093, -210357, -209597, -262118, -250218, -103544, 102818, 247659, 291719, 270863, 211010, 101329, -54612, -194041, -225181, -116434, 50347, 145839, 125933, 70604, 73140, 128253, 165997, 163811, 170874, 230899, 327869, 409828, 433988, 393956, 333016, 317569, 360199, 384131, 310362, 168107, 64183, 49154, 76768, 95710, 102264, 80936, -16481, -170653, -244805, -127118, 107120, 264531, 257301, 173255, 117047, 79513, 14463, -34915, 22193, 180333, 319174]
39729C19174K2244o8707o6716j0776L7079N4695L7314k0396r1616j15451o7646
39718B9198m323M589l3665n2854k6190M048M057M238M1948Q2233N0476n5450j34696
39705h6391r2574M4261J51436J35943J8398j02732j38708o7187N9949J52129J51514
39694B26038Q3324J5992k6233o9843j10004r2978j8351J5008n7538j39946q6128
39683b60659Q4615J96819J54133N2792K0510M6426M1235j3340o1965p4508o5202
39672A20856l9316P414M8868M6331N77n2735q4689p9482l0169L2617M2857k0843
39660g714q7610p7590m376N6476O9675N4113K5428j0613k9417j3941R653J6641
39648G25L1748P1532Q3123K2943m4629l0050K9162J7369p0124j17627p9540m4209
$$ y = [319174, 341418, 272711, 205995, 195219, 232298, 286993, 324307, 303911, 212295, 96844, 29198, 24875, 29464, -4201, -57055, -83245, -79197, -75140, -70902, -28954, 53279, 103755, 48305, -86391, -178965, -134704, 16732, 152675, 171073, 68341, -70367, -137554, -77605, 74524, 226038, 309362, 325354, 299121, 229278, 119274, 26296, 7945, 22953, -34585, -174531, -260659, -176044, 20775, 174908, 227700, 248210, 294636, 335871, 322531, 260566, 186058, 120856, 81540, 88954, 137822, 184153, 184730, 131995, 47306, -32176, -62345, -29728, 13129, -7714, -95324, -172914, -177290, -120814, -51139, 2974, 28402, 17789, -11628, -25569, -15916, 725, 32473, 104005, 187128, 210071, 165442, 135392, 164554, 181923, 111799, -5828, -85368, -129577]
39636a29577o8977q2892k0954N7780P1194M3826M5141O7135N5364J3916n333J2516
39624E9139L8049M5602J6930o1993j54650j72792q3146L0882P8087P9313J03042
39613b1537J32711R6863K803o3760o6271m8568l5981k180M6193M7469j0066m2187
39601C5489J1066P9668N4486m6297q4715J3013J48168J68379N8288m8784m7996
39590C40765J2347J9347m3457r3020q3592o3294p9281j00795p5801j2986L4259
39579a45508L2508r978n3610m6081K3884Q3234M8755m3729o9391K36M7471k421
39567a34630n9394k6235L5295K3604j2453L7777J32204J29595K9418k6684N936
39556A34433K1795k0309k2701M5783N7546n3756j47351q9682K3157K4583m5013
$$ y = [-129577, -198554, -281446, -302400, -244620, -173426, -129600, -84459, -17324, 38040, 51956, 46623, 59139, 97188, 142790, 159720, 97727, -56923, -229715, -312861, -281979, -203892, -124579, -21537, 111174, 208037, 210840, 147080, 80809, 32241, -3740, -5920, 40273, 87742, 77676, 35489, 46555, 126223, 180709, 134412, 49697, 62710, 210878, 379257, 437545, 388761, 340765, 353112, 372459, 329002, 235982, 152390, 89096, 9815, -90980, -166781, -179767, -145508, -113000, -122978, -176588, -222669, -198785, -115551, -66796, -110525, -179916, -179680, -132209, -134630, -194024, -220259, -184964, -161360, -173813, -136036, -3832, 125763, 155181, 128497, 134433, 156228, 135919, 113218, 159001, 216547, 162791, 15440, -74242, -51085, -26502, -71515]
39545g1515j3736J21337J71550M5645j14620j42194n3468K4171L4278J6632J1294
39534B9374J8958L2757M8171M6985J2140l9819o6804m8074j1517m316l3379m6208
39522f1732N460Q6349J05598M1641j5737N919M5762L465q6041q4305L4935J20477
39510B01791N2904p7100r3795J8970J07982O7503m1259j04657r7398o4843l5366
39499f5268j0980j733q589J649M7349P8829L7098m3883o4539J657O7398N7258
39487I6246P982k565L0271N7166O4765O9196M5298m5949j55177j63380m2757P5499
39475C6595N6111o4782j29390o1877M9668Q1242K1196m1317l9090O007L3342K4594
39463b7701J4307L2648O4237P3888N5302L2501J8998J991k6090m2959k0802L4860
$$ y = [-71515, -85251, 36086, 207636, 253281, 138661, -3533, -57001, -32830, 1448, 18080, 29374, 48332, 81089, 129260, 176245, 188385, 148566, 81762, 33688, 22171, 17855, -15524, -61732, -56272, 30077, 135675, 177316, 161579, 167498, 213260, 216725, 130684, 46379, 81314, 201791, 254695, 177595, 83800, 102770, 210752, 278255, 236996, 132339, 34941, -29902, -65268, -76248, -77981, -86570, -84921, -37572, 41257, 78355, 34472, -30067, -28410, 38988, 96246, 104228, 101663, 131934, 189100, 253865, 323061, 368359, 322410, 167233, 3853, -38904, 36595, 92706, 27924, -101466, -163343, -113675, -32433, -11237, -52554, -91644, -85637, -52295, -27701, -13394, 19254, 83491, 157379, 212681, 245182, 264180, 266171, 240081, 197122, 176320, 211180]
39451B11180Q5100R2592M9111k3027q4239r7673n4778J0448M2999J8108k8244
39440B21577l5209Q812M5315J7492n3490r6087q1894m6481j5453L1948J01396
39429I7926J42853J15377M7644j3178o7015j19209j24919n4163K9585N0835M6909
39418A52645R4632J37220M0014j60501k37746q9570Q3329M8590j26198j84464
39408b42049n4646P9656P6986J7390K9315R1507J06806P1479N5341O3292K7291
39397C22368o7801j38229j09588j9269K9766j076m3426k1391L9977N1341k601
39386D0071k7951M0597J29082J21821K9270l4285k7557k9851q8772j26223o0712
39375c4510N3890R5221L4482m8061q4574q0074o0767l4925j2738n444P842O0089
$$ y = [211180, 296280, 388872, 437983, 414956, 330717, 233044, 178266, 188714, 231713, 249821, 221577, 186368, 195180, 240495, 257987, 204497, 108410, 26516, -19965, -35418, -3470, 97926, 240779, 356156, 403800, 390622, 323607, 204398, 79479, 25316, 54901, 105736, 152645, 247277, 384497, 424511, 264010, 26264, -63306, 20023, 68613, -57585, -242049, -296695, -217039, -140053, -122663, -93348, -1841, 104965, 176444, 231785, 295077, 322368, 254567, 116338, 6750, -12519, 17247, 16171, -27255, -48646, -8669, 42672, 40071, 12120, 52717, 181799, 303620, 332890, 298605, 271048, 241197, 152425, 26202, -34510, 19380, 114601, 149083, 101022, 16448, -63626, -124393, -159318, -172056, -177500, -169658, -109569]
39363a09569J28362J37655N9529l4140m9397K3048J06280J22599N8951l3588q5319
39352C24411o9067k8966k6573n2523l5193M1756Q9668L7200m8425m6047M1022
39341B27263R3355O2723L6557P5866J01196K3124r7933j30425o0807P751J9969
39330C58639J6698K3012O978k6829j4645M8693O7548j4884j16261j28579o5071
39319A55299j2804N766L0877O1606N4562J7431J2003N3759Q6248P3408M7581L8307
39307F24043J6240m8820j17760j21443n4431J2774J8325k1438m1972j7857O881
39296B54542j1096m1958k5228K4954K4171m9634r8612l7667O9617Q7742m976r2687
39284I9168q1088o07O4555Q0146O3875L5823N525j6538k0433j587L4645N9558
$$ y = [-109569, 18793, 156448, 215977, 181837, 132440, 155488, 261768, 384367, 443318, 409730, 324411, 255344, 226378, 199805, 147282, 112089, 153845, 243513, 280713, 232288, 186241, 227263, 320618, 383341, 419898, 495764, 596960, 620084, 522151, 391726, 330919, 338670, 358639, 375337, 398349, 405327, 378498, 363853, 412546, 480094, 465210, 348949, 220370, 155299, 142495, 148261, 179138, 240744, 295306, 312737, 324740, 378499, 464747, 538155, 585736, 624043, 640283, 591463, 473703, 352260, 297829, 310603, 328928, 307490, 265518, 247661, 254542, 243446, 201488, 176260, 201214, 225385, 175751, 77139, 39472, 109089, 196831, 191855, 99168, 18080, 17473, 82028, 162174, 226049, 261872, 267397, 250859, 230426, 228839, 263484, 323042]
39272C23042L3081l8656q3309m8196J8961L7736J8769L4289P6032N1709n2951
39261C70507j18913n9686M8041P6939K3068j9523q405J7692L3010N3860P2965
39250D89555M7237k7074q7001p9547k8083L050j3375m4924m2949M770O3133Q9006
39238C73798P6354M9897J9121l1940j01640j52134j53147j12728m4814N1843J47403
39227A22013J61515N6721p2053q1864L3422J15289L5943j32525k03628j06533
39217g1700L7839Q1031K3944j7369J6189O2388M7416j3136n8089o6688m9349k412
39205i936O0137O9311j8146j21071j10712J2288J10112Q9916J274o7977r2617
39194g7421p1876M684R7509J20724O9964M9654J01126J14286J1795r1990n9781
$$ y = [323042, 356123, 317467, 234158, 185962, 204923, 242659, 261428, 295717, 371749, 423458, 370507, 251594, 191908, 239949, 316888, 339956, 320433, 312028, 329720, 362730, 416590, 489555, 536792, 509718, 422717, 343170, 315087, 318137, 304762, 259838, 216889, 221659, 284792, 373798, 450152, 500049, 519170, 487230, 385590, 233456, 80309, -32419, -77233, -25390, 122013, 283528, 340249, 268196, 186332, 219754, 335043, 370986, 238461, 34833, -71700, -33861, 47170, 71114, 53745, 69934, 132322, 179738, 166602, 108513, 41825, -7524, -9936, 50201, 119512, 101366, -19705, -130417, -118129, -8017, 81899, 83173, 15196, -77421, -149297, -144613, -47104, 73620, 143584, 193238, 294364, 408650, 420445, 328455, 268674]
39183B68674L2620Q632j13224j39210j5591Q3425L8980l0023K3880J31795J16899
39172D06857l5975j62364j40779j7877Q7710J16923Q6914L6035j6567p2522j26651
39161A61704j45497r8961j9362R158n2439j36140j31942p688J51278K19612J51719
39150A01442L1910j0956M7914J01951O6152Q00Q965O0811L7261o5494j11416l2572
39138B36768O8653Q1980L4840r51l6883j00846j34745p8891M409J2075l8770m8165
39126e26R99L3509K0177Q615J8634J6732O60O778K3750j338n9348q2095o2699
39113g6152o5285r2287n9162N4950J45295J31337O3971J4502l4848r8308r0808
39102a06795M6089J95586J89590M7487n1559k6857J5482k5353r8823j06352m5169
$$ y = [268674, 301294, 309926, 196702, 57492, 41901, 125326, 164306, 134283, 158163, 289958, 406857, 370882, 208518, 67739, 49862, 137572, 254495, 341409, 377444, 360877, 288355, 161704, 16207, -82754, -102116, -92958, -145397, -281537, -413479, -421167, -269889, -50277, 101442, 133352, 122396, 170310, 272261, 338413, 339213, 348178, 408989, 446250, 380756, 269340, 236768, 305421, 387401, 422241, 421290, 384407, 283561, 148816, 69925, 74334, 86409, 47639, -526, 473, 33982, 54159, 62774, 81408, 98140, 98800, 105578, 129328, 127990, 68642, -13453, -76152, -141437, -233724, -292886, -237936, -92641, 38696, 102667, 117169, 82321, -15987, -106795, -60706, 134880, 324470, 371957, 320398, 293541, 309023, 283670, 184847, 78495, 33326]
39091C3326K4464P9113J22000J26808P0387o011l3705j445M4457O8861P2340O1928
39079F62523M0938J9380l1l2959p8005r2846m9890M984N713l2547k9923L5026
39067D52363Q4672M9140m1841j07912j14525q2547l8620lJ5015L971o217M302
39055B17798J4319k974k9077k4948N855K2673J1609j171l118j6695n1125p0983
39043G2163l9747K5997O9373N2831m710m2336r252Q0095J42604J03509j4285j01959
39031C34283q1268J0254O8784M2172k6659o7035o0554m0161k8725r176L5639P9872
39019B57426Q3159N4194M4181O5085N8313k1166j23188j54094r4673j5690K0261
39008A73808J9290Q965j5909o7305j16371j12848m7532L1021O9085O4235N5449
$$ y = [33326, 57790, 136903, 258903, 385711, 456098, 450087, 416382, 414937, 459394, 528255, 600595, 662523, 703461, 722841, 722810, 689851, 611846, 519000, 469110, 474094, 479807, 447260, 417337, 452363, 537035, 586175, 544334, 436422, 321897, 239350, 200730, 200727, 215742, 219713, 213496, 217798, 232117, 229143, 200066, 175118, 180973, 203646, 215255, 214084, 210966, 194271, 143146, 72163, 32416, 58413, 127786, 180617, 175907, 133571, 124319, 204414, 347018, 450527, 436242, 334283, 253015, 263269, 332053, 374225, 347566, 280531, 219977, 179816, 151091, 141915, 177554, 257426, 340585, 394779, 438960, 504045, 562358, 541192, 418004, 263910, 169237, 153547, 173808, 193098, 202063, 186154, 118849, 2478, -110370, -157902, -126881, -57796, 6439, 61888]
38997F1888N7959L5418l3266q3245k7604R9880J51572O4383l4005n477Q3766N8308
38985D29577r0721j78263r2574N5156J08128O9747M5165O5047O6521N121r1757
38974C91147j59319j42276m6151L5101R276p0274m6182J08500K12085J20071n9968
38963C52010j25483o2358j5720l4510k4037N1193Q9588K1875p4601r1748k6269
38952E9940N2817R7060R5274N7395J3291j7626n7701j16167j26072k8810R5026
38941A24427J03166Q534k2695O8456J24491J1833j56976j70387r754J38765J32124
38930C51984J7536o3149l0610P7674J54977J23174J2627o9191o3755j5998J5881
38919E11150L9951P5414Q3667K1991p8138j49027j65839j37236o7562J4329M5837
$$ y = [61888, 119847, 155265, 121999, 38754, 11150, 111030, 262602, 326985, 292980, 287503, 371269, 429577, 338856, 160593, 68019, 123175, 231303, 301050, 346215, 411262, 477783, 482904, 391147, 231828, 89552, 43401, 78502, 87778, 17504, -28678, 79822, 291907, 411978, 352010, 226527, 164169, 148449, 113939, 89902, 141095, 230683, 252558, 177957, 86209, 59940, 112757, 209817, 305091, 362486, 375777, 358151, 300450, 184283, 58211, 29401, 124427, 227593, 236127, 213432, 281888, 406379, 418212, 261236, 90849, 81095, 219860, 351984, 369520, 306371, 275761, 353435, 508412, 631586, 644213, 575022, 511267, 495269, 511150, 551101, 626515, 710182, 732173, 654035, 505008, 339169, 201933, 134371, 148700, 194537]
38908A94537J8569J6524Q9173J52206J11806K2249m271R319m4455j40431j31741
38897B93485J006Q9084L1815m6784l694R4011Q8064j0852m4140M3132J25106R0842
38885G51075n013m0638N461M9739K4774n0367j06554r4903k4491M9658P8470O5931
38873G03142N3742N6027L6647k7346q7448p4493j073M2366J1767k7565o345L3307
38861G12728N545o6401o9730J6596P2137J6985n9272l6696M9189P4994L0411J8804
38849G65290P2840J06940P4645M4118O4715P1668K688p8858p4044n030J9089l3393
38837A030668q1616o1526j0444j185m6444r5878r7881m4503K8139P2279O7792
38826G59401L0367j7474o5196r8098r1698m4400O349K4412J3205m257j6249j0718
$$ y = [194537, 213106, 229630, 318803, 471009, 582815, 605064, 600793, 610112, 565657, 425226, 293485, 294491, 383575, 415390, 368606, 364912, 458923, 546987, 536135, 491995, 535127, 660233, 751075, 746062, 705424, 710885, 760624, 785398, 735031, 628477, 533574, 509083, 558741, 637211, 703142, 756884, 812911, 849558, 822212, 734764, 660271, 659198, 701564, 713331, 685766, 679421, 712728, 718273, 651872, 582142, 598738, 670875, 687860, 628588, 591892, 641081, 716075, 746486, 765290, 838130, 945070, 1019715, 1063833, 1128548, 1200216, 1202904, 1124046, 1050002, 1044972, 1064061, 1030668, 949052, 887526, 877082, 875897, 829453, 733575, 635694, 591191, 619330, 691609, 759401, 789768, 772294, 707098, 609000, 517302, 472902, 479251, 503663, 516868, 512611, 496362, 485644]
38814D85644L1859R8363J29169Q9903K8974J2944L2163L0925N103p505j8121p2842
38802H46579j40344j18740O487J09892R4922K7946J9256M7615J7299o0752q0392
38791G69768k1692J6597j1257k5545K7883P7849O0186L9886R0670J41150P8913
38780A244408m8293q9866k9565l125o5031j03582m2651L0687L3505M0022J36310
38769A102819K34184J91910N1096k0092J1688J8032n4102r9957n8275k4029o9928
38758A283346r9568l638J43099J86002J28372J13091J85840K23673J27526l2392
38748B255351j20592j05269n8317l5306k2030J3639O8155J10468J21015J11065
38738B338179J06320J15623J22867J13002R3527P7519N6305Q573o5897j37548
$$ y = [485644, 517503, 615866, 745035, 834938, 863912, 876856, 909019, 939944, 945047, 937542, 919421, 846579, 706235, 587495, 593982, 703874, 798796, 826742, 845998, 893613, 910912, 850160, 769768, 748076, 764673, 753416, 727871, 755754, 833603, 893789, 933675, 1024345, 1165495, 1244408, 1196115, 1106249, 1076684, 1073559, 1008528, 904946, 862295, 892982, 926487, 966509, 1102819, 1337003, 1528913, 1580009, 1559917, 1571605, 1589637, 1535535, 1435578, 1377303, 1353274, 1283346, 1183778, 1180140, 1323239, 1509241, 1637613, 1750704, 1936544, 2160217, 2287743, 2255351, 2134759, 2029490, 1971173, 1935867, 1913837, 1927476, 1995631, 2106099, 2227114, 2338179, 2444499, 2560122, 2682989, 2795991, 2889518, 2967037, 3023342, 3031915, 2966018, 2828470]
38728B828470j72752j60017j15324o9428m3670l2113j5138R663K7392L5470M3720
38717B336273L9909k934o4687p0319J5310J21848J54762J16747Q9969J11704J31280
38706B979862R3916J0783o6899r7829o4075K0078R8737J17009R0297R1746J53669
38695C427294K23175K39123K12046J93396J95925J84654J35136P1401M7503J00265
38685E029918K08216K95297K99789K45764K17664K58198L28552L80108M17297
38676G680803M63185N09756N42528N76985O27369O73873P09542P86037R49802
38667A3519880J152374J292885J348967J406185J554461J812012K156379K565926
38659B6809069L008721L450301L913782M498135N301606O345392P591654R020924
$$ y = [2828470, 2655718, 2495701, 2380377, 2310949, 2267279, 2235166, 2220028, 2229691, 2257083, 2292553, 2336273, 2376182, 2373248, 2308561, 2238242, 2253552, 2375400, 2530162, 2646909, 2736878, 2848582, 2979862, 3073778, 3084561, 3017662, 2919833, 2855758, 2875836, 2974573, 3091582, 3181879, 3273625, 3427294, 3650469, 3889592, 4101638, 4295034, 4490959, 4675613, 4810749, 4882150, 4929653, 5029918, 5238134, 5533431, 5833220, 6078984, 6296648, 6554846, 6883398, 7263506, 7680803, 8143988, 8653744, 9196272, 9773257, 10400626, 11074499, 11784041, 12570078, 13519880, 14672254, 15965139, 17314106, 18720291, 20274752, 22086764, 24243143, 26809069, 29817790, 33268091, 37181873, 41680008, 46981614, 53327006, 60918660, 69939584]
38651F9939584J0693490J2767881J5446853J8830543K2776802K6896589L0581876
38644B07933618L2844097L2136280K6770672J6126781J751533j2904297k4227981
38637B80430703l0306991l1465367k9370561k5784605k1908971j8374164j5420278
38630A07799766j3017201j0995954r237461p771017o666264n859073n158895m446669
38622D4647232l796080l345268l096667k914726k689071k411317k103706j780399
38614B2509998j502931j364873j360260j351938j240200j086994r95549r47262
38606A2659991q64279p65835p26088p12935o18205m45264l19125k91793k87593
38597G628874k78652l47462m92402n34320l55866j12306l8839j28927j81561j20446
$$ y = [69939584, 80633074, 93400955, 108847808, 127678351, 150455153, 177351742, 207933618, 240777715, 272913995, 299684667, 315811448, 317562981, 304658684, 280430703, 250123712, 218658345, 189287784, 163503179, 141594208, 123220044, 107799766, 94782565, 83786611, 74549150, 66778133, 60111869, 54252796, 49093901, 44647232, 40851152, 37505884, 34409217, 31494491, 28805420, 26394103, 24290397, 22509998, 21007067, 19642194, 18281934, 16929996, 15689796, 14602802, 13607253, 12659991, 11795712, 11029877, 10303789, 9590854, 8972649, 8527385, 8208260, 7916467, 7628874, 7350222, 7002760, 6510358, 5976038, 5620172, 5507866, 5469027, 5340100, 5158539, 5038093]
38587E038093p0125j10355j48798j00462l4349m5424r8316j06036p9872q8427
38577D155929j20994j03378k7514L3080L5947J5642O699r574n7753j18758j56304
38566C653022j62053j52176j39592j27077j15187j05462j01199j04915j06610
38557B538751q1990k0803M6181P2256N4133M6124R7730J84319K18849J40704j5500
38546C280754j52075k07740k08450k13002k32443k30067j87711j33660r9885q5157
38536A530564p4185o5058n8740m3162j0003K3657K6536j8607r8802j69141j73120
38525H69939r5098M448M1366N439l1413j5807K4685M1884L7589L5007K7687P747
38513I53473L552K9319L3969k7217r7236p9798J1168N6659J805o8775o0520L341
$$ y = [5038093, 4967968, 4857613, 4708815, 4608353, 4574004, 4528580, 4430264, 4324228, 4244356, 4155929, 4034935, 3931557, 3904043, 3937123, 3973070, 3988712, 3995411, 3985837, 3928084, 3809326, 3653022, 3490969, 3338793, 3199201, 3072124, 2956937, 2851475, 2750276, 2645361, 2538751, 2456761, 2435958, 2482139, 2554395, 2608528, 2654652, 2752382, 2936701, 3155550, 3296254, 3280754, 3128679, 2920939, 2712489, 2499487, 2267044, 2036977, 1849266, 1715606, 1615721, 1530564, 1456379, 1391321, 1332581, 1289419, 1279416, 1303073, 1329609, 1311002, 1212200, 1043059, 869939, 774841, 779289, 820655, 826094, 794681, 778874, 803559, 845443, 883032, 918039, 945726, 953473, 957025, 986344, 1020313, 993096, 895860, 816062, 827230, 883889, 885694, 816919, 756399, 759740]
38501G59740L6577J3845k2222m1427n2113o1201n7405l5604j0586m147k4610m8893
38489D51954l1047M1707J08265R5934K2920k2877j5011j8389o0966p0309n4O9039
38477E71166M6297j9350j4858O0714J11514J02902Q0119M7814l4279j32038j50645
38466F69356r0309n3662o5448l1980O4718R3436o001q0027J7522J80245J96028
38455H93878N9331m5649k9690J9627K9839L3216M1489K717o6917o1001M1404J12765
38443A031009O2964l5461q5147j02630j26337j08685k0648L9901j5737j01902
38433E37327p9170J8586L9302l7340p5450j1162O0848O5640O0711J04541J40638
38422H24471J00360K6334L101L4357P2788J12961J68060J98815J55787P1287L0308
$$ y = [759740, 796317, 810162, 787940, 746513, 694400, 633199, 575794, 540190, 529604, 525457, 500847, 451954, 420907, 462614, 570879, 666813, 689733, 666856, 651845, 633456, 572490, 502181, 502127, 571166, 617463, 598113, 583255, 643969, 755483, 858385, 938504, 986318, 952039, 820001, 669356, 579047, 525385, 459937, 427957, 492675, 586111, 580110, 500083, 517605, 697850, 893878, 953209, 907560, 877870, 897497, 927336, 960552, 1002041, 1004758, 937841, 876840, 918244, 1031009, 1093973, 1058512, 973365, 870735, 744398, 635713, 615065, 654966, 639229, 537327, 458157, 476743, 516045, 478705, 403255, 392093, 452941, 518581, 579292, 683833, 824471, 924831, 951165, 954266, 988623, 1061411, 1174372, 1342432, 1541247, 1697034, 1768321, 1798629]
38411A798629N7107R4200Q8713M2909j8906q2529j39931j91342k46149k86964
38401A115737k52653j12275N3474J11750L2151p6144j03780o1162k3578j2231
38391F71289M493J8680k5266j26748j83554j07073M4078J11083K6520r6126j01447
38380B35929J7981J27134J27148N7515M802j9215n5210r7830r2469k4144N0019
38369C31660O7895K0505o2331j39767j63133j02170M612O7476M7749P510J9527
38358I9533O4582P2337L6079J5765L4688N1245M7324O2958J02881Q6292l7250
38347F36434j74963j86278p1640K6311J6401l4814k2209M7390P9718K5790o2999
38336B79141r5416k4998J07541J96388J61106L3819p2381r3495o9566n5687m4024
$$ y = [1798629, 1855736, 1949936, 2038649, 2081558, 2062652, 1980123, 1840192, 1648850, 1402701, 1115737, 863084, 750809, 804283, 916033, 948184, 872040, 768260, 707098, 683520, 671289, 675782, 694462, 669196, 542448, 358894, 251821, 295899, 406982, 433502, 337376, 235929, 253910, 381044, 508192, 565707, 570509, 551294, 496084, 398254, 305785, 281641, 331660, 399555, 420060, 357729, 217962, 54829, -47341, -42729, 24747, 72496, 80006, 99533, 164115, 236452, 272531, 288296, 322984, 374229, 421553, 484511, 587392, 673684, 636434, 461471, 275193, 203553, 229864, 246265, 211451, 189242, 236632, 316350, 342140, 279141, 183725, 158727, 266268, 462656, 623762, 657581, 585200, 491705, 422139, 366452, 322428]
38325C22428j5704l528l4251n7959j6253N1210N4135j1563o1307n2593l1414l6488
38313A06713l8811n294M1433N8541L3433j9591p0447p4186j1790O2909P1878J6745
38301A71533k2125L191N8723R4743R2566M0398n5903j24436q0408M4643J16594
38290C39519P3322r155n7237q8900j08408m8324Q3860J29368r280j76285j50771
38279b2291L3881J39649O8504l0467j7857N2844P3641N1262M1387K6171l2502
38268C84222q9571p3462o960K2029p757k9105N836O4169R2472Q6574P6049P1892
38256E96388O1677M3901L3121K3484k0624j07805j74876j47802m6261K6861J5124
38245C03188k6943k2766L0184Q5841J10540P8570k4202j38062j47477l7193M6104
$$ y = [322428, 306724, 303196, 268945, 210986, 194733, 245943, 300078, 288515, 227208, 174615, 143201, 106713, 67902, 62608, 104041, 162582, 196015, 176424, 105977, 31791, 20001, 82910, 154788, 171533, 149408, 152599, 211322, 306065, 398631, 439029, 383126, 258690, 178282, 222925, 339519, 412841, 403686, 346449, 257549, 149141, 100817, 184677, 314045, 304765, 128480, -22291, 11590, 151239, 219743, 189276, 171419, 224263, 297904, 349166, 390553, 416724, 384222, 294651, 221189, 214229, 236258, 228501, 199396, 205232, 269401, 361873, 448447, 524496, 596388, 658065, 701966, 735087, 758571, 737947, 630142, 455266, 307464, 261203, 288064, 303188, 276245, 253479, 283663, 369504, 480044, 558614, 534412, 396350, 248873, 211680, 257784]
38234B57784j3406j18442r3937N2621J54579J37201Q2426M8296k793o7070o1583
38223C75676J5438M2008k8085o5772K9625J50539J29731j9898j38573j33313m8657
38212C08719L0394M9230m526p7803p8563Q145Q3130P5166M5112O6007Q4976J9971
38200F09958p6491q6861j6540K7974J9229K0113K7697l4401j45557j65299m0376
38189A39446R3243R3536k256o0921m4747k4908m8037q0722p8293m1964J584L7437
38177a6602O5016P9916O7465K3354k0225j4585M0579Q0337N4309n161l5492l1564
38165B87347k4150k596O2002J30094J18409K0497p6126j07655r2570n8035L640
38154B60857O9795O4857l8104j55735j92275j48649q1950j1173P0348J31901J32399
$$ y = [257784, 244378, 125936, 31999, 84620, 239199, 376400, 458826, 507122, 504329, 437259, 375676, 391114, 433122, 405037, 339265, 368890, 519429, 649160, 629262, 490689, 357376, 308719, 339113, 388343, 383817, 306014, 227451, 235596, 318726, 393892, 439004, 505011, 589987, 609958, 533467, 446606, 430066, 458040, 477269, 497382, 525079, 490678, 345121, 179822, 139446, 232689, 326225, 323969, 263048, 218301, 193393, 145356, 64634, -13659, -55623, -54039, -16602, 48414, 128330, 195795, 219149, 198924, 184339, 224918, 305255, 359564, 354403, 318911, 287347, 263197, 260601, 322603, 452697, 571106, 591603, 515477, 407822, 315252, 257217, 260857, 330652, 395509, 357405, 201670, 9395, -139254, -221204, -232377, -162029, -30128, 102271]
38143A02271R2556P2378Q1849P1075J1419o2107r8734q6594m8892j0134K2450
38132A47537N3294P8217P4784K9777k5794m1102j2972R680M066P409M1780N9299
38120D25975J8644k8142l311O4372O6047k1119q5850m1334M4758M7468l5951q8110
38108C63447m2707K8703K7647l5268o7123k6916K4638J4895m4999q0812n0570
38097A10935J3221N6350O6754O3967M3514k3969j22312j61219p1798Q0085J40902
38086A96430N1493p5284r8249j5912O7601R6271R5417P7409K0527m7446m7845
38075C20412K7062P7331L1181n7035r9312r1179p1417l6252K3190N5335J3402
38064A92718n4102o9538m7287n0946n9778O119J30832J90149J21716J1102l3134
$$ y = [102271, 194827, 267205, 349054, 420129, 431548, 369441, 270707, 184113, 135221, 125087, 147537, 200831, 279048, 353832, 383609, 357815, 316713, 303741, 313421, 317487, 324896, 366676, 425975, 444619, 416477, 413166, 477538, 543585, 522466, 436616, 395282, 440040, 487508, 451557, 363447, 320740, 349443, 377090, 341822, 274699, 247783, 272421, 287316, 242317, 161505, 110935, 124156, 180506, 247260, 311227, 354741, 330772, 208460, 47241, -24557, 55528, 196430, 247923, 172639, 74390, 58478, 126079, 222350, 317767, 395176, 415703, 368257, 320412, 347474, 424805, 455986, 398951, 299639, 208460, 137043, 100791, 123981, 179316, 192718, 138616, 69078, 21791, -29155, -88933, -82814, 48018, 238167, 359883, 370985, 337851]
38053C37851j4085p549m0992o2800j8562O4460Q0144l6066j83114j70414K6741
38042b4386J83845J10951o7353q3736P2611J45472J5090j20794o4329Q6787J15541
38031C69699J1883n7390j9870L9780N5686O2211R1267J05973O4963j6311q4514
38020F23377r2697l8700J3773r199q5956j08918m0115K1327r501o8152m7813K9629
38008A87055N8012J3275l4450m3026l0894j2138R171N897k6633k9666K7050O3901
37996A87554P889o4139k9040P8573J14634N3825Q854K4516K1217l1475n1656o508
37984C14244J6081l5402q5188p1180m7412o2273n7668J3891Q3252Q1198O0210
37973B09753Q6979J07081M5455l6481k8143L8339L4492m9052q3097p114P6903
$$ y = [337851, 323766, 316217, 275225, 212425, 193863, 258323, 338467, 302401, 119287, -51127, -24386, 159459, 270410, 203057, 119321, 191932, 337404, 352494, 231700, 167371, 254158, 369699, 381582, 324192, 304322, 344102, 399788, 461999, 553266, 659239, 724202, 707891, 623377, 530680, 491980, 505753, 496554, 410598, 301680, 261565, 282892, 273391, 205239, 157426, 187055, 245067, 258342, 223892, 180866, 149972, 137834, 147005, 152902, 126269, 96603, 123653, 187554, 195443, 131304, 102264, 180837, 295471, 349296, 358150, 382666, 403883, 372408, 320752, 314244, 330325, 294923, 209735, 138555, 91143, 28870, -28798, -14907, 68345, 149543, 209753, 296732, 403813, 449268, 412787, 384644, 422983, 457475, 408423, 325326, 318212, 395115]
37962C95115N7443m0410j09594r2045j6593M1789J6924q4002j55537r1364P2928
37951e346J74698J13906k7364r8509o5868k3023l9825p3198m4975M3654J16982
37940G1132J23927Q8321N7180M0589K7720K9450O0742R3527P6515Q660m7769m1671
37928E88323R204M4481J7957p1467j67967j80211o8209Q2256J33881O8535J6824
37917D73607P9098J86323K01053R9432k6862j10884j60159j78177j30830j7250
37907D15351R0703J17344O1705j2091m2271k1759l051m6089j39362j90055j29798
37896A00627j3951L6227j3584p3073n2244L3841J10857J42616J38415R9901J9821
37885E29453p1297j09225o7938N14K3915m826k8685j2734N318k5520q5468j03001
$$ y = [395115, 452558, 412148, 302554, 210509, 193916, 235705, 252629, 168627, 13090, -78274, -5346, 169352, 283258, 255894, 157385, 91517, 68494, 28669, -44529, -89504, -45850, 71132, 195059, 283380, 340560, 381149, 408869, 438319, 499061, 592588, 669103, 677763, 629994, 588323, 597527, 642008, 659965, 588498, 420531, 240320, 172111, 254367, 388248, 456783, 473607, 552705, 739028, 940081, 1039513, 1012651, 901767, 741608, 563431, 432601, 415351, 506054, 623398, 685103, 673012, 630741, 608982, 605931, 559842, 420480, 230425, 100627, 86676, 122903, 109319, 36246, -15998, 17843, 128700, 271316, 409731, 509632, 529453, 458156, 348931, 280993, 281507, 305422, 300596, 271911, 259177, 264495, 238975, 153507, 50506]
37873E0506n4949j620o173n5849q5984n2877L8844J50008K21038K02793J06556
37862E12293O74o8044j16208j57363j44938m4871P1988R6005L0535p842M4377
37851B16606J13028J04389L5995r246j0500j8869n7753q1732m7708J9029N5294
37840C18533L4463j2881m4648n1704n0042m4399k1090K1529N7345O1059L7120
37829C05285M816k8475n6989n6155n591P2215J27355J36393J14175P8503M0966
37818G32498L1595Q1557J61098J81512R8816j2623l4330N9130J77353K28808K22469
37807A927883K40794L32086M45903M70371L31029O2890k10887l79103m24659m05968
37797B390339l71986l22954k54067j94433j69784j53913j04988l9998j6895l7180
$$ y = [50506, -4443, -6063, -12236, -68085, -154069, -206946, -168102, -18094, 202944, 405737, 512293, 512967, 444923, 328715, 171352, 26414, -18457, 53531, 149536, 180071, 172229, 216606, 329634, 434023, 470018, 460772, 450272, 431403, 373650, 291918, 244210, 263239, 318533, 352996, 340115, 295467, 243763, 193721, 149322, 128232, 149761, 207106, 268165, 305285, 310101, 281626, 224637, 168482, 162891, 235106, 362461, 498854, 613029, 691532, 732498, 764093, 845650, 1006748, 1188260, 1287076, 1274453, 1240123, 1299253, 1476606, 1705414, 1927883, 2168677, 2500763, 2946666, 3417037, 3748066, 3810956, 3600069, 3220966, 2796307, 2390339, 2018353, 1695399, 1441332, 1246899, 1077115, 923202, 818214, 778216, 761321, 724141]
37787G24141l2075K4333N5143q286j11476j53134j34181j28292j27012m3756J10025
37776A75430J89351J18478P148k6240l4349j15623k01277j40564L5872J21965
37766A30191K9318r0964q1260J2176N6338M1992N1186Q5189O1544l3367j03896
37755A58447p6200P782N3326K2463l6872m2272M3620J59893J87661P6888q6101
37744D68635j78161j79485j55999j29181n6041N3602J03231M6350k3056N877J00654
37733E6426J38401Q8175L7336L4277J3167p8369j64698j36170j1196Q1102O6652
37722A25103j030l7725k7641l185J5521K3327J1491j3860j8813J7331O3318O8524
37710B22361K4901k7865n0616l7264o935J5583J3761j1308m2335n8117m3532J000
$$ y = [724141, 692066, 716399, 771542, 763256, 651780, 498646, 364465, 236173, 109161, 65405, 175430, 364781, 483259, 490407, 464167, 429818, 314195, 112918, -27646, 8226, 130191, 159509, 68545, -12715, -539, 55799, 97791, 148977, 234166, 295710, 262343, 158447, 82247, 90029, 143355, 165818, 128946, 86674, 130294, 290187, 477848, 554736, 468635, 290474, 110989, -45010, -174191, -230232, -176630, -73399, -27049, -50105, -44228, 56426, 194827, 283002, 320338, 354615, 367782, 289413, 124715, -11455, -22651, 58451, 125103, 124073, 86348, 58707, 55522, 71043, 94370, 105861, 92001, 73188, 90519, 153837, 222361, 247262, 219397, 168781, 131517, 124582, 140165, 153926, 142618, 100283, 42166, -1366, -366]
37698c66M6650N1220J4299n732K5329M4666k3235j24684j23663o718P7753L6510
37686A2029l4236j8732L1574R072m8296k8538M2520M2863j6617K041J13096J56176
37674B62952N4125n8030n3150j307k1612q0904q0255l7126l0510m0832R91N6788
37662b8870L1010m7776n0638M3220J06433N9617k0378l4891J043J7027j563k4419
37650D9815l9716m8059l3457R574M6049L7271o840l5821j0153N9840J12917Q6872
37638B28292l597o1339k4491L6459J0823p8317r1513J6945J13355P1241m5078
37627A72780p9141j0968K8023l6460j09400o9427N1848J11293N0345l1599k4220
37616E3074L6836K7574p2471j36330p0347M1858N5985k0483m2036M9520J29034
$$ y = [-366, 46284, 97504, 111803, 106071, 131400, 176066, 152831, 28147, -95516, -102234, -24481, 12029, -22207, -40939, -9365, -293, -48589, -77127, -34607, 8256, -8361, -6320, 106776, 262952, 317077, 259047, 205897, 204590, 182978, 102074, 21819, -15307, -45817, -86649, -85658, -28870, 2140, -45636, -96274, -53054, 53379, 112996, 92618, 57727, 58770, 75797, 74234, 49815, 10099, -37960, -71417, -61843, -15794, 21477, 14637, -21184, -31337, 28503, 141420, 228292, 224695, 163356, 138865, 175324, 186147, 107830, 16317, 33262, 146617, 217858, 172780, 93639, 82671, 110694, 74234, -35166, -104593, -52745, 58548, 108893, 77294, 53074, 89910, 117484, 45013, -91317, -161664, -119806, -63821, -84304, -126340, -76820, 52214]
37605E2214O8832p4579j40064p8360P000K4721Q416L2377Q3101P9762L189o1830
37593D779l9063K6490K3641o3567j15680l3510J19888J96173J48289O1473R972
37582C38885k3178o3245p4760k9742K6364M2582M1375N9924O1671p483j04249
37571B68144j23988m8971K5427K4991k0034m7985n0441m8103m0340k2412j2485
37560i6197k1729k7197o139L0085O1181Q5312R6603P2311J4282l2452l8043k9227
37548A08790l2630j7291M9023J16597R7535j3883j25844j54528r3494J4214J09793
37537E8282J26735M2273o0638n8287N2598J29950P0830m7851q3697k9451n155
37526A95589o9741j39199j13594j0119P3092Q1011M3503J1632o651l7812q6842
$$ y = [52214, 121046, 46467, -93597, -171957, -164957, -140236, -131820, -99443, -16342, 63420, 66609, 4779, -34284, -7794, 15847, -47720, -163400, -196910, -77022, 119151, 267440, 328913, 338885, 315707, 252462, 177702, 147960, 174324, 216906, 258281, 318205, 379876, 372393, 268144, 144156, 95185, 120612, 145603, 125569, 77584, 27143, -20960, -61300, -83712, -96197, -117926, -145123, -151262, -121177, -59996, 25316, 121919, 194230, 208512, 176060, 138017, 108790, 76160, 58869, 107892, 224489, 322024, 308141, 182297, 27769, -65725, -51511, 58282, 185017, 227290, 166652, 108365, 160963, 290913, 361743, 313892, 230195, 200744, 195589, 125848, -13351, -126945, -137064, -63972, 17039, 60542, 72174, 65523, 27711, -59131]
37515e9131j11384o7308K5524R1452Q4027L4662k372k1841n2066r2323j05505
37504b76265o2471L3094J44918K05636J55585K2085p8177p0801j9413k2962o1931
37493c0702m5707J6013J8190n3472p7113J3578J13688J04679K9799J0443N6367
37482A55763P1744J6665m2823m2498L894M4742M9420J9612j9368l7813l4729l7326
37470A47283n4139o4415o9205r5100j19682p0777M7407J13417N6184j8279K0658
37459a06648J17494J13248L8o5651n414Q0296Q6982L9743m834o2697j45459j77854
37447a30756q9000O8236J65051J30754k098j38314j73916p3999O4893R9528K4508
37436e5113j5277N1426R5692j3860j80511j91572k0712J31854J09998j7875q9098
$$ y = [-59131, -170515, -237823, -212299, -120847, -36820, -2158, -4530, -26371, -78437, -170760, -276265, -338736, -305642, -160724, 44912, 200497, 222582, 144405, 73604, 54191, 31229, -30702, -76409, -60396, -42206, -95678, -172791, -159213, -45525, 59154, 88953, 99396, 155763, 227507, 244172, 201349, 158851, 162745, 207487, 256907, 276519, 257151, 219338, 184609, 147283, 93144, 28729, -40476, -135576, -255258, -326035, -278628, -165211, -109027, -127306, -106648, 10846, 124094, 124132, 58481, 53067, 133363, 220345, 260088, 255254, 192557, 47098, -130756, -219756, -151520, 13531, 144285, 142187, 3873, -170043, -244042, -179149, -79621, -55113, -70390, -18964, 76728, 62868, -117643, -309215, -329927, -198073, -88075, -105950, -195048]
37425a95048n2322K2339O9853Q9929J01057R4034M7494k5311o2984j3045Q8411
37414A64407J28926M7912p3928j04334k3765N9843N9511P001j7072Q418M3692
37403C00611N2468K6167k6701p3732o4155J2715Q8416Q5242K2201n218L6523O3940
37391E18477M82r9191j17891l8693M4144P1006Q0198J02091Q6456m042j04079
37380E38958j27839q6230m2150j89O5980J20327J08247O4784O1139O4583j0600
37369G57010j17101j02679M1248J28058M8838o3110n3147J4084j2466j06762j17180
37358D16793k4444L4370r842p1060o5301k1377o03j1616l9086p2874q5298n4719
37346e057k2291m6807r8893q8114k586P3135R2153R5383J05048P7032L007m2254
$$ y = [-195048, -247370, -225031, -155178, -65249, 35808, 129842, 177336, 152025, 89041, 75996, 164407, 293333, 341245, 267317, 162983, 139218, 199061, 258572, 265573, 248501, 256919, 300611, 353079, 379246, 352545, 278813, 214658, 227373, 315789, 401031, 423232, 418014, 454537, 518477, 518959, 419768, 301877, 263184, 307328, 378334, 458532, 560623, 647079, 643037, 538958, 411119, 324889, 282739, 282550, 348530, 468857, 577104, 641888, 703027, 767610, 757010, 639909, 537230, 578478, 706536, 755374, 692264, 639117, 653201, 640735, 533973, 416793, 392349, 426719, 416877, 345817, 280516, 259139, 258536, 246920, 207834, 134960, 49662, -5057, -27348, -74155, -173048, -261162, -263748, -190613, -98460, -3077, 101971, 179003, 182010, 139756]
37334A39756j5418K1683P666j8961J411M0806L4893q288l0032j5796J328L051
37322A62099q517l9073p9875q6981l7017K6214N2716N7180P1198O7500Q946n9292
37310A35098n8233n012L95p0312j23360q2850n546J726o5998j05811m2613P5895
37298c46621J32268O9520m4425q6552j0940J02856J41691P9781j1149n1848k4410
37287d9829L4281O9353M2806l1486q8455q1421m4083l8837n1744q173R0625J28136
37275b8827K9190j04517j04282M2154J69741J49670L6630l6682l4808j6464n964
37264I5841L2548R2166R1089q660j14540j06552k6O9272K7065m3696k7210N7634
37252A64931Q2804p218j13136j12302j8967M7370L0330k577J8658N9530M8637
$$ y = [139756, 124338, 146021, 153687, 134726, 136137, 176943, 211836, 203548, 173516, 157720, 159048, 162099, 153582, 114509, 34634, -52347, -89364, -63150, -10434, 46746, 117944, 185444, 194390, 135098, 76865, 71853, 72248, 1936, -121424, -204274, -209820, -208094, -274092, -379903, -422516, -346621, -214353, -144833, -189258, -275810, -286750, -183894, -42203, 37578, 26429, -25419, -49829, -15548, 53805, 96611, 65125, -23330, -104751, -148834, -187671, -239415, -247588, -156963, -28827, 363, -104154, -208436, -166282, 3459, 153129, 189759, 153077, 118269, 101805, 95841, 128389, 220555, 311644, 302984, 188444, 81892, 81866, 151138, 178203, 134507, 107297, 164931, 247735, 240517, 127381, 15079, -3888, 43482, 73812, 71235, 89893, 149423, 198060]
37241A98060m18j3749J4891P725o8781j36095j08550j3240N0102L9508O483J1661
37229a2403N1817P7630N5456J595l4105j6933L8189Q5623R5264O3488o929r9364
37217B99328j63045j52959r6855o6564p1744m9578J8442O0928L2961j985K7973
37206a63098R1710J19791J15778J15685R5930K2526n5690o9831m6961n2898o1518
37195A11424j0445M7437L559j01577j00436M5053J68393J36969K2861l7632k8494
37184B57112j2893j4150k5183n0725o6481k0530O1193O6929l5000j25568j08752
37173g4048m8843m3133o5154m2908N345K9815N2080R0357P7184j7381p8573j4769
37161a30028O2638N081j10614r3478M3740J08826N3438K7819Q6798Q7521m1289
$$ y = [198060, 197642, 183893, 198784, 206509, 137728, 1633, -106917, -120157, -70055, -30547, -24064, -12403, 39414, 117044, 172500, 174095, 139990, 123057, 161246, 246869, 342133, 405621, 398692, 299328, 136283, -16676, -113531, -180095, -251839, -301417, -282975, -222047, -189086, -191071, -163098, -71388, 48403, 164181, 279866, 375796, 398322, 342632, 272801, 225840, 172942, 111424, 100979, 148416, 151975, 50398, -50038, -4985, 163408, 300377, 323238, 285606, 257112, 244219, 230069, 204886, 154161, 87680, 67150, 128343, 195272, 160272, 34704, -74048, -122891, -166024, -231178, -274086, -268741, -238926, -186846, -96489, -19305, -36686, -115259, -130028, -67390, -62309, -172923, -266401, -222661, -113835, -60397, -32578, 54220, 141741, 100452]
37150A00452j51945j18380l6026m0400p9892k8238Q8047J35011P4948j4042p2949
37139a43414r5795o9043J2063R2897J16939J06538J06839Q7747o549j35349j81684
37128a08811r4625N3533J48744J28718J5825r6435j12795l3172M7354O3112M8867
37117F0315M8976L1845l5723j00220r9450p2226q7309j07343l9447J00257J87936
37106a12389J56470N8400l4569r5772j04480m4916L8512P4100O2947N9668N4930
37095A12901j1131j07030j14086j6190M6353j4064r1040n0325O7052J26574J01202
37084E0216N6371j828j06700j86730j10632R6665K30430J60023o659q3996m0368
37073E6792J4322R99o2817j26836j48512r2243L1298J33829J27110K9887n9279
$$ y = [100452, -51493, -169873, -205899, -246299, -326191, -354429, -266382, -131371, -56423, -70465, -143414, -239209, -308252, -296189, -203292, -86353, 20185, 127024, 214771, 208222, 72873, -108811, -203436, -149903, -1159, 127559, 143384, 46949, -65846, -99018, -51664, 11448, 60315, 109291, 141136, 105413, 5193, -94257, -166483, -253792, -361135, -400582, -300325, -112389, 44081, 102481, 67912, -27860, -132340, -177256, -138744, -64644, -1697, 57971, 112901, 101770, -5260, -119346, -135536, -89183, -103247, -194287, -244612, -177560, -50986, 50216, 106587, 104759, -1941, -188671, -299303, -202638, 27792, 187815, 181156, 97160, 56792, 71114, 72113, 9296, -117540, -266052, -358295, -326997, -193168, -66058, -36171, -95450]
37062i5450q3848o0961j0120O2106J05777N8058m0053n7483M1346J18761N2014
37051I0147q2986j23645n6271q934l4492m4151K2219Q9811O8602j7910q5143r3936
37039b76689n1608K0658O8916L2152n3065n6392O2133J58184R4796n0702j00149
37028a51766l4554J4533L359K8083J19571J61584Q2232j9976l5009o154k8350
37017A33553q0260q0319l8988k6677l5451k41O5779Q1067L6685J1146L3171L8426
37005A37891j0594n9554n5461k2544l813J872M328r629l1090j5554M1614P6281
36993E3747M7001l773k5613l2208m3738k9446J7980K1073o8599j48424p9977R3899
36981a98078J76680P6401q2423j40225q5813k815O5508J11790R8582L570r8496
$$ y = [-95450, -179298, -240259, -250379, -188273, -82496, -24438, -64491, -121974, -80628, 38133, 90147, 7161, -116484, -172755, -181689, -216181, -260332, -238113, -148302, -79700, -97610, -182753, -276689, -328297, -307639, -238723, -206571, -259636, -316028, -253895, -95711, -915, -51617, -151766, -186320, -171787, -168428, -140345, -20774, 140810, 223042, 203066, 168057, 161903, 133553, 53293, -27026, -66014, -92691, -128142, -128383, -62604, 18463, 55148, 66294, 99465, 137891, 127297, 67743, 12282, -10262, -14075, -12203, -7875, -17504, -48594, -64148, -22534, 53747, 100748, 96975, 71362, 39154, -4584, -34030, -16050, 5023, -63576, -212000, -291977, -198078, -21398, 55003, -27420, -167645, -253458, -256273, -190765, -78975, 19607, 23177, -75319]
36970g5319r7536N215Q8993O7837q752l5901J4475P9887R7502O4848J4796l1682
36958A84363o9539q7570p1458k9200R259K3077J1442k5977q2330j07371l4555
36947b79859J13575K00628J28844j9014p7644j8392L5019R837k3596l829N912
36936G1481n8057j22544q3217J7522M7462j2405n0875r608M1611L9073K2891M6374
36924e0292P3347L7819m3477q6488m7772L2465Q6507Q3579M2778P185N700K6291
36912A67642K6136k5378j11729j75594j63073p4061K9198Q0584P9811Q0233J06042
36901A9811J20687Q9035K3384n3081j32292j79584j35458j4794O3584K3336n3691
36890b29063m9253J2373K3726j2183Q640R8147J43233Q9950K1256P539R779j1939
$$ y = [-75319, -172855, -167640, -78647, -10810, -19562, -55463, -40988, 38899, 136401, 201249, 216045, 184363, 114824, 27254, -44204, -73404, -64145, -41068, -29626, -55603, -137933, -245304, -279859, -166284, 34344, 163188, 144174, 66530, 48138, 83157, 92994, 69398, 65569, 71481, 13424, -109120, -192337, -174815, -127353, -139758, -190633, -200241, -158630, -119557, -96666, -50292, 23055, 60874, 17397, -69091, -116863, -84398, 2109, 85688, 128466, 135651, 141351, 167642, 193778, 168400, 56671, -118923, -281996, -356057, -326859, -246275, -166464, -86231, 19811, 140498, 229533, 252917, 199836, 67544, -112040, -247498, -262292, -198708, -175372, -229063, -278316, -265943, -242217, -254400, -245760, -147613, -4380, 85570, 106826, 114365, 124144, 112205]
36878A12205j9800n89k4480j08206j32402j4898J22756J00921n9320j62766j04255
36867b90834K4550R6341R5377P0282L6087j8061p3305q4701k9537O4702J33031
36856B3932J18653K4732q2310j32291j04330j9311Q7831J72114J89809J33641
36846D12470L6805o7118j54114j79629j04494K2190P5024j559j10502j18353j2642
36835b01922J04661J40671Q4099m250l2972M1861J44629J44671K8577p0207o3244
36824C16574l0436o9512j22498p6293L5054P2897O528n3936l0606L5773P6621
36813A60166P0310K1792m3757o9210k7512K0783J2123j2855J5590N7450K3437
36802B28317n8240p5818j6191L4130N5986R9618J21858J5118j64137j96982j5125
$$ y = [112205, 92405, 91816, 67336, -40870, -173272, -188170, -65414, 35507, -23813, -186579, -290834, -266284, -169943, -74566, -4284, 31803, 13742, -59563, -144264, -173801, -109099, 23932, 142585, 167317, 85007, -47284, -151614, -170925, -83094, 89020, 278829, 412470, 449275, 382157, 228043, 48414, -56080, -33890, 41134, 39575, -70927, -189280, -201922, -97261, 43410, 127509, 123259, 90287, 132148, 276777, 421448, 450025, 379818, 316574, 286138, 216626, 94128, 17835, 52889, 125786, 132314, 78378, 47772, 83545, 160166, 230476, 252268, 208511, 139301, 111789, 132572, 144695, 131840, 147430, 204880, 228317, 170077, 94259, 78068, 112198, 168184, 267802, 389660, 404778, 240641, 43659, 28534]
36791B8534J67571J45735j2220j12648j09229q3659o7148l5307n750l694R627
36780g8188N6955O3736k0165r0104k0056J27736J75988Q4498j6545l2188j957
36769B49710J1357N836n322k0063j3593L2517O7679L1025l7106m8355k0620n2640
36757B00425j39357j56410o4698J4853j501k4642M6156J41293J29051K8191k7239
36746A46122M079L4615J1007j5131K596L7482O5309J03801J29264N8743j05667
36735D72220k05288j10092Q1159J53700O2313l7527m6792m7407j10580j42885
36725F8821m8909P5009P4477j0868j3875P3126P8685n8008j75693j45390o0684
36714a43309n5234p5343P553J51102J84037O2896o8107q2498j3510L6756L3655
$$ y = [28534, 196105, 341840, 329620, 216972, 107743, 24084, -43064, -78371, -84121, -87815, -78188, -21233, 42503, 22338, -67766, -87822, 39914, 215902, 300400, 283855, 251667, 249710, 261067, 266903, 261581, 241518, 227925, 260442, 328121, 359146, 322040, 273685, 253065, 200425, 61068, -95342, -160040, -145187, -146688, -171330, -125174, 16119, 145170, 173361, 146122, 150201, 184816, 195823, 180692, 183288, 220770, 286079, 389880, 519144, 577887, 472220, 266932, 156840, 237999, 391699, 454012, 416485, 369693, 322286, 211706, 68821, 19912, 94921, 169398, 158530, 144655, 217781, 296466, 238458, 62765, -82625, -143309, -198543, -273886, -266333, -115231, 68806, 131702, 63595, -18903, -32413, 4343, 37998]
36703C7998J4737J9775N2217Q0036O3262K895m7117m3655q262J6233L0412N1602
36691B70133N5466Q787n7547p4869l1282J7421K7862O509k9170p0919r6634p8325
36679e2568k6815Q085n318m5204o1909k6848L7300P1677M8800K1020N2870J03877
36667A24967N9617q9114j92004j31875J1789Q1859N4134J9830J4151q731n3451
36656a08828o2005j7603L2624O2613Q5392R0710N4968O268j0093j5564n0949p0830
36644c297n898Q7940Q5432k125l2480L2659O4045r790p9177m4809J5489j2115
36632I5874q9625j08940o7209k9542P034P5427J20289O1725m7534o4351M0762
36621f090J34198R2990n7380j94921k20769j18550L7151J20375O4325n3981r3483
$$ y = [37998, 52735, 72510, 124727, 204763, 268025, 270920, 223803, 180148, 171886, 188119, 218531, 270133, 325599, 334386, 276839, 201970, 170688, 188109, 215971, 222480, 193310, 122391, 25757, -52568, -79383, -71298, -76616, -121820, -183729, -210577, -173277, -101600, -52800, -31780, 21090, 124967, 184584, 95470, -96534, -228409, -216620, -134761, -80627, -60797, -46646, -55377, -108828, -170833, -188436, -155812, -93199, -7807, 82903, 137871, 144139, 134046, 118482, 67533, -3297, -9195, 78745, 164177, 162052, 129572, 162231, 226276, 216486, 137309, 92500, 107989, 95874, 6249, -102691, -169900, -199442, -192408, -116981, 3308, 65033, 17499, -46852, -6090, 128108, 221098, 163718, -31203, -251972, -370522, -333371, -212996, -148671, -202652, -296135]
36610b96135k0868N7317M7902j0624k1322L2535Q0372P3161L8304J8461Q561j1564
36598c900j7845K6425Q6844P4857k6384j16564j05760l2320Q789M362P390K3181
36586g0925J2221j2160K899L9365J9179o2221j19453j12333q8324o7437p086P7503
36574c88772Q7413Q19o1697j5715N6273M9219K705O129K9449j2117q5741p8559
36562d10594J7875R1137P5669L0345L4803Q5940J13953O0442n3390j18642m4985
36551a17447J01995J48287L8923q1080p9153j2095J0129J4853P5138J30929Q1092
36540C11571j4636j6289N7123O6243M584J214O4950M8854q0107j48771m5380J03822
36528C53178J36349P5030K4524j8023j06174j95501j95746j15662l8070O448M1439
$$ y = [-296135, -317003, -259686, -211784, -222408, -243730, -211195, -130823, -57662, -19358, -897, 7664, -3900, -21745, 4680, 91524, 166381, 139997, 23433, -82327, -114647, -105858, -101496, -94106, -70925, -58704, -70864, -67965, -28600, -9421, -71642, -191095, -303428, -391752, -459189, -466275, -388772, -301359, -300540, -362237, -377952, -321679, -272460, -269755, -263626, -234177, -246294, -332035, -410594, -392719, -301582, -225913, -195568, -160765, -74825, 39128, 99570, 46180, -72462, -117447, -15452, 132835, 171758, 90678, 11525, -570, 9559, 24412, 99550, 230479, 311571, 296935, 280646, 337769, 404012, 408596, 409810, 474760, 523614, 443507, 294736, 249356, 353178, 489527, 564557, 589081, 571058, 464884, 269383, 73637, -42025, -80095, -73647, -32208]
36517c2208O1840M4202R366p513k3224o9463j14184r0266R312J17319J61564J16313
36505A83058J2145p5240q1451k7757N59k7239m5574M67O9801R1245N6721K060
36493A58795m8830p2014l2743N8845J30026J30979Q8059L4244m3568j37091j74896
36482I1806j19561l9183p923l097J8716J8386m8962j17078r0854o123J8604k8881
36470c14150l9364M0311J29638J36418O3463k9772r3651r6819l8202L2737O5068
36459a44323P4886J02211J16897N7580m0838o6681J050N1812J1730m8491l8127
36448G7706P828n378p5283j04917m5756L9277O4428K2205k2504j5628K5961L9877
36436G816J426l8059j9300L7007N5608J7197j1927K0248P1335O1293k0329j03349
$$ y = [-32208, 29632, 73834, 83200, 75687, 52463, -17000, -131184, -221450, -212138, -94819, 66745, 183058, 195203, 119963, 38512, 10755, 11314, -15925, -61499, -61032, 8769, 100014, 156735, 158795, 109965, 37951, 5208, 64053, 194079, 325058, 413117, 447361, 403793, 266702, 91806, -27755, -66938, -74861, -77958, -59242, -40856, -89818, -206896, -297750, -303873, -285269, -314150, -353514, -313203, -183565, -47147, 16316, -13456, -107107, -203926, -242128, -209391, -144323, -69437, 32774, 149671, 207251, 166413, 99732, 100782, 152594, 164324, 115833, 77706, 85534, 80156, 4873, -100044, -145800, -106523, -42095, -19890, -42394, -58022, -32061, 7816, 9242, -28817, -48117, -11110, 44498, 61695, 49768, 70016, 141351, 202644, 182315, 78966]
36424G8966j22885q5746m7241l8335l0104K1705J05389J53780J23813M3788l4652
36413A68478r0251j10626p1294R721M5509j6024r7668q7407o2N3366L9171K7971
36401a29116M6204L0042l8295p2847k3666L4534K8557N462L8808R9156J14513
36390A33352R2962Q5311P8632K7041n2792j10700j46990j74359j44554k5219R0194
36379a47122Q0386j4840m1810L1465P5286K0105l6090q189K9905j5910q4066n0289
36367a61169O6664J23636N6420m8413q8432n8744j1503K2850M1607M6448M6544
36356C5908N7636P6392P3835K9008m1941r7670j06004o6187m297N0954Q4417Q3390
36344A75441L0262o3980j32413j08924j8527M1151K2904k3171m5349n8072p1046
$$ y = [78966, -43919, -129665, -176906, -215241, -245345, -223640, -118251, 35529, 159342, 203130, 168478, 78227, -32399, -103693, -93972, -48463, -64487, -162155, -249562, -249624, -196258, -157087, -129116, -82912, -52870, -91165, -164012, -187678, -153144, -124587, -119125, -80317, 18839, 133352, 226314, 311625, 390257, 417298, 364506, 253806, 106816, -67543, -212097, -237316, -147122, -66736, -81576, -123386, -91921, -16635, 3470, -32620, -40809, -10904, -26814, -110880, -161169, -94505, 29131, 85551, 37138, -51294, -110038, -121541, -98691, -57084, -10636, 35908, 93544, 169936, 243771, 272779, 230838, 133168, 27164, -39023, -43320, 7634, 92051, 175441, 205703, 141723, 9310, -99614, -118141, -76990, -54086, -77257, -122606, -180678, -251724]
36333b51724l3925O9363J39753Q1747m0375q0605k0838K4244P147R617P2847J08606
36321H5857N2042k0647k6269k3276j01568j96748j60404R698J49532J50284P8955
36310b544M3659M3962J7134l9778o9827m8663j7054k1261n2367n4780N415Q3068
36298a13036Q9155M261p5319n0498M8187J06040Q6314O2182P8123P4839j490r4253
36286B14505j11821n8292j4124j2290n810M4538J07808J20965N9167l6357q6270
36275B22019m3578M5943P9156J7850n5202m1460M1461Q5543L2581o7589j32256
36264A84468j24310n6724K5018N7939J3864m9349m1097M0499R5523N6649k1394
36253A81086m8814k4732j3686l4772m7603l7393l9899o7934p5250k5330M6677
$$ y = [-251724, -285649, -216286, -76533, 5214, -35161, -115766, -136604, -112360, -105213, -95596, -22749, 85857, 137899, 117252, 90983, 67707, -33861, -230609, -391013, -381315, -231783, -81499, -2544, 41115, 85077, 102211, 62433, -7394, -56057, -73111, -94372, -146739, -201519, -196104, -113036, -23881, -19620, -94939, -145437, -97250, 8790, 95104, 157286, 235409, 310248, 308758, 214505, 102684, 44392, 30268, 17978, 12168, 56706, 164514, 285479, 344646, 308289, 222019, 178441, 224384, 303540, 321390, 266188, 224728, 266189, 351732, 384313, 316724, 184468, 60158, 3434, 28452, 86391, 100255, 50906, 9809, 50308, 145831, 202480, 181086, 132272, 107540, 93854, 59082, 11479, -25914, -65813, -133747, -208997, -234327, -187650]
36242a87650P6832N0578M675k9725n0826o0919n0625j4484L5820P8638R4091P2324
36230A8729K1492l4572p2646p8770m4320K0158O1810K1605p4152j06642j0577
36219b77885J09752R9552k5791q9997o811R9447Q9764J6010K1005J09585J53471
36208B98102R2987L713l6584l1135l676L4860L9424m0140j51301j66959o5008
36197b5717K5113J0845l4239n600O5210P6174J3945n4113r0731r4424m6082M7059
36185a12560R7468L6122o4818p6629J781N5657L4178j577j0274k6026o1142o8650
36173a96470l8383k6988m9567l8556L7692J04774R1422L2693O23k250j5144m0290
36161a40444n5371n9960n5352k3720K3096K7641k2306m2342L6234J46258J58336
$$ y = [-187650, -110818, -60240, -55565, -85290, -136116, -197035, -247660, -262144, -226324, -147686, -53595, 18729, 40221, 5649, -66997, -145767, -190087, -169929, -108119, -86514, -160666, -267308, -277885, -168133, -68581, -94372, -184369, -191180, -91733, -1969, 14041, 35046, 144631, 298102, 391089, 394802, 358218, 327083, 323407, 358267, 397691, 357551, 206250, 39291, -25717, -604, 10241, -23998, -29598, 35612, 111786, 125731, 71618, -19113, -113537, -159619, -112560, -15092, 21030, -43788, -120417, -118636, -62979, -28801, -30378, -40652, -66678, -127820, -196470, -234853, -261841, -311408, -349964, -312272, -207498, -116076, -83383, -82760, -85010, -100154, -140444, -195815, -255775, -311127, -334847, -311751, -284110, -306416, -348758, -312524, -166266, -7930]
36150g930M9903p5066j20035p8778N323Q9598J34740J17728O0546R857j7880m1231
36138A26775o7479p5180m4144J8906P7818P9286k075j08031j29099l5207O6060
36127i2370N6637m1998j09057q2589l784P0232J11796R5243J9204m1148l81J02949
36115H4734J33677M6218n7283r3077j08820j60882j85038r8807L9433R8461O4280
36104b37104L8722O0666N4077k5143j02367r2859j5535N4320Q4325Q7124P2767
36093b1007M6431J6225k9821j09188j78088j45261n229J09876R1365J2985K7411
36082a84301J36393J84576Q7841n0881r4548m3550L846j1190p2179j31717j33897
36071c09607m3226R2522J57219J01311J1700j2700M643j2897n1347l9260J1924
$$ y = [-7930, 41973, -33093, -153128, -231906, -226583, -136985, -2245, 115483, 176029, 185886, 168006, 126775, 59296, -15884, -60028, -41122, 36696, 115982, 113907, 5876, -123223, -158430, -92370, -35733, -77731, -186788, -269377, -273161, -202929, -91133, 4110, 23314, -17834, -18215, 84734, 218411, 264629, 207346, 114269, 5449, -155433, -340471, -439278, -399845, -301384, -237104, -198382, -137716, -83639, -108782, -211149, -304008, -319543, -265223, -180898, -93774, -21007, 25424, 41649, 11828, -97360, -275448, -420709, -425938, -316062, -224697, -211712, -184301, -47908, 136668, 224509, 173628, 79080, 35530, 39376, 28186, -43993, -175710, -309607, -352833, -260311, -103092, -1781, 9919, -2781, 1862, -11035, -62382, -101642, -89718]
36060h9718K1982j3211j2021M6876Q5898O2561K9214K0465n837n9506o2147J8760
36048D3316P7653J3527j09137j49949q9267k4353n649Q349M4781P1571O7039M8919
36036c200K4895j2429l8012j5259L1848M0583P104j3075n782j4124m0387k4443
36024f2281M7746J01037Q1578L1886M909k0073p2076j10351r1087n5564o3060
36013b07336p7684j9979R1143J50350J19448O9942N3340K6098n0589j19453j07091
36002g1811m2757j7391m5978m7647L0983J35294J71262J14666K1387m7540p8407
35991A22061q8074q4399n9660j7513J1553J61l0557k1917M4100R9582O6231k7926
35979A3642o2385K1480J30198J30738K0233q0029q9272n4795n7043r0516q5445
$$ y = [-89718, -67736, -80947, -92968, -46092, 39806, 102367, 131581, 152046, 146209, 86703, 24556, 43316, 120969, 134496, 25359, -124590, -213857, -238210, -243859, -235510, -190729, -119158, -52119, -3200, 21695, 9266, -28746, -44005, -12157, 28426, 35530, 22455, 16673, 2549, -37838, -62281, -14535, 86502, 168080, 199966, 204875, 184802, 112726, 2375, -88712, -144276, -207336, -285020, -304999, -213856, -63506, 55942, 125884, 179224, 205322, 154733, 35280, -71811, -114568, -131959, -177937, -225584, -194601, -59307, 111955, 226621, 248008, 200468, 122061, 33987, -50412, -110072, -127585, -116032, -115871, -146428, -168345, -124245, -24663, 41568, 13642, -48743, -27263, 102935, 233673, 253906, 173877, 84605, 29810, -27233, -117749, -203194]
35968b03194j4689P0325J03101O7455r13n4298o8323m9750j8297J3224L8219N0310
35956f6830N4752P1651J01851J05148N0926k3123n5321n4744q2382j32962j23254
35945a54288l0772M7733L9013J0100N2846J21165J00533J167m9246n267L0950
35934A63934k2538j03594j09004m1282J5707J7390q123j8871k397K4608L0757
35923e3413r5l9199l9943m914J1684j5538m2224j9057L9056P6756O1761J439p4343
35910i8030j23967j15838o2705j2623P322J3031K4665M1816O2889Q6412Q6452
35899i0576L7057k9417m4798K210N8312R9544J49330J81519J12515n1977j66327
35888B57392j29123l0024r033m9525m0395J7021J8597m9612q6288n3741l2223
$$ y = [-203194, -217883, -147558, -44457, 22998, 22085, -32213, -100536, -150286, -168583, -155359, -117140, -66830, -12078, 59573, 161424, 266572, 317498, 294375, 239054, 184310, 101928, -31034, -154288, -185060, -137327, -98314, -88214, -35368, 85797, 186330, 187497, 138251, 132984, 163934, 141396, 37802, -71202, -112484, -96777, -79387, -87510, -106381, -108778, -84170, -53413, -53508, -92707, -132650, -137564, -125880, -141418, -183642, -202699, -163643, -86887, -25126, -23687, -98030, -221997, -337835, -400540, -413163, -405841, -392810, -368145, -326329, -263440, -177028, -90576, -53519, -82936, -127734, -125524, -67212, 32332, 181662, 363181, 475696, 423719, 257392, 128269, 98245, 89212, 39687, -708, 16313, 34910, -14702, -100990, -154731, -186954]
35877a86954n9625n8036J8053Q5212O4873R519J313J1784k8197q1933n2925M9810
35865b27106J09766P1360J0595J0167M3315K9016m4512j02887q1364m836L9107
35854a47379M369m9499k2721R1002J76131J30748l392r3130p4349l224M4432N6887
35842A09875N2340K5594k5857o3141m8663j1021j4832o6990j02461p5041j4169
35831b34366L3757P1421J09313J00719l34j25461j33830j331J21480J03994P555
35820E2917l0194j2825m9631j32497j16381M1634J81935J66975P5903N7526R3085
35809C28447N5083n8697j14223n3880K8583M6180K4156J1375k415l3241n8274
35798A73094o9608r0925j04164n0582N1384Q8405J4815o2139l7503L9215N9873
$$ y = [-186954, -246579, -304615, -286562, -201350, -136477, -126958, -125645, -113861, -142058, -223991, -276916, -227106, -117340, -45980, -35385, -25218, 18097, 47113, 2601, -100286, -181650, -186486, -147379, -143010, -192509, -215230, -124228, 51903, 182651, 179259, 86129, 11780, 8556, 52988, 109875, 162215, 187809, 161952, 98811, 50148, 39127, 24295, -42695, -145156, -220197, -234366, -200609, -129188, -19875, 80844, 80510, -44951, -178781, -180112, -58632, 45362, 52917, 22723, 9898, -39733, -172230, -288611, -246977, -65042, 101933, 177836, 235362, 328447, 383530, 324833, 210610, 156730, 185313, 231493, 255649, 267024, 264609, 231368, 173094, 103486, 12561, -91603, -142185, -90801, -2396, 12419, -49720, -87223, -48008, 11865]
35787A1865K7479K1214N0931O2350M8698M5196M0561K860l0616j432N0533L3686
35775C63325l8121n8712m456K9577j3131p9055j16594j36359j24892k8299J21678
35764h5039J89225J15621J0519j2726J3375P918j8065j7659r431j7056M688P1719
35752B53089Q4424l1408j69156j66928l7557O4339O3635J5929k5606n0100k2034
35741b1373P5406J42671O1002j12851j98541j43660o7069l7100J9356J36783K07069
35730F1693J41139O809p7667q3476l9382L3279R0263P4185J3272K746L9811R748
35718B72420j02976j46018l8178P7747N0414n1809q0114m8131n9177r0404m4393
35707b60619M7426O7469K1931K1462P1583O7412k309k7748K2697M4957j8535r0991
$$ y = [11865, 39344, 60558, 111489, 173839, 222537, 267733, 308294, 311154, 280538, 279106, 329639, 363325, 325204, 266492, 262036, 291613, 278482, 199427, 82833, -53526, -178418, -206717, -85039, 104186, 219807, 230326, 217600, 230975, 238893, 220828, 203169, 193738, 176682, 181370, 253089, 337513, 306105, 136949, -29979, -67536, -3197, 60438, 76367, 50761, 661, -21373, 54033, 196704, 257706, 144855, -53686, -197346, -264415, -301515, -282159, -145376, 61693, 202832, 209641, 131974, 48498, 9116, 42395, 132658, 206843, 220115, 222861, 262672, 272420, 169444, 23426, -14752, 62995, 113409, 61600, -18514, -66645, -125822, -216226, -260619, -213193, -145724, -123793, -102331, -30748, 36664, 34355, 6607, 29304, 74261, 55726, -35265]
35695c5265j03329q6056o9126k2294M7065O1710N963k5758J7809N2259j017p9740
35683b37779q0271j4852K6474J6276K851J7682M4226N8500M9361J9154m243J1597
35671i1024M8398M7686m304n7708q1014q9032o7634L3120J80289K31910J12593
35660B63280o1862j27971p9783l0601k3480k320M6575M9208l2467j23195j26878
35649b49494m4361M0030O1718L7067K9397O5924R7180N7855l4872q5375l8757
35638f3688N0392R9390R9038Q7217O6090J1768n6459q3838n5419j3205L028o362
35626A37952j9511j6947P540L3661K5457k0474n9824o1267n1618o3682p4239m6279
35614b09231n596j2728o8802j06684p6116O301Q8227J24876J01646M8690J5214
$$ y = [-35265, -138594, -224650, -293776, -316070, -269005, -207295, -201332, -227090, -209281, -157022, -158039, -237779, -318050, -332902, -306428, -290152, -287301, -269619, -225393, -166893, -117532, -98378, -102621, -91024, -42626, 5060, 756, -56952, -137966, -226998, -294632, -261512, -81223, 150687, 263280, 201418, 73447, -6336, -36937, -60417, -62737, -16162, 33046, 579, -122616, -249494, -293855, -253825, -192107, -155040, -125643, -59719, 37461, 95316, 60444, -24931, -63688, -13296, 86094, 185132, 272349, 338439, 350207, 293748, 209910, 154491, 141286, 144314, 137952, 118441, 101494, 109034, 142695, 168152, 147678, 87854, 26587, -25031, -88713, -162952, -209231, -214827, -227555, -296357, -403041, -479157, -472856, -384629, -259753, -158107, -109417, -94203]
35603i4203r30n6227j45903j48044K0218K32548K69489J05541n3463n2913K4412
35592A00525K3901n2916r6935p9099n5961l5058K7198J02868R9685J4053l8930
35581I331O755P0727N9553J0065J3420N8655N4864j8470q5357r7451r1730j03802
35569a13440j04860o2021K034M9744P6510Q1878M9259k859j0145L8851N2364l7318
35557A9997j43550j20836L0803J57982J49790M5859n8825j15457j01625l998J22695
35546a7165J62995P7704k4931k3229N8281R1582J5095j05906j72415j48331o8696
35535a55016N676L7692L6781L0085J6769j9384o0121o9243n9128p0290p5290L912
35523c77557J47751K11398J14814l0777p4872k4931J3996K4165O4290J13240P3156
$$ y = [-94203, -95133, -151360, -297263, -445307, -425089, -192541, 76948, 182489, 129026, 76113, 100525, 124426, 71510, -25425, -104524, -160485, -195543, -168345, -65477, 34208, 48261, 9331, 16086, 86813, 146366, 156431, 169851, 228506, 283370, 264900, 179543, 82092, -9638, -113440, -218300, -280321, -278287, -228543, -152033, -70155, -20896, -23755, -33900, 4951, 57315, 19997, -123553, -244389, -213586, -55604, 94186, 140045, 81220, -34237, -135862, -139860, -17165, 145830, 223534, 198603, 175374, 233655, 325237, 340332, 234426, 62011, -86320, -155016, -149340, -111648, -74867, -44782, -28013, -47397, -107518, -176761, -235889, -306179, -381469, -377557, -229806, -18408, 96406, 65629, -9243, -34174, -20178, 3987, 68277, 181517, 254673]
35512B54673o2272j67432j45282l6996N6016Q1378M3722k4215p2261p0883n2961
35501a96513o6176q7153m9459M4208J12352J02882L8504m6190j27371j45954m2944
35490d63814J23901J95028R8520m8847q9832j5534N6952M8326j0012m5232k7817
35479a78361J4663L9653L7994L6421M5732L4300j3811m9667k7410J0147o274m8665
35467a05278l0895L7884N7782R910m765N9534J05967N2582l4629n3603j7469J462
35455G8482l5J4432K5620m503m6755m9726l0578l2879l4819J0499P9152J09183
35443A18073R5061O5115Q562p8078j17877m6107N3700L8982p3181j13827q240
35432e7817J18177J26079L8414l4219n0803m6396m6798m9790n1612l9016Q383
$$ y = [254673, 192401, 24969, -120313, -157309, -101293, -19915, 23807, -408, -72669, -143552, -196513, -262689, -349842, -399301, -355093, -242741, -139859, -101355, -147545, -274916, -420870, -463814, -339913, -144885, -46365, -95212, -185044, -200578, -143626, -95300, -105312, -150544, -178361, -163698, -124045, -86051, -49630, -3898, 30402, 16591, -33076, -60486, -50339, -56613, -105278, -136173, -98289, -40507, -30597, -35362, 24172, 130139, 182721, 148092, 94489, 77020, 78482, 78447, 92879, 118499, 113996, 67241, 17515, -13063, -45942, -80761, -70262, 8890, 118073, 213134, 278249, 286811, 208733, 90856, 44749, 98449, 137431, 64250, -49577, -57817, 60360, 186439, 224853, 190634, 139831, 93435, 46637, -3153, -54765, -93781, -85398]
35421h5398O6417O1795l1062j25902j13668K222J06578J03259J3000o0414m5373
35410a08546K0628L8026k2769o9106r913R8645J11585k414j12047j08324m4179
35399b08414k5331m2140n665R3099J63329J46255P9094J7194l1842p2115p9786
35388C3678l8104K2862N2028K4587m5838j14393j19146l0212R5709J49680Q8305
35377A19156j5342o7140o0178m7434m6917l8840l3231n8466q0402k0280J15877
35366b33197K06743J69017P2911L2545L9324R06q7747j26899o9518J2556N0693
$$ y = [-85398, -18981, 42814, 11752, -114150, -227818, -225596, -119018, -15759, -2759, -63173, -108546, -87918, -49892, -72661, -141767, -151680, -53035, 58550, 56136, -55911, -164235, -208414, -233745, -275885, -281550, -188451, -25122, 121133, 200227, 217421, 185579, 113464, 33678, -4426, 18436, 70464, 95051, 49213, -65180, -184326, -214538, -118829, 30851, 119156, 103814, 36674, -23504, -70938, -117855, -156695, -189926, -248392, -328794, -349074, -233197, -26454, 142563, 215474, 248019, 287343, 288249, 200502, 73603, 4085, 16641, 67334]
$$ [...]
##END NTUPLES=NMR SPECTRUM
##END=
