##TITLE=31Pdec_DE-83_ORG
 D2O, 64 sc
 11.3.2025
##JCAMPDX= 6.0         $$ Bruker NMR JCAMP-DX V2.0
##DATA TYPE= NMR SPECTRUM
##DATA CLASS= NTUPLES
##ORIGIN= UXNMR, Bruker Analytische Messtechnik GmbH
##OWNER= root
$$ XWIN-NMR		Version 3.5
$$ Tue Mar 11 15:53:35 2025 Russian Standard Time (UT+4h)  she@DPX200
##.OBSERVE FREQUENCY= 81.013821
##.OBSERVE NUCLEUS= ^31P
##.ACQUISITION MODE= SIMULTANEOUS
##.ACQUISITION SCHEME= undefined
##.AVERAGES= 64
##.DIGITISER RES= 17
##SPECTROMETER/DATA SYSTEM= spect
##.PULSE SEQUENCE= zgpg30
##.SOLVENT NAME= D2O
##.SHIFT REFERENCE= (INTERNAL, D2O, 0, 198.062)
##AUDIT TRAIL= $$ (NUMBER, WHEN, WHO, WHERE, WHAT)
$$ ##TITLE= Audit trail, XWIN-NMR		Version 3.5
$$ ##JCAMPDX= 5.01
$$ ##ORIGIN= Bruker BioSpin GmbH
$$ ##OWNER= she
$$ F:/spectra/data/she/nmr/P31/2/pdata/1/auditp.txt
$$ ##AUDIT TRAIL=  $$ (NUMBER, WHEN, WHO, WHERE, WHAT)
(   1,<2025-03-11 15:52:43.06 +0400>,<she>,<DPX200>,
      <created by zg, POWCHK disabled, PULCHK disabled
       configuration hash MD5:
       00 E9 B6 7A A2 85 ED C7 34 08 36 98 17 FE 4E 26
       data hash MD5: 32K
       B5 7E 2D 24 AC 65 04 0C 42 03 20 48 73 B1 BD AC>)
(   2,<2025-03-11 15:52:45.50 +0400>,<she>,<DPX200>,
      <Start of raw data processing
       efp BC_mod = 2 LB = 1.5 FT_mod = 6 PKNL = 1 PHC0 = 1807.651 PHC1 = -10.1056 SI = 64K 
       data hash MD5: 64K
       F4 33 54 45 D6 53 2A 20 25 AC 06 83 87 BC 44 86>)
(   3,<2025-03-11 15:52:57.87 +0400>,<she>,<DPX200>,
      <pk PHC0 = -19.49672 PHC1 = 0 
       data hash MD5: 64K
       19 CB A9 C1 4B D5 E1 4D 89 25 6C 5F FD 4B 19 CE>)
(   4,<2025-03-11 15:53:01.21 +0400>,<she>,<DPX200>,
      <abs ABSG = 5 
       data hash MD5: 64K
       E1 F5 D5 AF 23 25 E2 50 4A FF 82 C9 3F 6C DE B0>)
$$ ##END=
$$ 
$$ hash MD5
$$ 03 89 9E EC 62 B5 F5 FE 3A 80 7D D5 71 CA 2B B5
##$RELAX= 
##$RELAX= 
##$RELAX= 
##$RELAX= 
##$RELAX= 
##$RELAX= 
##$RELAX= 
##$RELAX= 
$$ Bruker specific parameters
$$ --------------------------
##$DU= <F:/spectra>
##$EXPNO= 2
##$NAME= <P31>
##$PROCNO= 1
##$TYPE= <nmr>
##$USER= <she>
##$AMP= (0..31)
100 100 100 100 100 100 100 100 100 100 100 100 100 100 100 100 100 100 
100 100 100 100 100 100 100 100 100 100 100 100 100 100 
##$AQSEQ= 0
##$AQ_mod= 1
##$AUNM= <au_zg>
##$AUTOPOS= <>
##$BF1= 81.014009
##$BF2= 200.13
##$BF3= 200.13
##$BF4= 200.13
##$BF5= 200.13
##$BF6= 200.13
##$BF7= 200.13
##$BF8= 200.13
##$BYTORDA= 1
##$CFDGTYP= 0
##$CFRGTYP= 5
##$CHEMSTR= <none>
##$CNST= (0..31)
1 1 145 1 1 1 1 1 1 1 1 1 1 1 1 1 1 1 1 1 1 1 1 1 1 1 1 1 1 1 1 1 
##$CPDPRG= <waltz16>
##$CPDPRG1= <>
##$CPDPRG2= <waltz16>
##$CPDPRG3= <>
##$CPDPRG4= <mlev>
##$CPDPRG5= <mlev>
##$CPDPRG6= <mlev>
##$CPDPRG7= <mlev>
##$CPDPRG8= <mlev>
##$CPDPRGB= <>
##$CPDPRGT= <>
##$D= (0..31)
0 1 0 0 0 0 0 0 0 0.06 0 0.03 2e-05 3e-06 0 0 0.0002 0 0 0 0 0 0 0 0 0 
0 0 0 0 0 0 
##$DATE= 1741693962
##$DBL= (0..7)
120 120 120 11 120 120 24 19 
##$DBP= (0..7)
150 150 150 150 150 150 150 150 
##$DBP07= 0
##$DBPNAM0= <>
##$DBPNAM1= <>
##$DBPNAM2= <>
$$ [...]
##$SUBNAM3= <"">
##$SUBNAM4= <"">
##$SUBNAM5= <"">
##$SUBNAM6= <"">
##$SUBNAM7= <"">
##$SUBNAM8= <"">
##$SUBNAM9= <"">
##$SW= 400.765351723535
##$SWIBOX= (0..15)
0 1 3 0 0 0 0 0 0 0 0 0 0 0 0 0 
##$SW_h= 32467.5324675325
##$TD= 32768
##$TD0= 1
##$TE= 0
##$TE2= 300
##$TE3= 300
##$TEG= 300
##$TL= (0..7)
0 120 53 12 22 120 120 120 
##$TP= (0..7)
150 150 150 150 150 150 150 150 
##$TP07= 0
##$TPNAME0= <>
##$TPNAME1= <>
##$TPNAME2= <>
##$TPNAME3= <>
##$TPNAME4= <>
##$TPNAME5= <>
##$TPNAME6= <>
##$TPNAME7= <>
##$TPOAL= (0..7)
0.5 0.5 0.5 0.5 0.5 0.5 0.5 0.5 
##$TPOFFS= (0..7)
0 0 0 0 0 0 0 0 
##$TUNHIN= 0
##$TUNHOUT= 0
##$TUNXOUT= 0
##$USERA1= <user>
##$USERA2= <user>
##$USERA3= <user>
##$USERA4= <user>
##$USERA5= <user>
##$V9= 5
##$VALIST= <valist>
##$VCLIST= <CCCCCCCCCCCCCCC>
##$VD= 0
##$VDLIST= <DDDDDDDDDDDDDDD>
##$VPLIST= <PPPPPPPPPPPPPPP>
##$VTLIST= <TTTTTTTTTTTTTTT>
##$WBST= 1024
##$WBSW= 4
##$XGAIN= (0..3)
0 0 0 0 
##$XL= 0
##$YL= 0
##$YMAX_a= 47300
##$YMIN_a= -51201
##$ZGOPTNS= <>
##$ZL1= 120
##$ZL2= 120
##$ZL3= 120
##$ZL4= 120
##$ABSF1= 198.0616
##$ABSF2= -202.7028
##$ABSG= 5
##$ABSL= 3
##$ALPHA= 0
##$AQORDER= 0
##$ASSFAC= 0
##$ASSFACI= 0
##$ASSFACX= 0
##$ASSWID= 0
##$AUNMP= <proc_1d>
##$AZFE= 0.1
##$AZFW= 0.5
##$BCFW= 0
##$BC_mod= 2
##$BYTORDP= 0
##$COROFFS= 0
##$CY= -3
##$DATMOD= 1
##$DC= 0
##$DFILT= <>
##$DTYPP= 0
##$F1P= 0
##$F2P= 0
##$FCOR= 1
##$FTSIZE= 65536
##$FT_mod= 6
##$GAMMA= 0
##$GB= 0
##$INTBC= 1
##$INTSCL= 9.790993e-09
##$ISEN= 30
##$LB= 1.5
##$LEV0= 0
##$LPBIN= 0
##$MAXI= 10000
##$MC2= 0
##$MEAN= 0
##$ME_mod= 0
##$MI= 50
##$NCOEF= 0
##$NC_proc= -3
##$NLEV= 6
##$NOISF1= 182.463
##$NOISF2= 159.3651
##$NSP= 0
##$NTH_PI= 0
##$NZP= 0
##$OFFSET= 198.0616
##$PC= 4
##$PHC0= 1788.154
##$PHC1= -10.1056
##$PH_mod= 1
##$PKNL= yes
##$PPARMOD= 0
##$PSCAL= 0
##$PSIGN= 0
##$REVERSE= no
##$SF= 81.0140089999434
##$SI= 65536
##$SIGF1= 159.3651
##$SIGF2= -187.1042
##$SINO= 113.3802
##$SIOLD= 16384
##$SREGLST= <1H.CDCl3>
##$SSB= 0
##$STSI= 65536
##$STSR= 0
##$SW_p= 32467.5324675325
##$SYMM= 0
##$S_DEV= 0
##$TDeff= 32768
##$TDoff= 0
##$TI= <>
##$TILT= no
##$TM1= 0
##$TM2= 0
##$TOPLEV= 0
##$USERP1= <user>
##$USERP2= <user>
##$USERP3= <user>
##$USERP4= <user>
##$USERP5= <user>
##$WDW= 1
##$XDIM= 65536
##$YMAX_p= 310721352
##$YMIN_p= -899088
$$ End of Bruker specific parameters
$$ ---------------------------------
##NTUPLES= NMR SPECTRUM
##VAR_NAME=  FREQUENCY,     SPECTRUM/REAL,   SPECTRUM/IMAG
##SYMBOL=    X,             R,               I
##VAR_TYPE=  INDEPENDENT,   DEPENDENT,       DEPENDENT
##VAR_FORM=  AFFN,          ASDF,            ASDF
##VAR_DIM=   65536,         65536,           65536
##UNITS=     HZ,            ARBITRARY UNITS, ARBITRARY UNITS
##FACTOR=    0.49542278885378, 1,            1
##FIRST=     16045.7642231865, 0,            0
##LAST=      -16421.768244346, 0,            0
##MIN=       -16421.768244346, -899088,      0
##MAX=       16045.7642231865, 310721352,    0
$$ Real data points
##PAGE= N=1
##DATA TABLE= (X++(R..R)), XYDATA
$$ [...]
42287E885412J135797J869696K732022L817205M895692N016139L195077k44441
42279B8302599l509661m917201m402164l187808k290002j800040j424618j095240
42271E675865q82119p29658n53861m06696l50202l07470j96712r6255j21063k18145
42261A813684k33021j32135k8978j2315n8449j06107j26398j15166q6209p4858
42251H40048r5911j08624p5636l5578n1794j05956j19867p8420m6007m8515k9028
42240D4712M0511Q5185K9736p8369j20145n2436N7436J27630J36603J11010Q8461
42229D70334Q9992R3489M8110m7341j09078p1674k169k5630j38447j94862j10091
42218B633K0117O3702L2531L0117P6705R3843M4917j1750k3127j1805j8837m0378
$$ y = [5885412, 7021209, 8890905, 11622927, 15440132, 20335824, 25351963, 28547040, 28302599, 24792938, 19875737, 15473573, 12285765, 9995763, 8195723, 6771105, 5675865, 4793746, 4064088, 3510227, 3103531, 2753329, 2445859, 2249147, 2152892, 2031829, 1813684, 1580663, 1448528, 1419550, 1407235, 1348786, 1242679, 1116281, 1001115, 914906, 840048, 744137, 635513, 559877, 524299, 472505, 366549, 246682, 168262, 122255, 73740, 44712, 85223, 170408, 200144, 121775, 1630, -50806, 6630, 134260, 270863, 381873, 470334, 560326, 653815, 701925, 654584, 545506, 473832, 471663, 446033, 307586, 112724, 2633, 22750, 86452, 118983, 149100, 225805, 319648, 364565, 352815, 329688, 317883, 299046, 258668]
42206B58668n2795n1380l4310Q469N9025O3259k430q1792r3788k5427N8620R2057
42194A98176O9965L7540L2392M5712M2846J6869j292J673j0333o2052j05491q0497
42182A85508j9386j1219n7424n5550L9194J28368J09175J8870m3852p3111j20897
42171I9676j53803q2123O7357J44139Q1502o803m466L6620J514q8636j09461l7658
42159e2142P401n1054j27861j01177J3734R3084P7865M1492P1115J37216J28486
42148B38159N607j28442j43159m2184M1283J5861n9984p6536k3396K5865M3056
42137a03870O7944J05224R5834J9681n7774q3730q2778p1215K977J46261K24270
42126B62824J08939j13320k16276j20415K1730N0969j4620p3884r9058j06421
$$ y = [258668, 205873, 154493, 120183, 128652, 187677, 250936, 248506, 166714, 72926, 47499, 106119, 198176, 268141, 305681, 338073, 383785, 426631, 443500, 442208, 443881, 433548, 371496, 266005, 185508, 166122, 154903, 97479, 41929, 81123, 209491, 318666, 337536, 293684, 220573, 99676, -54127, -136250, -68893, 75246, 156748, 149945, 145479, 182099, 183613, 94977, -14484, -52142, -44741, -95795, -223656, -324833, -311099, -218015, -140150, -98658, -27543, 109673, 238159, 243766, 115324, -27835, -70019, -28736, -12875, -72859, -149395, -172791, -146926, -103870, -35926, 69298, 165132, 184813, 127039, 43309, -39469, -110684, -107707, 38554, 262824, 371763, 258443, 42167, -78248, -56518, -5549, -20169, -94053, -193111, -299532]
42116b99532o3084N8306J76323J66861K7831j07613j26308l7564P7855J52646
42106B5721J55412Q8048j2678j00257j54406j72585j42233o1765K4617O5449P2258
42095b12419R7242J36699J16916J077j37296j84732j08252K1882J14524J38265
42085a6094J22146R3927L9066n9197j52497j54164n6616L3511K7671k5030k0148
42074a67425L9950O0432J4262k0256J228J7876k1426o0813k4494N8537R0207L2328
42062B0406n9422j10450q9331j2036P4978J23975J22993R4515N2390r437p8365
42051A30216j17260j12991q6176m0854L5647J05162R0154o216p3668m8925j2652
42040a37563m8889r1280l0078Q7661J15156M3303J8409R6370J39155L4717j11590
$$ y = [-299532, -362616, -304310, -127987, 38874, 66705, -40908, -167216, -204780, -126925, 25721, 181133, 269181, 256503, 156246, 1840, -170745, -312978, -374743, -350126, -284677, -212419, -115177, 21522, 138438, 139515, 2219, -182513, -290765, -268883, -154359, -16094, 106052, 199979, 239045, 179848, 27351, -126813, -183429, -149918, -122247, -147277, -167425, -127475, -67043, -52781, -73037, -71809, -53933, -75359, -136172, -160666, -102129, -11922, 20406, -39016, -149466, -238797, -250833, -175855, -51880, 71113, 165628, 218018, 208581, 130216, 12956, -100035, -186211, -227065, -191418, -86256, 3898, -2318, -75986, -124911, -137563, -186452, -277732, -307810, -220149, -104993, -61690, -43281, 53089, 192244, 226961, 115371]
42029A15371j23700q932O7110K2920n1956n7804j6272K234n506m38J1169p389
42017e3193m0954l1228K5550N9256L2685M233L1547O5166J8894p9318j05200j8194
42005i0756P3437O9798J4908O744M2886M7813J0908n041J9755L3929J1320j0769
41993B24932r749j6125m4277n6530l5437k7199o2499q7421l3451P8658J63163
41982I4065J73781J30188O1099j8113p7542q4029n2203l6429n6758p5330o3110
41971d381m3640m0280k4218L5395R9037R8413M3399J9158O0132R2466M2063n3002
41959C24542r4673n4812Q867M4170M5614J6108m1777r3803r9819p8672q2062r8997
41947b05314o4710K1222P6035O3825M8218O6660N4043l3498j14878j03054m5345
$$ y = [115371, -8329, -17261, 49849, 72769, 20813, -36991, -53263, -51029, -56535, -56973, -45804, -53193, -94147, -125375, -99825, -40569, -7884, -3651, 27896, 93062, 111956, 32638, -72562, -90756, -17319, 52479, 67387, 74131, 117017, 164830, 175738, 170697, 190452, 224381, 235701, 224932, 215183, 199058, 154781, 98251, 62814, 35615, -26884, -114305, -147756, -69098, 94065, 267846, 398034, 459133, 441020, 363478, 279449, 227246, 190817, 134059, 58729, -4381, -48021, -88301, -112519, -77124, 21913, 120326, 163725, 182883, 243015, 335481, 377544, 324542, 229869, 175057, 183924, 228094, 273708, 289816, 248039, 154236, 54417, -24255, -106317, -205314, -270024, -248802, -172767, -108942, -60724, 5936, 59979, 26481, -88397, -191451, -236796]
41936b36796l1188l3471K2082Q7129N2014m7173n4453O0159J46638J08091L1090
41925A04122J6775K8335K29k7211K310L5852K039m5855r969P4261P4865l3740
41913B22013j26128j01264p349L8695r514r7398j35239p7989L1412R7900P7723
41902h7138K7273J5943K6391J639l9441k1894N1196P8771R260p1260n5071L8074
41890b6257R5553O4761m19l9574o0606r1900j16763j00988n3468q911L2202Q9786
41878b16584J35710J08730J8132l7308M42N9492M2003l2857o9254m1486p659M297
41866c6342K2810M4916K7086j6383o953P0347J25752R5609K6490k1270o4073j22425
41854A45564j40289o2883N9377J23137R1080L198q1831j05150l1137Q4429J13243
$$ y = [-236796, -267984, -301455, -279373, -192244, -140230, -187403, -241856, -181697, -35059, 73032, 104122, 120897, 149232, 149461, 122250, 124560, 160412, 162451, 116596, 106627, 180888, 255753, 222013, 95885, -5379, -12728, 25967, 16453, -80945, -216184, -294173, -262761, -164861, -87138, -59865, -43922, -17531, -15892, -55333, -77227, -26031, 52740, 62000, -9260, -64331, -26257, 69296, 134057, 133638, 94064, 33458, -58442, -175205, -276193, -329661, -338572, -306370, -216584, -80874, 27856, 45988, 8680, 9122, 68614, 110617, 77760, 8506, -32980, -40639, -36342, -13532, 31384, 58470, 42087, 35134, 105481, 231233, 326842, 353332, 332062, 267989, 145564, 5275, -57608, 1769, 124906, 215986, 219184, 137353, 32203, 1066, 85495, 198738]
41843A98738J0706j10354j31795q0589m3736j8916L5483P5446L5752k8303q851
41832f6419P0852Q4905O726n9245n0423j2528J8399O1633R5386N2093m9191r1886
41820F0302l2054L5027K5972k5373o2759r1523j08084n9737N0525J19521Q1409
41809f774J550l4612l1617j4333M2844J26356J29211J088j33502j29394k2427
41798g1610M6771M3990L6915L0234l5338j30607j36876k1384J09125J60512J49055
41787A80787J13509L5364r3543k00944k01232r7658K6762R6852R7914O3180K8851
41776D9842n198o2974j28338j27562k2079J06528J29680K9278p5430o7013M9847
41765a23419J73283K06263J25775j2420j24999j72566j74119j46001p1658L5995
$$ y = [198738, 209444, 99090, -32705, -113294, -157030, -175946, -140463, -65017, -29265, -57568, -66419, 4433, 89338, 96064, 36819, -13604, -26132, -7733, 53900, 149286, 201379, 152188, 60302, 28248, 63275, 89247, 63874, 1115, -90408, -198492, -258229, -207704, -88183, -6774, -5224, -39836, -71453, -85786, -42942, 83414, 212625, 213713, 80211, -49183, -71610, -24839, 19151, 56066, 86300, 50962, -79645, -216521, -237905, -128780, 31732, 180787, 294296, 329660, 236117, 35173, -166059, -263717, -236955, -140103, -42189, 20991, 49842, 44644, -18330, -146668, -274230, -296309, -189781, -60101, -30823, -106253, -173266, -123419, 49864, 256127, 381902, 369482, 244483, 71917, -102202, -248203, -319861, -283866]
41755b83866J00119P2552J4994J0625L6697J7812l1162l1363R981P615l8251k7804
41743a42051N5475R1465J8704n2015j5407N4881L3525m7514o1529k225J7561l3097
41731h2227n2058K2328J12021J22756P0542K6074N347j9464m7166m8998k1677
41720H7478P387J7115O386j5286k9133j7755N264k49m2274o8404l2417L1151M5956
41707d781J306l1107j66N3711O0889J7307k6589m6867o2450p7885o7874l1149
41695b15655o760j2709j6826K20M601k2053k6431L4542R8140P4795l07p258O0746
41682c4955O8041m4599j37762p1149P2522R9089j2175q9974l7492L6536O459q0200
41670b25659r6710l5246L032k3242m8228k0077K6084M4958N8851J10414J77212
$$ y = [-283866, -183747, -111195, -96201, -85576, -48879, -31067, -62229, -93592, -83611, -75996, -114247, -142051, -86576, 4889, 23593, -28422, -43829, 11052, 44577, -2937, -64466, -66691, -49130, -82227, -134285, -111957, 64, 122820, 193362, 219436, 224783, 205319, 158153, 109155, 87478, 94865, 111980, 118366, 103080, 73947, 56192, 61456, 61207, 18933, -49471, -81888, -50737, -4781, -3475, -34582, -34748, 18963, 79852, 97159, 70570, 23703, -38747, -116632, -184506, -215655, -222415, -235124, -251950, -251730, -247129, -269182, -295613, -261071, -162931, -88136, -88443, -95701, -34955, 33086, -11513, -149275, -220424, -147902, -48813, -60988, -150962, -188454, -151918, -145459, -225659, -322369, -357615, -354583, -377825, -426053, -446130, -420046, -375088, -316237, -205823, -28611]
41659b8611J84286R6015l4475j13632r8566l9725k7449q7533j43830j08351M712
41648c97159R5625J08010Q7785R3676J04897O6358j0388n2922k5821K8368M6882
41637A45311N527p6936j50503j52217o1401N6593J07798P8288L7435K7658J6437
41626C3990j9526l7143n701K0192k0442q3963p2396K1133R6085P8440O031l4422
41614a7722o162N4419P5383P886j13206j73810r7782M3122R9035K8994n2524l9459
41602a91826K9977N1336Q431k1101J1274O3067O4748M738n9099n8559R581O5146
41590b2287K8463o8969j02075r687J10679J16096m439j25333j40604o1033M1808
41579b37381J18070J42249R3581j5412j15934j35759p5431m499K0116J0521J7569
$$ y = [-28611, 155675, 251690, 217215, 103583, 5017, -34708, -62157, -149690, -293520, -401871, -397159, -301534, -193524, -105739, -12063, 92834, 159192, 148804, 95882, 70061, 98429, 145311, 150838, 73902, -76601, -228818, -290219, -233626, -125828, -47540, -10105, 17553, 33990, 14464, -22679, -28380, -8188, -28630, -112593, -184989, -163856, -67771, 10669, 16700, -17722, -23884, 30535, 105918, 113804, 598, -173212, -270994, -227872, -128837, -99843, -152367, -191826, -161849, -110513, -102082, -123183, -111909, -48842, 15906, 20644, -38455, -97014, -87433, -22287, 6176, -62793, -164868, -174555, -63876, 52220, 47781, -77552, -218156, -279189, -237381, -119311, 22938, 116519, 101107, -14827, -150586, -226017, -230516, -210400, -199879, -182310]
41568a82310O3340J17279J30152P7962k0839j12082j32275n9150M8642R0973L4973
41557E6665l6389k1738O8219J24837Q0029k4319j10762j48020j34995o6925L3393
41546a80005R5423P1375N720j6330K3545O5403N7513J1315k6862k3701J9401O4712
41534A67509O4338J1731m4425n9313m3040k6532q854J9518L1771o04m8028n7094
41522F977l0407j1091k385K4656N1208K4176m1153o2440k1743n451o5741j25840
41510b59234r0744J3822Q7915R0432M8947j5420q3157r1160L342J20788J23447
41499e1022j327j11633r4413K521O2658N0590J1913j7672l2598k1936J6127M0551
41487a46241J0906m2009m7149M903M8090L8594J0297R673K5348J9617m942j2490
$$ y = [-182310, -118970, -1691, 128461, 206423, 185584, 73502, -58773, -117923, -69281, 21692, 56665, 20276, -1462, 66757, 191594, 271623, 247304, 136542, -11478, -146473, -213398, -180005, -84582, -13207, -7487, -23817, -272, 65131, 122644, 133959, 107097, 83396, 102797, 167509, 231847, 243578, 199153, 139840, 96800, 70268, 61414, 80932, 112703, 112099, 64071, 6977, -23430, -34521, -36906, -12250, 38958, 63134, 21981, -40459, -62202, -67653, -133394, -259234, -349978, -336156, -248241, -157809, -108862, -124282, -207439, -298599, -295257, -174469, -51022, -52349, -163982, -258395, -255874, -193216, -142626, -130713, -148385, -180983, -202919, -186792, -146241, -135335, -177344, -224493, -219590, -171500, -132906, -122609, -112936, -87588, -67971, -72913, -85403]
41475h5403J1169M6416O9799O7031L2780j0765j5284L1189O0486l81j15406j68866
41463g7235j21752o5334q0273j14041o9087L6895R1407N4235J0942L9334J00263
41452a94646J05973M5493j2328j8992j915j5964o3839q0455o642J21003J84363
41441F2051J17778j639n0148j9461l554l1136j9793O6035J21400M7844q8191j46919
41429E4267j07688n6737k3364L9984J23398J42772Q2376K8580J8989j8090j07952
41418A76535j37135k3166J18763J11995l1824j33740r6321j249M5154L9996K7252
41407I6260J9539K2945N5071R0215O1421l3473j00218p9249l7694n8623j01825
41396f5631o8074L7128J06386Q7243L9297K1797J1446l2081q4810r0732l8353
$$ y = [-85403, -74234, -27818, 41981, 109012, 141792, 131027, 115743, 146932, 207418, 207037, 91631, -77235, -198987, -264321, -344594, -458635, -527722, -490827, -399420, -345185, -334243, -294909, -194646, -88673, -43180, -55508, -74500, -76415, -92379, -156218, -236673, -243315, -122312, 62051, 179829, 178190, 128042, 108581, 105027, 73891, 54098, 120133, 241533, 289377, 201186, 54267, -53421, -110158, -133522, -93538, 29860, 172632, 255008, 283588, 302577, 284487, 176535, 39400, 16234, 134997, 246992, 215168, 81428, -14893, -16142, 29012, 69008, 96260, 115799, 138744, 193815, 284030, 345451, 311978, 211760, 132511, 94817, 36194, -65631, -133705, -96577, 9809, 97052, 136349, 158146, 169592, 137511, 52701, -38031, -76384]
41385g6384L2998P9131P7199L0158k9948o1774n6808m3527l6969j3043M3264R1074
41373C5371P3097n254p0169o1498j560L1402m959o3521n9216K4047J00919Q2742
41361H1401p929o0494j4493O9127R2838L9527k7349n3758m3526k3471J056M0349
41349I3278Q5543R7393M0014o9479j54776j43356l9841P5658J22052P8789j4427
41338A70848r0687r5099k9402L7444L8401q723k9571p331q500p2168j38122j31419
41326c64329o6276r099J9367M0461M9847K7369j992Q325M3057L4608l3132r1202
41314c42996p5828n129N5158O6944M3985K7272M4949P7941P3651J7066l6574m0813
41302i4374l6347q1902j30469p0978R5217K16493J73042K2776q4860p9849k832
$$ y = [-76384, -43386, 35745, 112944, 143102, 113154, 51380, -5428, -48955, -85924, -98967, -55703, 35371, 108468, 103214, 33045, -28453, -30013, 1389, -3570, -67091, -126307, -102260, -1341, 81401, 73472, 12978, -1515, 67612, 160450, 199977, 172628, 118870, 75344, 51873, 52929, 93278, 178821, 276214, 316228, 246749, 91973, -51383, -91224, -15566, 106486, 185275, 170848, 80161, -14938, -44340, -6896, 31505, 22782, -6789, -14120, -22620, -94788, -232910, -364329, -430605, -439704, -420337, -379876, -330029, -302660, -304652, -296327, -253270, -218662, -251794, -342996, -418824, -423953, -368795, -301851, -257866, -230594, -185645, -107704, -34053, -16987, -53561, -94374, -130721, -212623, -343092, -414070, -318853, -102360, 70682, 93458, 8598, -71251, -74083]
41291g4083P9538J23106J01818K1317o6531j02014p0154k608N2186N2936l045
41280A12466n7399m2789K5972O4575M1575J9189L6566L3235m4005j28250j17979
41269e6844l0704K4257J697m2434n6098m3407j5030K7220M9632J0820n9855q0322
41257b71068k6732L9133O2578M7809J1334l8486o4587l0102J7806j0191q8956
41246c51462p5519P6458K09973J69892K3727m6423p695J4344l6042o6322j2800
41235a01869M5501J9716m6810n7480j4092L791k7838n5421m6529k9161k3865m594
41223c38651M7962J02215J14546Q2226L4122o422k7865k2439L831K7651L3836
41212E1012K8772J4033k6362q4474j02606l7096O2745R3451K2818p1490j04055
$$ y = [-74083, 5455, 128561, 230379, 251696, 185165, 83151, 12997, 10389, 62575, 115511, 112466, 55067, 12278, 38250, 102825, 144400, 163589, 200155, 233390, 189385, 61135, -56844, -87548, -63291, -61594, -104028, -160126, -203533, -218563, -191343, -141711, -130891, -190746, -271068, -297800, -258667, -196089, -148280, -136946, -175432, -240019, -270121, -252315, -262506, -351462, -426981, -350523, -140550, 29342, 53069, 6646, -1049, 13295, -22747, -89069, -101869, -56368, -36652, -83462, -140942, -155034, -151243, -179081, -234502, -281031, -310192, -334057, -338651, -290689, -188474, -73928, 8298, 42420, 35998, 8133, -14306, -10475, 17176, 51012, 79784, 93817, 67455, -17019, -119625, -156721, -93976, -525, 22293, -49197, -153252]
41201a53252p4291l1017O497M4646O5595M1415q822k9669n234J9685J1841M909
41189a07697M9993J29431J59447Q9432k5182p5746k4376N3612O6628J5834k9282
41178C02094m0472n3865q3200q3057l0187K1985J9557j1160j4753N590J4373J7620
41166F4525L6118L7177k0175q9274p8605Q439O7503M0610j5989l1532n474L3598
41154D6921P1568P9227K0931o8789r7865m6964p55k417K0617J11770J69949Q9194
41142C93387o4105j37330j00832m5322j4449K0320M2818K850n2357j1702J02560
41131A35838J22861j5572j54850j35962k1469K1099l2223o7385l4100K089J85
41120a79489M838M2217O1634K6404j6936j3475J3856R539k0947k0563L1758R1696
$$ y = [-153252, -227543, -258560, -252063, -207417, -141822, -100407, -109229, -138898, -144132, -124447, -112606, -107697, -57704, 71727, 231174, 320606, 295424, 219678, 195302, 248914, 315542, 331376, 302094, 261622, 207757, 124557, 41500, 11313, 33298, 52855, 41695, 26942, 32532, 46905, 64525, 100643, 137820, 117645, 28371, -50234, -41795, 25708, 66318, 50329, 18797, 13323, 46921, 118489, 197716, 218647, 149858, 51993, 5029, 4274, 1857, 22474, 134244, 304193, 393387, 329282, 191952, 91120, 45798, 31349, 51669, 94487, 97337, 44980, 33278, 135838, 258699, 243127, 88277, -47685, -69154, -48055, -80278, -147663, -181763, -179674, -179489, -174651, -132434, -70800, -44396, -61332, -74807, -60951, -51412, -72359, -92922, -61164, 30532]
41108C0532J07113P0357J0086m0251n7492l4645J4141O3484R7150J09204Q7659
41097D57338K2683n8561r7438p4238m6104o8835j01743n9427M2885Q5319J9561
41086A21440m3306M369R5576Q9340j0277p1020m9582m0381q5040q9662k533O5742
41074a5334Q771r7807j13144m4018M74P687N5974J35284J39652N5169J117L7876
41062A71701P1476J7022o2588o6793r516L1779M2251M9315L8208j3077o0329n1390
41050A58059k3081m5616r9995j09024o8021l8777k4488L2078J14205J16852J1259
41039B3451q2804n8584K5607L7523m1394j05787p7404J0342P4797P4392L1397
41028h8464j283L739Q806m8651j52362j84121n9142J39986K34569J58213K8819
$$ y = [30532, 137645, 208002, 218088, 177837, 120345, 85700, 99841, 163325, 260475, 369679, 457338, 480021, 421460, 324022, 249784, 203680, 134845, 33102, -26325, 16560, 101879, 121440, 78134, 82503, 178079, 267419, 257142, 186122, 136540, 96159, 11119, -78543, -81076, -15334, -6563, -104370, -217514, -261532, -261058, -253371, -197397, -62113, 77539, 132708, 133825, 171701, 243177, 260199, 197611, 130818, 121302, 153081, 195332, 244647, 282855, 269778, 209449, 158059, 134978, 89362, -10633, -119657, -187678, -226455, -250943, -218865, -104660, 12192, 23451, -59353, -117937, -92330, -54807, -96201, -201988, -279392, -269050, -194253, -119861, -88464, -89747, -86008, -77202, -125853, -278215, -462336, -521478, -381492, -146923, 11290, 40109]
41017D0109j0335L7151N5961q009p8155o2194J7620N7468J4988m3120n2786m7681
41005g8983q6345j31518r3843J3288O7754J8308l1004J9021J05957J05944K8799
40994f2622n098M3905R0015P4352M3891M4407L9745m984m4396k7452J1390R338
40982B12491k1753k3962O491K2696J4117J6194L3043J9562m0713r3127p7137k792
40970F5110O4677P9765N5461L4192L5931M1268K4540q879l6296n9976r8226j27633
40958F9934q6840K5677J05640N9219o0545j10313m6221K6633J6937k7415j6724
40947d4018K6772P821p5624j10947l6156O4108Q0511K8346L76J6040J2990k3181
40935e2962k6340K5026M7964j6973r6356q9097k4171o939m0719k7338N1074Q5073
$$ y = [40109, 29774, 66925, 122886, 114877, 36722, -25472, -7852, 49616, 64604, 21484, -31302, -78983, -165328, -296846, -390689, -377401, -309647, -291339, -322343, -303322, -197365, -91421, -62622, -67720, -23815, 66200, 140552, 184443, 228850, 268595, 263611, 219215, 191763, 203153, 212491, 190738, 166776, 173267, 195963, 210080, 226274, 259317, 278879, 238166, 145039, 67902, 65110, 129787, 209552, 265013, 299205, 335136, 376404, 400944, 392065, 355769, 295793, 197567, 69934, -16906, 8771, 114411, 173630, 113085, 2772, -43449, -16816, 121, -27294, -44018, -17246, -9425, -85049, -195996, -232152, -168044, -87533, -59187, -58811, -42771, -29781, -52962, -79302, -54276, -6312, -23285, -119641, -208738, -232909, -239848, -280567, -307905, -256831, -171758]
40923a71758K0258l6034K1300J17614J01148k8014j13981n9848O1299J24924R5903
40912A32811K3142l4724m2333O3M3108K7461l8175p8018m9884J456K1357K6318
40900C2582N9451J01208Q6307N01r2653j26538r3333k7375L1895M8259K942p0311
40888d7065r5935m0823L2339M0490l904j0572N0335R8169O5910Q113J7998Q3456
40876A98511J11307P0964J8496j7298o7486j23773j17851m6621j2245o6777j13437
40865a66210n5471M1128M9238j7078l2712L8719J07320J11311Q4885O3153L3558
40854B57841N32m520L283k3713o6297n8635j7838k9817q6028p8529n29J0646q7456
40841a81060j28433N025J57600J16968n1830r9124L1224J36345P6374m3807p3685
$$ y = [-171758, -151500, -187534, -166234, -48620, 52528, 24514, -89467, -149315, -88016, 36908, 132811, 155953, 121229, 78896, 78959, 122067, 149528, 111353, 33335, -16549, -15093, 6264, 32582, 92033, 193241, 279548, 280049, 187396, 60858, -32475, -59850, -27955, 20304, 23246, -47065, -143000, -183823, -151484, -110994, -114898, -125470, -75135, 23034, 88944, 97057, 115055, 198511, 309818, 380782, 399278, 381980, 314494, 190721, 72870, 26249, 14004, -52773, -166210, -221681, -180553, -131315, -148393, -181105, -142386, -35066, 76245, 161130, 224283, 257841, 258373, 253853, 257136, 233423, 167126, 108491, 90653, 60836, -25192, -103721, -104250, -93604, -181060, -309493, -304468, -146868, -29900, -81730, -180854, -149630, -13285, 63089, 19282, -54403]
40830e4403k3041K2631N1351P5397L9048r1860k09417j68370L260J16949O5892
40819a72563m4141n3412L6485Q3732J3464q4530q8553m507O8640Q9467J01172
40808e4746J14659P0953l6643r9693l9338N4131L5574p6952j21145k8229Q2071
40797i9358Q4237J6369p460K2638J7599n2724r9716l5792R8601J67383R1866n3724
40785A49919j20539n6437L5793L3994m9230j01847p5633l4843l6880m8827k1571
40774c26101K1004K5978K183L830M2028O8425M7178K287j6682O169L9049M3183
40762d1469K2599J9948N1327O9201K6489m1577n5511m953M3745N7549P0514Q3317
40750C01179K8145j02820j84978j16708J5378M3989l9596q2070m067R0508Q1571
$$ y = [-54403, -77444, -54813, -3462, 71935, 110983, 19123, -190294, -358664, -355404, -238455, -172563, -216704, -270116, -233631, -149899, -136435, -220965, -309518, -314025, -245385, -155918, -54746, 59913, 130866, 94223, -5470, -44808, 9323, 44897, -32055, -153200, -181429, -99358, -15121, 1248, -6212, 16426, 34025, -18699, -118415, -154207, -55606, 111777, 203643, 149919, 29380, -27057, 8736, 42730, -6500, -108347, -183980, -218823, -255703, -304530, -326101, -305097, -279119, -276936, -273106, -231078, -162653, -115475, -113188, -129870, -123701, -84652, -41469, -18870, 1078, 52405, 121606, 148095, 106518, 51007, 46054, 89799, 147348, 217862, 301179, 329324, 226504, 41526, -75182, -59804, -15815, -55411, -137481, -141548, -51040, 30531]
40739C0531p82m6554k5021O683R918L622J2278L0038L3950M304n4404r4602n9510
40726a49549L7505J05427Q3806J8662j5048k1949n0282q2627n1699M0427J06117
40715B0790R0602L0910k2215o2623p9221l2487O5093J16833N9213m3444r1982
40704E1469q7815r3359j03653n9918L0242R0695R3603Q1643P0688L1902j6540
40693H8957j1103L2479J0555r8198j65172r3578L0007O3826R595k9075k3379k7542
40681b12628m5961k1797M5837Q6162O7513L0034K329k3987l3610K076M5070K1908
40669c7054m7224n5395K3682Q1743L9982l2612l3551K3622N3124K7817j1150k8544
40657D440j0693M8305J10629R1722l2932j57115j58549n5672K8019L1352M45j9925
$$ y = [30531, 29749, -16805, -41826, -35143, -25225, -21603, -9325, 20713, 54663, 58967, 4563, -90039, -149549, -112044, -6617, 77189, 95851, 80803, 58854, 8572, -74055, -125754, -85327, 20790, 111392, 142302, 120087, 57464, -21757, -54244, 10849, 127682, 186895, 143451, 51469, -36346, -129705, -233358, -293276, -263034, -172339, -78736, 2907, 73595, 105497, 88957, 77854, 110333, 120888, 22690, -142482, -236060, -206053, -142227, -132632, -161707, -185086, -212628, -258589, -280386, -234549, -148387, -80874, -50840, -48511, -72498, -106108, -104032, -58962, -37054, -84278, -139673, -115991, -34248, 5734, -26878, -60429, -36807, 16317, 44134, 32984, 4440, -6253, 42052, 152681, 244403, 211471, 54356, -104193, -159865, -131846, -100494, -100049, -119974]
40645a19974m0622n7291j9174Q0814J49419R2855n3497j53019j22036j1512P2214
40634a81823Q6660O6163M6193K4812m15q100R126J9909j142l4840n3174n6395
40622h3026m0717J7975R5258R6359j2515j09556o7762M5009N7450l9335q6820
40611a27680k7093J5123k7318l6837O9767J69000J21888k269n3274l6465m9342
40600A5500p4517k4217O5823P3231p180o4579n9572n1303n0099k099P7850J06790
40588E628P4059M6834L8371N116l7787m2157m7497j13986j58859n3255J24275
40577a59258J51860O652r0017k5523M8830Q538m3137l495K8949m1620j05005m6896
40565b70122K1688m0054j25805m5574J44612K29172J72700J19440J03343K2101
$$ y = [-119974, -160596, -217887, -237061, -156247, -6828, 86027, 32530, -120489, -242525, -254037, -181823, -95163, -29000, 17193, 42005, 41590, 33490, 42616, 62525, 61383, 26543, -26631, -83026, -123743, -105768, -10510, 85849, 73334, -36222, -103984, -58975, -1525, -40860, -127680, -154773, -139650, -166968, -203805, -134038, 34962, 156850, 154581, 101307, 64842, 15500, -59017, -83234, -17411, 55820, 48640, -15939, -75511, -126814, -176913, -179012, -101162, 5628, 79687, 126521, 164892, 170008, 132221, 90064, 42567, -71419, -230278, -283533, -159258, -7398, -746, -90763, -116286, -67456, -58918, -102055, -105550, -76601, -118221, -223226, -270122, -248434, -288488, -414293, -459867, -315255, -86083, 86617, 206057, 309400, 331501]
40555C31501j08103j31508k3518M8388m882o8572m3776l497l2383p1778l6382
40544a44510L7400O5560M3925J1901k8367p6225q8077m0312K2640N5745O6557
40533g3763O1423J4327o4087j01742o1497K016K5790J6048Q226J6550N0949J08403
40521B643J26401L8999r3765j24749l1761L2344l1988j20556j00084j5514L052
40510c14978m9945p6615m4879j262M3884J13290J69176J45256O3338J1897J4806
40499G3968J6735j0271l7229m4984l4949Q700Q0365J05378L2925n3243l6629M3368
40487A44134M6080l4300n0905M8553J26596P8921l224K65M0712M478q0509r3565
40475B27236k7296J960n8742j26236j13665m1592J0313k075o0108j02020o4281
$$ y = [331501, 223398, 91890, 68372, 116760, 111878, 43306, -470, -3967, -36350, -108128, -144510, -107110, -41550, 2375, 14276, -14091, -90316, -178393, -218705, -196065, -140320, -73763, -12340, 1987, -62100, -163842, -225339, -223323, -197533, -181485, -173259, -156709, -105760, 2643, 129044, 168043, 74278, -50471, -82232, -49888, -81876, -202432, -302516, -318030, -314978, -364923, -441538, -486417, -487679, -443795, -330505, -161329, -16073, 47265, 59162, 73968, 90703, 80432, 43203, -1781, -36730, -28030, 52335, 157713, 190638, 137395, 100766, 144134, 190214, 155914, 105009, 153562, 280158, 359079, 355855, 356120, 396832, 401310, 320801, 227236, 199940, 201900, 143158, 16922, -96743, -138335, -128022, -130097, -190205, -292225, -356506]
40464c56506N1643J56133J60291P9741J526l4805n7412p5068n4655k98K7044M600
40452i7766q669K9521O6579L8978j4740n538O3286Q9390J6862q4746j17726p6237
40440a00806k4323M729K7827M8935M3876J8840K2672O7218Q7082L2177l8276k8426
40428A61525M4560O3237j4732q9151p1168j4388j3493m6627k7439L3369M7416
40417G3109J3385K2202P9874P1681l8950j15152m7750O6328P3981J626j1680M4056
40405B32710M9224k2032n7251j0256J9232k9081o5827j7833L0850j8889j05000
40394E847j03164k2611L6444O0694J06682J41416O7179q7187j58746p7447L4252
40383C359M8194j546j2620K4591M9451L9897J0366m0585r6776r1248M999J03461
$$ y = [-356506, -304863, -148730, 11561, 91302, 92828, 58023, 611, -74457, -129112, -129410, -102366, -97766, -106435, -76914, -10335, 28643, 13903, 8365, 71651, 161041, 177903, 93157, -24569, -100806, -125129, -120400, -92573, -43638, 238, 19078, 41750, 108968, 196050, 228227, 189951, 161525, 206085, 269322, 254590, 165439, 94271, 79883, 66390, 19763, -7676, 25693, 73109, 86494, 108696, 188570, 260251, 221301, 106149, 58399, 124727, 198708, 200334, 188654, 232710, 281934, 259902, 202651, 192395, 211627, 182546, 116719, 98886, 129736, 110847, 5847, -97317, -119928, -83484, -22790, 83892, 225308, 292487, 205300, 46554, -30893, 3359, 51553, 50007, 37387, 61978, 111429, 151326, 161692, 121107, 24331, -66917, -61918, 41543]
40371D1543R7854J0723n0152n1218m6665n2776k8147J3098p893q9765j08886P619
40359b64665J53535J72446N4732p8768j42707j43900j01014j1497R3599J48044
40349a20195J30613Q6463M9457M184n0912o7712j8902M6234O5495M4190K2787
40338A91702K181l7874p3502o2567k7423l7909j00769j34434q0620J5788P3212
40327b72215P2491M9729K9220J1361L921J8521M3302N1509L2125o941n0156p1068
40315h8201m2420K5531Q1506R2688P8803O2450K9082k2990m1365Q166O5788N1443
40303C00481r507j9582M0834Q5517N0640l3488j11380j57292j43131m5967P5167
40292C2292J01992J1648p0868l6485O5758J19259J00551O4565L0372j6673m6037
$$ y = [41543, 139397, 150120, 99968, 48750, 2085, -50691, -78838, -65740, -73633, -163398, -272284, -264665, -111130, 61316, 116048, 37280, -105427, -249327, -350341, -361838, -268239, -120195, 10418, 96881, 146338, 150522, 99610, 31898, 12996, 59230, 124725, 168915, 191702, 193883, 156009, 82507, 19940, -7483, -45392, -146161, -280595, -361215, -345427, -272215, -199724, -149995, -120775, -109414, -105493, -86972, -43670, 7839, 39964, 33023, -17133, -88201, -130621, -105090, -23584, 69104, 147907, 210357, 239439, 216449, 175084, 183250, 249038, 300481, 290974, 271392, 312226, 397743, 448383, 414895, 303515, 146223, 3092, -42875, 32292, 134284, 145932, 75064, 38579, 104337, 223596, 324147, 388712, 419084, 402411, 356374]
40281C56374j1318N2147N4151j9521q1642o1252J7197Q3519R5303N3112q461l7412
40269D92197j3288K1113J5295j4372j3292K3676N1977N5935O3713Q2750Q0987
40258H46691M0094k2408q3925j20691r4082J572Q5819O3724m4415j20481j03692
40247D48206m8119j1742J9702O1301O7223Q18q9980j24143q1358r336L1406J1475
40235B75453m1962n8788j1118K6899k4329j11217j11860l6576k3427j02339j23743
40224c43007j372J29691J20088L6451L0872Q7107P5142j1366n9018m1150l9340
40213a5902o9335n9130q554m068n1633n3263J7623P1731P2559R0327J35608J05422
40201B31385k5713j20634q8333l0166n5372q8677j3411J05652J16608K5766k5386
$$ y = [356374, 345056, 397203, 451354, 431833, 350191, 288939, 306136, 389655, 484958, 538070, 529609, 492197, 478909, 500022, 515317, 500945, 487653, 511329, 563306, 619241, 682954, 765704, 846691, 886785, 864377, 780452, 659761, 565679, 567251, 653070, 716794, 672379, 551898, 448206, 400087, 388345, 408047, 469348, 536571, 537389, 447409, 323266, 241908, 232572, 263978, 275453, 233491, 174703, 163585, 190484, 166155, 54938, -56922, -93498, -116925, -219264, -343007, -344379, -214688, -94600, -58149, -27277, 59830, 134972, 123606, 64588, 23438, -15902, -85237, -144367, -152921, -156989, -208622, -261885, -244262, -172531, -99972, -9645, 125963, 231385, 205672, 85038, -3295, -33461, -88833, -177510, -190921, -85269, 31339, 57105, 31719]
40190C1719J0075M2037J5616k5528n0277p7303q9051l3915O4596J11853P6732
40179G6554K2678p575l3295n0154j9153L4623K9510l1584m5537K0147O3306J7441
40167G6961l5067o768M7686L5206j5330j6709J9899J6963k6256m5502l7561n4765
40155d1243q9206p9300k9301q485k1268J0438J08527J84209J63881Q4842J9250
40144C02344k4500p1665j08662r7518l5427L5420O2263K1289m8901o4695N169
40133b4883P8462O1308j1721l1986N605M285m7148l9323N4935R9274J0477q6762
40121G2523n3933L3633J6068q4302j10774l5867J5103r538k4987J0534L1091J5924
40109a24525L8651J06383J10127J3317o0244k3245K8711j6227r6056q8891j8579
$$ y = [31719, 41794, 83831, 99447, 73919, 23642, -53661, -142712, -176627, -112031, -178, 76554, 99232, 91657, 58362, 8208, -10945, 23678, 53188, 21604, -23933, -3786, 59520, 76961, 41894, 35126, 82812, 118018, 102688, 85979, 105878, 122841, 96585, 51083, 13522, -41243, -130449, -209749, -239050, -247535, -268803, -258365, -149838, 34371, 198252, 283094, 302344, 277844, 206179, 97517, -1, -35428, -8, 62255, 83544, 34643, -30052, -24883, 53579, 114887, 103166, 71180, 76785, 81070, 33922, -5401, 49534, 148808, 159285, 72523, 18590, 52223, 68291, -16011, -126785, -162652, -147549, -157087, -182074, -171540, -140449, -124525, -85874, 20509, 130636, 143953, 83709, 60464, 89175, 72948, -23108, -111999, -130578]
40098a30578M937j8553k52O1578Q0332M1981K3075M2286K8084m0973q2483l5082
40086b5648N9633J35673J74675J65273Q1357m9564j33867j23775p9993p0667o8650
40075F4447j2955P4205J04544M0773n9143j09979p6513O805O4973M4016l2206
40064A08967q1823o1388j8224j8146m8354l9882K2409O8875M5347q44J4873P9984
40052G1794Q2642k7256j36927j05554L1554R8956L1194l5353J8222J02632O8193
40041B00097m5623p1328J1472M1662o1337j70279j51346n0458J3575K5800L7570
40030b20195M5206K4972K1631P9720J33030Q6566j8625m6991L1483J03922R1904
40019C32623N1531N7026Q2549O1477l987n7799p5279p6790p7479o9844m9490k5779
$$ y = [-130578, -125641, -144194, -144446, -82868, -2536, 39445, 62520, 104806, 132890, 91917, 9434, -25648, 33985, 169658, 344333, 509606, 590963, 541399, 407532, 283757, 203764, 133097, 64447, 51492, 125697, 230241, 271014, 211871, 101892, 25379, 32184, 97157, 141173, 108967, 27144, -34244, -52468, -70614, -118968, -158850, -136441, -67566, -22219, -23063, -8190, 71794, 154436, 127180, -9747, -115301, -83747, 15209, 46403, 11050, 29272, 131904, 200097, 154474, 83146, 94618, 136280, 74943, -95336, -246682, -297140, -283565, -257765, -220195, -174989, -150017, -128386, -48666, 84364, 170930, 152305, 105314, 136797, 240719, 332623, 384154, 441180, 523729, 585206, 581219, 523420, 448141, 371351, 293872, 224028, 174538, 148759]
40007A48759n847J3005L0631L1906k987o6355j08179q2327j4550J5391j6869l4765
39995i2187K9645J22449J32586M6292m0357n7046k6656J0948N5899R6779Q2393
39984C60745J429o8664n7908q422j4128q1162j22033q4321j2860L3433O1527J00756
39972A08392J26727Q9634M028n0389l1495J0089P485k9351m0642j1299J7811K5672
39960B26662L6748N9394N8278J6140k8622m2277m7400p2373r4044q3246o6893
39949c7633p9262q2164j3477R3751J25034L7975o5366n9087N2816J43349J09900
39938B25836j3603r8598o8136J9467N5395K6359J5103N5468P6476K9462k4641
39927B98588k8794l8379j08372j52991o3000Q7009J16384J1845m9667K5962J22652
$$ y = [148759, 142912, 155917, 186548, 218454, 215467, 149112, 40933, -41394, -55944, -40553, -57422, -92187, -62542, 59907, 192493, 238785, 198428, 141382, 114726, 125674, 181573, 278352, 360745, 362174, 293510, 235602, 227180, 213052, 131890, 9857, -74464, -87324, -53891, 7636, 108392, 235119, 324753, 328781, 278392, 246897, 256986, 264471, 235120, 194478, 183179, 200990, 226662, 263410, 322804, 381082, 397222, 368600, 326323, 278923, 206550, 112506, 29260, -37633, -116895, -199059, -212536, -118785, 6249, 44224, -21142, -80229, -27413, 115936, 225836, 212233, 113635, 45499, 64966, 120361, 146720, 161823, 217291, 293767, 323229, 298588, 269794, 231415, 123043, -29948, -92948, -5939, 110445, 122290, 72623, 98585, 221237]
39916B21237J12380K6076m5382q0534p6100r51J02310R6534n6581j93743j60689
39905e5443k4230N1153L8648J9920J2699j0725n375P1830J22959L0181j16741
39894A34876j12313M8550J51118Q8325J431J9083M8630m5155j96507k25599r1426
39883a78987P3722J43816J12550N0094K0350K8866J6988o1149j42432j06949M3005
39872a26J48384R9218j5364m9720j2812j9302q1890r1401l987P7425N2357l3120
39860F9662n3167K9219J17588J02567o884r3014o8803J7467M7752j1398p5487
39849G5502o9469k0713Q865J8383L8030N3295L0518j0087j7657O883J6908K556
39837A33014L234L2530M9665K4016j6966k8246o956J0250m382l8851n7603m4958
$$ y = [221237, 333617, 359693, 314311, 233777, 157677, 156726, 259036, 355570, 298989, 105246, -55443, -79673, -28520, 10128, 30048, 42747, 32022, 26647, 98477, 221436, 251617, 134876, 22563, 71113, 222231, 310556, 311987, 331070, 379700, 334545, 138038, -87561, -178987, -105265, 38551, 151101, 201195, 221545, 250411, 267399, 206250, 63818, -43131, -126, 148258, 247476, 232112, 182392, 169580, 150278, 68388, -23013, -27000, 50425, 102782, 69662, 16495, 45714, 163302, 265869, 258985, 165971, 97168, 114635, 162387, 150989, 75502, 6033, -14680, -5815, 12568, 50598, 103893, 134411, 124324, 106667, 113550, 130458, 133014, 136248, 168778, 218443, 242459, 225493, 197247, 190291, 200541, 196159, 157308, 99705, 54747]
39825E4747k2827j0784J4832P9262J34174R5979j7681p2933p59Q3257L3698j04538
39813B66427j50995m7734O4439N2312l9789q1284l1721M3287P7698N9433R775
39802B21848l5929m3408j3873J2158J0329M716J6796J7205k8139q8717r7660m1943
39790f6617K1508M3099L4465L2537M0431K7882j8652o6029o4218n900N5547O4051
39778I8104L1683K2972O0512Q3545L3604m6455n4925K5529Q6416L0889q8846j31208
39766A51820n1534L9589K9115m7779o8589J64O8601O7297L9802M8910O0861J181
39754C39438j05302j39064m3359R2178J40405Q3280N650k9240m1687o8639q6752
39743A46908m4658M4048R3330N2080k0746l2139J7680M2600l9n5452o2692l0583
$$ y = [54747, 31920, 21136, 35968, 115230, 249404, 345383, 327702, 254769, 254010, 337267, 370965, 266427, 115432, 67698, 132137, 184449, 144660, 63376, 31655, 74942, 152640, 212073, 221848, 185919, 142511, 128638, 140796, 151125, 155841, 172637, 189842, 161703, 72986, -24674, -66617, -45109, -2010, 32455, 64992, 105423, 133305, 114653, 48624, -15594, -21494, 34053, 98104, 129787, 152759, 213271, 296816, 330420, 283965, 229040, 254569, 340985, 371874, 283028, 151820, 100286, 139875, 168990, 121211, 52622, 52786, 121387, 188684, 228486, 277396, 338257, 339438, 234136, 95072, 51713, 143891, 284296, 367576, 373226, 343986, 302299, 233660, 146908, 102250, 146298, 239628, 291708, 270962, 238823, 256503, 299103, 299064, 243612, 180920, 150337]
39731A50337J1347O8672J34426J48176P6841j0321l0577j4855n0822j23552j27950
39720B31722m6379N402m5631j08762n7469Q8172J86749J51321L3388n7829p0795
39709C09889m3008m1503p8271r2382l2948O0194J03842Q6027O7612O9232L9406
39698D48090l7922q7263m6414L6382P0232L8177j0794m1968m7983j9818L4058
39687C34777O6635M3473r795n2309q2659j04984r1821m1420j9575o5985j04397
39676a28060m0886P9352J20463N1922j3321Q897O5349O4216j084p1161j00248
39665C5439p4741k648P7700J16352J03590O8462K0847m9667j09175q8922Q202
39654A05439Q0716N5584j7210n0145m1729m7101o8398n6316n487K9403K0261N324
$$ y = [150337, 161684, 230356, 364782, 512958, 589799, 579478, 548901, 534046, 483224, 359672, 231722, 185343, 190745, 145114, 36352, -21117, 67055, 253804, 405125, 438513, 380684, 309889, 266881, 225378, 147107, 54725, 21777, 81971, 185813, 271840, 339452, 408684, 448090, 410168, 322905, 276491, 312873, 383105, 421282, 410488, 368520, 320537, 300719, 334777, 401412, 444885, 435090, 382781, 300122, 195138, 103317, 61897, 42322, -23663, -128060, -168946, -89594, 30869, 82791, 69470, 78367, 143716, 207932, 206848, 135687, 35439, -39302, -41950, 35750, 152102, 255692, 324154, 345001, 295334, 186159, 97237, 105439, 186155, 241739, 224529, 174384, 132655, 85554, 17156, -39160, -44647, -15244, 5017, 10341]
39642A0341K1876M7886M1647R460k046K7154O1163N4451R456k9920l5081j8844
39630A97543j615J9537N0675P5709P5996N4164J6712l5971p4230m1193N5904J03896
39618D97127J5185j31462j81325j16283n7590n5092j8726R3847J68798J09791
39608C24270j892m1856l8187q7610j49308r5538N5152J30119N3349m9061m9531
39597D9907O073O058m4934n2746J2840Q5548J03182P0692K8092L634j098p299
39585B59949l6316p8278r8204q0603m4355q457K4264M3856L5220J3961J4491L0221
39573G5749K0335o969J1810Q1503J04150J4407j04226j23969m9583N036q307k6006
39561f070j154K8252K7440K7177M9934N0362r603q2886r9098o3619l1760j6315
$$ y = [10341, 32217, 80103, 121750, 131210, 129164, 156318, 217481, 271932, 281388, 251468, 216387, 197543, 195928, 215465, 266140, 341849, 417845, 472009, 488721, 452750, 378520, 337327, 393231, 497127, 512312, 380850, 199525, 83242, 25652, -29440, -48166, 45681, 214479, 324270, 322378, 280522, 242335, 154725, 5417, -90121, -34969, 95150, 148499, 99438, 49907, 55980, 62038, 17104, -35642, -22802, 62746, 165928, 236620, 264712, 268346, 267248, 259949, 223633, 145355, 47151, -33452, -77807, -86264, -62000, -18144, 17076, 31037, 45528, 75749, 96084, 89115, 100925, 182428, 286578, 300985, 196759, 72790, 23207, 28243, 19936, -6070, -7224, 21028, 48468, 75645, 125579, 175941, 166338, 83452, -15646, -79265, -111025, -127340]
39549a27340J0787M3614M1403M111j5250J1696N0313N9590M0486O834m4706j00694
39537a9156j05483j9266J12246J89145J59152O0705l1534p4707p2088n2594m7365
39526I9055o3218o8128k4579N0869Q6719L9790l8718n4842J2912Q5093Q0454J3379
39514B18786l4201j9374K0615L3080J7271Q459K2804M6992O6302P0775M2463k6055
39502D67917r8751j19573q0873l5340k5365l5932l7513l4604l6679j9818L1954
39491b4577P4489N2560j3450n2587m8324m8694o6841n0123K3960R3786J00113
39480D0312O6653M4255L0099J185k2120j6668j9440o9465j16871q1023J3735N7134
39468g2214J3589l3233k0052P766o799l3315j7842K0560L2361K7904M6837P1835
$$ y = [-127340, -116553, -72939, -31536, -27425, -42675, -30979, 19334, 78924, 119410, 126244, 81538, -19156, -124639, -143905, -31659, 157486, 316638, 377343, 345809, 271102, 199014, 146420, 99055, 35837, -32291, -56870, -6001, 80718, 120508, 81790, 26948, 39860, 124953, 205407, 218786, 184585, 165211, 185826, 218906, 236177, 244636, 267440, 314432, 380734, 451509, 493972, 467917, 369166, 249593, 168720, 133380, 108015, 72083, 34570, -34, -36713, -56531, -24577, 49912, 102472, 89022, 36435, -11889, -60583, -127424, -177547, -153587, -59801, 40312, 106965, 151220, 181319, 182504, 160384, 143716, 124276, 54811, -62060, -143083, -129348, -72214, -58625, -91858, -111910, -104144, -110943, -144258, -162100, -141540, -109179, -81275, -34438, 37397]
39456C7397N5183J2846Q915M7816O1684J9548k2846j0627L1680M5146J5596k7957
39444B74381n8201n8284j8362L8434N3273k513p6229r0667m1517N329J0333P468
39432D3445M2006R9476J22242P8458m440o4902n7338P722O4672N1390k1545p7564
39420B83622o3133r900J2286j4574m2320k2220M4363J15153J38116Q1161l0245
39409D92309j05004o4357N4205J17410N2651n7569q3538j6296L6341O951n3192
39398C79911o7077l4057n53J8914L7856M6021K0270k1246k8004J2845N5131N4232
39386D74243J7708j8130l6327m7203o5032q9038r6260n2549M6522J42825J56675
39375D33434P6115k6095q4814j14276j51813j68568j01569L4661J37202J33288
$$ y = [37397, 92580, 105426, 114341, 162157, 223841, 243389, 220543, 209916, 241596, 286742, 302338, 274381, 216180, 157896, 139534, 177968, 231241, 228728, 152499, 61832, 20315, 25644, 35977, 43445, 85451, 184927, 307169, 385627, 381187, 316285, 258947, 266669, 331341, 382731, 361186, 283622, 220489, 210589, 222875, 208301, 165981, 143761, 188124, 303277, 441393, 522554, 492309, 387305, 322948, 377153, 494563, 547214, 489645, 406107, 389811, 426152, 433103, 379911, 312834, 278777, 278224, 297138, 334994, 381015, 401285, 380039, 352035, 364880, 420011, 474243, 491951, 473821, 437494, 390291, 325259, 236221, 139961, 87412, 133934, 276759, 433434, 509549, 483454, 398640, 284364, 132551, -36017, -137586, -102925, 34277, 167565]
39365A67565N7797q656l0030j6435J3864L2336K369o5963r6782m0335M2431N0527
39353A08688j9451p5500o1444j0729L3081O6563P7990L4794l9289n2791K9286
39342I1198J13813R7403K411p3711r4906r3210q0962m6289r524N801L6801J20707
39330F9532J89933J41233P622o4848l2883j3694p8107j26816o5004K4103J0325
39319F1396o8625p3692O964N4885K9709J9282O0631O5687j3135p5893k7664O0061
39307I9606N3926l3749o2286K6429J22504R9974k0251j04907p1450K5966P1956
39296B07718K6495l4939k2802N0329R0710M9873k4163p1768r3356j01708o8651
39285G738J5838Q0341N2092k3956l5198L5038Q6228N6790Q402J5173M9935L9974
$$ y = [167565, 225362, 216706, 186676, 170241, 184105, 216441, 218810, 152847, 56065, 15730, 58161, 108688, 89237, 13737, -47707, -58436, -25355, 41208, 119198, 153992, 114703, 61912, 91198, 205011, 302414, 304825, 231114, 136208, 42998, -37964, -84253, -93777, -87976, -51175, 69532, 259465, 400698, 408320, 343472, 310589, 296895, 218788, 91972, 26968, 51071, 61396, -7229, -80921, -73957, -19072, 10637, 29919, 90550, 156237, 143102, 67209, 39545, 99606, 153532, 119783, 57497, 83926, 206430, 306404, 286153, 181246, 109796, 135762, 207718, 234213, 199274, 176472, 226801, 317511, 367384, 343221, 271453, 178097, 76389, 7738, 23576, 103917, 156009, 132053, 96855, 131893, 218121, 274911, 283313, 298486, 348421, 388395]
39273C88395k1962q2713j02452p1708K330P4397P2832o741o5712l0539L2414J9021
39261B07562l9847k6044O2454R1240l536j14443j22856n2877K917K0482K8147
39250E3199K7379J2970J5442M6900N7817J9760r261J7820M0844q201p2430n5366
39238A46873J0936J8553k8580k8993K6543M0771j113K915P2617Q1961k4030j06825
39226B11628m5299O3545N8437l0770m3406N3071J27950R7926K6459p314j9603
39215D92624n8595j10272j14815m0785P6853J54174J26708K5696m3820l2160n212
39204D70396l1961p6144p1382l9845l8034l6782K6160J07083J01220J7355k4586
39193D03480K0447O7836N5687K2635q39m6912j02882p9193L8043J19216O9411
$$ y = [388395, 366433, 283720, 181268, 109560, 111890, 186287, 259119, 252378, 186666, 156127, 188541, 207562, 167715, 141671, 204125, 295365, 291829, 177386, 54530, 1653, 4570, 25052, 53199, 80578, 93548, 108990, 155890, 213707, 233467, 224206, 242026, 282870, 274669, 202239, 146873, 157809, 176362, 147782, 118789, 145332, 186103, 184990, 187905, 260522, 342483, 318453, 211628, 166329, 229874, 288311, 257541, 214135, 267206, 395156, 493082, 519541, 512227, 492624, 434029, 323757, 208942, 168157, 245010, 399184, 525892, 551588, 507768, 475608, 470396, 438435, 362291, 290909, 251064, 213030, 176248, 202408, 309491, 410711, 428066, 403480, 423927, 491763, 547450, 570085, 569246, 522334, 419452, 340259, 378302, 497518, 566929]
39182E66929k6649m1025P255J9161j501K5714Q6952P5985k7870j10105q1798O663
39170D99711N4524L9217P463j1993l5259q0342j29831j38557p7603K2802Q6744
39159B36876O7315k449m9059l2520L3804J07958J38232R1242J245l6128L3613
39148E90129J46383J90521J39130O5300M0852P0117J14023J29264Q9706J6974
39138A592399j7467L0528J09468J37145J22350J50677K48461L43855L87484M30907
39128C535807N36433O73401P65425P93067P79396P02784N02947J77757j85865
39119H281152m92319p02866q07214p84179o37990m48835l26833k96863k64881
39110C519172j32618O7630J89746J32199m8978k01230k27631j58558r1820r3087
$$ y = [566929, 540280, 499255, 506510, 525671, 524170, 549884, 636836, 712821, 684951, 574846, 493048, 499711, 554235, 593452, 600915, 588922, 553663, 473321, 343490, 204933, 127330, 150132, 236876, 304191, 301742, 252683, 220163, 253967, 361925, 500157, 591399, 592644, 556516, 590129, 736512, 927033, 1066163, 1131463, 1172315, 1242432, 1356455, 1485719, 1575425, 1592399, 1574932, 1605460, 1714928, 1852073, 1974423, 2125100, 2373561, 2717416, 3104900, 3535807, 4072240, 4745641, 5511066, 6304133, 7083529, 7786313, 8289260, 8467017, 8281152, 7788833, 7085967, 6278753, 5494574, 4856584, 4407749, 4080916, 3784053, 3519172, 3386554, 3454184, 3643930, 3776129, 3727151, 3525921, 3298290, 3139732, 3047912, 2954825]
39100B954825j52904k14277k29610j96473j43739r2545m7937k4188m2500q7516
39090A723136j02173n6537P920L9242M8823P3549R2412N4676j4236k0022O0939
39079A907729J26729Q6881n385k8505L6455R2004P4036L3257M2418Q8586J05222
39068B559427P1361K6350O196J5512N2306J07921J42913J22001Q7019J30100K58128
39057C579234L48887L06472K07835K03743L01341L55335K85534J92566K10096
39048E991043L33231M61429N41060N86956O15034O41627P22076R06409J163119
39039A1961984J412556J631585J871909K188291K604777L131603L737500M297078
39031C2837283M630232M620315M275248L703671L100427K749050K952642L911204
$$ y = [2954825, 2801921, 2587644, 2358034, 2161561, 2017822, 1925277, 1877340, 1853152, 1810652, 1723136, 1620963, 1564426, 1572346, 1611588, 1660411, 1733960, 1826372, 1881048, 1866812, 1846790, 1907729, 2034458, 2121339, 2115954, 2087449, 2123904, 2215908, 2289944, 2323201, 2365619, 2454205, 2559427, 2630788, 2657138, 2663334, 2678846, 2731152, 2839073, 2981986, 3103987, 3191006, 3321106, 3579234, 3928121, 4234593, 4442428, 4646171, 4947512, 5302847, 5588381, 5780947, 5991043, 6324274, 6785703, 7326763, 7913719, 8528753, 9170380, 9892456, 10798865, 11961984, 13374540, 15006125, 16878034, 19066325, 21671102, 24802705, 28540205, 32837283, 37467515, 42087830, 46363078, 50066749, 53167176, 55916226, 58868868, 62780072]
39023F2780072N674837Q204184J1445569J5375224K0007928K5264798L0621500
39016A79374112L4772926L5757214L1700513K1842434P274153r079443k3424717
39009B78217192l2693097l5858298l4069301k9579615k4412784j9697213j5780866
39002H6126018j2637027j0159582q266681o874359n842806n004942m264322l621531
38994B9454768l090644k646165k270043j976993j752993j535246j297749j092203
38986A3792732r58875q66629p89211p56868p64796p19067n68440m14197l76113
38977G578536m08993l79134k80636k31494k64399k69062j72947n2475r231l4694
38967E475471o3653q6382j31619j79680j64485n8737Q2278J70933J76085J63212
$$ y = [62780072, 68454909, 76659093, 88104662, 103479886, 123487814, 148752612, 179374112, 214147038, 249904252, 281604765, 303447199, 310721352, 301641909, 278217192, 245524095, 209665797, 175596496, 146016881, 121604097, 101906884, 86126018, 73488991, 63329409, 55062728, 48188369, 42345563, 37340621, 33076299, 29454768, 26364124, 23717959, 21447916, 19470923, 17717930, 16182684, 14884935, 13792732, 12833857, 11967228, 11178017, 10421149, 9656353, 8937286, 8368846, 7954649, 7578536, 7169543, 6790409, 6509773, 6278279, 6013880, 5744818, 5571871, 5519396, 5510165, 5475471, 5411818, 5325436, 5193817, 5014137, 4849652, 4790915, 4873193, 5044126, 5220211, 5383423]
38957E383423K35022M20621O42297Q04117Q73196Q44048O79983L59883m8931m37494
38947I756165p53289r84298j081443r97073p91920o00287m75504l61813k33106
38938C477432j55652j73636k24394k24256j71313j12230o6303l1763j5585j0358
38928B291942J3325N2475N7480J1775k2874J3523R2608J33792R7384J1656o2485
38917B690601p6349m3487n3558j75742l34891l64566k17859m1092J2805m2261
38907A353601j04273j41615j71386j53842m0507J00788J35266M0394o6819r3960
38897H57647p2559p2848j03556j31467j37370j17990p7472l8865k2676l589O1290
38886A40545J49852J79857J21039M6614L6138P1416P2140O211p5976j02726m9926
$$ y = [5383423, 5618445, 6039066, 6681363, 7485480, 8358676, 9202724, 9882707, 10242590, 10193659, 9756165, 9002876, 8018578, 6937135, 5940062, 5148142, 4547855, 4072351, 3710538, 3477432, 3321780, 3148144, 2923750, 2699494, 2528181, 2415951, 2349648, 2317885, 2302300, 2291942, 2305267, 2357742, 2415222, 2426997, 2404123, 2417646, 2510254, 2644046, 2741430, 2753086, 2690601, 2614252, 2570765, 2517207, 2341465, 2006574, 1642008, 1424149, 1383057, 1395862, 1353601, 1249328, 1107713, 936327, 782485, 741978, 842766, 978032, 1018426, 951607, 857647, 785088, 712240, 608684, 477217, 339847, 221857, 144385, 105520, 82844, 79255, 140545, 290397, 470254, 591293, 637907, 674045, 745461, 817601, 823812, 747836, 645110, 595184]
38875E95184L6993P4403J8946o7474o6424M9959J55155J07109o3132j69508r6023
38864E75188N7704J05622R942q8893p5171n274k964p1422r8157k8926O0372Q8183
38852E26204P5531P5045O3675p189r0519p2386O7833K05517K12378R6298l5108
38841A117279j05537j18449j04394p7946m9163l3577l2340k7973j6752k1860n0612
38830D78676o1344j4764N0333M8959k6329p4450k3396N5171M3466m2626o8129
38819C65567K3259J25344J22578M4032J078K8224N9379L7061j7844m2234r14P3963
38807H19493J00532L1175o9709p8298L4074J52651J61757P9460L530j7358M240
38796A221547N6561J24694J63339J50823J38068J69577J95417J51954R5774J48777
$$ y = [595184, 632177, 706580, 725526, 658052, 591628, 641587, 796742, 903851, 840719, 671211, 575188, 632892, 738514, 748456, 659563, 584392, 579118, 576154, 504732, 406575, 377649, 438021, 526204, 601735, 676780, 740455, 733266, 642747, 570361, 638194, 843711, 1056089, 1152387, 1117279, 1011742, 893293, 788899, 710953, 661790, 628213, 595873, 567900, 551148, 529288, 478676, 417332, 402568, 452901, 501860, 475531, 401081, 377685, 432856, 476322, 433696, 365567, 388826, 514170, 636748, 680780, 681858, 710082, 769461, 806522, 788678, 746444, 745530, 819493, 920025, 951200, 881491, 803193, 837267, 989918, 1151675, 1231135, 1234665, 1217307, 1221547, 1278108, 1402802, 1566141, 1716964, 1855032, 2024609, 2220026, 2371980, 2467754, 2616531]
38786B616531L21835N00951O10093O79358P36325P38102O47454M86119K75064
38777G611832M479k97900n46839o90881p56904p72556p21532o12175n04878m19844
38767B292802l01281j37976l7689r3348k32746k96182k31470j26097o5673m4601
38757G25739j8590K2639N2217L7783l0221j18239j64809j38485p0110j2229J3232
38746B98927J3685M031O462L9121Q2136Q7431M2503j1863m4646o8930r2022q6064
38734B70771m0983N549K5178L2376K9429j4807q7636j08604m3871K6195K5008
38723A18605n959M166K4854p518m6873M350J17337J50912N2045p3815j15467p9294
38711A43343l2655j3634l0604p4924r9593m9274N8702J39399J46908J18831R7268
$$ y = [2616531, 2938366, 3439317, 4049410, 4728768, 5465093, 6203195, 6850649, 7336768, 7611832, 7616311, 7318411, 6771572, 6080691, 5323787, 4551231, 3829699, 3217524, 2712646, 2292802, 1991521, 1853545, 1815856, 1722508, 1489762, 1193580, 962110, 836013, 770340, 725739, 707149, 729788, 782005, 819788, 789567, 671328, 506519, 368034, 297924, 285695, 298927, 312612, 316643, 323105, 362226, 444362, 531793, 574296, 562433, 517787, 448857, 356835, 270771, 229788, 235337, 260515, 292891, 322320, 307513, 219877, 111273, 67402, 93597, 118605, 112646, 116812, 141666, 134148, 87275, 91625, 208962, 359874, 411919, 338104, 222637, 143343, 110688, 97054, 66450, -8474, -108067, -157341, -98639, 40760, 187668, 306499, 403767]
38700D03767O8249P055o7826j13501j01592l3771M2918N0043l4162j15638q8021
38689A7521J5848O5255K0536k6497j6379q316n6664j08603r2263k1288N6097J34160
38677b0593K04020K04066J00738l1692q9417n9727l904L3288L5921r264q0822
38666B82614j08489o0476k931n157l3653j7008L1604M6491K5059J4175R712k6059
38654A55882o2596k7871N8404Q6759J8146n4032l8818L9311J06234J40020J49092
38643E70531J11498J1626r1747j07521k7586M9620L3021m8644p9471l993R1269
38632E08603Q0994l0107j05393n9679K8756M1999p457j7137L4487O3622K5275
38621E63963k1113j8263L010q377l4600k5265J4732K8848j1441o8846q4970m7653
$$ y = [403767, 472016, 479071, 411245, 297744, 196152, 162381, 205299, 255342, 221180, 105542, 17521, 33369, 98624, 119160, 92663, 76284, 67968, 11304, -97299, -189562, -210850, -154753, -20593, 183427, 387493, 488231, 456539, 367122, 307395, 303491, 336779, 372700, 363436, 282614, 174125, 113649, 110718, 105561, 71908, 54900, 86504, 132995, 158054, 172229, 181941, 155882, 93286, 65415, 123819, 210578, 228724, 174692, 135874, 175185, 281419, 421439, 570531, 682029, 693655, 601908, 494387, 466801, 516421, 549442, 500798, 421327, 417334, 508603, 589597, 559490, 454097, 394418, 423174, 465173, 457716, 440579, 475066, 538688, 563963, 542850, 524587, 527597, 519220, 484620, 459355, 474087, 502935, 491494, 422648, 337678, 290025]
38609B90025q470k5474q4490j01640k5966Q8695J48957J30059P4944J9076k2140
38598D83576k1028K7605N6454o67r0485r2611J693O7338K7792m6068o3675l8720
38586C11204k3172j1783R485J405n2955p8840j3678P3744P2726J260k4362K4843
38574B89877M7574k9654j44043j81592j10845p9O1283L8149k8853o8814n7567
38563a84564l3688k6523j0735L4921P5033P7184P2717Q7347O3738m7637j57654
38552d9861j23889L3596J30073O4062m8569n0024M5845J00071M7458m0754o9821
38541C8187k4825L9424O6797M9570K5171K2966K2774q313n0247n0462q895J8250
38529A40397J0019O874K2364O477n6919r0625l2214N5271O4454J159k7797K5246
$$ y = [290025, 281555, 256081, 171591, 69951, 43985, 132680, 281637, 411696, 486640, 505716, 483576, 462548, 490153, 546607, 545940, 455455, 362844, 364537, 431875, 459667, 413599, 349924, 311204, 288032, 276249, 285734, 287139, 234184, 155344, 141666, 215410, 288136, 289396, 265034, 289877, 337451, 307797, 163754, -17838, -128683, -128762, -67479, -29330, -58183, -126997, -184564, -218252, -244775, -255510, -220589, -145556, -68372, 4345, 91692, 155430, 107793, -49861, -173750, -140154, -10081, 53981, 5412, -44612, 1233, 101304, 148762, 108008, 38187, 13362, 52786, 119583, 169153, 194324, 217290, 240064, 231751, 181504, 131042, 122147, 140397, 150416, 157290, 179654, 186131, 129212, 38587, 6373, 61644, 126098, 127257, 99460, 124706]
38517A24706Q4328O0944l3005j10278j09369m8455L904K916k2679r116M5821O2489
38505E2206j0945j07829j19676l9485M0169O3545O8967R5982J12019P2620k182
38494B25391o3483j05433j43586j48313p1604N5330J20648O6757j9372j0053Q6187
38483g531J22981J2217j44706j80964p9515J8344J4888k4259J0988J11078J69172
38472B2693J27954L4513l7168n8387m1345j2919j270j3622k2092J950M2902N8795
38460A02004L8725J2064M674J5199K9237K8699k716n1257o3535n242P9804J12313
38448B99969P2588R191l8095o8527p5337l6234L1047N9863J3892o1601r4298o2806
38436D9652m113K7662o62p2084j19643q9122n163O0280P7632O8355L9105j5637
$$ y = [124706, 209034, 269978, 236973, 126695, 17326, -31129, -27225, -24309, -46988, -56104, -10283, 52206, 41261, -66568, -186244, -225729, -185560, -122015, -53048, 42934, 154953, 227573, 225391, 161908, 56475, -87111, -235424, -307028, -251698, -131050, -64293, -83665, -93718, -7531, 115450, 127667, -17039, -198003, -277518, -259174, -244286, -268545, -257557, -146479, 22693, 150647, 185160, 147992, 89605, 48260, 35341, 34071, 20449, -1643, 307, 43209, 102004, 140729, 152793, 157467, 172666, 201903, 230602, 227886, 176629, 113094, 107852, 187656, 299969, 372557, 381748, 343653, 275126, 199789, 163555, 194602, 254465, 268357, 206756, 112458, 49652, 45539, 73201, 72539, 455, -119188, -208310, -213473, -153193, -75561, -7206, 31899, 16262]
38424A6262m7129J2380J23289J51899N7347m0811m8844l8984j00408j57914q8467
38413a61380N2192R3947J7134k7187K5396N6297j7507r5573o4622J7584L4058
38402f9661L686K3439Q0558P3356l353l7943J8168P4596M6764k2550m3710j1073
38390A32277J0061j4733n5481o4807k2077N1355R8241P1711n091n6238m7625k1640
38378G5953j2974J0728P1146J01110L2581p0254p5376J8157O2907j7547j07411
38367H9020p6256J9625L1410m6905p8299m284P5853P5674M0623L5049K4252l7509
38355A48253q6273k9082J01334J83402J75599J43054J24079Q0577m15n8803n7485
38344G24240m3288o0438p4416m4981j7087o0565j49452j80070j06595M570O5655
$$ y = [16262, -30867, -18487, 104802, 256701, 314048, 273237, 224393, 185409, 85001, -72913, -161380, -109188, -15241, 1893, -25294, 102, 56399, 38892, -56681, -121303, -103719, -69661, -65975, -42536, 38022, 111378, 108025, 70082, 88250, 162846, 209610, 187060, 143350, 132277, 142338, 127605, 72124, 7317, -14760, 36595, 134836, 206547, 201456, 145218, 97593, 75953, 62979, 73707, 144853, 245963, 278544, 208290, 132914, 151071, 213978, 196431, 89020, 12764, 32389, 63799, 16894, -61405, -65689, 10164, 85838, 126461, 161510, 185762, 148253, 61980, 32898, 134232, 317634, 493233, 636287, 760366, 840943, 840528, 781725, 724240, 680952, 620514, 546098, 501117, 484030, 423465, 274013, 93943, -12652, -8082, 57573]
38333E7573O2330L8069K1374L22m0354q0197p2077P043J18101J83638J54206M6387
38321D96415p9548j62318j65179r2483M063O0953O4179N6364O7461O5089K694
38310C17690j01211j68821j49054p2863j5278j3176k6997J2013J12630J97492
38300I2425J91123J18761O9396O4756L7314l7956p7007k0190M1337j8421j52712
38289C08826j77608k8321J38215J47140J8225r4592j05536n6290j6346r070k2947
38278A01696k8606R177Q1542J10122L3402q8284j24245l9410O0254P1692J6439
38267B03779k4429l7147o8201j19192j24681m5057P0530J37147J22401O4638K2436
38256B02224K1514L9721L1455k7820j13132j66926j46683n8448M7301J08667R6047
$$ y = [57573, 119903, 157972, 179346, 179668, 139314, 59117, -12960, -5917, 112184, 295822, 450028, 496415, 416867, 254549, 89370, -3113, 950, 61903, 126082, 182446, 249907, 314996, 317690, 216479, 47658, -101396, -174259, -189537, -202713, -229710, -217697, -105067, 92425, 283548, 402309, 471705, 536461, 573775, 535819, 458812, 438622, 479959, 461538, 308826, 131218, 102897, 241112, 388252, 406477, 311885, 206349, 150059, 133713, 124643, 101696, 73090, 82267, 163809, 273931, 307333, 219049, 94804, 55394, 115648, 187340, 203779, 179350, 142203, 74002, -45190, -169871, -214928, -144398, -7251, 115150, 179788, 202224, 223738, 263459, 294914, 267094, 153962, -12964, -159647, -218095, -170794, -62127, 33920]
38245C3920L9163K639J9857N9707P2968N3696K8750N702k6438n3874m8036k3775
38233A64279l0770o8520o9416j699O8030O8288L0437L3019O9953N6288l9546j45069
38221A35274j77478j26744l2263O4554J26021J30762J02534Q1335N5957j5378
38211C44574j04611j14871k3813N2183N869j08770j54842j00490l3300o014K6582
38200b17503R5850J36036P1286o0866j34651p9451M0315J00659N5956k1731m6387
38189f0487k9117m3072r3689r7973j6481O9435O8715R476j5993J0000L1051K5831
38177a42304K4512K8598N712l5187m9400l9321m3320m0032L1917J40870J63300
38166D5345O1274n0166p2065n0444n8120n5409J7286R0611M9927p2099j24448
$$ y = [33920, 73083, 75722, 95579, 155286, 228254, 281950, 310700, 316402, 289964, 236090, 188054, 164279, 133509, 64989, -4427, -6126, 61904, 130192, 160629, 193648, 263601, 319889, 280343, 135274, -42204, -168948, -201211, -136657, -10636, 120126, 222660, 303995, 359952, 344574, 239963, 125092, 101279, 153462, 159331, 50561, -104281, -204771, -238071, -244085, -217503, -121653, 14383, 85669, 24803, -109848, -189299, -148984, -48325, 7631, -14100, -60487, -89604, -132676, -226365, -324338, -340819, -271384, -202669, -193193, -209186, -199186, -168135, -142304, -117792, -89194, -83482, -118669, -168069, -207390, -250710, -290742, -258825, -117955, 45345, 106619, 56453, -15612, -66056, -124176, -179585, -162299, -71688, -21761, -93860, -218308]
38155b18308n2123M3755P2446O1596O1187M2950l7330j39886j72190r8373K2838
38144d13438R8106Q1004J0554k4471K1163R3966J04761L7736l8024n6591j3594
38133i8828N4076R8487P7086n149p1117m9746J9113K8713l4537o0657J5428R8683
38121G1552O0160p6058j57932r8928K9253J01423P6846J2510k2790j7146m161
38110b5271j977J4070O2192R9790O6144j9440o0748j2268N0502L2628n1049j04206
38098E0367q0083k5605m850l0413p0987q6624n5039O535M9966N1712M3379N6294
38086i5348O2366J9890m2167n0574M224N2940N1508L5406M5236N9291M1944J2272
38074A96988J2330L3826K7560k2733p7239r2278o6953l2978j6079j1988O292N5078
$$ y = [-218308, -270431, -226676, -154230, -92634, -31447, 11503, -25827, -165713, -337903, -436276, -413438, -315332, -234328, -223774, -248245, -227082, -133116, -28355, 9381, -28643, -85234, -98828, -44752, 53735, 130821, 125672, 54555, 4809, 23922, 52635, 18098, -42559, -27131, 71552, 131712, 55654, -102278, -201206, -171953, -70530, 6316, 18826, -3964, -21110, -25271, -27248, -13178, 49014, 148804, 214948, 195508, 134760, 122492, 172994, 205622, 154573, 50367, -29716, -55321, -60171, -90584, -161571, -248195, -303234, -296699, -246733, -195021, -151642, -95348, -32982, -13092, -55259, -105833, -101609, -48669, 2839, 38245, 83481, 142772, 184716, 196988, 209318, 243144, 270704, 247971, 170732, 78454, 11501, -21477, -37556, -49544, -43252, 11826]
38062A1826J11502J28730Q3315n436j02518j79009k02773j45585k6284Q1748J22705
38051a21779J21038J34685J60042J33817L4757o7782r5006n3435j1629m566o918
38040B23224L579P751r276j6103K0340P1626P9450M5105L1793O2524P1286l979
38028E87320j20070j73950j29245m4525J3024K5703M5n1900q8871n8397K5220
38017a5646O6753N0j15678j56571p9731L3365Q0190N0117J7984L9688P9917O4236
38005F4674n515l5800K7581J02195P3006l5711q9836m5660n419l8107o7003j3104
37993f8699N8400M7512q048l563M5138L2372m5212p8941l1455J8737L4593P1472
37981G2306J30628J15842P083o6345k1958L6689o151q2206o1074K2005K7140n1021
$$ y = [11826, 123328, 252058, 335373, 329937, 227419, 48410, -154363, -299948, -326232, -244484, -121779, -741, 133944, 293986, 427803, 462560, 394778, 299772, 246337, 234708, 230142, 223224, 226803, 234554, 225278, 209175, 229515, 301141, 380591, 425696, 457489, 520013, 591299, 587320, 467250, 293300, 164055, 119530, 132554, 158257, 158302, 106402, 17531, -40866, -15646, 51107, 51157, -64521, -221092, -300823, -267458, -187268, -137151, -119167, -79479, 438, 64674, 59159, 23359, 50940, 153135, 226141, 190430, 100594, 54934, 49515, 11408, -55595, -68699, -10299, 37213, 29165, 25602, 70740, 103112, 57900, -21041, -52496, -33759, 834, 72306, 202934, 318776, 325859, 259514, 237556, 274245, 268094, 185888, 124814, 146819, 173959, 122938]
37969A22938p5362R486R7499Q6766J855p4639r1988l7330N1958P6552j9382j29234
37957A9119r3719N9330J30154L9469n5101j4441O9580M8015k9722r744R2149J02630
37945C57719l2345j55823j24699N919Q3464M9406l4212q8440q9419o7600o9552
37934a65582j01404j06526l5177O8253J03409M5968j9870j8459K9868O6443P8215
37923e4862Q1042O9266L5525R322K3391N6782N3923n474q3558j24143r8020k2881
37911e9687M7898P3952P1260P6992P2622L100j05669j28785p401J32869J24405
37900C01556j6523j13428o9581L0776Q0344Q8065J00454Q6932K166r7684j08540
37889B84537k9172L3300J0188n1133o6274r252Q2056J42959J17471J0369r0525
$$ y = [122938, 47576, 57062, 154561, 241327, 243182, 168543, 76555, 39225, 91183, 167735, 148353, 19119, -74600, -15270, 114884, 154353, 99252, 84811, 154391, 202406, 172684, 162940, 255089, 357719, 325374, 169551, 44852, 50771, 134235, 183641, 149429, 60989, -28430, -96030, -165582, -266986, -373512, -408689, -340436, -237027, -191059, -210929, -229388, -199520, -133077, -54862, 26180, 95446, 130971, 140293, 163684, 220466, 274389, 268915, 185357, 61214, -36806, -59687, -11789, 62163, 133423, 210415, 283037, 286137, 180468, 51683, 44282, 177151, 301556, 285033, 171605, 102024, 132800, 213144, 301209, 401663, 488595, 490761, 393077, 284537, 255365, 288665, 298853, 247720, 181446, 172194, 254250, 397209, 514680, 525049, 434524]
37878D34524j02144o1593q2151j78019k21536j23789K5000P4885J7345k7094R399
37867b35173P1844R0806O9634M2648J6561j6141n0890p7592q0310l3262N7418
37856a44457J19458Q8229J0789l918N3982P8383J7231m5582l3915k174k7633o5963
37844D4430k5880O9191J13388P9592L0890q599o9600j26162j01139j1995J4784
37833H900o8835j40156p7699O1870J28543P8757k601m0915m0707l0297j7133l431
37821a43704Q207K8482O2666Q5544P0630L1651O75j6042k4148j0558K6370M4579
37809A64352J5746r375L3624J04751R3473j8643j15682j02829l0499j2111p2541
37798E0266j36068j30619n2411M9285J08375Q4802J0278l0995j363M2958M4918
$$ y = [434524, 332380, 270787, 188636, 10617, -210919, -334708, -309708, -234823, -217478, -244572, -235173, -163329, -72523, -2889, 39759, 56320, 40179, -10711, -88303, -168613, -201875, -144457, -24999, 63230, 74019, 70101, 124083, 202466, 219697, 174115, 140200, 138026, 110393, 44430, 18550, 87741, 201129, 280721, 311611, 303012, 233412, 107250, 6111, -5884, 8900, -59935, -200091, -277790, -215920, -87377, -8620, -11221, -52136, -92843, -123140, -140273, -143704, -135497, -107015, -44349, 41195, 111825, 143476, 144151, 128109, 103961, 93403, 119773, 164352, 180098, 170723, 204347, 309098, 402571, 383928, 268246, 165417, 134918, 122807, 50266, -85802, -216421, -268832, -219547, -111172, -26370, -16092, -47087, -48450, -5492, 39426]
37787C9426M1750R6152J65607J39821J3600p8257l9158N9077Q5004K3325l2894
37776E13453k5467J4518L9887L9315J3959l2376o8435n6707j3694J980k4079m1524
37764C60830k1568n295k9357n6530l2677K4702N3579M1734L5793O1909Q8670P5292
37752E97082K0334m3327p6334n7615n083L4863L9623L5852M7563M7658O013l9566
37740F07063k4375L7954N9569K29p5031q2700j7021O2448R6528O0495k4133r1720
37728F09306q8359m3124l8118r2121j31318j00617l9919j0883j3360k7703p3696
37717d9912j51672j79118q3108O9334J31197O4436j9086j5477N5501J13565J16643
37706E2303O0883m3647j42411j40067p475J42922J60655L5284q8182q4841J1500
$$ y = [39426, 81176, 177328, 342935, 482756, 496356, 418099, 378941, 438018, 523022, 546347, 513453, 487986, 502504, 542391, 581706, 595665, 563289, 494854, 438147, 424453, 426433, 402354, 360830, 339262, 333967, 304610, 248080, 215403, 240105, 293684, 335418, 371211, 433120, 521790, 597082, 617416, 574089, 497755, 440140, 435057, 469920, 509543, 545395, 592958, 640616, 646629, 607063, 582688, 620642, 680211, 680440, 605409, 522709, 505688, 568136, 664664, 725159, 701026, 609306, 520947, 477823, 439705, 347584, 216266, 115649, 75730, 64847, 51487, 23784, -49912, -201584, -380702, -463810, -394476, -263279, -198843, -217929, -233406, -177905, -64340, 52303, 113186, 69539, -72872, -212939, -220414, -77492, 83163, 118447, 30265, -54576, -43076]
37695d3076P7131O4274L8639N7690Q0798M1472l8833p8933o3740n9746q9545p7524
37683i1393K6355J40176J49143O7318P085N588j6222j05982j86454j60110m5933
37672b10429M5928M6210j1801m6516j2329O0447R2745L8153n3544p8912q90J01557
37660b9381J25120N8870j7892l6308k808L3032M2469L2239J1637k3753o3023o3354
37648F6848m316N1271J4036r4650j33514k4544J17468J24583M402p7164l0443
37637A3977N5250O4162J436n8149p7245n3839R970P3685O2824k2786p0174k133
37625c022R4716Q6082j1592o1484j6252K2998k4570j00012j02391k5193O6662
37614g4058J38580J91540J94846R6941p7707k02149j70117l0170N7461J2068p2446
$$ y = [-43076, 34055, 98329, 136968, 194658, 275456, 316928, 278095, 199162, 135422, 75676, -13869, -91393, -65038, 75138, 224281, 291599, 298684, 304272, 288050, 182068, -4386, -164496, -210429, -164501, -118291, -130092, -176608, -188937, -128490, -35745, 2408, -51136, -130048, -130938, -29381, 95739, 154609, 136717, 100409, 97601, 130633, 173102, 205341, 216978, 193225, 130202, 66848, 62532, 113803, 127839, 33189, -100325, -124869, -7401, 117182, 121584, 44420, 13977, 69227, 133389, 134825, 76676, -569, -54408, -44438, 29247, 92071, 69285, -889, -3022, 91694, 177776, 166184, 104700, 88448, 111446, 86876, -13136, -115527, -140720, -74058, 64522, 256062, 450908, 547849, 470142, 267993, 97876, 67706, 125167, 137235, 64789]
37603F4789o6008J4761M6230k247k4663L6344Q0149N884j13231j27515k8489N3823
37591f0173M7581J0431K684P981O396K0434M6080L0001l3644o5142j6530M4990
37579D1089L8325q137j1637L1090M8951J3734k6646l0368j2329l245o178n642
37567F9007J1736M9781R1468J01334O5610J7999n448k0380o0900j05684r3431
37556A21092j6382N7872P7457O7543O8085N6467j3424j16016j59119r6230Q419
37545E5764N2538J1498m4615m0315K3995Q3064P9948J6294o0644j05491j06458
37534c4422q0303m8096k1062m403j623p756p430P316K2065J9047R424K5218P2330
37521d9695J12041J02340M2816l1837q4495q9691m1065K9630O1705K6775l1401
$$ y = [64789, -1219, 13542, 59772, 57525, 32862, 69206, 149355, 155239, 42008, -85507, -113996, -60173, -12592, -2161, 523, 8504, 14900, 35334, 81414, 111415, 77771, 12629, -3901, 41089, 79414, 71277, 59640, 90730, 139681, 153415, 126769, 96401, 84072, 80827, 74649, 69007, 80743, 130524, 221992, 323326, 388936, 406935, 401487, 381107, 320207, 214523, 121092, 104710, 162582, 240039, 307582, 375667, 432134, 418710, 302694, 143575, 47345, 55764, 108302, 119800, 75185, 34870, 58865, 141929, 221877, 238171, 177527, 72036, -34422, -114725, -162821, -183883, -188286, -189909, -197665, -205095, -197779, -175714, -156667, -147243, -122025, -49695, 62346, 164686, 207502, 175665, 91170, 1479, -39586, -9956, 51749, 78524, 47123]
37510D7123n1161l4636l3616n9052n7020Q014Q9999J14083O8015Q464j3815p626
37498G8772j6670n5468q1771m3503M5543J01345O5294j6900n2781k6490p647l4426
37486d4702n8088l5574r758l5724p3412l4291P9036J59132J32712M8740J047J5264
37474A44382M9630O8135O4944L6494k0597q2749j10207r6788q0609q9310r7454
37463b14129o1510J6589Q7919J14155R7914N2509k2621j12539j61900j22831k3147
37452c49591N4482O9706O2818P9549R9189P5493J9468j2552o246p833m2617o8999
37440b7133m5512K526L0981N3654J03127J36475P2055o4083j26862m5910N3157
37429A42475J5727j11884j45146l6739N3841L615r2545o9638P2563J87924J80948
$$ y = [47123, -4038, -38674, -72290, -131342, -188362, -180348, -90349, 23734, 91749, 100213, 86398, 78772, 62102, 6634, -75137, -118640, -73097, 28248, 93542, 76642, 23861, -2629, -10276, -44702, -102790, -138364, -148122, -183846, -257258, -291549, -212513, -53381, 79331, 128071, 129118, 144382, 194012, 262147, 327091, 363585, 342988, 260239, 150032, 53244, -27365, -116675, -214129, -275639, -259050, -171131, -56976, 40938, 93447, 70826, -41713, -203613, -326444, -349591, -295109, -225403, -162585, -83036, 16153, 91646, 111114, 98562, 92316, 84483, 41866, -27133, -72645, -70119, -39138, 14516, 117643, 254118, 326173, 262090, 135228, 89318, 142475, 158202, 46318, -98828, -135567, -81726, -78111, -170656, -240294, -167731, 20193, 201141]
37418B01141Q2105l7517j24049j32246o0527O557j7697r1882r0340J4702J11869
37407a37884J14217O4291L2380N841m9320q9549m4269O9126J54274J46098O2285
37396C27490l8251j03128j04710m9733K7579R1648J13124O3826m6099j28176q7224
37385F6346M3169J14124N0358n4416q6780p2041r7162j47692j34630m5978L9745
37374c24957P5674Q3204P7508N3301L8106O1453P3953K354j08984j26862k4093
37363a19343P1247O4632J7470J6442L3360Q953j8577J2881N3557J1367p7662q6110
37351a1783n97M5340k2451j02643p6382J5789M7426n260n0889l3374L617P582
37339a83625j1273k3407k8380k7513j117N1949R5200J06384J04084R3912M7512
$$ y = [201141, 283246, 245729, 121680, -10566, -71093, -64536, -82233, -174115, -264455, -249753, -137884, -23667, 40624, 73004, 78845, 29525, -60024, -104293, -35167, 119107, 265205, 327490, 289239, 186111, 81401, 31668, 59247, 150895, 264019, 327845, 281746, 153570, 66346, 109515, 223639, 273997, 219581, 132801, 60760, -36402, -184094, -318724, -364702, -324957, -249283, -166079, -88571, -35270, 2836, 64289, 138242, 140596, 31612, -95250, -119343, -48096, 16536, 34006, 50448, 83808, 92761, 74184, 87065, 140622, 151989, 74327, -11783, -12380, 32960, 10509, -92134, -168516, -152727, -105301, -110561, -161450, -194824, -191207, -183625, -194898, -218305, -246685, -274198, -275315, -223366, -128166, -21782, 82302, 176214, 223726]
37328B23726k0499k5996N9236J21591N0988p6648r4158L375N4512q233o2943j8383
37316B06568L7290O773m6576l1793p381o5883j39205r9331J1188L8970k5007m4423
37304a58810J5989M2121p316k6874L0873O1535L573m2069P089O5430L5598j7188
37292I951R206O1448K3066p6234j07466n5359k4938n0214m7397K5376R1747P8227
37280f2587J3991k9801k6733J1430O5783J02599Q3033J2212m9055m0979L7955
37269A17848J25608J36601L3268j21138k10897j93905j37174j01093n7487K3118
37259c85251Q0698N3173o026o438K9065J5043k7905O86Q9259J02747j007q7082
37247a43038m2179O5153J07013P5541M1126J3576m1220r4980q0097l450N5448
$$ y = [223726, 203227, 177231, 236467, 358058, 409046, 332398, 238240, 241615, 296127, 287894, 224951, 206568, 243858, 250631, 204055, 172262, 164881, 98998, -40207, -139538, -128350, -89380, -114387, -158810, -142821, -100700, -108016, -134890, -104017, -42482, -38909, -80978, -73889, -8459, 27139, 9951, 19157, 80605, 103671, 27437, -80029, -135388, -160326, -210540, -257937, -232561, -140814, -62587, -48596, -78397, -105130, -93700, -27917, 74682, 157715, 169927, 120872, 79893, 117848, 243456, 380057, 413325, 292187, 81290, -112615, -249789, -350882, -408369, -385251, -304553, -251380, -257406, -263844, -234779, -219736, -247641, -246955, -157696, -54949, -55956, -143038, -185217, -120064, -13051, 62490, 103616, 117192, 75972, -19008, -99105, -102555, -47107]
37236d7107N8323M4645N0785N9532M3712R117k1851l3092j2202M1617R6361J02315
37224C92155M4031l6602p7915n3106J0166N5056M3239j2752o4436p6257n4713
37213A68866l0308k1813k0746m558L1254N1868J6935m8501n5861K8004R9869L6706
37201B51715j19509j92088j03931K1940M7121J878l742K9710J3219n7526q3029
37190a94242j8027O6797J05158J13091J08775N6406m5680j06960o1081J9972K3038
37179F7247l4278l3655N5338J26675R8031K0066k0690k5408m2515o4740m7570
37168I8501J576L1162K8915K5665K2038j3601o5969o7657j520N6061L4225l9592
37156A09804q7270p8615l8736P276M7821O5210M7840J1968j7513l3644l6270k2813
$$ y = [-47107, 11216, 55861, 106646, 166178, 209890, 219007, 197156, 164064, 151862, 193479, 289840, 392155, 436186, 399584, 321669, 268563, 278729, 333785, 377024, 364272, 299836, 223579, 168866, 138558, 116745, 95999, 91441, 122695, 174563, 191498, 142997, 87136, 115140, 215009, 251715, 132206, -59882, -163813, -141873, -94752, -92874, -96616, -66906, -53687, -111213, -194242, -212269, -145472, -40314, 72777, 181552, 237958, 192278, 85318, 24237, 44209, 67247, 32969, -686, 54652, 181327, 279358, 299424, 278734, 253326, 210811, 146071, 98501, 100077, 131239, 160154, 185819, 207857, 194256, 128287, 60630, 59110, 115171, 149396, 109804, 22534, -56081, -94817, -87541, -39720, 25490, 73330, 85298, 67785, 34141, -2129, -24942]
37144b4942j0824l1570p3712p8055k3441L1575L5029J2938J227k7195r0679j18949
37132c98598m7732N5675P8536L9191M6517J04786J09724M4805J9315P0361Q7161
37121B09741N599p0777m5515P098k0003p3714l5561O3703Q4732K363o3990m2566
37109B1110K736K86k5460j8718K1066N8534P1911N3982P859l8963n2945l6044
37097F5354j7139n992Q129K2570K7708L3608M4779K7532m0433j04250q4932M149
37085a8917O2962L5236l1439o9588p1534n9496l2460J7756P0399Q9786O1485R45
37073E5135n7707p5618l2580N2603J30782J50841Q6814l3980j27059j22084n4971
37062b7824l0877o9069o4760L9349J34947R8220j9710p8748o6737p6972j02081
$$ y = [-24942, -35766, -67336, -141048, -219103, -242544, -210969, -175940, -163002, -161775, -188970, -279649, -398598, -446330, -390655, -312119, -272928, -226411, -121625, -11901, 32904, 52219, 122580, 209741, 215340, 144563, 99048, 106146, 86143, 12429, -23132, 40571, 125303, 127666, 63676, 21110, 23846, 24132, -1328, -20046, 1020, 59554, 131465, 185447, 193306, 154343, 101398, 65354, 48215, 42223, 50352, 72922, 100630, 134238, 179017, 206549, 166116, 61866, -23066, -18917, 44045, 79281, 47842, -21746, -93280, -152776, -185236, -167480, -97081, -7295, 54190, 55135, -2572, -78190, -110770, -58167, 72615, 223456, 310270, 276290, 149231, 27147, -27824, -58701, -127770, -192530, -153181, -18234, 79986, 60276, -18472, -85209, -162181, -264262]
37051b64262l1779J26415K04290J13892k2820o7985n2463o3113p0238k929Q7091
37040d3901Q1590k0986j01604q6358j7132L5743M5152J2346m5347q4140o5934
37029b90571p586L7471M0420J2280k2001l5418j1039K8663L5499M762j0718J6058
37017b02180M2446L4467K8539O1425R5741P8403K3419k6703o9898j07673r6571
37006a38585j7417N8391N9091K1500J9258L4913J0971k0630J1278O9130M9545
36995A57445l7528p8149m7352l8638p4191m9547O7225J35932M9543q2967q7261
36984h5488K5256R1131L5601m9415o2431j9691n04l5568q3165q5022k6041N2103
36972b43234R5522R5021Q2255P4033N5332K0817r426k6590m4022o2416o9544p8907
$$ y = [-264262, -296041, -169626, 34664, 148556, 125736, 57751, 5288, -57825, -128063, -130992, -43901, 37689, 16703, -84901, -171259, -188391, -152648, -107496, -95150, -140497, -224637, -290571, -298157, -260686, -220266, -207986, -229987, -265405, -276444, -247781, -212282, -207520, -218238, -202180, -159734, -125267, -96728, -35303, 60438, 138841, 162260, 135557, 65659, -42014, -138585, -156002, -97611, -38520, -17020, 2238, 37151, 48122, 27492, 38770, 107900, 157445, 119917, 41768, -5584, -44222, -118413, -167960, -100735, 35197, 84740, 1773, -85488, -60232, 30899, 66500, 17085, -45346, -65037, -65541, -101109, -184274, -269296, -295337, -243234, -147712, -52691, 29564, 103597, 158929, 179746, 170320, 143730, 99708, 37292, -32252, -111159]
36960a11159j09749j20743l8914J18490K25698J92734O4929n5843j18092j12668
36950f5317m4684K9138J9212o9911j10187k4718R1516J17420Q5082R4195J25042
36939B46788Q5523m225l7074j0152k6080r6129j06902j8431O0089M9109J0198
36928A52714P699m628o6733j04324m9257L1294M3974K3356N0269Q7095L8618o4218
36916A45859q9820o607P6708Q0842M4269K2524J2443N101R789l884p9900j57498
36904E9826j02004Q3821K04037J22006m1580q8792k9052k0845q6708q4135K9883
36893D6457J02176K5935q3893p3696J5217L8772r505j3516M6131N4405m0412j35290
36881b7219j27958n0621J1548M0837N7048M7334N509j8895Q924L7376O754m3974
$$ y = [-111159, -220908, -341651, -380565, -262075, -36377, 156357, 221286, 165443, 47351, -65317, -110001, -80863, -61651, -131562, -241749, -266467, -174951, -57531, 27551, 121746, 246788, 332311, 328086, 291012, 280860, 254780, 158651, 51749, 33318, 93407, 142516, 152714, 160413, 155785, 89052, -15272, -64529, -33235, 10739, 34095, 84364, 171459, 210077, 145859, 56039, 49432, 126140, 206982, 251251, 273775, 286218, 291319, 301108, 297224, 217324, 59826, -42178, 41643, 245680, 367686, 326106, 237314, 208262, 187417, 100709, 16574, 46457, 148633, 174568, 90675, 16979, 32196, 70968, 61463, 47947, 94078, 148483, 108071, -27219, -155177, -205798, -194250, -153413, -96365, -49031, -43522, -62417, -53493, -16117, -9363, -53337]
36869e3337l5559K1374N2038N0657P6778J18429Q0638n0864j44656r3813K9792
36858E1477P6794K0432l9143m0727k8820m6192n4196p612N2884M9211j7474o3835
36846d7201m3028p161j8232m2865L54J01095J40933M6895r7910j50123p6437K9206
36834a64474P4638N3220J0221j0460J4235O2220O2057k5122j22192j11230N34
36823a56353Q0322N9217J7954L0823L4511m9288j47180j20577K4490J45615J65562
36812H5096J35019R2127K501j17597j53354n3107O2088N5738k6314l3058N4684
36801A03823R6132J1554q9430o3980N7069J07336P883j28858j41444j5957J04922
36790D9050R6669p950p3137k5254P2739J08968M8168m7916j00886q7695l9612
$$ y = [-53337, -88896, -67522, -15484, 35173, 111951, 230380, 311018, 260154, 115498, 21685, 51477, 128271, 148703, 109560, 68833, 40013, -6179, -60375, -67987, -15103, 34108, 16634, -47201, -90229, -97390, -115622, -158487, -158133, -57038, 83895, 130790, 32880, -117243, -193680, -164474, -89836, -36616, -26395, -36855, -22620, 39600, 101657, 76535, -45657, -156887, -156353, -76031, -16814, 1140, 31963, 66474, 17186, -129994, -250571, -226081, -80466, 85096, 220115, 312242, 314743, 197146, 43792, -9315, 52773, 108511, 82197, 49139, 103823, 199955, 211509, 122079, 58099, 115168, 222504, 230387, 101529, -39915, -55872, 49050, 145719, 137769, 64632, 39378, 112117, 221085, 269253, 221337, 120451, 32756, -6856]
36779f856K434K1226K4995K8339L3090K7780P057j2836p034K5571N0089K7667
36767B21522l7366r4104r9923o9095m7045m2268j7423M0774Q0236M6104l7524
36756e6112q9853o8635k769O4347J13223J21811N9221n6657j36224j04202P465
36745a48385R7280J15135R8474Q8500O7197O241o4377q6330n7045l4635n3015
36734B9040p6578o1713k5021j0423j3206R234N6080P3036M0405J2547L1376N2056
36722A16833J3470n3409o2305m836L2249l665n6383m7790J8499Q2412J11773J13491
36710B60339R1280M2611j5365n5725p0090o1706k8104K0129M4407K0319j8333
36699B29762j6624K6099N2974K0407n5487j18649j16781l9707N6644Q2981J2451
$$ y = [-6856, -4422, 16804, 41799, 70138, 103228, 131008, 138065, 125229, 118195, 143766, 193855, 221522, 184156, 90052, -9871, -78966, -126011, -168279, -185702, -144928, -64692, -18588, -56112, -145965, -214600, -217369, -153022, -39799, 82012, 141233, 84576, -51648, -155850, -148385, -51105, 64030, 162504, 251004, 318201, 324442, 260065, 173735, 116690, 82055, 29040, -47538, -109251, -134272, -144695, -157901, -148667, -92587, -19551, 20854, 33401, 64777, 116833, 130303, 76894, 14589, 9753, 42002, 38337, -18046, -65836, -47337, 35075, 146848, 260339, 351619, 394230, 378865, 323140, 253050, 191344, 163240, 183369, 227776, 248095, 229762, 213138, 239237, 292211, 312618, 257131, 138482, 21701, -18006, 38638, 121619, 134070]
36688A34070p1929p1322R11M1105r19o6136q3927n6522j8728K3002O7941Q7515
36676a4939O4376L1012K5789M1398N5477P2391Q5990M6016o6556j61863j27532
36665E1559J1971J10183Q8407K6868L1924Q8804J04630M5738l4131p7363p7099
36654C71491n6717l6505k0638J742L1401L1282l5667j23781j19493J2668J51233
36643B07016J54113L7869n6188m9894K999K4514j466n5765j10096j14410m2332
36632c640L7509K7052m8702o3888L809K4609n8927j01066K7720K03747J99890
36621B48113J2078j38167j11355M481O9807O1331K1131l0304o8952n6115r035
36610C013J37m1628o0321j8577K6128K9979K9724M7383L1492l7002p9409m1463
$$ y = [134070, 62141, -9181, -8270, 32835, 31916, -34220, -118147, -174669, -193397, -170395, -102454, -14939, 49437, 80449, 106238, 147636, 203113, 275504, 361494, 407510, 340954, 179091, 51559, 63530, 173713, 262120, 288988, 320912, 409716, 514346, 560084, 525953, 448590, 371491, 314774, 278269, 257631, 259373, 290774, 322056, 286389, 162608, 43115, 55783, 207016, 361129, 398998, 342810, 292916, 295915, 320429, 318963, 263198, 153102, 38692, -3640, 33869, 60921, 12219, -51669, -47860, -23251, -82178, -183244, -155524, 48223, 248113, 260191, 122024, 10669, 15150, 84957, 146288, 167419, 137115, 68163, 12048, 3013, 3150, -38478, -98799, -117376, -91248, -61269, -31545, 15838, 47330, 10328, -69081, -110544]
36598a10544J2443J5811J5430O3541Q7776L992j11025j11130m197O9372O1175
36587g356N8971R8874R2522j1305j24185j43069p9586m674N0328P8073N7896L24
36575F6813k9533M851M9465L3882l1437p9670p5269l2345K5666Q0081J07166R0383
36563B10053L8868k0570o1598o8559m7815k6274j8336p582J2622Q594l8192p6771
36551i5560n4267j2682l3907j00008j05394j6361P9470J06269Q8387P2523N3367
36540a8163K2490R332K2239J9786j1839k1476K1785P3514Q5547O3434J8703n1687
36528B33665j00310m7166P7846J17933k241j49014j55970l7935P4354J25060J37436
36517B73658J03836J0577p5936q0745m3331m8289p4346m2542K2970K6728k6467
$$ y = [-110544, -98101, -82290, -66860, -3319, 84457, 88449, -22576, -133706, -137903, -68531, -7356, 51615, 150489, 243011, 231706, 107521, -35548, -115134, -119808, -69480, 8593, 66489, 66813, 37280, 42131, 91596, 125478, 94041, 14371, -60898, -93243, -67577, 12504, 119670, 210053, 248921, 228351, 166753, 98194, 50379, 24105, 5769, -1813, 10809, 19403, -18789, -95560, -149827, -162509, -196416, -296424, -401818, -418179, -338709, -232440, -144053, -71530, -18163, 4327, 13659, 35898, 55684, 43845, 22369, 44154, 117668, 203215, 266649, 285352, 233665, 133355, 86189, 164035, 281968, 279727, 130713, -25257, -63192, 11162, 136222, 273658, 377494, 388071, 312135, 231390, 188059, 139770, 65424, 22882, 45852, 72580, 46113]
36506D6113l9367M453K1879r465j9314P564k930o6352r4939m6255R212J6307Q797
36493a64297N742l8270j16052j25077k1863Q9748J08964P7434Q1252J07726R5769
36482A01076M8440k26n8035j22027j27210m6708K8301J5919j8485K6353R9907
36471e2695P0036n1659j11501m5971L6123L9020J3211L8286Q1815O5308K795k1012
36459F3756J7045M8602J5737n5790r9426q5052l2573K6341O9688P4781K3494o0989
36447E614j07878o7110K2361P0207M2085q406j9602Q813L8318M1751J3897l0497
36435I553n5150l7036q838j6365l2256J1443Q8286P6473n2208j45214o8326Q6702
36423a42936J19070j44j02396p3047R417K5014j3830j7671K2431K4479n2823j36114
$$ y = [46113, 6746, 11199, 33078, 23613, 4299, 11863, 8933, -57419, -152358, -198613, -189401, -173094, -164297, -158555, -196825, -312877, -437954, -459817, -370069, -261105, -183671, -102419, 5307, 101076, 149516, 149290, 91255, -30772, -157982, -204690, -176389, -160470, -178955, -152602, -52695, 17341, -34318, -145819, -191790, -155667, -116647, -103436, -65150, 16665, 81973, 84768, 63756, 80801, 129403, 145140, 89350, -10076, -95128, -127701, -101360, -31672, 43109, 66603, 5614, -102264, -169374, -147013, -76806, -34721, -43127, -62729, -53916, -15598, 26153, 40050, 9553, -45597, -82633, -91471, -107836, -140092, -128649, -40363, 36110, -16098, -161312, -229638, -142936, -23866, -24010, -126406, -199453, -190036, -165022, -178852, -196523, -174092, -149613, -202436, -338550]
36411c38550j16587J8570J54899J63539M5023o4676m9523N3292J10649O2202j9027
36400A9811l3669K4036P1600L8250n7312j23732r1541R535Q5259R0059O9336P3479
36388A75111P8453L3339n0432j10541j13788p8004l1993K649Q990j576J6476P9900
36376H584J31444J08098L1405k5966m0976m4527m4806k0705J2110K501n5786j02421
36364d1045q3333l627R2402J52224J35834N4529k2432m8677o4670j19085j59940
36353a07820r8179L3595R7178M2132k1897J2847J08998J58582J27623O3110P711
36342D23880l0039n1140o1415p4747r2522r6797p6226l5153K2410Q0949R2601
36331A01801K3526p5844j07246m3282M4666Q3773O6657J8636l2902m9275j2572
$$ y = [-338550, -455137, -436567, -281668, -118129, -73106, -137782, -187305, -134013, -23364, 38838, 19811, -13858, 10178, 81778, 120028, 62716, -61016, -152557, -143022, -57763, 32296, 101632, 175111, 253564, 286903, 236471, 125930, 12142, -65862, -97855, -95206, -86216, -87792, -71316, 8584, 140028, 248126, 279531, 253565, 212589, 168062, 123256, 102551, 114661, 117162, 61376, -41045, -124378, -128005, -35603, 116621, 252455, 306984, 284552, 235875, 171205, 52120, -107820, -205999, -172404, -75226, -33094, -54991, -42144, 66854, 225436, 353059, 416169, 423880, 393841, 342701, 281286, 206539, 114017, 17220, -59006, -94159, -71749, 9200, 101801, 125327, 49483, -57763, -101045, -56379, 27394, 94051, 112687, 79785, 30510, 17938]
36320A7938K5934M921m0260k2669M4969O2194J8149J5540P4952P2962m0180j17255
36308A17195l7824P7860M3761r8345j44841l8188P7385R5704O6134M7995Q119
36297B14955p7921j44810j27791n3126J4396M8575M8610J5244k1676j2310L8203
36286e7651N8213J0734m4215l1697L2591O5615K6228l8687n6802j6866K0355K226
36274b9956l9345k9105L1074M5782l2207j10660q1222J8333O2455K7050N289L6782
36262i5730M5189j7503p5898m7385K9752O3060M2202K5569K7671P241m1567o6870
36250a04269m4299j9560l1520m2186K744O8945O0417l5823j02205l9279R0081
36239a96954J43255R3893M4822M8671L6147l7895r5280n9375J7342M4679L2072
$$ y = [17938, 43872, 48793, 8533, -14136, 30833, 93027, 111176, 126716, 201668, 274630, 234450, 117195, 79371, 157231, 200992, 102647, -42194, -80382, -2997, 92707, 158841, 206836, 214955, 137034, -7776, -135567, -188693, -174297, -125722, -77112, -61868, -83544, -95854, -57651, 562, 11296, -32919, -64616, -32025, 33590, 59818, 21131, -35671, -52537, -32182, -29956, -69301, -98406, -67332, -21550, -53757, -164417, -245639, -227306, -164851, -137801, -132512, -95730, -50541, -68044, -143942, -191327, -161575, -98515, -56313, -30744, -3073, 4168, -37399, -104269, -148568, -168128, -199648, -241834, -239090, -170145, -109728, -145551, -247756, -287035, -196954, -53699, 40194, 85016, 133687, 169834, 131939, 36659, -22716, -5374, 39305, 71377]
36228G1377L0584J5289m9065q9832k0837Q6940Q8488k087l1911L4809O5007k165
36216A96597n0069J61M2998k4570j14766r2545K352L4869k2K079M9416L8130n4055
36203C0575j10696n5072L4388M8938K026j6157J8236M2782J5609k3876j8213K3059
36191h401L5764r666o6745p6325m2717j4495r235j761J9125L0349J7300l972j4333
36178a45112o926K1992N7696N4743n286n7496k7762M5100N2267j3846l9113K9299
36166c4444R1766N0036m7762r6628q5020o3841l4608K8614R2119R7948N9943L9269
36154I7392M7349M9329L7897K7429J689n2269q0461j7190J04567J74221J33433
36143E23386K4426p9981j34092j23163p3339m5787o5109p5268k3697M5476N4856
$$ y = [71377, 101961, 117250, 68185, -21647, -42484, 44456, 132944, 130857, 98946, 133755, 198762, 196597, 146528, 146689, 189687, 165117, 50351, -42194, -39842, -4973, -4995, -2916, 46500, 84630, 30575, -80121, -135193, -100805, -51867, -49841, -65998, -47762, -4980, 10629, -13247, -31460, -8401, 27363, 17697, -49048, -125373, -168090, -182585, -191820, -193581, -174456, -144107, -126807, -130779, -145112, -152038, -130046, -72350, -17607, -22893, -80389, -108151, -63051, -10784, -24630, -63743, -34444, 57322, 107358, 59596, -37032, -122052, -185893, -220501, -191887, -99768, -1820, 58123, 97392, 144741, 194070, 231967, 259396, 261085, 208816, 128355, 111165, 215732, 389953, 523386, 547812, 467831, 333739, 210576, 137237, 91450, 26341, -48927, -72624, -27148, 27708]
36132B7708J6434L656K5072K0951k5123o5304p4365o6323k8407O1524J45923J23454
36120A65200J392q5546m8993M3998P9643M0536j0745l1258k7111k0888l0340n5460
36108B0428o6964l3679L2284Q7098J06129Q8831L4308l7473o8137l3212m409n5962
36096F9242j34847j26860l3999L4476M3504O7111J23900J25829M0779l4271l2868
36085A41996k1842o1244q5830k8675M6467N0510J4473J3016K5881k093l7405k4472
36073C0782j1517p1304j46503j19959p584O3618N0928K4855J3735k6302p6119
36062b75370m6868N2349Q8768J0627n6278J66J05191J16538K9674m5774n5157
36051g6134l3660n412M4024R6080R0497J0429q1905j15095p4938Q364R6761J49148
$$ y = [27708, 44142, 47798, 72870, 93821, 68698, 3394, -70971, -137294, -165701, -104177, 41746, 165200, 166592, 81046, 32053, 76051, 155694, 196230, 185485, 154227, 127116, 106228, 75888, 20428, -46536, -80215, -47931, 39167, 145296, 234127, 268435, 230962, 162825, 129613, 125204, 69242, -65605, -192465, -226464, -191988, -148484, -81373, 42527, 168356, 209135, 174864, 141996, 120154, 58910, -26920, -55595, -9128, 41382, 55855, 68871, 94752, 92659, 55254, 30782, 19265, -52039, -198542, -318501, -326085, -262467, -211539, -186684, -172949, -199251, -275370, -322238, -269889, -181121, -170494, -226772, -226606, -121415, -4877, 24797, -20977, -76134, -109794, -115206, -71182, 24898, 115395, 125824, 43919, -71176, -146114, -137750, -40989, 108159]
36039A08159J26309K6706r2200j56111j42992r6175o5005n0588k6082O642J6093
36028c45244j548m225L6666R1270J12451R2785M9807j1875p8143r5639l0245N5064
36016a28876N4040l7986j01882n0235N4258Q8210L3858j3409O856L8575M848o9084
36004a20827q8612k8386L0343K0302j5841N06O1063R4445Q4810P6026O2842j3768
35992A62903j32874j65888n0584R7640J34574P2705K0755M622l1078q4717r3050
35981f4992n4248l2730l6651o512O1096R2806O4248L5279L1139K767n5525o8014
35969c1337j3572J7115k7429o5216k8009Q583l9705r6095l5041R6831J31398K9357
35957e3120p2551p1920j6828J7552L5351M8530J6800o0902q6101J0765J38997
$$ y = [108159, 234468, 261174, 168974, 12863, -130129, -226304, -291309, -341897, -367979, -361337, -345244, -346792, -351017, -314351, -223081, -110630, -17845, 31962, 20087, -58056, -153695, -183940, -128876, -74836, -112822, -214704, -264939, -210681, -122471, -88613, -102022, -95166, -56591, -51743, -120827, -209439, -237825, -207482, -187180, -203021, -202515, -141452, -47007, 37803, 113829, 176671, 162903, 30029, -135859, -186443, -88803, 45771, 118476, 139231, 143853, 112775, 28058, -64992, -119240, -151970, -188621, -195133, -134037, -41231, 23017, 58296, 89435, 92202, 36677, -31337, -44909, -27794, -55223, -120439, -148448, -139865, -179570, -275665, -310706, -213875, -82477, -53120, -125671, -197591, -214419, -196867, -161516, -112986, -96186, -157088, -243189, -232424, -93427]
35946i3427J45639J9290r7849r9873l2089P110K582N412K5643J6780l2866n8964
35934a92612p087P7230R4433J9819o0063n4585K0931O9458L1739m6058o9286o487
35922a22568P0566O7987j7017r0109p3379R820Q4288J13679R9245L4302o6791
35911A10023j23876o9025L5353N4678l0277r7776p0945j2428J3830M5783J02714
35900d1946Q8686n0687j72732j04450Q8821J76276Q6785j6381o193L9175N912
35889I3266o7570p7086k2908J7876K4199L4630N7511O4088M8400K5971o279n2570
35877A39528q5723q5880q3876j08901j21532o7058K2282N3998O128m0119j6856
35866c88009M4597P8151Q1580R8364J27861J15700M1734l2446l6671J5365M9061
$$ y = [-93427, 52212, 71502, -26347, -126220, -158309, -151199, -148617, -143205, -117562, -100782, -133648, -192612, -199699, -122469, -28036, -8217, -68280, -122865, -101934, -32476, -737, -46795, -116081, -122568, -52002, 15985, -1032, -91141, -164520, -154700, -70412, 43267, 142512, 176814, 110023, -13853, -82878, -47525, 7153, -23124, -120900, -191845, -204273, -190443, -144660, -41946, 46740, -3947, -176679, -281129, -192308, -16032, 70753, 54372, 48179, 87354, 93266, 25696, -51390, -74298, -56422, -32223, 2407, 59918, 124006, 172406, 198377, 192098, 139528, 53805, -32075, -115951, -224852, -346384, -413442, -391160, -337162, -331034, -371153, -388009, -343412, -265261, -183681, -85317, 42544, 158244, 199978, 167532, 130861, 146226, 195287]
35855A95287L2534P133Q345J1312j7039o0100q5411r2688q2418k5899O9886J17431
35843G8373N7097k8344j7167N5942M0827q5802j67697j06558p297L15m1580j8007
35831b39898O0418R3968O6851M7652N0689K4579l5617p9301r5201j09381r8052
35820c13293j4855R3861J17417M2708k0446j598M7227O3338O2418O8043N2415
35809A97235R827K85M6445O4620j7323j34653j68790j11287n1065k5574J5496
35798a74784R6526J57638J41165P2899J6555j2834m5569q6696r8290o4782l7211
35787c5383p0011j25100r8029L5282J52926J24230k1086j27947j03203J855Q8341
35776a78125J12748Q5759M0218J7051K4867J0682o3894j29197q4819L2380P7478
$$ y = [195287, 227821, 234954, 243299, 254611, 237572, 177472, 92061, -627, -83045, -108944, -39058, 78373, 135470, 107126, 89959, 145901, 186728, 100926, -66771, -173329, -180626, -180311, -221891, -239898, -179480, -85512, -18661, 28991, 79680, 104259, 68642, -10659, -105860, -215241, -313293, -328148, -234287, -116870, -74162, -94608, -96206, -48979, 14359, 76777, 144820, 197235, 207062, 207347, 253792, 318412, 301089, 166436, -2354, -113641, -164706, -190280, -174784, -78258, 79380, 220545, 293444, 309999, 297165, 251596, 164900, 66610, 1828, -35383, -105394, -230494, -328523, -293241, -140315, -16085, -37171, -165118, -268321, -266466, -178125, -65377, 20382, 60600, 77651, 102518, 113200, 49306, -79891, -164710, -132330, -54852]
35765e4852J3095m2901l0689n2135j68114k44399j43508M6264J39957J29069J44341
35754b63872J99289J66788P897j52550k04290j61441p3718L3210J05688Q8377
35744b54622L2397M4404J02377P0903o1080j23987k4873R5906P2851n0284j15606
35733b11614p5766o12N5521P3587K9471n2069o8894K4819J23944J19232O1557
35722G9176N6357P5264K5947n3643m8211J8578O551r7588j40133m1768Q2844J06142
35710F9516M9792j408k5641l1061k697M2910M0996j6099m6077j2965K680n1706
$$ y = [-54852, -41757, -84658, -115347, -167482, -335596, -579995, -723503, -677239, -537282, -408213, -263872, -64583, 102205, 110102, -42448, -246738, -408179, -481897, -448687, -342999, -254622, -222225, -177821, -75444, -4541, -65621, -189608, -214481, -118575, -45724, -96008, -211614, -287380, -287992, -232471, -158884, -129413, -181482, -250376, -225557, -101613, 17619, 79176, 135533, 210797, 236744, 183101, 134890, 153468, 160019, 62431, -77702, -119470, -36626, 69516, 119308, 117900, 92259, 61198, 58501, 101411, 142407, 126308, 80231, 67266, 69946, 18240]
$$ [...]
##END NTUPLES=NMR SPECTRUM
##END=
