##TITLE=31Pdec_DE-83_OR6
 D2O, 64 sc
 10.3.2025
##JCAMPDX= 6.0         $$ Bruker NMR JCAMP-DX V2.0
##DATA TYPE= NMR SPECTRUM
##DATA CLASS= NTUPLES
##ORIGIN= UXNMR, Bruker Analytische Messtechnik GmbH
##OWNER= root
$$ XWIN-NMR		Version 3.5
$$ Mon Mar 10 14:15:08 2025 Russian Standard Time (UT+4h)  she@DPX200
##.OBSERVE FREQUENCY= 81.013821
##.OBSERVE NUCLEUS= ^31P
##.ACQUISITION MODE= SIMULTANEOUS
##.ACQUISITION SCHEME= undefined
##.AVERAGES= 64
##.DIGITISER RES= 17
##SPECTROMETER/DATA SYSTEM= spect
##.PULSE SEQUENCE= zgpg30
##.SOLVENT NAME= D2O
##.SHIFT REFERENCE= (INTERNAL, D2O, 0, 198.062)
##AUDIT TRAIL= $$ (NUMBER, WHEN, WHO, WHERE, WHAT)
$$ ##TITLE= Audit trail, XWIN-NMR		Version 3.5
$$ ##JCAMPDX= 5.01
$$ ##ORIGIN= Bruker BioSpin GmbH
$$ ##OWNER= she
$$ F:/spectra/data/she/nmr/P31/2/pdata/1/auditp.txt
$$ ##AUDIT TRAIL=  $$ (NUMBER, WHEN, WHO, WHERE, WHAT)
(   1,<2025-03-10 14:13:06.45 +0400>,<she>,<DPX200>,
      <created by zg, POWCHK disabled, PULCHK disabled
       configuration hash MD5:
       00 E9 B6 7A A2 85 ED C7 34 08 36 98 17 FE 4E 26
       data hash MD5: 32K
       0E 8B E4 1F 6A 56 43 1C BF 82 88 70 25 45 3E 0A>)
(   2,<2025-03-10 14:13:08.90 +0400>,<she>,<DPX200>,
      <Start of raw data processing
       efp BC_mod = 2 LB = 1.5 FT_mod = 6 PKNL = 1 PHC0 = 1852.191 PHC1 = -145.3056 SI = 64K 
       data hash MD5: 64K
       29 9A D9 5E 41 9D 2D 7F F2 CC BD FF C9 08 C8 05>)
(   3,<2025-03-10 14:13:41.73 +0400>,<she>,<DPX200>,
      <pk PHC0 = -76.15302 PHC1 = 153 
       data hash MD5: 64K
       E0 2A 96 7C 9D 6A 28 70 C7 B7 08 C9 21 AA 73 61>)
(   4,<2025-03-10 14:14:08.12 +0400>,<she>,<DPX200>,
      <pk PHC0 = -20.14475 PHC1 = 47.60001 
       data hash MD5: 64K
       3C A6 F7 CA CC F2 23 68 1F AC 7B 26 A5 8A 91 BF>)
(   5,<2025-03-10 14:14:14.57 +0400>,<she>,<DPX200>,
      <abs ABSG = 5 
       data hash MD5: 64K
       21 46 6B 0B 4B 54 BF 1A 88 C3 19 B5 97 F6 22 AC>)
$$ ##END=
$$ 
$$ hash MD5
$$ FF 34 A7 E7 69 FB F8 89 91 C6 F1 29 C8 C7 74 01
##$RELAX= 
##$RELAX= 
##$RELAX= 
##$RELAX= 
##$RELAX= 
##$RELAX= 
##$RELAX= 
##$RELAX= 
$$ Bruker specific parameters
$$ --------------------------
##$DU= <F:/spectra>
##$EXPNO= 2
##$NAME= <P31>
##$PROCNO= 1
##$TYPE= <nmr>
##$USER= <she>
##$AMP= (0..31)
100 100 100 100 100 100 100 100 100 100 100 100 100 100 100 100 100 100 
100 100 100 100 100 100 100 100 100 100 100 100 100 100 
##$AQSEQ= 0
##$AQ_mod= 1
##$AUNM= <au_zg>
##$AUTOPOS= <>
##$BF1= 81.014009
##$BF2= 200.13
##$BF3= 200.13
##$BF4= 200.13
##$BF5= 200.13
##$BF6= 200.13
##$BF7= 200.13
##$BF8= 200.13
##$BYTORDA= 1
##$CFDGTYP= 0
##$CFRGTYP= 5
##$CHEMSTR= <none>
##$CNST= (0..31)
1 1 145 1 1 1 1 1 1 1 1 1 1 1 1 1 1 1 1 1 1 1 1 1 1 1 1 1 1 1 1 1 
##$CPDPRG= <waltz16>
##$CPDPRG1= <>
##$CPDPRG2= <waltz16>
##$CPDPRG3= <>
##$CPDPRG4= <mlev>
##$CPDPRG5= <mlev>
##$CPDPRG6= <mlev>
##$CPDPRG7= <mlev>
##$CPDPRG8= <mlev>
##$CPDPRGB= <>
##$CPDPRGT= <>
##$D= (0..31)
0 1 0 0 0 0 0 0 0 0.06 0 0.03 2e-05 3e-06 0 0 0.0002 0 0 0 0 0 0 0 0 0 
$$ [...]
##$SUBNAM3= <"">
##$SUBNAM4= <"">
##$SUBNAM5= <"">
##$SUBNAM6= <"">
##$SUBNAM7= <"">
##$SUBNAM8= <"">
##$SUBNAM9= <"">
##$SW= 400.765351723535
##$SWIBOX= (0..15)
0 1 3 0 0 0 0 0 0 0 0 0 0 0 0 0 
##$SW_h= 32467.5324675325
##$TD= 32768
##$TD0= 1
##$TE= 0
##$TE2= 300
##$TE3= 300
##$TEG= 300
##$TL= (0..7)
0 120 53 12 22 120 120 120 
##$TP= (0..7)
150 150 150 150 150 150 150 150 
##$TP07= 0
##$TPNAME0= <>
##$TPNAME1= <>
##$TPNAME2= <>
##$TPNAME3= <>
##$TPNAME4= <>
##$TPNAME5= <>
##$TPNAME6= <>
##$TPNAME7= <>
##$TPOAL= (0..7)
0.5 0.5 0.5 0.5 0.5 0.5 0.5 0.5 
##$TPOFFS= (0..7)
0 0 0 0 0 0 0 0 
##$TUNHIN= 0
##$TUNHOUT= 0
##$TUNXOUT= 0
##$USERA1= <user>
##$USERA2= <user>
##$USERA3= <user>
##$USERA4= <user>
##$USERA5= <user>
##$V9= 5
##$VALIST= <valist>
##$VCLIST= <CCCCCCCCCCCCCCC>
##$VD= 0
##$VDLIST= <DDDDDDDDDDDDDDD>
##$VPLIST= <PPPPPPPPPPPPPPP>
##$VTLIST= <TTTTTTTTTTTTTTT>
##$WBST= 1024
##$WBSW= 4
##$XGAIN= (0..3)
0 0 0 0 
##$XL= 0
##$YL= 0
##$YMAX_a= 43224
##$YMIN_a= -45952
##$ZGOPTNS= <>
##$ZL1= 120
##$ZL2= 120
##$ZL3= 120
##$ZL4= 120
##$ABSF1= 198.0616
##$ABSF2= -202.7028
##$ABSG= 5
##$ABSL= 3
##$ALPHA= 0
##$AQORDER= 0
##$ASSFAC= 0
##$ASSFACI= 0
##$ASSFACX= 0
##$ASSWID= 0
##$AUNMP= <proc_1d>
##$AZFE= 0.1
##$AZFW= 0.5
##$BCFW= 0
##$BC_mod= 2
##$BYTORDP= 0
##$COROFFS= 0
##$CY= -3
##$DATMOD= 1
##$DC= 0
##$DFILT= <>
##$DTYPP= 0
##$F1P= 0
##$F2P= 0
##$FCOR= 1
##$FTSIZE= 65536
##$FT_mod= 6
##$GAMMA= 0
##$GB= 0
##$INTBC= 1
##$INTSCL= 9.790993e-09
##$ISEN= 30
##$LB= 1.5
##$LEV0= 0
##$LPBIN= 0
##$MAXI= 10000
##$MC2= 0
##$MEAN= 0
##$ME_mod= 0
##$MI= 50
##$NCOEF= 0
##$NC_proc= -4
##$NLEV= 6
##$NOISF1= 182.463
##$NOISF2= 159.3651
##$NSP= 0
##$NTH_PI= 0
##$NZP= 0
##$OFFSET= 198.0616
##$PC= 4
##$PHC0= 1755.893
##$PHC1= 55.29441
##$PH_mod= 1
##$PKNL= yes
##$PPARMOD= 0
##$PSCAL= 0
##$PSIGN= 0
##$REVERSE= no
##$SF= 81.0140089999434
##$SI= 65536
##$SIGF1= 159.3651
##$SIGF2= -187.1042
##$SINO= 113.3802
##$SIOLD= 16384
##$SREGLST= <1H.CDCl3>
##$SSB= 0
##$STSI= 65536
##$STSR= 0
##$SW_p= 32467.5324675325
##$SYMM= 0
##$S_DEV= 0
##$TDeff= 32768
##$TDoff= 0
##$TI= <>
##$TILT= no
##$TM1= 0
##$TM2= 0
##$TOPLEV= 0
##$USERP1= <user>
##$USERP2= <user>
##$USERP3= <user>
##$USERP4= <user>
##$USERP5= <user>
##$WDW= 1
##$XDIM= 65536
##$YMAX_p= 437851084
##$YMIN_p= -6628743
$$ End of Bruker specific parameters
$$ ---------------------------------
##NTUPLES= NMR SPECTRUM
##VAR_NAME=  FREQUENCY,     SPECTRUM/REAL,   SPECTRUM/IMAG
##SYMBOL=    X,             R,               I
##VAR_TYPE=  INDEPENDENT,   DEPENDENT,       DEPENDENT
##VAR_FORM=  AFFN,          ASDF,            ASDF
##VAR_DIM=   65536,         65536,           65536
##UNITS=     HZ,            ARBITRARY UNITS, ARBITRARY UNITS
##FACTOR=    0.49542278885378, 1,            1
##FIRST=     16045.7642231865, 0,            0
##LAST=      -16421.768244346, 0,            0
##MIN=       -16421.768244346, -6628743,     0
##MAX=       16045.7642231865, 437851084,    0
$$ Real data points
##PAGE= N=1
##DATA TABLE= (X++(R..R)), XYDATA
$$ [...]
41982A40296R5741j25290j80838o4951L9143l0064j67718j03719K00675M25653
41972B28928K91193o4796k89315k77325j97584j28744L5212K84081L84215K03709
41962D69574p1122k01200k02344k13772k12766q2458J23238K12840J32329O228
41952c9453r0364j97216k83256k11765K1771K03402J80007P4465O9039J04169
41942a69201r11j96218k12707M1478L07763L04722P6844j18570j65878j65397
41932b98075j97317j92869q4655N1239R6772O2905N8796J15742J39799O1520m5314
41921b31457n9121Q802J3063j22432k69669k37531k1564J74752J85139O6426o858
41910e00450L5417J16738J51654J38138J17801J13021J12045P5985k5160j42400
$$ plain form
41982 140296 236037 110747 -70091 -135042 -95899 -125963 -293681 -397400 -196725 228928
41972 228928 520121 455325 166010 -111315 -308899 -437643 -402431 -118350 265865 469574
41962 469574 398452 197252 -5092 -218864 -431630 -514088 -390850 -178010 -45681 -39453
41952 -39453 -129817 -327033 -610289 -822054 -800283 -596881 -416874 -342409 -273370 -169201
41942 -169201 -170112 -366330 -579037 -537559 -229796 74926 151770 33200 -132678 -298075
41932 -298075 -495392 -688261 -772916 -721677 -624905 -562000 -503204 -387462 -247663 -186143 -231457
41921 -231457 -290578 -281776 -268713 -391145 -660814 -898345 -919909 -745157 -560018 -493592 -500450
41910 -500450 -465033 -348295 -196641 -58503 59298 172319 284364 360349 335189 192789
41900A92789j54445j7340J31428J19186l4938j55575j56920j05679l2651J27849
41890h6296L36772L82948J68778q3972j08131K6358K5353j76300l20298k26297
41880f1085n9492o7231k07613k23909l0574J57063J18483p3854j56833l2293J10379
41869e26959P5118n2853l8925J31848K14321P6260q9220n6046R6349J30969K3960
41858a5178m6837k6596l9376j10761r3443N2617J36885K8079j13484n4696J81129
41847a01661L60579L33766J42014j03052l07912l95241l36301j90006m3128P2222
41837e68720J56331J85026J39554N8447L820J185L7685P3078M2502p2140j63274
41826a06506j03833M4136P8863k6366m4493J47501L21425K08465q4220k14489
$$ plain form
41900 192789 38344 21004 152432 271618 236680 81105 -75815 -181494 -214145 -86296
41890 -86296 250476 633424 802202 718230 610099 636457 661810 485510 165212 -61085
41880 -61085 -120577 -187808 -395421 -619330 -649904 -492841 -374358 -448212 -605045 -637338 -526959
41869 -526959 -451841 -504694 -543619 -411771 -197450 -121190 -210410 -266456 -170107 -39138 -15178
41858 -15178 -62015 -88611 -127987 -238748 -332191 -279574 -142689 -114610 -228094 -282790 -101661
41847 -101661 258918 592684 734698 631646 323734 -71507 -407808 -597814 -640942 -568720
41837 -568720 -412389 -227363 -87809 -29362 -25542 -24357 13328 86406 128908 56768 -106506
41826 -106506 -210339 -166203 -87340 -113706 -158199 -10698 310727 519192 434972 220483
41816B20483q9752M6620M002j23062j56648o7425O8709J89353K43984J90060N3336
41805E79660r0805k14968l26279l66982k59017n0144J22853K19311K93266L14920
41795B21815J89729j7696r8306j0382L9346p0910j84562j49731p3575r3099r2439
41784c39810Q6686K95927K48488k7169k09336j58417p0939j00256j14367K7843
41774c61350J93764J66943k5949j68630j48292k9714R5469J68947J20901o0321
41764d8232k17546j50524J12602L13048K83202J34120M5775J4537n2190j04332
41754C30460j9759J23569P6177k09954m31050k99682O4217K84378K01212Q969
41744A28537o3345k0607k551o5031j46462j66109r0207L8388J03163K2581j18180
$$ plain form
41816 220483 130731 177351 181353 58291 -98357 -165782 -97073 92280 336264 526324 579660
41805 579660 488855 273887 -52392 -419374 -678391 -728535 -605682 -386371 -93105 221815
41795 221815 411544 393848 295542 285160 324506 253596 69034 -80697 -154272 -247371 -339810
41784 -339810 -253124 42803 291291 264122 54786 -103631 -174570 -274826 -389193 -361350
41774 -361350 -167586 -643 -26592 -195222 -343514 -373228 -277759 -108812 12089 -48232
41764 -48232 -265778 -416302 -303700 9348 292550 426670 472445 486982 434792 330460
41754 330460 310701 434270 510447 300493 -130557 -430239 -366022 -81644 119568 128537
41744 128537 65192 44585 42034 -22997 -169459 -335568 -425775 -387387 -284224 -261643 -379823
41733c79823j37074J2300J83781K48561K27981J58388j0247k56380l78661k28492
41723e59666M5296J75733J33489R8516J24101P4851p8521j49814k4053J39402
41713b0666J26099m5134j85711j88918r2342L0575J15083R7354j9672j27811j37199
41702d48342r6925r9653j22341q3731j7105l1756j02162n8613J56459L62155L63090
41691a78924J96399M2881k9203q7488j38568q1034R7304K21656J38085o9462j92519
41680h0873j72526j22065r9457l4776Q5250J35960N9250o47Q5847J97370J32394
41669A85727n5001j13958J5475J06072k761j67087j74369m8002L8554L3521K5879
41658a55950O1339R4535R4010O8807J2736p3158j30631j13342o9080n7424l7699
$$ plain form
41733 -379823 -516897 -504597 -320816 -72255 155726 314114 303867 47487 -331174 -559666
41723 -559666 -514370 -338637 -205148 -106632 17469 92320 13799 -136015 -160068 -20666
41713 -20666 105433 60299 -125412 -314330 -406672 -376097 -261014 -163660 -183332 -311143 -448342
41702 -448342 -545267 -644920 -767261 -850992 -868097 -899853 -1002015 -1060628 -904169 -542014 -178924
41691 -178924 17475 60356 31153 -56335 -194903 -275937 -178633 43023 181108 111646 -80873
41680 -80873 -253399 -375464 -474921 -509697 -424447 -288487 -229237 -229884 -144037 53333 185727
41669 185727 130726 16768 32243 138315 135554 -31533 -205902 -253904 -215350 -181829 -155950
41658 -155950 -94611 -76 93934 162741 175477 102319 -28312 -141654 -210734 -268158 -305857
41647c05857M6739J28276R9769j080m6623k9054m3241p6232j4682J18422J51314
41636B7751N0362k11Q7160J26355l8566k41229k26033m1901M6993k4739n9432
41625b93490N4344J75548J62121Q8549J00119J83320J99034P2862j33311k93211
41615C15885l07380j70272J4455J26562J50215J46897J18041L170j59525k02534
41605C5514m8761J34584J23696o6268j98542j28144J8083L0145r1906j36603J8110
41594c10092K02677J56863r9759k50571r7191J55276J74712m1131j90728j11424
41584d11368M1981R2966P6449P4273L6206p4136j28156j9533J24382J21070K7784
41573c8082M0853J57331J66824j7777k26286k67363j40352K5281J07630M5129
$$ plain form
41647 -305857 -259118 -130842 -31073 -32153 -78776 -107830 -151071 -227303 -241985 -123563 27751
41636 27751 78113 77902 165062 291417 252851 11622 -214411 -256312 -209319 -234058 -293490
41625 -293490 -239146 -63598 98523 187072 287191 470511 669545 742407 609096 315885
41615 315885 8505 -161767 -147312 -20750 129465 276362 394403 397573 238048 35514
41605 35514 -13247 121337 245033 178765 -19777 -147921 -129838 -99693 -191599 -328202 -310092
41594 -310092 -107415 49448 -50311 -300882 -398073 -242797 -68085 -109216 -299944 -411368
41584 -411368 -369387 -276421 -199972 -125699 -89493 -163629 -291785 -311318 -186936 -65866 -38082
41573 -38082 2771 160102 326926 309149 82863 -184500 -324852 -299571 -191941 -146812
41563a46812j16932k10085r9654J24377K38482J70894N1213k5680j02786j91962
41553c08945j98375r7776j3682j2251J7466J52132K53827J61806m3974j38374
41543b28146m5396J07795J79970J26983l0694k17686l01401j94705L8865K49711
41533c14704L43236L05735J61979j0182r3138n3850M034n164k5164J4370M9156
41522C76308n249q5622r0191p3506j44951k36952j88232k6601N7427J8799Q291
41511c90479Q8176J37457J02630R8064J52382R9591j15859k50227j01098J33918
41501d5445J10057j45962k59315m7174K31685K47944J4981j97180k22217j21603
41491d34229j7175M7661O9612K3480r2168j89097j46260M1813K13160J86211l5109
$$ plain form
41563 -146812 -263744 -473829 -573483 -449106 -210624 -39730 11483 -14197 -116983 -308945
41553 -308945 -507320 -605096 -618778 -631029 -613563 -461431 -207604 -45798 -89772 -228146
41543 -228146 -273542 -165747 14223 141206 110512 -107174 -408575 -603280 -564415 -314704
41533 -314704 28532 334267 496246 486064 392926 339076 343110 337946 312782 327152 376308
41522 376308 371059 285437 195246 121740 -23211 -260163 -448395 -474996 -417569 -398770 -390479
41511 -390479 -302303 -164846 -62216 35848 188230 287821 171962 -78265 -179363 -45445
41501 -45445 64612 -81350 -340665 -387839 -156154 91790 106771 -90409 -312626 -434229
41491 -434229 -451404 -403743 -334131 -310651 -402819 -591916 -738176 -696363 -483203 -296992 -332101
41480c32101k37804j99622R5971M38540N63604L63086k7044l34295l77090k02348
41470b49103P569J31661J69752J49674Q1638J4550K3199Q1022M0275j69077l81138
41459i9978l45952l1922L12264M15661K44675j2779j63956j67869j04273m8185
41449b314p178L5726O3414L7849m0027j08235q9366L4639J78302K02434N9592
41438C64836j15985j42589k7943L7068l3349q0705L4519J69998R4425j40019k45392
41427h5136r9426J21111K22096J92320R1440l8772r7000J2010J57361P5617k07043
41416C44578l20145q6443J68749J01857j08451n3317K39744L33662L3251l63589
41406B89896n07551l73859j22773J29269K82998K37285M1375r3519m4816Q7549
$$ plain form
41480 -332101 -569905 -769527 -673556 -235016 328588 691674 664630 330335 -46755 -249103
41470 -249103 -241534 -109873 59879 209553 291191 305741 328940 409962 450237 281160 -99978
41459 -99978 -445930 -477852 -165588 250073 494748 481969 318013 150144 45871 -2314
41449 -2314 -9492 26234 89648 127497 87470 -20765 -110131 -75492 102810 305244 364836
41438 364836 248851 106262 78319 115387 82038 1333 35852 205850 300275 160256 -85136
41427 -85136 -184562 -63451 158645 350965 442405 403633 306633 318643 476004 551621 344578
41416 344578 24433 -62010 106739 208596 100145 46828 286572 620234 653485 289896
41406 289896 -217655 -591514 -714287 -585018 -302020 -64735 -23360 -116879 -161695 -74146
41396g4146J61250J55662R4332l0464j70018k05141j10054l439L2040M3546O2212
41385d4220K7341o1831q5721K024P9638O3087M0666P9775P7966l3918j12833k8422
41373C552Q0310R760j52630j40451O9793K12382J26639l5196o1301L9747J02939
41362B55544L2923j12202j96548j29921L5223J36740Q8711o965j5360K8648l770
41351A13023j09685j60555j12716n2700l3701j9723L711J7300O6113J95069K76358
41340A82494J09292k48805m57549l05534K3794K15400J96746J15990Q2203Q0219
41330e750N6805l2913j90145k98877k02040N5066K02837R7567o0175k3718J36529
41319b64814J81909Q6409J3057J662l6141n8638O4333K46548K30886k504j68951
$$ plain form
41396 -74146 87104 242766 337098 306634 136616 -68525 -178579 -182018 -149978 -106432 -44220
41385 -44220 -16879 -78710 -164431 -162407 -82769 -19682 20984 100759 178725 144807 31974 3552
41373 3552 83862 93622 -59008 -199459 -129666 82716 209355 174159 112858 152605 255544
41362 255544 288467 176265 -20283 -150204 -114981 21759 110470 103505 88145 116793 113023
41351 113023 3338 -157217 -269933 -322633 -356334 -376057 -372346 -355046 -288933 -93864 182494
41340 182494 291786 42981 -414568 -720102 -696308 -480908 -284162 -168172 -85969 -5750
41330 -5750 51055 18142 -172003 -470880 -672920 -617854 -415017 -317450 -377625 -401343 -264814
41319 -264814 -82905 3504 16561 18223 -17918 -76556 -12223 234325 465211 462707 293756
41308B93756j15504l5618j08822k03990j37335J2899Q0528J02659J82702K22409
41298B93684P3850j42793j62303K4414J55794Q4214n7491r2775l480J27446K02365
41287E02925J33345n2979j56068l8413J10888q728l34479m64519k15453J32445
41277c91036K63028K19487J98532J98402J06082m0107j16784j30045j52498j46112
41267H949n2924K5532m9822k13151k66954j50525L7083K15653L36866K90819K8332
41256B09858k52409k72582l7142J70026J67359N2676j7782j8592K1465R2010J36750
41245B51637Q1877k7026p6552q8752j74422k67581j63416J06637K18024J6777
41235a22797k22446k03609l7238j565o9583M652K32630L59408K71372J33654P9166
$$ plain form
41308 293756 178252 142634 33812 -170178 -307513 -294614 -214086 -111427 71275 293684
41298 293684 367534 224741 62438 86852 242646 326860 269369 176594 173114 300560 502925
41287 502925 636270 583291 427223 388810 499698 490970 156491 -308028 -523481 -391036
41277 -391036 -128008 91479 290011 488413 594495 554388 437604 307559 155061 8949
41267 8949 -43975 -18443 -68265 -281416 -548370 -698895 -661812 -446159 -109293 181526 209858
41256 209858 -42551 -315133 -352275 -182249 -14890 37786 20004 1412 22877 114887 251637
41245 251637 333514 306488 229936 141184 -33238 -300819 -464235 -357598 -139574 -122797
41235 -122797 -345243 -548852 -586090 -587655 -657238 -652586 -419956 -60548 210824 344478 423644
41224D23644L2175p1197j26064n6227J7243l8677j47331j46705m3589K1626J1514
41213a23588K1202P3450N1163j04286k55721k34076o5942P3528R5664O8464O4106
41202c36036O8300O6359Q2618P7552m4354k21222j92010J46347M67478L59860
41192D74892j03917m23159l19599m6849M2944l9516p1504k369N0569M9855M9681
41181c38972M1794r635m1882J6793R1668P1347J1400M2248J27470J16141L617
41170A31989p1117p9138j33133k40072k38486n2727J68562K49627J77700K9160
41160e7635j43163k64294k21670j1823J92243K24316J11088R51k3050J4411O3020
41149a15606R4297R9921Q8061N4307m5633k27229l80927l49149j33393P7265J33737
$$ plain form
41224 423644 455819 384622 258558 202331 219574 180897 33566 -113139 -156728 -135102 -123588
41213 -123588 -102386 -28936 22227 -82059 -337780 -571856 -637798 -564270 -468606 -400142 -336036
41202 -336036 -267736 -201377 -118759 -41207 -85561 -306783 -498793 -352446 115032 474892
41192 474892 370975 -52184 -371783 -418632 -375688 -415204 -486708 -489077 -438508 -388653 -338972
41181 -338972 -297178 -306813 -348695 -331902 -240234 -168887 -157487 -115239 12231 128372 131989
41170 131989 60872 -18266 -151399 -391471 -629957 -682684 -514122 -264495 -86795 -57635
41160 -57635 -200798 -465092 -686762 -698585 -506342 -282026 -170938 -169987 -193037 -178626 -115606
41149 -115606 -21309 78612 166673 220980 175347 -51882 -432809 -781958 -915351 -838086 -704349
41138g04349Q5329N3105N0891K3491k0350k7874j4674m8441j22899j33721j1114
41127h70606J61524J98576M304k79898l64587j08685K92593M90728L51317O0048
41117f4686j33349j65887j20016m5715P5616K28565L13495K28307l231j95496
41107A17603j47348J21950L32421K33870q7570l03921k39809m7272L3476m3793
41097c0393j48864j72627j28207j05095j66815k61127k37930k1757K52577L70034
41087f50204K84603J30225R738q0499j25107o6224O4280J54282J84546K20826
41077A26466K14784L8468k22225k69323k3887J88219P4518k04843k83643r5682
41067d57148J10996J56001Q1697o925m2164K2353J47025J76860L5317j28845j49985
$$ plain form
41138 -704349 -619020 -565915 -515024 -491533 -511883 -539757 -554431 -602872 -725771 -859492 -870606
41127 -870606 -709082 -510506 -506202 -786100 -1150687 -1259372 -966779 -476051 -124734 -64686
41117 -64686 -198035 -363922 -483938 -529653 -454037 -225472 88023 316330 313099 117603
41107 117603 -29745 92205 424626 658496 570926 267005 27196 -20076 13400 -30393
41097 -30393 -179257 -351884 -480091 -585186 -752001 -1013128 -1251058 -1272815 -1020238 -650204
41087 -650204 -365601 -235376 -225638 -306137 -431244 -497468 -433188 -278906 -94360 126466
41077 126466 341250 379718 157493 -111830 -135717 52502 127020 -77823 -361466 -457148
41067 -457148 -346152 -190151 -108454 -115379 -157543 -135190 11835 188695 224012 95167 -54818
41056e4818r5414j12841j42705k9627J58830K00161P6729K247Q0407J78432J64493
41045D25894N6480p9946j76270j11553J54767M05903L70397J06736p5423q0697
41035I96288j07403k25992k32757m4256J04428M0704o8196l2178M6315J6431k1878
41024D71506N6052J07043k5025j56458l0671J99655J59443j34296k59306l4724
41014C53219K04114J16588j70364k98876j70609J4896Q7229P7560J06320K19733
41004E39810L25652K56794m2007l74247m46626k04924R7595K15915J63626P4437
40994F06025k3711j44087j78566j8922J96758J83818r7561l41386k83479l6216
40984a37327J02203N5317j126L8077P2738K1132k4280K2357O0066l8454j89340
$$ plain form
41056 -54818 -150232 -263073 -405778 -435405 -276575 -76414 315 2562 82969 261401 425894
41045 425894 482374 402428 226158 114605 269372 675275 1045672 1152408 1076985 996288
41035 996288 888885 662893 430136 385880 490308 531012 462816 430638 476953 493384 471506
41024 471506 527558 634601 609576 453118 422447 622102 781545 647249 387943 353219
41014 353219 557333 673921 503557 204681 34072 48968 136197 213757 320077 539810
41004 539810 865462 1122256 1080249 706002 259376 54452 152047 367962 531588 606025
40994 606025 582314 438227 259661 240739 437497 621315 523754 182368 -101111 -137327
40984 -137327 -35124 20193 19067 57144 129882 151014 126734 149091 209157 170703 -18637
40973a8637k06248r5729m7594j30072j87740r1016Q4535K04490K49593K48366
40963I948J72552J8901j11979j40553j23968j33853j18533k4700M0482n1138k03287
40952f66128j87895J9636J85094J35240k5469q3469K0161J64591J99212O4561
40942a74466j59556k88408j98351M421P2711p8489k54475k29195j5699J96865
40932a124642K92281K99547K65977J85369N8234o8462j44472j47246p3939L7092
40922d20261Q6993M174j29351j26785P4215K97063L15269J15250j12451k17781
40912a13665k18518j73394o1301J23067K48769J71110m2605j54293o2564N4207
40902b29187j2572j97929k33835l088K94048L67503J64333q9568j50003J795J90255
$$ plain form
40973 -18637 -224885 -320614 -368208 -498280 -686020 -777036 -692501 -488011 -238418 9948
40963 9948 182500 201401 89422 -51131 -175099 -308952 -427485 -452185 -411703 -462841 -666128
40952 -666128 -854023 -834387 -649293 -514053 -539522 -622991 -602830 -438239 -239027 -174466
40942 -174466 -334022 -622430 -820781 -816360 -743649 -822138 -1076613 -1305808 -1321507 -1124642
40932 -1124642 -832361 -532814 -266837 -81468 -23234 -91696 -236168 -383414 -457353 -420261
40922 -420261 -333268 -329094 -458445 -585230 -511015 -213952 101317 216567 104116 -113665
40912 -113665 -332183 -505577 -566878 -443811 -195042 -23932 -66537 -220830 -283394 -229187
40902 -229187 -241759 -439688 -673523 -676611 -382563 -15060 149273 59705 -90298 -88503 101752
40891A01752K67326K36801J66361P3574l9101j12787j01838p4692j23608j93603
40881B00185j45834n29N2409n6082j44012n0215J11868J24190k2539j57411j96010
40870b83980j95243j78622r1224O3307J94118K50027K49209J83632L5836j02368
40860A24692q8966M9953J13465K866j32169j11524K8356J13817Q0164K4329M5017
40849B50000J20848J49949O9027o8722j35690p3788K4986L3668m4570j06961j14337
40838A04410j07651p7074L8210J96285K47891J40252n532p6305r1855q9496l9084
40827B40051L8431K6308r4081j55318n3378O2630K6751n7453P386J54948J42586
40816C38861m5227j64783j08700n3798j23280j59873j60K21768K50561P0948j10090
$$ plain form
40891 101752 369078 605879 772240 845814 806713 693926 592088 517396 393788 200185
40881 200185 54351 53822 106231 50149 -93863 -144078 -32210 91980 69441 -87970 -283980
40870 -283980 -479223 -657845 -749069 -685762 -491644 -241617 7592 191224 227060 124692
40860 124692 35726 85679 199144 202010 69841 -41683 -13327 100490 180654 204983 250000
40849 250000 370848 520797 589824 521102 385412 311624 336610 370278 325708 218747 104410
40838 104410 -3241 -80315 -42105 154180 402071 542323 536791 460486 368631 279135 240051
40827 240051 278482 304790 210709 55391 2013 64643 91394 33941 41327 196275 338861
40816 338861 293634 128851 20151 -33647 -156927 -316800 -316960 -95192 155369 226317 116227
40805A16227j75372j90534k01905j41825O983J08813M6723q8107r9330M6820J69517
40794d01990J16815l0675p4110L6691J52905J42390M9890l202J1833M1626O6686
40783A08859J07741J46257J33373O8600r321r3645j85577k16663j03713J07669
40773F3580K52604K23084N7792j38703k64012k17476J5849K49558K31002l2267
40763D41011k40344j96301o4024q1933j89210j64347j8051L4178m4458n0371R7663
40752d76187K12447J55585M4750n019j05995l46022n07949l26622P5352L03413
40742i76247K17738O6917P2978J60131J86729J91502K45283K50150R0142j31614
40732C73709k04167j01160Q020J0354l8090m1681K3594J30022K19473K08497P5591
$$ plain form
40805 116227 -59145 -249679 -451584 -593409 -586426 -477613 -430890 -518997 -618327 -571507 -401990
40794 -401990 -285175 -315850 -389960 -353269 -200364 -57974 -8084 -11286 547 42173 108859
40783 108859 216600 362857 496230 564830 555509 461864 276287 59624 -44089 63580
40773 63580 316184 539268 597060 458357 194345 -23131 -7282 242276 473278 441011
40763 441011 200667 4366 -59658 -141591 -330801 -495148 -513199 -479021 -523479 -573850 -476187
40752 -476187 -263740 -108155 -63405 -68424 -174419 -520441 -1028390 -1355012 -1279660 -976247
40742 -976247 -758509 -691592 -618614 -458483 -271754 -80252 165031 415181 505323 373709
40732 373709 169542 68382 76402 86756 48666 6985 30579 160601 380074 588571 664162
40721F64162o6272r2032m6481p9722k02993k53178j34338M2533J23027R7999N6891
40710A09596M8697O6761R6430J07545O2058j9221o6644p3943j01237j23646j7414
40699H8982K09188L19583J41203j58478k80264j99431j38275j66427r7265J52029
40689a29155L48595K54158k0931j68046r2587J9767J6203l7791k5086K9915L2324
40678B27366j2716j9894J3224k1702j72147l06356k48782j1910J93186K00992
40668a58739P3687j1440P602M8225N0852N6550R0192P4264n8085k20883k44220
40657b91995q5606R9273J25062k0466j69109j52381K9990K15778K40502R1270
40647H2318q8750j39465k7492J37585K17060J67288N3261m5783j13335j62686
$$ plain form
40721 664162 597890 505858 459377 379655 176662 -76516 -210854 -168321 -45294 52705 109596
40710 109596 158293 225054 321484 429029 491087 471866 405222 331279 230042 106396 88982
40699 88982 298170 617753 758956 600478 320214 120783 -17492 -183919 -281184 -129155
40689 -129155 219440 473598 452667 284621 192034 211801 228004 190213 165127 195042 227366
40678 227366 214650 194756 207980 186278 14131 -292225 -541007 -552917 -359731 -158739
40668 -158739 -85052 -96492 -88890 -40665 10187 66737 156929 231193 173108 -47775 -291995
40657 -291995 -377601 -278328 -153266 -173732 -342841 -495222 -465232 -249454 -8952 82318
40647 82318 -6432 -145897 -173389 -35804 181256 348544 401805 356022 242687 80001
40637H0001j67474r0315K2260N6594j3985o3212K6200J85452K40727J48585M0914
40626D65747K4719M9437K2859l8132n6390l2723l9098r5142j36249j08799l2731
40615B3498M0486P8651O6399M744o5359q4504m8548k1473l9834m3827L9765J66169
40603A16167J96242O7809j14770j96411j34818j1346P8418Q8681J1351j20137
40593a8814k13666j80330m0111Q6474J14973P7781N1091N6460O0661K1450q5438
40582f9469k20997k50507n8718K51768L92605K19194o9428j85649j18640p7208
40572a87049j32388j39940l2336M2841k5131j05825k4964J57380K32038J38975
40562g6399K0750l455K5691K1271j0262k016N3126P5572K789r8100o6811J49664
$$ plain form
40637 80001 -87473 -177788 -155528 -98934 -112919 -176131 -149931 35521 276248 424833 465747
40626 465747 490466 539903 562762 524630 468240 435517 396419 301277 165028 56229 23498
40615 23498 63984 142635 209034 213778 148419 63915 15367 -6106 -45940 -89767 -50002 116167
40603 116167 312409 380218 265448 69037 -65781 -77127 1291 89972 101323 -18814
40593 -18814 -232480 -412810 -452921 -366447 -251474 -173693 -122602 -66142 -5481 15969 -69469
40582 -69469 -290466 -540973 -599691 -347923 44682 263876 194448 8799 -109841 -187049
40572 -187049 -319437 -459377 -491713 -448872 -474003 -579828 -604792 -447412 -215374 -76399
40562 -76399 -55649 -59104 -33413 -12142 -22404 -24420 28706 104278 107067 8967 -57844 91820
40550I1820L60391K98695m3042l54701l58921j29737L7693k998j40917k20847
40540d62564k07107j28822r826R5153J08419M1432J4717R7782K00704K01961J25395
40529G7244R4761J39260J46197K5231j57837k56992k16074j16109o5255q2163
40519d11737r9598n8891K3875Q5465R2211P5589Q8154J28086J21316O93j90982
40508a45819l06666k40134n7231O2339K7511o1476m6769P9488J57893O4591j14227
40497e80500j63012N540K27583K71117J10895o0361r5976n7043n0545k9436J00572
40486c21166K49239K19232K2988q7717J1145J15473P426j93190k07266l2284N6450
40475a59670o0567j68417o9025J00079P2201j48952k99906k27358m9324Q0334
$$ plain form
40550 91820 452211 750906 707864 353163 -5758 -135495 -97802 -100800 -241717 -462564
40540 -462564 -669671 -798493 -808319 -713166 -604747 -563315 -548598 -450816 -250112 -48151 77244
40529 77244 172005 311265 457462 482693 324856 67864 -148210 -264319 -329574 -411737
40519 -411737 -511335 -570226 -546351 -460886 -368675 -293086 -204932 -76846 44470 45163 -145819
40508 -145819 -452485 -692619 -749850 -687511 -660000 -721476 -768245 -688757 -530864 -466273 -580500
40497 -580500 -743512 -737972 -510389 -239272 -128377 -188738 -284714 -341757 -392302 -421738 -321166
40486 -321166 -71927 147305 170293 82576 93721 209194 216620 23430 -183836 -216120 -159670
40475 -159670 -220237 -388654 -457679 -357600 -285399 -434351 -734257 -961615 -1010939 -930605
40465i30605J77017K86862K99083R5616j69215j74888J20429L51431K07466j39593
40455A23603k77104j15059N5265L9418j8069N3300J67022J70205J03642P3540
40445C75763K8892j12155k37239j79632o079P2518L4846N8168K06473L37913L37562
40434I17030K30900M8228k03241l96771l50906j14899K9739m3927j27369j2959
40424b4175J82904K06211L0034j53171k14024j91334j61152j34059o9489O7262
40414d60993K20451K17145m0828l37473l04523P7928L67425K21871j28758k15165
40404c82920K8019K47128K09745M6358m3272l7894N570O4377Q5726j408j41165
40393H0264j79927r4686l3211p9032j43900j50583j46647j57365r8791N4727J68579
$$ plain form
40465 -930605 -753588 -466726 -167643 -72027 -241242 -416130 -295701 55730 263196 123603
40455 123603 -153501 -268560 -213295 -173877 -191946 -138646 28376 198581 302223 375763
40445 375763 404655 292500 55261 -124371 -130450 -57932 -23086 35082 241555 579468 917030
40434 917030 1147930 1196158 992917 596146 245240 130341 160080 116153 -11216 -24175
40424 -24175 158729 364940 394974 241803 27779 -163555 -324707 -458766 -528255 -460993
40414 -460993 -240542 -23397 -64225 -401698 -706221 -628293 -260868 -38997 -167755 -382920
40404 -382920 -354901 -107773 101972 148330 105058 67164 72734 137111 222837 221429 80264
40393 80264 -99663 -194349 -227560 -306592 -450492 -601075 -747722 -905087 -1003878 -949151 -780572
40382g80572J39170O2370P9928J59846J65799P0254l3337q0525p8713l4271N2933
40371b77118J32799J30026L2085r5601j75099j69334r5240o745O1035J30299K17752
40360a15141K55787J72192M6526N6652K25064L44761K36874j8507j95814j88290
40350H20104p6227J203l3490j49941k30486j89371q7243l9731k2462P2926J75024
40339B40306O1576k46421l74851q5617L30867M11093J14676k14594l59251l74118
40329d96334k92400n5618K29394L05872J45456K9035J27898K60165K07645L8689
40319D99802n8827o5961o2808l2780O5500J53481J46588J14842J58679K15037
40309A133553J57619J3622q5484j04295r9013q0982m4903o4549j83811k68281
$$ plain form
40382 -780572 -641402 -579032 -499104 -339258 -173459 -103205 -136542 -217067 -295780 -330051 -277118
40371 -277118 -144319 -14293 17792 -77809 -252908 -422242 -517482 -524227 -463192 -332893 -115141
40360 -115141 140646 312838 359364 416016 641080 985841 1222715 1204208 1008394 820104
40350 820104 743877 745080 711590 561649 331163 141792 54549 14818 -7644 65282 240306
40339 240306 301882 55461 -319390 -405007 -74140 336953 451629 237035 -122216 -496334
40329 -496334 -788734 -844352 -614958 -309086 -163630 -134595 -6697 253468 461113 499802
40319 499802 440975 375014 312206 279426 344926 498407 644995 759837 918516 1133553
40309 1133553 1291172 1304794 1219310 1115015 1016002 935020 890117 825568 641757 373476
40299C73476j57883O3310J45497J4038j59459k32719k36889k09118r2075J04329
40289c87493K17389J43007J4568L0297J71589K28589Q6408j25876j96338p4400
40279A07740R3724J58848J36803J27447J11597k9565k55939l09927o5568K10618
40269B85778J77663q4974j80935J6116J94881J11861m8310j2755J30557R8484
40259F88366j18744k46613j41130L8451R1405J3322p2427p6380O194J00042Q4921
40248C67407p7023k41630k12638J3739K23599K17856k657k73079l98562k70225
40238f53213M3614L13716L46898J70804m4300j98169k81155k47032n7256J50333
40228d55760J49303n6952j94890r0138J02221J56785R4657P4431J06010P8467
$$ plain form
40299 373476 215593 278903 424400 438438 278979 46260 -190629 -399747 -491822 -387493
40289 -387493 -170104 -27097 -12529 17768 189357 417946 504354 378478 182140 107740
40279 107740 201464 360312 497115 624562 736159 706594 450655 140728 75160 285778
40269 285778 463441 378467 197532 213648 408529 520390 472080 459325 589882 688366
40259 688366 569622 323009 181879 220330 311735 325057 252630 176250 182444 282486 367407
40248 367407 290384 48754 -163884 -150145 73454 291310 288653 15574 -382988 -653213
40238 -653213 -609599 -295883 51015 221819 177519 -20650 -301805 -548837 -606093 -455760
40228 -455760 -306457 -363409 -558299 -648437 -546216 -389431 -294774 -220343 -114333 -35866
40218c5866p596m5292k7661n3217j24736j26797l6490J2812n5340j21725l6130
40207f58038J72435L36243L40974K12090N5955l2596l8682l4510q1501j21852
40197A50518m4551J19429J72916j550k50953l10734j20832J14035J76328O7927
40187G2533k7890L5354K14117L26177K49878O2828n2383l4432J898l6857p8862
40176G32361l0714L2043k9442j66658j79094j3539J51569J77936J45544J54743
40166I74749J23893m2041k09716j70757J7736Q3841n8075j90121j40892k9429
40156C59188k9734q3165l4503P7139Q4593j4066n1880K4472Q2124N1651M7404
40145E13223J45994K15886J07572j02895k17423j97047j80875k43426k84621j93661
$$ plain form
40218 -35866 -43462 -88754 -116415 -169632 -294368 -421165 -457655 -444843 -500183 -621908 -658038
40207 -658038 -485603 -149360 191614 403704 459659 427063 388381 353871 272370 150518
40197 150518 105967 225396 398312 396762 145809 -164925 -285757 -171722 4606 72533
40187 72533 44643 79997 294114 620291 870169 932997 880614 846182 848080 811223 732361
40176 732361 701647 733690 704248 537590 358496 344957 496526 674462 820006 974749
40166 974749 1098642 1056601 846885 676128 693864 777705 719630 529509 388617 359188
40156 359188 329454 246289 211786 288925 373518 359452 307572 332044 414168 465819 513223
40145 513223 659217 875103 982675 879780 662357 465310 284435 41009 -243612 -437273
40135d37273o523J56986K35759K47245K18903J64244R9903K9372p6195k23499
40125D08922l24372k48117R876K58631K84011Q6906j19328j63621r3343n4337
40115D5228p7575p5356O52J08018K00444K54008K15092N2655j21401j31746N757
40104D75776N8065j03562k99758k95603j31378k2798j9809K0550J51025K45243
40094G7751K20598J52275J04548K7011r6817j61998j14858p0583j24436j64822
40084a51331l5784J89425K66375R0234j86536l41777k80651n7231J89804L15588
40074a884K72060J43003K3305r5382k33366k80891j04831K04540L60140K13072
40064D99766o1755j87191r3280O9978J43980R4665j3510r1665r1922m6019j9903
$$ plain form
40135 -437273 -443796 -286810 -51051 196194 415097 579341 679244 708616 632421 408922
40125 408922 84550 -163567 -153691 104940 388951 475857 356529 192908 99565 45228
40115 45228 -32347 -107703 -107051 967 201411 455419 670511 723166 601765 470019 475776
40104 475776 533841 430279 130521 -165082 -296460 -319258 -339067 -318517 -167492 77751
40094 77751 298349 450624 555172 582183 485366 323368 208510 137927 13491 -151331
40084 -151331 -187115 2310 268685 358919 172383 -169394 -450045 -507276 -317472 -1884
40074 -1884 270176 413179 436484 341102 107736 -173155 -277986 -73446 286694 499766
40064 499766 438011 250820 157540 227518 371498 466163 452653 360988 269066 223047 203144
40053B03144j7641J4528P3246P3735j2355q1755l5620P9908J50414J49385J30312
40042G27301J14800Q1383K5979n2098j77425l19307l43751j67218Q3727K03710
40032A77101J70678J24416J05462J0415j62841k36953j22210J8626J3330n8281
40022C9743j5263J23415J84777J25379O3268M4323j5570j22378j38057j3903P4262
40011C49996l8682k43234k81962r3354J19093J59951M8204q7488j93879k76236
40001e37591k75794j09682J55776L00689J98306j2915j01752l7245J3325l9131
39991d46014q2239K91J45902K19753K00377J51028Q9599J1492k1418M4730J27507
39980D41008R5208l3339j12868q6635l3990n662K6914M1077l7426j54199j35383
$$ plain form
40053 203144 185503 200031 273277 347012 334657 252902 217282 297190 447604 596989 727301
40042 727301 842101 923484 949463 897365 719940 400633 56882 -110336 -26609 177101
40032 177101 347779 472195 577657 588072 425231 188278 66068 84694 98024 39743
40022 39743 24480 147895 332672 458051 521319 565642 550072 427694 289637 275734 349996
40011 349996 311314 68080 -213882 -307236 -188143 -28192 20012 -67476 -261355 -537591
40001 -537591 -813385 -923067 -767291 -466602 -268296 -281211 -382963 -420208 -406883 -446014
39991 -446014 -528253 -527962 -382060 -162307 38070 189098 278697 290189 268771 313501 441008
39980 441008 536216 502877 390009 303374 269384 263722 290636 331713 294287 140088 4705
39969D705L4051J31282K6355r2766j0309J63533J71170K8475k3442M9097O618
39958D88769k32761l99770k73876l5561J0159j02248q5758J19361K44253J11574
39948a55858r6441j19876P684M6929q3612k18359k01051p0811L7164N4978L332
39937g95921n0209r268J74708L84643M01253J72634p5462j14706j3685r748j41657
39926g7418k05866q3078R2167J55084J31903J28934J32985N8526p9455j62866
39916I0916j13603L4187J72869J91610O6685q3750j11840l1695J1751j0337L3493
39905B50286J57390J48856r5466l16288k19761O9774J66725l0310k41109k41210
39895c51113j05508K5746J41278K24836J79649J9198p4555k0059K5350o2460j52051
$$ plain form
39969 4705 38756 170038 196393 103627 93318 256851 428021 456496 433054 482151 488769
39958 488769 256008 -143762 -417638 -453199 -443040 -545288 -631046 -511685 -267432 -155858
39948 -155858 -252299 -372175 -364491 -317562 -401174 -619533 -820584 -891395 -854231 -799253 -795921
39937 -795921 -846130 -855398 -680690 -296047 105206 277840 202378 87672 73987 64239 -77418
39926 -77418 -283284 -366362 -274195 -119111 12792 141726 274711 333237 253782 90916
39916 90916 -22687 11500 184369 375979 442664 358914 247074 215379 227130 216793 250286
39905 250286 407676 556532 461066 144778 -74983 -5209 161516 131206 -109903 -351113
39895 -351113 -456621 -430875 -289597 -64761 114888 134086 59531 39472 64822 2362 -149689
39884a49689q1517N7122O4532n2308j23573r2787m1409J0745J17910K31959K14264
39873A55249N8207o3359k6097R7135J66540J42103N9268o3606k06842k93195k40814
39862b15411p1983Q6472J30788Q1177L0588J2221k5855r7383j07306J4760J63606
39851A674J63893J6414r4399n8955L3086P4571R5239J40287J30726j7125k17794
39840B67617k99826k17491p1899L4037O4520K3243m3584n2361K8517J33315J98402
39829F4490K31142K18279Q4198j49337k83423j79826J3388N0114p0395j41114
39819a62484q0954j5785k4524j4466R4377K24822K55886J70126L6444o8232r4093
39808C21117n3150k4768n5606p6217J900J45842K46440K46094J31809r6251l21151
$$ plain form
39884 -149689 -231206 -174084 -109552 -161860 -285433 -378220 -419629 -408884 -290974 -59015 155249
39873 155249 213456 150097 124000 221135 387675 529778 589046 525440 318598 25403 -215411
39862 -215411 -287394 -200922 -70134 11043 41631 53852 27997 -69386 -176692 -161932 1674
39851 1674 165567 181981 87582 28627 61713 136284 231523 371810 502536 485411 267617
39840 267617 -32209 -249700 -321599 -287562 -223042 -199799 -243383 -295744 -267227 -133912 64490
39829 64490 295632 513911 598109 448772 165349 -14477 -1089 49025 -21370 -162484
39819 -162484 -243438 -259223 -283747 -298213 -203836 20986 276872 446998 483442 415210 321117
39808 321117 267967 243199 187593 111376 113276 259118 505558 751652 883461 787210 466059
39797D66059l13389l7158J83794O7282j83611j68760P1576J29358p1024j35406
39787H721J10061K81737N8036k84825l13826q4479N7568O3174J23592J98084P0348
39776B88191j81193k19263J3090J84811R4637n3155k3919R5369R7969j0781p5817
39765B09939m7881j0963k9592q0324q9440R311J93861L20655K64557R2496j7178
39754H15441k3749m5019j18721j21654J1900J54946J63335N6533o5367j61996
39744F65649k15274j71202l4291P5010P4856N3870J27691K34724K16545O4277
39734A091855o4255p9370p3374j49771k49207k38210j13700o821J8739N8329J88193
39723C82408K87330J77330q2883k15466r5766N8559k396j95594k32927l6789J78112
$$ plain form
39797 466059 152670 115512 299306 366588 182977 14217 85793 215151 144127 8721
39787 8721 118782 400519 458555 173730 -140096 -224575 -167007 -103833 19759 217843 288191
39776 288191 106998 -112265 -99175 85636 180273 127118 103199 198568 296537 285756 209939
39765 209939 162058 151095 121503 41179 -48261 -38950 154911 475566 740123 832619 815441
39754 815441 791692 746673 627952 506298 518198 673144 836479 893012 827645 665649
39744 665649 450375 279173 244882 319892 394748 448618 576309 811033 1027578 1091855
39734 1091855 1027600 948230 874856 725085 475878 237668 123968 117147 135886 194215 382408
39723 382408 669738 847068 764185 548719 452953 511512 509116 313522 80595 43806 221918
39712B21918K17955J05765m9701j85974k39445j46991K7348J17797Q2446N4693
39702B05811R6260P3875r8015k58795k17035m2440M6864R118m540Q3180J87091
39691H1374K35704K53749K38354J20819q1665k13357j68386l4715L6644K5664
39681D94185J1915J4493j9165q6072j02811k4671R8530K06579K77537K57553N8041
39670A186114k79468n08958m22358j29989O3389N6039L5323J32437K14103J39217
39660D85849J7668K0411Q7769N6338m0144n5694l5854j40308k90261k18806P8652
39649c4380K66519J60034j585N0538K04704J83274k1659j76786j57732m7113M6703
39638D72517Q2382M9416j4320k7100M721m0162j78244k16672k9914J98452K08959
$$ plain form
39712 221918 439873 545638 495937 309963 70518 -76473 -49125 68672 151118 205811
39702 205811 302071 375946 277931 19136 -197899 -240339 -193475 -184357 -188897 -105717 81374
39691 81374 317078 570827 809181 930000 848335 634978 466592 431877 468521 494185
39681 494185 506100 520593 501428 415356 312545 287874 386404 592983 870520 1128073 1186114
39670 1186114 906646 397688 -24670 -154659 -91270 -35231 92 132529 346632 485849
39660 485849 503517 523928 611697 668035 627891 572197 536343 396035 105774 -113032 -34380
39649 -34380 232139 392173 390588 441126 645830 829104 807445 630659 472927 425814 472517
39638 472517 554899 604315 589995 562895 567616 527454 349210 132538 102624 301076 510035
39627E10035K4957j32007j77650j83613j52142k8777J12219J43274J07196J29554
39617C53046J60022O4953o9325l1007J30770J43689l0354j18643j263R5107N913
39606G02908j02475o6052j8092j05987j77238l4738J95505K47153J15910m420
39596G52474o2915j36217j67641l1779J77923K21864Q1037j6271L8708R8559M7676
39585A003418j6029J0428M6194k3509j50060j98118j26953k703R5783J18181O4228
39574H20860J3799N7390J57529J70080M6105q7835j06086l8145K2646O0447R1287
39563A208077O7152n0048j74248j86483j16433j01741j64250j65838l3179J05107
39553C88116J03577K2326K2299R0850N3166j18827k01349l8073J89491J96738
$$ plain form
39627 510035 534992 402985 225335 41722 -110420 -139197 -26978 116296 223492 353046
39617 353046 513068 578021 508696 477689 608459 752148 721794 603151 601888 696995 702908
39606 702908 600433 534381 516289 410302 233064 198326 393831 640984 756894 752474
39596 752474 689559 553342 385701 353922 531845 753709 834746 818475 857183 955742 1003418
39585 1003418 987389 997817 1044011 1020502 870442 672324 545371 542668 638451 756632 820860
39574 820860 834659 892049 1049578 1219658 1265763 1177928 1071842 1033697 1056343 1116790 1208077
39563 1208077 1275229 1225181 1050933 864450 748017 646276 482026 316188 283009 388116
39553 388116 491693 514019 536318 627168 680334 561507 360158 322085 511576 708314
39543G08314J0760p8053L6409J24616r232k28808k79039j32951M0494J31537J35503
39532D59550L9354j40411k56466j62276O3613J95598J66761J32199K05456K92263
39522I95641K46244P2668q6369j02344K4560J41477O1857k01798l77794k47314
39512E26828L4390J22376l3018j30627N128J61681R7023p3717p9763O5991R5460
39501G91752r1503k79561k56934r4390q704o1751j18500p4919q768l9222j02448
39490c44948n985K59897M23362K80486J6193m0948R2698R8816j11797k48905j35036
39479B83833j0162j18834k80374j86329P6106J61900K1546n6925O1650J82604
39469A35015J48471O9174P9705J23117J00151L4683k2536q3164j24674p7427J1192
$$ plain form
39543 708314 719074 641021 677430 802046 792814 564006 284967 152016 192510 324047 459550
39532 459550 498904 358493 102027 -60249 3364 198962 365723 497922 703378 995641
39522 995641 1241885 1314553 1228184 1125840 1150400 1291877 1353734 1151936 774142 526828
39512 526828 561218 683594 650576 519949 525077 686758 783781 710064 630301 696292 791752
39501 791752 700249 420688 163754 69364 60660 -1091 -119591 -194510 -203278 -242500 -344948
39490 -344948 -350933 -91036 332326 612812 629005 588057 680755 779571 667774 418869 283833
39479 283833 273671 154837 -125537 -311866 -235760 -73860 -52314 -109239 -47589 135015
39469 135015 283486 352660 432365 555482 655633 690316 667780 584616 459942 382515 393707
39458C93707j1850j39902j59372J2261J56072Q4975n5491l4162Q6808P9134n3835
39447C58345q6262N5076J82543J39299j2218j38305j93538j78989r1806K2565
39437E6710Q2698P5334M4863k3445j66685k79021j69136J45471L77924L19615
39427D64328R7288m9125r2364j36679j42257P505K04822J72871j08834k90543
39417A27012j16491J92553K30298m1966k72173k10165J1943J30684P9453k7994
39407A03154r0927q1945j2594N6713M4660l4561o7024k3344l0340j52390k34830
39396e23428j30252L5073M0132o1204j5515J93848K76456Q1460j50986j35255
39386c89671P4303K24527K22414J50192M7278r8813k08511j69351k4572O9401
$$ plain form
39458 393707 381857 241955 82583 94844 250916 335891 280400 246238 333046 412180 358345
39447 358345 272083 327159 509702 649001 636783 498478 304940 125951 34145 56710
39437 56710 139408 214742 259605 236160 69475 -209546 -378682 -233211 144713 464328
39427 464328 561616 512491 420127 283448 141191 148696 353518 526389 417555 127012
39417 127012 10521 203074 433372 391406 119233 -90932 -78989 51695 131148 103154
39407 103154 12227 -69718 -82312 -25599 19061 -15500 -82524 -105868 -136208 -288598 -523428
39396 -523428 -653680 -618607 -578475 -639679 -655194 -461346 -184890 -103430 -254416 -389671
39386 -389671 -315368 -90841 131573 281765 329043 230230 21719 -147632 -172204 -102803
39376a02803O6930O1080R4909J01101M3743k2981o4888j10337j54309j40327p2547
39365c00429k9580k2699M4551K09012L40319K93580J11889j7551L253O6500J369
39354G00214j94678l14374j71502J43357L24035K04802l8540j32350o3132m2986
39344D14846j54937k19271o6711K02336L34315K18617k7776k24975k85534k14611
39334b3701m6259J64811L17675L09248J48656j7217o2439l2514l9015m3803P9455
39323G54897K57905K26336o8098k97895j87872P8233J37531k1471j13905m0434
39313G25227K9947J9520K7335M0814p5698k42189j81323J09325K68225J17978
39303H39161n5991Q445J37827Q3184l0001K9286J36552K6728k03888k28605k5405
$$ plain form
39376 -102803 -35873 25207 120116 221217 264960 241979 177091 66754 -87555 -227882 -300429
39365 -300429 -330009 -352708 -308157 -99145 241174 534754 646643 629092 632345 698845 700214
39354 700214 505536 191162 19660 163017 487052 691854 653314 520964 457832 414846
39344 414846 259909 40638 -26073 176263 510578 729195 701419 476444 190910 -23701
39334 -23701 -69960 94851 412526 721774 870430 853213 790774 758260 719245 675442 754897
39323 754897 1012802 1239138 1171040 873145 685273 763506 901037 879566 765661 725227
39313 725227 755174 774694 802029 842843 767145 524956 343633 452958 721183 839161
39303 839161 783170 791615 929442 1012626 982625 1011911 1148463 1175191 971303 742698 717293
39292G17293J18371Q6368L6100L8989m506o6240K4654K28290K67656N8640j45615
39281A360000j60887j23891j86095k33472j12320Q0486J44162O4261k1433l4351
39271G76460M682M1380m523j70739l10696j89357J68559M06202K59305j05371
39261H75902l35750l24743k11457r5026K5195J04897P6510m143q350P9974J68597
39250C51606K15325K40557K13867Q0555j05060k08727j85968j15437o7424l9623
39240C79671j4989J1565N4000R9884Q1288l1615j43536j38512l6863N1927R1511
39229D04331J21127J37500J04339N0766K5369k0749j51867k65763j79018P5422
39219C01457K20332Q3919j73630k84016j96167n8280L0311J06529K12851K95385
$$ plain form
39292 717293 835664 922032 958132 997121 992615 926375 951029 1179319 1446975 1505615 1360000
39281 1360000 1199113 1075222 889127 655655 543335 623821 767983 832244 810811 776460
39271 776460 781142 822522 817999 647260 336564 147207 315766 721968 981273 875902
39261 875902 540152 215409 3952 -91074 -65879 39018 115528 111385 103035 183009 351606
39250 351606 566931 807488 1021355 1101910 996850 788123 602155 486718 419294 379671
39240 379671 364682 376247 430247 530131 611419 579804 436268 297756 260893 312820 404331
39229 404331 525458 662958 767297 818063 843432 822683 670816 405053 226035 301457
39219 301457 521789 605708 432078 148062 -48105 -106385 -76074 30455 243306 538691
39209E38691K52281M3552k35342l77753k30841J12519L51738K82510J3816j94745
39199E56426k50888k63945k92712k25947K3609L32864M87880M27449K63569J03149
39189A161454l1357j19180j17438n7998n0810j26450j72691j00874K0057Q4681
39179D89394J07075J36961J15099k7096j89253k07343j02148k9036l349R6404
39169C86708K41195K30565L4991j02115l5478N6788m338q7782j491J45369J18595
39158I83007l6059p3830L3793P4405k9771j17629r2635n9591q9539q7155J2104
39147E17100J09258J03918K8521n6452j44892j92239j02603J04020K54671K40460
39137H61762J46394R5440R2109Q6814O3316k396j36115k61288k47585j18653m5301
$$ plain form
39209 538691 790972 834524 599182 221429 -9412 103107 454845 737355 751171 556426
39199 556426 305538 41593 -251119 -477066 -453457 -120593 367287 794736 1058305 1161454
39189 1161454 1130097 1010917 893479 835481 784671 658221 485530 384656 404713 489394
39179 489394 596469 733430 848529 821433 632180 424837 322689 293653 290304 386708
39169 386708 627903 858468 893459 791344 755866 812654 808316 720534 719043 864412 983007
39158 983007 946948 873118 906911 981316 951545 833916 741281 681690 592151 504996 517100
39147 517100 626358 730276 758797 702345 557453 365214 262611 366631 621302 861762
39137 861762 1008156 1103596 1195705 1282519 1345835 1343439 1207324 946036 698451 579798 534497
39126E34497p2482n2083O5252J02119l5129j44908l7218J42568J47908L4880M1256
39115G26660J58485J43590n4511j89078j03445L6228K1465q0491n2210J35982
39105G42675K72506J76608p4498k29213j53252Q840K1082j15246j43833Q4855
39095E90524L71129M05276J47427j69484l29395k74797m7137K23441L24121J61279
39085A402384o4175p7904R4205J87303J13237N2665J00930J12632P330m8129N9218
39074A939696J44508J6040j70172j18357J46241K96076J52278j19375k73763k46111
39064A767061j16807N804J9066j09360k56540k46223p9287N6077M4040j9271m672
39053A059888O4106R3842P7520N5011R063p2540j00053O554J43525J19436o3669
$$ plain form
39126 534497 462015 409932 475184 577303 542174 397266 360048 502616 650524 685404 726660
39115 726660 885145 1028735 974224 785146 681701 717929 739394 658903 606693 742675
39105 742675 1015181 1191789 1117291 888078 734826 743666 764748 649502 505669 590524
39095 590524 961653 1366929 1514356 1344872 1015477 740680 693543 916984 1241105 1402384
39085 1402384 1338209 1260305 1354510 1541813 1655050 1707715 1808645 1921277 1928607 1880478 1939696
39074 1939696 2084204 2100244 1930072 1811715 1957956 2254032 2406310 2286935 2013172 1767061
39064 1767061 1650254 1656058 1675124 1565764 1309224 1063001 983714 1039791 1083831 1064560 1059888
39053 1059888 1123994 1217836 1295356 1350367 1359430 1286890 1186837 1193391 1336916 1456352 1392683
39042A392683j79408q5381P0985O0741r8698j60824J5109K63334K99423O1084
39032A639048k00708j93829P0526K65949J36419j58224k10492J08712M57236M58841
39022B373478J86404K4036J36473L15159L49012K96660L00205L37224L04280K07153
39012D830084J24994Q6726R8865J83311K71036J96698m8469k05296r0195Q6907
39002E534661J0360k36582k78942l3507J73006J31005L3065P8858J31165J2822
38992E555911j26009n5251J00820K4435k81851m76225l67687j28420J9534N5710
38982D320967K5733q6823k23522j98160N3096L15682L51997K03097Q3116O7912
38972D913095N9852Q409j0039O3845J84410K80205L25025L17164K70851K34896
$$ plain form
39042 1392683 1213275 1127894 1198879 1259620 1160922 1000098 1015207 1278541 1577964 1639048
39032 1639048 1438340 1244511 1315037 1580986 1717405 1559181 1348689 1457401 1914637 2373478
39022 2373478 2559882 2583918 2720391 3035550 3384562 3681222 3981427 4318651 4622931 4830084
39012 4830084 4955078 5041804 5140669 5323980 5595016 5791714 5743245 5537949 5447754 5534661
39002 5534661 5545021 5308439 5029497 4995990 5168996 5300001 5333066 5411924 5543089 5555911
38992 5555911 5429902 5374651 5475471 5499906 5218055 4741830 4374143 4245723 4265257 4320967
38982 4320967 4346700 4259877 4036355 3838195 3891291 4206973 4558970 4762067 4845183 4913095
38972 4913095 4972947 4981356 4971317 5035162 5219572 5499777 5824802 6141966 6412817 6647713
38962F647713K43359K51308K03605J56820K20675L64792M10340K68631P7164K0180
38952H864587J07017K20669L00982L60012L78437L33547L09278M24673O31471
38943A1930673P30561O51276N82779P26217J013895J204397J203865J150963J187766
38934B0382392J289918J381012J501134J745133K074071K319638K419523K553242
38926C5666063K946596L581783M223007M738122N253268N916790O657431P337988
38918G6321048Q054881R072109J0483019J2168537J4121583J6562449J9620220
38911A66403846K3119716K6828248L0666473L4385756L7130880L7585102L4576559
38904C90696580K7521749J6611016L021739j1073327k3202915l1682713l6117067
$$ plain form
38962 6647713 6891072 7142380 7345985 7502805 7723480 8088272 8498612 8767243 8844407 8864587
38952 8864587 8971604 9192273 9493255 9853267 10231704 10565251 10874529 11299202 11930673
38943 11930673 12661234 13312510 13895289 14621506 15635401 16839798 18043663 19194626 20382392
38934 20382392 21672310 23053322 24554456 26299589 28373660 30693298 33112821 35666063
38926 35666063 38612659 42194442 46417449 51155571 56408839 62325629 68983060 76321048
38918 76321048 84375929 93448038 103931057 116099594 130221177 146783626 166403846
38911 166403846 189523562 216351810 247018283 281404039 318534919 356120021 390696580
38904 390696580 418218329 434829345 437851084 426777757 403574842 371892129 335775062
38897C35775062l7038242l5374742l2208105k8531063k4894098k1404849j8166539
38890A38157424j5471041j3432323j1751759j0124940q658609p594448o819692
38883F4304612o006909n122706m425478l992083l605311l145128k760262k555722
38875C2691013k389338k108902j771845j500164j300368j148117j083937j099985
38867B0288357j079512r71701q90003r13442r27905q12044o60204o43620p26143
38858A2663783p04749n11574l05382k35507k51777k17177j23451r5985j89422
38849A0028759k65513j54047Q5880J88515K6122j96431k29350j49408k23681m57175
38839H653671n64350m32984l07476l67643m18712k42325j5686n6194k96173l74473
$$ plain form
38897 335775062 298736820 263362078 231153973 202622910 177728812 156323963 138157424
38890 138157424 122686383 109254060 97502301 87377361 78718752 71124304 64304612
38883 64304612 58297703 53174997 48749519 44757436 41152125 38006997 35246735 32691013
38875 32691013 30301675 28192773 26420928 24920764 23620396 22472279 21388342 20288357
38867 20288357 19208845 18237144 17347141 16433699 15505794 14693750 14033546 13389926 12663783
38858 12663783 11959034 11447460 11142078 10906571 10654794 10437617 10314166 10218181 10028759
38849 10028759 9763246 9609199 9695079 9883594 9909716 9713285 9483935 9334527 9110846 8653671
38839 8653671 8089321 7656337 7348861 6981218 6562506 6320181 6304495 6248301 5952128 5577655
38829E577655j99096n1769j00496j67455j02678o0676j95069l35746k42792j7919
38819D103959L2039j28941k10270k3268K80879M61150M63621L50414J38879j30350
38809E338112k88493j96406K5742R5583q7022l27779m04286l16073k04887j46422
38799C488069j30141j60298k38932k86396k17478r1038n1971j14830j46050r2416
38789A958519o8634j40785j80687o9821P6931O4265q3321j60199q3697K9103Q8432
38778A430106J41772K12131K09190R3257j8734k1870J7173j2409p3834n2610M4018
38767A968190R5081M6770l6885r7436j47473k02461k36158k23656j67910q0521
38757I17541Q768M0562l655l7149L4539J57640J77928N9066o3501r1628j07699
$$ plain form
38829 5577655 5378559 5326790 5226294 5058839 4956161 4895485 4700416 4364670 4121878 4103959
38819 4103959 4135998 4007057 3796787 3773519 4054398 4515548 4979169 5329583 5468462 5338112
38809 5338112 5049619 4853213 4878955 4974538 4887516 4559737 4155451 3839378 3634491 3488069
38799 3488069 3357928 3197630 2958698 2672302 2454824 2363786 2311815 2196985 2050935 1958519
38789 1958519 1889885 1749100 1568413 1498592 1575523 1639788 1556467 1396268 1312571 1341674 1430106
38778 1430106 1571878 1784009 1993199 2086456 2067722 2045852 2063025 2050616 1976782 1924172 1968190
38767 1968190 2063271 2110041 2073156 1975720 1828247 1625786 1389628 1165972 998062 917541
38757 917541 926309 966871 963216 926067 960606 1118246 1296174 1355240 1291739 1200111 1092412
38746A092412k18268l46985l12557q2575J68755K67047K13339J29578J00497J11521
38736A122764J03434M6729l0663p4623o6184m2596m2288n0614l6056j8963m3390
38725H67550q1851m2827R4182K14151J91857M1839j12552j86934j87625j41345
38715F56445o0257J5504K6289j9086l2772K5540P4127K8684n7251o5282K253K4091
38703F18285m0500p3579J9251J45884J44601P286j20162j34680o7616J4986R1447
38692F05203J39043J17173N2190N0482J51265K33892J61114k8245j60546j36906
38682A184665j4129J08529J88967K23531K19168K09625K27657K40378J85136Q9460
38672B862987O5181J39537J84563Q8340q2123j86472k19180k86055l92557l98167
$$ plain form
38746 1092412 874144 527159 214602 132027 300782 567829 781168 910746 1011243 1122764
38736 1122764 1226198 1272927 1242264 1167641 1101457 1058861 1016573 965959 929903 910940 867550
38725 867550 785699 742872 837054 1051205 1243062 1284901 1172349 985415 797790 656445
38715 656445 596188 611692 637981 618895 586123 611663 685790 714474 657223 591941 594194 618285
38703 618285 577785 504206 523457 669341 813942 821228 701066 566386 498770 513756 605203
38692 605203 744246 861419 913609 964091 1115356 1349248 1510362 1482117 1321571 1184665
38682 1184665 1170536 1279065 1468032 1691563 1910731 2120356 2348013 2588391 2773527 2862987
38672 2862987 2928168 3067705 3252268 3340608 3258485 3072013 2852833 2566778 2174221 1776054
38662A776054k27945j8115L9830n6098j29638p6484p455q5716k73132l37050j40165
38651D64086J53036K46503O4970j66563k13140q9160L5315P9816Q1790M6314o5682
38640F37285j91588j73088J6159J70424R1868j40870k66392j72515p567N4283
38630A7999L4907O4474J53558J71771M8923j10037j62629j10493o7067q3804j02158
38619a44556p2406k3019Q052J7019k0090j30491k13908p0573L06132N82968M35454
38608F74582o133k82182j82419L6367P6822n404P09P5089K9499j37504k09230
38597G0196p9950R6738J40607O1808k4812p1811r8997j10682r8394p6743o0162
38586b52202m4470m0630o5273o7823M6364K54638L60990K11276p1202j86810j4828
$$ plain form
38662 1776054 1548109 1529994 1569824 1513726 1384088 1307604 1300149 1214433 941301 604251 464086
38651 464086 617122 863625 928595 762032 548892 459732 495047 574863 656653 702967 637285
38640 637285 445697 272609 288768 459192 551060 410190 143798 -28717 -36284 17999
38630 17999 52906 117380 270938 442709 491632 381595 218966 108473 41406 -42398 -144556
38619 -144556 -216962 -239981 -231929 -214910 -235000 -365491 -579399 -649972 -343840 239128 674582
38608 674582 668449 386267 203848 240215 317037 311633 312342 387431 416930 279426 70196
38597 70196 -9754 86984 227591 289399 264587 192776 93779 -16903 -115297 -192040 -252202
38586 -252202 -296672 -337302 -402575 -470398 -424034 -169396 191594 402870 331668 144858 130030
38575A30030K32769K67557O5306j30439j17239M8440J67622J49740O8294N686
38565H87766m6460j05327j15102l0179P0771N3249r2491k22958k17310j17674
38555F4285n4415p4731r8915m0169P5412J36549Q8390R616J0665P4985P3900m1981
38543B23591j51854j29362k4408K2432K131M1969J83390K86100K11583J4335j18830
38532E61077p4378Q6148J90698J01383j51065l55835l09497m3862J99791K50982
38522D55442J80893J51415J93676K18971J69008N3102j05355k49308k59384p4025
38512G34435J66366K17175N459k74718l77277k54777o6539J4832k7799o3963J8635
38501I1829J65236K14681J17204N499k121L8938L8444N1265J46420J90775Q478
$$ plain form
38575 130030 362799 630356 695662 565223 447984 496424 664046 813786 882080 887766
38565 887766 841306 735979 620877 590698 661469 714718 622227 399269 181959 64285
38555 64285 9870 -64861 -163776 -203945 -128533 8016 96406 106022 116687 191672 265572 223591
38543 223591 71737 -57625 -82033 -59601 -57470 -15501 167889 453989 665572 679907 561077
38532 561077 486699 572847 763545 864928 713863 358028 48531 4669 204460 455442
38522 455442 636335 787750 981426 1200397 1369405 1422507 1317152 1067844 808460 734435
38512 734435 900801 1117976 1123435 848717 471440 216663 150124 164956 137157 73194 91829
38501 91829 257065 471746 588950 594449 592328 631266 669710 720975 867395 1058170 1066648
38490A066648k70844l08000n1752J52726P9088n4121J0845J19286j1196k53103
38480D79577k30670N4739J97086K6244j46989p0418N9193r120j30247m1666J49118
38469C36847J41663l2086o2550J01347J71178K1795j02102j6243R6147J3079j51238
38458E17837j51346r208N7207m529m7181n86N1740O3642Q5803J15112O7875n6109
38446F90257j39073j22469q0467o7616l1170N4828R5472J2738j15650j58755j11285
38435B6810p1474q1229q3322k3109Q3993J83510K19925J48343k6588k06852k52664
38424h2657j23115N6090J15049L7744j2615R2209K51683K47494M1776j55209j62878
38413C05571n2458O288N765N4204J44299J56519P0850j1533o0473j36453j97717
$$ plain form
38490 1066648 795804 487804 436052 588778 667866 613745 624590 743876 732680 479577
38480 479577 248907 303646 500732 526976 379987 309569 368762 359642 229395 187729 336847
38469 336847 478510 446424 383874 485221 656399 678194 576092 559849 655996 669075 517837
38458 517837 366491 357283 414490 409961 362780 362194 413934 477576 563379 678491 746366 690257
38446 690257 551184 428715 348248 280632 249462 304290 399762 412500 296850 138095 26810
38435 26810 -44664 -125893 -209215 -232324 -148331 35179 255104 403447 376859 170007 -82657
38424 -82657 -205772 -149682 -34633 3111 -9504 82705 334388 581882 623658 468449 305571
38413 305571 253113 259401 265166 319370 463669 620188 691038 679505 619032 482579 284862
38402B84862j10563P7709J09942j03041k89353j87395O8187J58836M5526l9352
38392A5358J3614P5856M8591m283k3095l8480m6739P186P7568M3588n7607k9774
38380H1783J62077K74274J19785j53623k76419k01787o6209O5056K04692K72519
38370D82148J43959j26460l07647k54989n2373J24701J80182J23812L7110L2830
38360C83273J50395K70914K26584J4467j85500k24582j29760j6765M0985J9676
38350E49687p8380j92589k24483j55410q1816p2817n9775N0201K00152K23314
38340A58084N4371j72643k51639r6141J82428L52235K48959n4328k87399k58766
38330a24839o9739K7251m0187j01548l1783N4708O853q9897k4969J90986K92512
$$ plain form
38402 284862 174299 252008 361950 258909 -30444 -217839 -149652 9184 54710 15358
38392 15358 28972 104828 153419 149136 126041 87561 40822 48008 125576 169164 111557 81783
38380 81783 243860 518134 637919 484296 207877 6090 -60119 4937 209629 482148
38370 482148 626107 499647 192000 -62989 -115362 9339 189521 313333 350443 383273
38360 383273 533668 804582 1031166 1045633 860133 635551 505791 489026 530011 549687
38350 549687 471307 278718 54235 -101175 -182991 -255808 -315583 -265382 -65230 158084
38340 158084 212455 39812 -211827 -307968 -125540 226695 475654 421326 133927 -124839
38330 -124839 -194578 -167327 -207514 -309062 -340845 -286137 -279284 -369181 -394150 -203164 89348
38319H9348J26459j14203j40877N4163K14372J62598j3220j17064o7140O7965
38309B62401J64529J35649q435j58674k08742j65507j07466n0469N0110J60850
38299G4246J61809L1265p7169l0653R9873J51427Q5567j7441j09622j82552j70626
38288A6124j1105J95460K41958P8618j08782j47545q8339p5571j02398l1515J59448
38277A26353K83452J57112j48696l53580k77181m0845R7740O5641K0693P7764
38267H453J40718Q7455j7824m0831m598k6681r6963j12190q9576j29438j80690
38256d62165q8082J02055J49216R613n0665J32879L54773L61357K04086N7600
38246G70667q7687k83954l73209j95613Q1191J66720Q6053Q2506J63326J14749
$$ plain form
38319 89348 215807 101604 -39273 14890 229262 391860 378640 261576 194436 262401
38309 262401 426930 562579 554144 395470 186728 21221 -86245 -136714 -86604 74246
38299 74246 236055 267320 190151 159498 259371 410798 496365 478924 369302 186750 16124
38288 16124 5019 200479 442437 521055 412273 264728 176389 100818 -1580 -33095 126353
38277 126353 409805 566917 418221 64641 -212540 -253385 -155645 -90004 -69311 8453
38267 8453 149171 236626 218802 177971 173373 146692 49729 -62461 -152037 -281475 -462165
38256 -462165 -550247 -448192 -298976 -289363 -340028 -207149 147624 508981 713067 770667
38246 770667 682980 399026 25817 -169796 -88605 78115 164168 246674 410000 524749
38236E24749o0617j18782j8112R096r2606q4231R7613J59939m7963k38287j60981
38225c0182k4755j02680k21291n4361K86034L92256J83005l5244q1736q4282j41647
38214H5117j62557r6994k8678K1199J23498K37914K31928J25593O0409J7552j39799
38203D75182l26494k82082l3114N1761j80705l91443k38393J42241L75854L30007
38193g7186J23900j15963k59253j36521K21877M70048L37760Q33j90773j97179
38183A77543k09506k37208j32132N2755J04373M5256J23956L53209M07459J16419
38173H02124k29336k51908L6133L04304L12030Q9206j83694l34046k95737j50410
38163I8666m0151p216J8495P0153Q8044L3352n1856j24345j74474j69284q0442
$$ plain form
38236 524749 464132 345350 327238 336334 243728 159497 257110 417049 369086 130799 -30182
38225 -30182 -54937 -157617 -378908 -433269 -147235 245021 428026 392782 311046 226764 85117
38214 85117 -77440 -174434 -203112 -181913 -58415 179499 411427 537020 597429 614981 475182
38203 475182 148688 -133394 -166508 -114747 -295452 -686895 -925288 -783047 -407193 -77186
38193 -77186 46714 -69249 -328502 -465023 -243146 226902 564662 565495 374722 177543
38183 177543 -31963 -269171 -401303 -348548 -244175 -198919 -74963 278246 685705 802124
38173 802124 572788 320880 357013 661317 973347 1062553 878859 544813 249076 98666
38163 98666 58515 51299 69794 139947 227991 261343 209487 85142 -89332 -258616 -339058
38152c39058K2534M1344J5349N9808J31770O1432j36683k12444m7366J41636J21531
38141a40147j8901m3710N9120R8566p190j42910j87367j27479n190J09728J19525
38130b85955K31j21075j08452m503M3137N833r494N0490J14641J12895O1631J1309
38118a29312m647K9988Q7743Q7250j1930j29854j60183j03054j7786R3244K30040
38107b8501K84544J51153p1419j61691p3022J6279j7587q5081o8956o344J8402
38096d2223L0178Q1973J08573O250j76911k58474j40566P3232K03417J84451R8738
38085A68638M4691J4692o0535j60770j52858K2693K09518J89573l9905k52703
38075a6966k59513q5635J19720K33763J98331L4868j26649j41630k7469N5000
$$ plain form
38152 -339058 -316524 -275180 -259831 -200023 -68253 -6821 -143504 -355948 -403314 -261678 -140147
38141 -140147 -159048 -202758 -143638 -45072 -52262 -195172 -382539 -510018 -515208 -405480 -285955
38130 -285955 -285724 -406799 -515251 -519754 -476617 -470784 -480278 -429788 -315147 -202252 -140621 -129312
38118 -129312 -133959 -103971 -16228 71022 59092 -70762 -230945 -333999 -351785 -258541 -28501
38107 -28501 256043 407196 335777 174086 101064 117343 99756 14675 -54281 -60625 -42223
38096 -42223 -12045 69928 178501 184751 7840 -250634 -391200 -317968 -114551 69900 168638
38085 168638 213329 228021 167486 6716 -146142 -123449 86069 275642 235737 -16966
38075 -16966 -276479 -362114 -242394 -8631 189700 224568 97919 -43711 -71180 -16180
38065a6180L6700K3142P7099Q0331n9098k03174j66064m188P4904L7931M4278
38054g4319J47221K00190J13598K978j8298k5029j25151k47285k41298j13573
38044c80966l297L7032Q1454J53823J62609N8094o0287o3816M6417J56831J67082
38033C54976N6744j17924k45313k28884r2778K5106L7103R843L8929Q4287L9189
38022c8722p4745j17812m2041M6266O9755Q8353J52420J76494P3703p8561j38581
38011A16529j01221o2831l5524M6368J50742J48669K3496p2760l6035M4545L9901
38000B61879k8629n1704k996O0879J16502J79750K25957K10172J59513J48082
37990A279405J70577J32692Mj22617j21543l9369l4242j72932l27656l22165j54074
$$ plain form
38065 -16180 20520 43662 120761 201092 141994 -61180 -227244 -231432 -156528 -118597 -74319
38054 -74319 72902 273092 386690 389668 371370 346341 221190 -26095 -267393 -380966
38044 -380966 -384263 -347231 -265777 -111954 50655 108749 48462 -15354 31063 187894 354976
38033 354976 411720 293796 48483 -180401 -273179 -248073 -210970 -201127 -162198 -77911 -38722
38022 -38722 -113467 -231279 -273320 -227054 -157299 -68946 83474 259968 333671 255110 116529
38011 116529 15308 -47523 -83047 -36679 114063 262732 286228 213468 177433 221978 261879
38000 261879 233250 181546 178550 239429 355931 535681 761638 971810 1131323 1279405
37990 1279405 1449982 1582674 1582678 1460061 1338518 1299149 1264907 1091975 764319 442154 288080
37979B88080j0979m8669k05902k88126k02889m2998O0007Q7779J07182J46702
37969a09813J57646Q7225m4569j46864j33025j305J62389K69474K98128K66244
37959H05530J81290O3208k8584o4430j03482j92353k42752j40472L7470Q0606
37949C96031m4956j22106q963J29210O3112j54449k71777j94688o6206j4646r236
37938b98674J1078K7275J4151M293J9234K4924L101p082K3347O8414R7012J06971
37926I4044R5935O4887N4801R8447J31798N4044j05616j93927j46742q1175j09129
37915d2633j66924j24397J8510J48526J97310J84038J39650Q4143N4487O8189
37905E60899P4344J5616p9729j40103j59365j77470j71476p0807J06133K30439
$$ plain form
37979 288080 277101 228432 22530 -265596 -468485 -511483 -451476 -363697 -256515 -109813
37969 -109813 47833 135058 90489 -56375 -189400 -190705 -28316 241158 539286 805530
37959 805530 986820 1050028 1021444 957014 853532 661179 418427 277955 315425 396031
37949 396031 351075 228969 220006 349216 412328 257879 -13898 -208586 -274792 -289438 -298674
37938 -298674 -287596 -260321 -246170 -241877 -222643 -197719 -194618 -201700 -178353 -109939 -12927 94044
37926 94044 189979 254866 309667 408114 539912 593956 488340 294413 147671 66496 -42633
37915 -42633 -209557 -333954 -315444 -166918 30392 214430 354080 438223 492710 560899
37905 560899 635243 650859 571130 431027 271662 94192 -77284 -148091 -41958 188481
37895A88481K18250J31409P3965N0801o858j12169j90551j79349j09634o2741
37885A604o3602m9632L8194J52334J69952M1246j34189k13358j60833n2712L7095
37874b33901R1439J07006P3477J2063k3405r544K0285K6190K050l8129p1382o4853
37862a08704j6339J0559l6895r2496l7078J12042J95956J43521P4319R0911J08712
37851D44508K7756n2561J7642J55376J33748p0193k42974k62186k24374k00410
37841b73668j10178N8865J46896Q1582K3605P8606Q4676q5529k19851o2058K41940
37830c5114L29991J57172j0636o7538j32260j60541M5885L57375L25899j15395
37820F94838m15362j81062K10995J87860j64268l13885j36201M4q1453j39641
$$ plain form
37895 188481 406731 538140 612105 662906 656048 543879 353328 173979 64345 1604
37885 1604 -61998 -111630 -73436 78898 248850 290096 155907 -57451 -218284 -270996 -233901
37874 -233901 -142462 -35456 38021 50084 26679 17135 37420 63610 65660 27531 -43851 -108704
37862 -108704 -125043 -114484 -151379 -243875 -280953 -168911 27045 170566 244885 335796 444508
37851 444508 472264 419703 437345 592721 726469 656276 413302 151116 -73258 -273668
37841 -273668 -383846 -324981 -178085 -96503 -72898 5708 90384 4855 -214996 -277054 -35114
37830 -35114 294877 452049 441413 373875 241615 81074 126959 484334 810233 694838
37820 694838 279476 98414 309409 497269 333001 19116 -117085 -117041 -198494 -338135
37810c38135k5969P3707L8616K8116J24018J37280j9439j06358N0978K36782J83576
37799C83172j0371q7708m7445m8939o9043J6193J16336K6943j98697k88606j62894
37788c71059k2599j029L509P9654J33014P5323r533j7269P58n5945j47630j37014
37776d69820J2032J65840J62780L321j20946l6429J69092K19745K7128j53610
37766b0867q0539J09527J11878p9305j99744j62669j48277k13363j60763P0528
37756g73594K07519N0621j80175j66614L4935J25994L8425k4203M1403J07603
37746e38086O7914q454j5881N6915J60136K18730J43593o3826k42227k38272j04240
37735e63698J1238R8998K27981L15990K10204j6788j14311k7857L5486k6399n6450
$$ plain form
37810 -338135 -364104 -290397 -251781 -223665 -99647 37633 18194 -88164 -37186 199596 383172
37799 383172 372801 285093 237648 188709 119666 135859 252195 279138 80441 -208165 -371059
37788 -371059 -393658 -394687 -391178 -311524 -178510 -103187 -112720 -129989 -129231 -185176 -332806 -469820
37776 -469820 -457788 -291948 -129168 -125847 -246793 -283222 -114130 105615 132743 -20867
37766 -20867 -101406 8121 119999 40694 -159050 -321719 -469996 -683359 -844122 -773594
37756 -773594 -566075 -515454 -695629 -862243 -827308 -701314 -662889 -687092 -645689 -538086
37746 -538086 -470172 -478626 -494507 -437592 -277456 -58726 84867 21041 -221186 -459458 -563698
37735 -563698 -552460 -453462 -225481 90509 300713 283925 169614 141757 177243 150844 94394
37724I4394M2152J10690K7073n6240K2436J42492J12791l509l6534l2984j41254
37713B81507k78941k30526l1582O1422n675J377K05215M11075M07479K35446L7695
37702A094492j45493k90211k93520j35171R616j3255j15270j09571J9739J35986
37692A57342J52298P6190p0970k38191l10770k24862o7048M8148J26197K03269
37682a48397K08892P7999p9514j05146l5000k6034p8242m2497J01048J95138J69279
37671B37526J35781J57785J29065j4246j46749j43417n9856P101Q8580K16796
37661F08366K62309R5838j60453k40005p1480J48657K17141J17097m6181j61784
37651G69505j47286Q002J97875K90039K79343K57940K33135J05558j33859l20708
$$ plain form
37724 94394 136546 247236 274309 218069 240505 382997 495788 492279 455745 422761 281507
37713 281507 2566 -227960 -259542 -198120 -203795 -202418 2797 413872 821351 1056797 1094492
37702 1094492 948999 658788 365268 230097 239713 226458 111188 1617 21356 157342
37692 157342 309640 385830 314860 76669 -234101 -458963 -526011 -477863 -351666 -148397
37682 -148397 60495 138494 58980 -46166 -81166 -107200 -185442 -227939 -126891 68247 237526
37671 237526 373307 531092 660157 645911 499162 355745 295889 302990 391570 608366
37661 608366 870675 966513 806060 566055 494575 643232 860373 977470 931289 769505
37651 769505 622219 630221 828096 1118135 1397478 1655418 1888553 1994111 1860252 1539544
37641A539544l16689j91781j05068q0068k2780P4396Q9052m0356j90306j97038
37631E58906p4007K897p0620j83599j51464L4493J78362J23614m0918r0357M5702
37620C33009J94220J68835O991r9940o8180l827j2657m5021j1646L0254n5546
37609D36492k47230l47559k51898r4079k9147q92J15735K34798J44362j36821
37599a76239l17849k21293r448Q8698R3966J54403K49774K30632Q1835n7389j11737
37588E353j28314j33041j06420r4897j56147j86867k2209K46478K92294Q653k75576
37577e50693k19612O3306J91864N6038r0969n1403O4840O9951k0186n1652L3737
37566e04779J41239J53383N3347n6237m1527J11797K42579J83817j3264j24950
$$ plain form
37641 1539544 1222855 1031074 926006 845938 823158 897554 986606 946250 755944 558906
37631 558906 484899 487796 417176 233577 82113 116606 294968 418582 377664 287307 333009
37620 333009 527229 696064 703055 603115 534935 531108 518451 473430 461784 492038 436492
37609 436492 189262 -158297 -410195 -504274 -533421 -534313 -418578 -183780 -39418 -176239
37599 -176239 -494088 -715381 -724829 -636131 -542165 -387762 -137988 92644 174479 117090 5353
37588 5353 -122961 -256002 -362422 -457319 -613466 -800333 -822542 -576064 -283770 -275117 -550693
37577 -550693 -770305 -706999 -515135 -459097 -550066 -601469 -536629 -466678 -486864 -538516 -504779
37566 -504779 -363540 -210157 -156810 -213047 -254574 -142777 99802 283619 270355 145405
37556A45405m5223Q2664P6285n2884j57534j55628p3031M7505J64822K00791R6583
37545C29755r0168k23956k29802j39792k7645L7551J0529o8320o5365Q1308K15459
37534a70446J23360j51570l12702j81975Q0411K11756J61072M7039o9908j98135
37524d61098k67704j69978M8691J93683J62322N5615J1046L7258O9699Q8488J00404
37513a31574P1185l3790j59691j80409k6716K15496L51737K61098M9381m0416
37503C76301P5415J92771R5412j16957j57305J4262J14487l6224k36023k05622
37493A16517L186J09736R558j44771k18330k21527j56972L2866K82528L54810
37483A67601J19956k17830l20755j11831J49983J93085L1908j02032o0577P5192
$$ plain form
37556 145405 100182 182846 259131 206247 48713 -106915 -179946 -132441 32381 233172 329755
37545 329755 239587 15631 -214171 -353963 -381608 -344057 -333528 -401848 -467213 -385905 -170446
37534 -170446 -47086 -198656 -511358 -693333 -612922 -401166 -240094 -193055 -262963 -461098
37524 -461098 -728802 -898780 -850089 -656406 -494084 -438469 -427423 -390165 -320466 -231978 -131574
37513 -131574 -60389 -94179 -253870 -434279 -460995 -245499 106238 367336 416717 376301
37503 376301 451716 644487 739899 622942 465637 479899 594386 558162 322139 116517
37493 116517 119703 229439 238997 94226 -124104 -345631 -502603 -469737 -187209 167601
37483 167601 287557 69727 -251028 -362859 -212876 -19791 12117 -89915 -150492 -75300
37473g5300J46971J24876R1237P5312K3811n8312o8347K7537R6619J0054j65041
37462B29417k56650k14933j25380l5559Q5597K11973K24252O3413j65314k90325
37452b73509k29960m3827J16915J18223k7501j46372q8445Q6999J94326J65750
37442a27401J00968Q0982O5643M958p0202j16635j35502j17401l3334P4543J00948
37431a72433L1770j8784Q969J7889p0481j48034o1673J43952K67143K10034P3365
37420B81717j0800k4266p764L9279J24872J73978P0761j72389l54988k91087o2203
37409b32890N1078o5177j97214j19485O4633R2595l8189q0339N1405J66986J59178
37398a47419J74617K81822K54099p3574m44731m74014j75442R5660J56485J48257
$$ plain form
37473 -75300 71671 196547 287784 363096 386907 328595 260248 287785 384404 394458 229417
37462 229417 -27233 -242166 -367546 -403105 -317508 -105535 118717 182130 16816 -273509
37452 -273509 -503469 -547296 -430381 -312158 -339659 -486031 -574476 -487477 -293151 -127401
37442 -127401 -26433 54549 120192 125150 54948 -61687 -197189 -314590 -347924 -273381 -172433
37431 -172433 -140663 -159447 -150478 -132589 -203070 -351104 -412777 -268825 -1682 208352 281717
37420 281717 270917 246651 238887 278166 403038 577016 647777 475388 120400 -170687 -232890
37409 -232890 -181812 -246989 -444203 -563688 -499055 -406460 -444649 -524988 -473583 -306597 -147419
37398 -147419 27198 309020 563119 489545 44814 -429200 -604642 -508982 -352497 -204240
37388b04240J84840J61313R68j54716j43936j3778P6545P1729L0612L296k524
37377A0109J5778M7930N4254P591o6912j15532r8911j5060Q5349J22248P2637
37366A19481J3396K2366O5813N4164k1802r4852j33720j57452j60969j27673r4098
37355e15346r0818m3948J28654L34770L81297K48857J24233J10882Q6627n2732
37345G12476j78823j21020M0189N9865j26457l16110l14380j53862J4234J31468
37335b52420K31981K88778J95970n5499k81703k84927r4584P7324J13015R3189
37325C1124J04225J04441O7350R0070K06570K37798L4414k40938l20847k44864
37315F9343k66002l69720k44005J78490M98028L74141K904j86176j03992J1133
$$ plain form
37388 -204240 -19400 141913 142881 -11835 -155771 -169549 -93004 -21275 9337 12633 10109
37377 10109 25887 73817 128071 135662 68750 -46782 -145693 -160753 -75404 46844 119481
37366 119481 132877 155243 221056 275220 253418 158566 24846 -132606 -293575 -421248 -515346
37355 -515346 -606164 -650112 -521458 -186688 194609 443466 567699 678581 765208 712476
37345 712476 533653 412633 452822 512687 386230 70120 -244260 -398122 -383888 -252420
37335 -252420 -20439 268339 464309 408810 127107 -157820 -252404 -175080 -62065 31124
37325 31124 135349 239790 307140 397210 603780 841578 875992 635054 314207 69343
37315 69343 -196659 -566379 -810384 -631894 -133866 240275 243179 57003 -46989 -35856
37305c5856L1169M4045P9247L5925q7365j42871p7451k4220p4554j29598p2863
37294d54392M3403Q9039M4360K298L0729J00247J24381M2843j05732j92074j26325
37283d01223K5285J17730J11526R1861J01404O7426n9209j92750k15721j27360
37273d81031j6332O1830J04129R9296L6480l6238l9103M4586J52602K20746K23297
37262C70262J48145R112j08279j06964k7034l9614k12010l65547k93913o6078
37252f91920N6564j833l2010J20730L12520L30363K04565J07788N9428m7283j87373
37241B31539k17180j43130j38342k42024k64772q5580J49675K42874J94764J18411
37231a53765N0911p149P467J20701K12851J60498J8058p2519p7146m2281M0522
$$ plain form
37305 -35856 -4687 39358 118605 154530 67165 -75706 -153157 -177377 -251931 -381529 -454392
37294 -454392 -410989 -321950 -277590 -275292 -244563 -144316 -19935 22908 -82824 -274898 -401223
37283 -401223 -375938 -258208 -146682 -54821 46583 114009 54800 -137950 -353671 -481031
37273 -481031 -497363 -435533 -331404 -232108 -195628 -231866 -270969 -226383 -73781 146965 370262
37262 370262 518407 527519 419240 312276 285242 245628 33618 -331929 -625842 -691920
37252 -691920 -635356 -637189 -669199 -548469 -235949 94414 298979 406767 466195 418912 231539
37241 231539 14359 -128771 -267113 -509137 -773909 -859489 -709814 -466940 -272176 -153765
37231 -153765 -102854 -110003 -102536 18165 231016 391514 409572 337053 259907 217626 258148
37220B58148J78247K49372J21615j18681k27991j13436O3529J13417K0609j11853
37210D32976k02939k28045j91273j11084j621J29614K31346K01526Q799k12977
37200E6322k83781j72725N879J55515K52575K68461J67869j176j23849j51646
37190A73444j38689j35066j26382r0938l9683J3058N5007N8355K6682L8661J50723
37179a4828K65681K10332l2978k68507l00877j37940N3290J34271R8917K6286
37169C3647k6639o8702j10521j02142j0426O4222j7327j92470k13671P503K38135
37158c98391K39873Q7991k295j5113o5215j09310j1027J57492J70428R973r7602
37147c3196l9400M8987N9383O9787J41531J82680J16191L04r7911j74222j83456
$$ plain form
37220 258148 436395 685767 807382 688701 460710 347274 410803 524220 544829 432976
37210 432976 230037 1992 -189281 -300365 -301986 -172372 58974 260500 269299 56322
37200 56322 -227459 -400184 -394305 -238790 13785 282246 450115 448939 325090 173444
37190 173444 34755 -100311 -226693 -317631 -357314 -344256 -289249 -230894 -204212 -165551 -14828
37179 -14828 250853 461185 428207 159700 -141177 -279117 -225827 -91556 7361 33647
37169 33647 7008 -61694 -172215 -274357 -284783 -220561 -237888 -430358 -644029 -636526 -398391
37158 -398391 -158518 -70527 -72822 -87935 -153150 -262460 -273487 -115995 54433 64406 -33196
37147 -33196 -72596 -23609 35774 105561 247092 429772 545963 546267 448356 274134 90678
37136I0678o5437P8178N9971q3160j08052L3636R9796k0385r9140L1364J69518
37125A86967P8360j23399j82473j15183r6662j16009n0552L9095m395j28078j25458
37114f37787N1233K69868M34232M89026L16433q7460m10767l18129P1085K92648
37104D70382J34813j51672k60362j66304n462J20946J38599J3171j50564j97353
37094e3806j41628j14379r6202N0811K63955K80713M6446j52544r6802O8891J04838
37083A60293K6011m948L6842N5519K0168l3063r2050j29892p3110P0916J57743
37072A94429R5249j2877k6828L2752O4569N2706K5493m6068j69978k43227j77888
37061b11668m0326N8160J19054J73641J48627j2546j72560j40568M2296J45041
$$ plain form
37136 90678 25241 103419 163390 80230 -27822 5814 105610 85225 -13915 17449 186967
37125 186967 265327 141928 -40545 -155728 -252390 -368399 -418951 -379856 -384251 -512329 -637787
37114 -637787 -586554 -316686 117546 606572 923005 835545 424778 106649 177734 470382
37104 470382 605195 453523 193161 26857 21395 142341 280940 294111 143547 -53806
37094 -53806 -195434 -309813 -406015 -355204 -91249 189464 235910 83366 -13436 55455 160293
37083 160293 186304 181356 218198 273717 293885 260822 168772 38880 -34230 36686 194429
37072 194429 289678 276801 249973 282725 347294 400000 425493 379425 209447 -33780 -211668
37061 -211668 -251994 -193834 -74780 98861 247488 234942 62382 -78186 -35890 109151
37051A09151P3958j7517K2851J42372J94090J44094Q8585J07437J53319R6242
37041A114582j03521k77611j96155J18125L34147J86776j77747l79894k73428
37032C45274n7683N2107N6255K6094o4134k27268l25301k13655L0221J71892J03909
37021a02289n5513j46773j25442r448J85831L67581L44623N1336k61397k56066
37011g557M6952K49193Q4128k35809l28763j40198P6327J59255J62866J30317
37001A96711K3355r6076p9516M1193M9233r5882j43383N5656K78749K55218N9170
36990E44428n1861k9023o559m678O4408J54588J18661k8021j10260o3726M357
36979E92314K4432K7141o628j40662l03243l26014k04950j13522j05491k9568
$$ plain form
37051 109151 183109 165592 188443 330815 524905 668999 757584 865021 1018340 1114582
37041 1114582 1011061 733450 537295 655420 989567 1176343 998596 618702 345274
37032 345274 287591 339698 395953 422047 357913 130645 -194656 -408311 -378090 -206198 -102289
37021 -102289 -157802 -304575 -430017 -439465 -253634 113947 458570 509906 248509 -7557
37011 -7557 39395 288588 372716 136907 -191856 -332054 -255727 -96472 66394 196711
37001 196711 220066 123990 44474 85667 134900 39018 -104365 -48709 230040 485258 544428
36990 544428 492567 463544 456985 452307 516715 671303 789964 761943 651683 587957 592314
36979 592314 616746 643887 637259 496597 193354 -132660 -337610 -451132 -556623 -586191
36969e86191J72524L09277K23864N1503J9905J21766J59585L6624j49310k53988
36959A05559k10533n0440J01437J03567l9857j47404q0483O6563J03318K0865
36949b7408J576J49674L25583L02571M1846k40992k97917j21273N0959K6205j18271
36938I2553j83039j40859j24363j53647r2848P4466J52674M2902n4923O3915K64996
36927e8173K55294J9752j66586j38076j6974L2856J6491J238k0306n5278l2176
36916a61938Q5024J91816J61461J2414j33568k11621k37333k06087q2944R4363
36906d88413K04213J91862J65452K52193L82525L36846N5640k11311j93424K6473
36896G22056J07219p3826k48714j63301M3473N9384j31073k45030j31064M9127
$$ plain form
36969 -586191 -413667 -104390 119474 170977 190882 312648 472233 508857 359547 105559
36959 105559 -104974 -155414 -53977 49590 9733 -137671 -218154 -151591 -48273 -27408
36949 -27408 -25832 123842 449425 751996 793842 552850 254933 133660 184619 210824 92553
36938 92553 -90486 -231345 -355708 -509355 -602203 -527737 -375063 -332161 -387084 -323169 -58173
36927 -58173 197121 216873 50287 -87789 -104763 -71907 -55416 -54178 -74484 -129762 -161938
36916 -161938 -76914 114902 276363 288777 155209 -56412 -293745 -499832 -582776 -488413
36906 -488413 -284200 -92338 73114 325307 707832 1044678 1100318 889007 695583 722056
36896 722056 829275 755449 506735 343434 386907 446291 315218 70188 -60876 -11749
36886a1749J01462L5034o2366j76959k71698k13200L4109K63592K57426Q1162
36876C6813l2489l0356o1380j71282k05570p8482O3366O2387k1648m8553l9423
36865e26617j02578j91396j39099O8034K39126K41972J54349Q8148K4992o5068
36855b08137q6959L8560J93127J94360N8504m1435m4944m6266p7808n5817K4269
36844e2546M2990k1816k7934P3432J10322l1204j80359j25737N7727J43983J08752
36833I7610J06759J65113J53934M4678m4061o8248r6968j10174J196J81756K01322
36822F32917o896k13078k06308m7992R8855J87034J97010M4231k39661m09804
36812C6308k99586o9102L8112M3843J10550J97417J23051q7424j96749r6086Q6735
$$ plain form
36886 -11749 89713 124747 62381 -114578 -386276 -599476 -565367 -301775 -44349 36813
36876 36813 4324 -26032 -87412 -258694 -464264 -542746 -479380 -416993 -438641 -487194 -526617
36865 -526617 -629195 -820591 -959690 -891656 -652530 -410558 -256209 -168061 -143069 -208137
36855 -208137 -295096 -256536 -63409 130951 189455 148020 103076 56810 -20998 -76815 -52546
36844 -52546 -9556 -31372 -59306 14126 124448 93244 -87115 -212852 -155125 -11142 97610
36833 97610 204369 369482 523416 568094 524033 455785 358817 248643 249839 431595 632917
36822 632917 626021 412943 206635 158643 257498 444532 641542 685773 446112 36308
36812 36308 -263278 -332380 -294268 -250425 -139875 57542 180593 93169 -103580 -199666 -112931
36801a12931K22813K92503K48079K0502k69478l39080r6345K06988K83338J30574
36791E86963m5996r8687k5322R5895J57991Q6620p7152k08530k35829j75768n2229
36780G956R7225J53993L0215j40700j18143R9242K39891J35854p0045j74635j62395
36769I8458j04119k6200Q92j24516k92433k06467J61757M13779K68734j154o19
36758A88112J69752J33508j02570j87505m8763K1889o9857o1287J47450K65249
36748D55978R7003j29357j55930p8216q0574r0676J3084J02329J6060j22823j15135
36737h8257m0397q8933j79263q2717J50799K29539O4900j20086j39982m1523P0561
36726b65359J55972J57011K6772j18936r2491P9021J64471O9032m7450m7929K012
$$ plain form
36801 -112931 109882 402385 650464 670966 401488 62408 -33937 173051 456389 586963
36791 586963 540967 442280 416958 512853 670844 757464 680312 471782 235953 60185 7956
36780 7956 105181 259174 289389 148689 30546 129788 369679 505533 435488 260853 98458
36769 98458 -5661 -31861 -30969 -155485 -447918 -654385 -492628 -78849 189885 188731 188112
36758 188112 357864 491372 388802 201297 152534 174423 104566 43279 190729 455978
36748 455978 552981 423624 267694 189478 108904 18228 31312 133641 149701 26878 -88257
36737 -88257 -128654 -217587 -396850 -479567 -328768 -99229 -34329 -154415 -294397 -335920 -265359
36726 -265359 -109387 47624 74396 -44540 -137031 -58010 106461 175493 128043 80114 82126
36715H2126J3083K4635P2835Q9145M2212J6196M1810K0120o8828o5009J08722
36704C77047K52487J54577p6464j58149l1043J00096P6807n7657j91552k50420
36694A95729j77137J6663J70112J15383p3833j42041j181J46693J04611o1885
36684B93114j67881j74714j75001k02226k01900j51246q0335O750J22055K18703
36674e12681K32299J90794J71899J48054N819k37705l72455k49017j872J06352
36664e18513J6935p8317j3766J52994K51637K03361O2242o9319j06196k1345J14304
36653e983J71683R8279k0158p6427p0880o1087l4683O6853K07645K46168J07165
36642F28575r7267j74738o6337Q2388P7769r9964k59233k16492k7743Q0478J6582
$$ plain form
36715 82126 95209 119844 192679 281824 324036 340232 382042 402162 333334 268325 377047
36704 377047 629534 784111 707647 549498 518455 618551 695358 637701 446149 195729
36694 195729 18592 35255 205367 320750 246917 104876 103695 250388 354999 293114
36684 293114 125233 -49481 -224482 -426708 -628608 -779854 -860189 -853439 -731384 -512681
36674 -512681 -280382 -89588 82311 230365 236184 -1521 -373976 -622993 -624865 -518513
36664 -518513 -501578 -579895 -593661 -440667 -189030 14331 76573 7254 -98942 -120287 -5983
36653 -5983 165700 263979 243821 167394 96514 35427 744 67597 275242 521410 628575
36642 628575 531308 356570 290233 372621 450390 350426 91193 -125299 -153042 -72564 -55982
36631e5982n8965J3068J45525J47197K1517n7311l3590l5443j22458j62656n2313
36620b51411R5951J08607r290j12698j20656o5056R898Q2983J21994J10166Q1452
36609E1940N4787j6726j38763j80604k6256K04788K48211L4872k03060k26478
36599a97289o6926P2070Q0599n304j32310k59815k91666j39857J11393K43459
36589e85646J72933O5465Q4959J41275M2583j68267k35337o7976J05175O0992
36579c83844j00860j16070P6216K93753L78071L25719J80934j6641j58540j20599
36569C58139M4099J08729m5420k60916l05324j50660L6137J08411N4510n1890
36559a04185j30900j46038j22490r3682k5717J30802K98230K97726Q6579j34920
$$ plain form
36631 -55982 -114947 -101879 43646 190843 212360 155049 121459 86016 -36442 -199098 -251411
36620 -251411 -155460 -46853 -56143 -168841 -289497 -354553 -344655 -261672 -139678 -29512 51940
36609 51940 106727 90001 -48762 -229366 -255622 -50834 197377 232249 29189 -197289
36599 -197289 -264215 -192145 -111546 -116850 -249160 -508975 -800641 -940498 -829105 -585646
36589 -585646 -412713 -347248 -262289 -121014 -78431 -246698 -482035 -550011 -444836 -383844
36579 -383844 -484704 -600774 -524558 -230805 147266 472985 653919 637278 478738 358139
36569 358139 402238 510967 465547 204631 -100693 -251353 -215216 -106805 -52295 -104185
36559 -104185 -235085 -381123 -503613 -597295 -623012 -492210 -193980 103746 190325 55405
36549E5405j55456j3994Q4490N8191K2400Q4894J86291J82829K6762j74860k68927
36538H8025k11042r6471k1183M3548J65819K83429K52275P2764q0903j05420r3164
36527B97677j39182j78180j25107l8701r667m393L7524N9457o602r1067j00490
36516b98731q1343j04417r1950M4845J90871J72459M8502K1847J06367J25376
36506A33826J8490r3245j39190j52823j02941O4800K13349J33609q4285j10496
36496a18906J15011K56471R8091j34903j61315n3023j6108k0503O5085J65491
36486A95391J27203J3648j4642J473o9853j41138k2615J95256K00631p1078l16445
36475I7831k86125q5076M9233O8067Q2306J44835J88112J28643k3515j34562n2429
$$ plain form
36549 55405 -100051 -114045 -29555 28636 51036 135930 322221 505050 531812 356952 88025
36538 88025 -123017 -219488 -240671 -197123 -31304 252125 504400 577164 496261 390841 297677
36527 297677 158495 -19685 -144792 -183493 -193160 -197553 -160029 -100572 -107174 -198241 -298731
36516 -298731 -380074 -484491 -576441 -531596 -340725 -168266 -119764 -97917 8450 133826
36506 133826 152316 59071 -80119 -232942 -335883 -271083 -57734 75875 -8410 -118906
36496 -118906 -3895 252576 350667 215764 54449 1426 -14682 -35185 29900 195391
36486 195391 322594 336242 321600 323073 253220 112082 89467 284723 485354 414276 97831
36475 97831 -188294 -273370 -224137 -156070 -73764 71071 259183 387826 364311 229749 177320
36464A77320J86290L11265J11538k58372m21531k29571Q0196J97262O2040j58308
36454E8129k85229k63055j66976j11599r6497K0740K99763N33775M62272J36549
36444E87872j25556j50609o3274q016L7602R2098N7118q4132j61190p1841L5456
36433A45528P798n7528j0003O2556o812j29254p5835J19347J73838O06j48171
36422H2070p3184Q4680R5668j4225n4695J4942N4060k4334j41623j71001o5526
36411b13168J20057K58633K30821N6541q4716n2384O8144P9557m8827j42672p6027
36400A95959O2116J03558K498j54650k51629j98131J6492K45567K63757L7636
36390C23173j71879j24257N5971M2487k09153l71841k03432J20375K65339J69417
$$ plain form
36464 177320 363610 674875 786413 528041 106510 -123061 -42865 154397 216437 58129
36454 58129 -227100 -490155 -657131 -768730 -865227 -844487 -544724 -10949 451323 587872
36444 587872 462316 311707 248433 240417 278019 370117 427235 343103 181913 110072 145528
36433 145528 153326 95798 85795 148351 141539 12285 -63550 55797 229635 230241 82070
36422 82070 8886 93566 189234 175009 120314 135256 189316 164982 23359 -147642 -213168
36411 -213168 -93111 165522 396343 452884 368168 315784 383928 463485 414658 271986 195959
36400 195959 258075 361633 364131 209481 -42148 -240279 -223787 21780 285537 323173
36390 323173 151294 27037 83008 125495 -83658 -455499 -658931 -538556 -273217 -103800
36380a03800L7086N262J4349j4295n1612m2760O620O1954R2625N6840o2597j90152
36368a90480k07670j00229J7003M5077J2360P865N5577R4805O0981l7205j13270
36357c55186q4245K2993P1000l9664k35032l25263j94440R1352L42921L92743
36347c12821K26903J1434o2087O397L5664o4251j46814n9063J06141J54821R5697
36336g979Q7115J32785Q1018o2328q6319P4208J82350L8627k16018l09753k05712
36325b92006p4259r014L2475O3206L3074m2857p1675j7413N6597R4337J13173
36314a14362J47153J80249J51438J4655j82267k83810j69025P2749K07939J42765
36304A67484K7880J9619P4674Q4567O9997Q3846M2351j39527l14131k38498M9233
$$ plain form
36380 -103800 -66714 -61452 -47103 -61398 -113010 -155770 -149150 -87196 5429 62269 -328 -190480
36368 -190480 -398150 -498379 -481376 -436299 -423939 -416074 -360497 -265692 -204711 -241916 -355186
36357 -355186 -439431 -416438 -345438 -385102 -620134 -945397 -1139837 -1048485 -705564 -312821
36347 -312821 -85918 -74484 -136571 -130174 -94510 -158761 -305575 -364638 -258497 -103676 -7979
36336 -7979 79136 211921 292939 230611 144292 218500 400850 439477 223459 -86294 -292006
36325 -292006 -366265 -375279 -342804 -279598 -246524 -289381 -361056 -378469 -321872 -227535 -114362
36314 -114362 32791 213040 364478 379133 196866 -86944 -255969 -183220 24719 167484
36304 167484 195364 214983 289657 374224 444221 528067 570418 430891 116760 -121738 -72505
36293g2505K11890M2754k58454l45135j46021R1583J31657J1436n2257L7818J33478
36282b13756N7619j19873j54463K4200K04763K05094J13422Q6460P8396k6433
36272B55429j42255r5997N6269R1247k1285q0791J610P7724L4117n1382j04261
36261B0425j74590k60910k32508n9588P4746L9323m4399k1919M3436K2288k3253
36250f16949N2270K01023K22005M5670j81383k76805j76703M2522J97995J30636
36240c59719r2848j99631m6150J81241K40860J72141J57559J74184N2615j72660
36230A07592k62134j38190J2945N9886R2132J74178J77708J3311j60213j41845
36220f4630J9952J15857P4969J3876L0644R1111J12378O2612j8371m3777M0037
$$ plain form
36293 -72505 139385 182139 -76315 -421450 -567471 -475888 -344231 -332795 -385052 -347234 -213756
36282 -213756 -156137 -276010 -430473 -406273 -201510 3584 117006 203466 281862 255429
36272 255429 113174 17177 73446 164693 143408 62617 64227 141951 176068 124686 20425
36261 20425 -154165 -415075 -647583 -707171 -632425 -593102 -637501 -659420 -615984 -593696 -616949
36250 -616949 -564679 -363656 -141651 -95981 -277364 -554169 -730872 -688350 -490355 -359719
36240 -359719 -452567 -652198 -698348 -517107 -276247 -104106 53453 227637 280252 107592
36230 107592 -154542 -292732 -279787 -219901 -127769 46409 224117 237428 77215 -64630
36220 -64630 -44678 71179 146148 160024 190668 281779 394157 456769 438398 394621 434658
36209D34658J52426J25323p7826k63777k30832l3536Q8964J5494j48180k51230
36199a88516k56802j92798o7767R0155J89524J61094N8693K672K8820N4620Q486
36188a11819o1625n2148M6485J21676P9550k7877o3611J7917J08794Q2663m5265
36177I4740j32695p8651N6222J15336K0848j40524k13791j36142K0219J41937
36167b52501J66799R7330q495n0945K7707J42669J35464j0155j23637r5877m9688
36156b1329j25559k13038j10928J02194J25739r9294k54901r9557J75835K36927
36146b83911P4278n3004l2778K409l2714l7807O1899J58811J17570l1142j41506
36135a97895j25428j0663J17997J83673J60458Q4832M353p7601j64976k03389
$$ plain form
36209 434658 587084 712407 634581 370804 139972 106436 195400 210894 62714 -188516
36199 -188516 -445318 -638116 -705883 -615728 -426204 -265110 -206417 -203745 -174925 -120305 -111819
36188 -111819 -173444 -225592 -179107 -57431 22119 -5758 -69369 -51452 57342 140005 94740
36177 94740 -37955 -116606 -60384 54952 75800 -64724 -278515 -414657 -394438 -252501
36167 -252501 -85702 11628 3133 -47812 -20105 122564 258028 247873 124236 28359 -21329
36156 -21329 -146888 -359926 -470854 -368660 -242921 -342215 -597116 -696673 -520838 -283911
36146 -283911 -209633 -262637 -295415 -293006 -325720 -363527 -301628 -142817 -25247 -56389 -197895
36135 -197895 -323323 -333986 -215989 -32316 128142 212974 217327 139726 -25250 -228639
36125b28639j29292K1154J36009J65542J51580J12414K918j71180k93542k58233
36115d91269r3920Q4337J98586K39396K24611J80752J37278J00658N2855r834
36105F23450o8088j15323j57255j72552j32457o6637m0127n1115k9733M0102Q5877
36094h3858O8655M7274O9109Q6726M6805k3841q8933j65825k34280j85551J5433
36083d48286K01447J86603K7731n5258P534P3033L9981j4840j1897j4413q9338
36072i7703j43692m2624J62278K60177J44625m9905j16419k1823P6185M9910k6775
36061A94234J5136J86936K94269J86209l8455j70795j74533j91359k79087l05293
36051b82738j58420O4907J80424J43679O0244K2057K9471M6505M3533l923q0084
$$ plain form
36125 -228639 -357931 -336777 -200768 -35226 116354 228768 231686 60506 -233036 -491269
36115 -491269 -585189 -500852 -302266 -62870 161741 342493 479771 580429 633284 623450
36105 623450 555362 440039 282784 110232 -22225 -88862 -128989 -180104 -209837 -169735 -83858
36094 -83858 -15203 32071 101180 187906 234711 210870 121937 -43888 -278168 -463719 -448286
36083 -448286 -246839 -60236 -32505 -87763 -80229 -7196 32785 17945 6048 -8365 -97703
36072 -97703 -241395 -284019 -121741 138436 283061 233156 116737 94914 171099 221009 194234
36061 194234 209370 396306 690575 876784 838329 667534 493001 301642 22555 -282738
36051 -282738 -441158 -376251 -195827 -52148 8096 30153 59624 106129 149662 145739 65655
36040F5655r9245M176J44808J38610n9552k42371j70588J10088K80654J24643
36030B96878j92717l17081j33392J25266K03500J12869K4616Q145J1757J7132
36020A56973M7221N5539k4320j19701p9304P6340J33365j8429k20656k73520j90595
36009d57087j05599m3239N9460J72337J81644P5139j6630P434R2600J07342L150
35998G6551j26603j40972j7040R4804M5080r4869j03271P2249K13844J41827k3422
35987A38178n5780L6125N1238q2708k22843k30987j15221M0662J39652Q3378j13171
35976c31477k34572q0645K25580L49165J92998J4120J8700P6646j3772j77353
35966C9390j86381j7395J23761Q7855o9810k03359k08796o5898J38355K46828
$$ plain form
36040 65655 -33590 -29414 115394 254004 194452 -47919 -218507 -108419 172235 296878
36030 296878 104161 -212920 -346312 -221046 -17546 95323 119939 128084 139841 156973
36020 156973 204194 259733 235413 115712 36408 112748 246113 227684 7028 -266492 -457087
36009 -457087 -562686 -605925 -546465 -374128 -192484 -117345 -133975 -126541 -33941 73401 76551
35998 76551 -50052 -191024 -208064 -113260 -68180 -163049 -266320 -194071 19773 161600 138178
35987 138178 82398 118523 169761 87053 -135790 -366777 -481998 -441336 -301684 -218306 -331477
35976 -331477 -566049 -646694 -421114 -71949 121049 135169 153869 230515 216743 39390
35966 39390 -146991 -164386 -40625 47230 -22580 -225939 -434735 -500633 -362278 -115450
35956a15450J88198O9580K8538M0628j6005j43062k01814j12512M2173J38381
35946h1345J44954J01931L5408n5857j52247j88231j02577O4587J58726P3101
35936a550q7733j23131k7343k871j20504j67931Q938K06112J48238o1242q8411
35925c17428Q7910J33103r5481l06776k33056k6529K7456m3562j9036J07878J50372
35914e35149Q0770O0655J21099R8163n0607j21976J8340K02666K04337O2406k1631
35903A19073j0682m2262j38199j24844Q1237K72871J86316j27530l20043j60429
35893b64492J77163L20012J31179j63948k76841j71106k7691J4635j9439m5542
35883c26070l0415K0101R3586J50507J38934P4489M4066P7827Q1474k6175j58271
$$ plain form
35956 -115450 72748 142328 170866 211494 195489 52427 -149387 -261899 -219726 -81345
35946 -81345 63609 165540 200948 145091 -7156 -195387 -297964 -233377 -74651 -1550
35936 -1550 -89283 -212414 -239757 -242628 -363132 -531063 -522125 -316013 -167775 -229017 -317428
35925 -317428 -229518 -96415 -191896 -498672 -731728 -758257 -730801 -774363 -793399 -685521 -535149
35914 -535149 -454379 -393724 -272625 -174462 -225069 -347045 -328705 -126039 78298 140704 119073
35903 119073 108391 66129 -72070 -196914 -115677 157194 343510 215980 -104063 -264492
35893 -264492 -87329 232683 363862 199914 -76927 -248033 -275724 -261089 -280528 -326070
35883 -326070 -356485 -336384 -242798 -92291 46643 121132 165198 243025 324499 298324 140053
35872A40053j48172J9410J73340J73874O8465j4997m1764o0764q3815p2157k5853
35861A27620P79j7450m3996m6908l9828l3843l122O0780R9209M7631n8412r0056
35849B404L0574K10113K53327Q2257j38463j55682P6609L15540K91135M414k99209
35838F73019m12415l28676j45846N8151K06047J97363J5300j89063k24027o8860
35828b19007J11490J65250J04099M0682L3681L7050j5683j15523j83490j63866
35818b05317q6504j8230K2839O0178P8870K3536r8284j74383j04756O9472J99515
35807b33064J76214K1638j35814j57129j0820J71061K05050O3270r2496j32265
35797a24355j25577j88038k40020q8406K50137M81129L71495M4529j70845j24025
$$ plain form
35872 140053 -8119 11291 184631 358505 426970 411973 370209 309445 225630 153473 127620
35861 127620 128399 110949 66953 20045 -19783 -53626 -56748 4032 103241 150872 92460 2404
35849 2404 32978 243091 496418 578675 440212 284530 361139 676679 967814 972228 673019
35838 673019 260604 -68072 -213918 -155767 50280 247643 262943 73880 -150147 -219007
35828 -219007 -107517 57733 161832 202514 236195 273245 257562 142039 -41451 -205317
35818 -205317 -291821 -310051 -287212 -227034 -148164 -124628 -222912 -397295 -502051 -432579 -233064
35807 -233064 -56850 -35212 -171026 -328155 -338975 -167914 37136 100406 7910 -124355
35797 -124355 -249932 -437970 -677990 -766396 -516259 -35130 336365 380894 210049 86024
$$ [...]
##END NTUPLES=NMR SPECTRUM
##END=
