##TITLE=31Pdec_DE-83H
 D2O, 64 sc
 14.3.2025
##JCAMPDX= 6.0         $$ Bruker NMR JCAMP-DX V2.0
##DATA TYPE= NMR SPECTRUM
##DATA CLASS= NTUPLES
##ORIGIN= UXNMR, Bruker Analytische Messtechnik GmbH
##OWNER= root
$$ XWIN-NMR		Version 3.5
$$ Fri Mar 14 16:08:44 2025 Russian Standard Time (UT+4h)  she@DPX200
##.OBSERVE FREQUENCY= 81.013821
##.OBSERVE NUCLEUS= ^31P
##.ACQUISITION MODE= SIMULTANEOUS
##.ACQUISITION SCHEME= undefined
##.AVERAGES= 64
##.DIGITISER RES= 17
##SPECTROMETER/DATA SYSTEM= spect
##.PULSE SEQUENCE= zgpg30
##.SOLVENT NAME= D2O
##.SHIFT REFERENCE= (INTERNAL, D2O, 0, 198.062)
##AUDIT TRAIL= $$ (NUMBER, WHEN, WHO, WHERE, WHAT)
$$ ##TITLE= Audit trail, XWIN-NMR		Version 3.5
$$ ##JCAMPDX= 5.01
$$ ##ORIGIN= Bruker BioSpin GmbH
$$ ##OWNER= she
$$ F:/spectra/data/she/nmr/P31/2/pdata/1/auditp.txt
$$ ##AUDIT TRAIL=  $$ (NUMBER, WHEN, WHO, WHERE, WHAT)
(   1,<2025-03-14 16:07:32.09 +0400>,<she>,<DPX200>,
      <created by zg, POWCHK disabled, PULCHK disabled
       configuration hash MD5:
       00 E9 B6 7A A2 85 ED C7 34 08 36 98 17 FE 4E 26
       data hash MD5: 32K
       DE B0 42 19 78 1A 1F E8 82 9E A3 FB EF 8D 64 84>)
(   2,<2025-03-14 16:07:34.54 +0400>,<she>,<DPX200>,
      <Start of raw data processing
       efp BC_mod = 2 LB = 1.5 FT_mod = 6 PKNL = 1 PHC0 = 1817.73 PHC1 = -95.3056 SI = 64K 
       data hash MD5: 64K
       2A 9B 82 09 68 AC 41 88 14 26 F1 F9 19 6B E2 A4>)
(   3,<2025-03-14 16:07:57.76 +0400>,<she>,<DPX200>,
      <pk PHC0 = -44.64689 PHC1 = 106.3998 
       data hash MD5: 64K
       22 13 58 9E C4 3B C6 A3 01 82 A4 72 7C 34 1D E0>)
(   4,<2025-03-14 16:08:02.64 +0400>,<she>,<DPX200>,
      <abs ABSG = 5 
       data hash MD5: 64K
       58 7A 94 E1 44 00 F8 56 AB DA F1 04 8C 77 06 D7>)
$$ ##END=
$$ 
$$ hash MD5
$$ FA AA 65 F1 FE 07 1A C4 B4 FD BD DE 6A 2F A1 E6
##$RELAX= 
##$RELAX= 
##$RELAX= 
##$RELAX= 
##$RELAX= 
##$RELAX= 
##$RELAX= 
##$RELAX= 
$$ Bruker specific parameters
$$ --------------------------
##$DU= <F:/spectra>
##$EXPNO= 2
##$NAME= <P31>
##$PROCNO= 1
##$TYPE= <nmr>
##$USER= <she>
##$AMP= (0..31)
100 100 100 100 100 100 100 100 100 100 100 100 100 100 100 100 100 100 
100 100 100 100 100 100 100 100 100 100 100 100 100 100 
##$AQSEQ= 0
##$AQ_mod= 1
##$AUNM= <au_zg>
##$AUTOPOS= <>
##$BF1= 81.014009
##$BF2= 200.13
##$BF3= 200.13
##$BF4= 200.13
##$BF5= 200.13
##$BF6= 200.13
##$BF7= 200.13
##$BF8= 200.13
##$BYTORDA= 1
##$CFDGTYP= 0
##$CFRGTYP= 5
##$CHEMSTR= <none>
##$CNST= (0..31)
1 1 145 1 1 1 1 1 1 1 1 1 1 1 1 1 1 1 1 1 1 1 1 1 1 1 1 1 1 1 1 1 
##$CPDPRG= <waltz16>
##$CPDPRG1= <>
##$CPDPRG2= <waltz16>
##$CPDPRG3= <>
##$CPDPRG4= <mlev>
##$CPDPRG5= <mlev>
##$CPDPRG6= <mlev>
##$CPDPRG7= <mlev>
##$CPDPRG8= <mlev>
##$CPDPRGB= <>
##$CPDPRGT= <>
##$D= (0..31)
0 1 0 0 0 0 0 0 0 0.06 0 0.03 2e-05 3e-06 0 0 0.0002 0 0 0 0 0 0 0 0 0 
0 0 0 0 0 0 
##$DATE= 1741954051
##$DBL= (0..7)
120 120 120 11 120 120 24 19 
##$DBP= (0..7)
150 150 150 150 150 150 150 150 
##$DBP07= 0
##$DBPNAM0= <>
##$DBPNAM1= <>
##$DBPNAM2= <>
$$ [...]
##$SUBNAM3= <"">
##$SUBNAM4= <"">
##$SUBNAM5= <"">
##$SUBNAM6= <"">
##$SUBNAM7= <"">
##$SUBNAM8= <"">
##$SUBNAM9= <"">
##$SW= 400.765351723535
##$SWIBOX= (0..15)
0 1 3 0 0 0 0 0 0 0 0 0 0 0 0 0 
##$SW_h= 32467.5324675325
##$TD= 32768
##$TD0= 1
##$TE= 0
##$TE2= 300
##$TE3= 300
##$TEG= 300
##$TL= (0..7)
0 120 53 12 22 120 120 120 
##$TP= (0..7)
150 150 150 150 150 150 150 150 
##$TP07= 0
##$TPNAME0= <>
##$TPNAME1= <>
##$TPNAME2= <>
##$TPNAME3= <>
##$TPNAME4= <>
##$TPNAME5= <>
##$TPNAME6= <>
##$TPNAME7= <>
##$TPOAL= (0..7)
0.5 0.5 0.5 0.5 0.5 0.5 0.5 0.5 
##$TPOFFS= (0..7)
0 0 0 0 0 0 0 0 
##$TUNHIN= 0
##$TUNHOUT= 0
##$TUNXOUT= 0
##$USERA1= <user>
##$USERA2= <user>
##$USERA3= <user>
##$USERA4= <user>
##$USERA5= <user>
##$V9= 5
##$VALIST= <valist>
##$VCLIST= <CCCCCCCCCCCCCCC>
##$VD= 0
##$VDLIST= <DDDDDDDDDDDDDDD>
##$VPLIST= <PPPPPPPPPPPPPPP>
##$VTLIST= <TTTTTTTTTTTTTTT>
##$WBST= 1024
##$WBSW= 4
##$XGAIN= (0..3)
0 0 0 0 
##$XL= 0
##$YL= 0
##$YMAX_a= 34446
##$YMIN_a= -35976
##$ZGOPTNS= <>
##$ZL1= 120
##$ZL2= 120
##$ZL3= 120
##$ZL4= 120
##$ABSF1= 198.0616
##$ABSF2= -202.7028
##$ABSG= 5
##$ABSL= 3
##$ALPHA= 0
##$AQORDER= 0
##$ASSFAC= 0
##$ASSFACI= 0
##$ASSFACX= 0
##$ASSWID= 0
##$AUNMP= <proc_1d>
##$AZFE= 0.1
##$AZFW= 0.5
##$BCFW= 0
##$BC_mod= 2
##$BYTORDP= 0
##$COROFFS= 0
##$CY= -3
##$DATMOD= 1
##$DC= 0
##$DFILT= <>
##$DTYPP= 0
##$F1P= 0
##$F2P= 0
##$FCOR= 1
##$FTSIZE= 65536
##$FT_mod= 6
##$GAMMA= 0
##$GB= 0
##$INTBC= 1
##$INTSCL= 9.790993e-09
##$ISEN= 30
##$LB= 1.5
##$LEV0= 0
##$LPBIN= 0
##$MAXI= 10000
##$MC2= 0
##$MEAN= 0
##$ME_mod= 0
##$MI= 50
##$NCOEF= 0
##$NC_proc= -4
##$NLEV= 6
##$NOISF1= 182.463
##$NOISF2= 159.3651
##$NSP= 0
##$NTH_PI= 0
##$NZP= 0
##$OFFSET= 198.0616
##$PC= 4
##$PHC0= 1773.083
##$PHC1= 11.0942
##$PH_mod= 1
##$PKNL= yes
##$PPARMOD= 0
##$PSCAL= 0
##$PSIGN= 0
##$REVERSE= no
##$SF= 81.0140089999434
##$SI= 65536
##$SIGF1= 159.3651
##$SIGF2= -187.1042
##$SINO= 113.3802
##$SIOLD= 16384
##$SREGLST= <1H.CDCl3>
##$SSB= 0
##$STSI= 65536
##$STSR= 0
##$SW_p= 32467.5324675325
##$SYMM= 0
##$S_DEV= 0
##$TDeff= 32768
##$TDoff= 0
##$TI= <>
##$TILT= no
##$TM1= 0
##$TM2= 0
##$TOPLEV= 0
##$USERP1= <user>
##$USERP2= <user>
##$USERP3= <user>
##$USERP4= <user>
##$USERP5= <user>
##$WDW= 1
##$XDIM= 65536
##$YMAX_p= 351026463
##$YMIN_p= -17070360
$$ End of Bruker specific parameters
$$ ---------------------------------
##NTUPLES= NMR SPECTRUM
##VAR_NAME=  FREQUENCY,     SPECTRUM/REAL,   SPECTRUM/IMAG
##SYMBOL=    X,             R,               I
##VAR_TYPE=  INDEPENDENT,   DEPENDENT,       DEPENDENT
##VAR_FORM=  AFFN,          ASDF,            ASDF
##VAR_DIM=   65536,         65536,           65536
##UNITS=     HZ,            ARBITRARY UNITS, ARBITRARY UNITS
##FACTOR=    0.49542278885378, 1,            1
##FIRST=     16045.7642231865, 0,            0
##LAST=      -16421.768244346, 0,            0
##MIN=       -16421.768244346, -17070360,    0
##MAX=       16045.7642231865, 351026463,    0
$$ Real data points
##PAGE= N=1
##DATA TABLE= (X++(R..R)), XYDATA
$$ [...]
44487 374630 336460 153759 -53740 -239593 -474274 -802747 -1114880 -1254165 -1209392 -1073772
44477 -1073772 -858713 -526159 -196088 -93680 -218924 -289069 -137713 34382 -13000 -168195
44467 -168195 -154087 18299 76423 -70307 -204290 -153975 -14429 70775 120664 188323 211362
44456 211362 140377 75662 124108 224228 253163 217157 198209 195006 165549 160059 248870 357505
44444 357505 338776 200305 104566 128744 170094 126372 41703 17490 77678 176544 259963
44433 259963 274085 186930 41049 -82201 -173593 -285740 -386207 -335555 -84571 199892
44423 199892 303243 202492 52537 -20877 -24631 -15240 8546 116980 369644 697700 869851
44412 869851 669404 157101 -328734 -504177 -389275 -159800 114807 430507 651389 589749
44402 589749 294910 62733 92927 281488 409440 393745 275658 98266 -92320 -219361
44392 -219361 -260670 -297261 -384876 -440581 -354586 -165249 -23930 -13511 -82931 -136381 -115789
44381 -115789 -21725 78791 88819 -14955 -142877 -204080 -205948 -179924 -78789 142952 384314
44370 384314 459721 319218 116324 33519 98853 183070 131905 -90184 -346056 -444415 -357964
44359 -357964 -267195 -315630 -396001 -300338 -27120 216896 302779 298854 288150 243990 156966
44348 156966 134199 261332 454069 537673 417421 124215 -228581 -491013 -576959 -570096
44338 -570096 -627749 -735022 -694381 -438434 -191737 -180584 -317761 -353935 -236106 -106104
44328 -106104 -13496 125018 282600 282407 68020 -184444 -315613 -372200 -436170 -426046 -233938
44317 -233938 37544 158425 71363 -37766 12343 186914 307451 263901 108748 -30291
44307 -30291 -94795 -143288 -251822 -386272 -423493 -313781 -162830 -105829 -146015 -180144 -152305
44296 -152305 -104980 -79714 -40518 75631 272652 484091 627257 662419 621921 579612 560852
44285 560852 487745 261772 -87788 -391800 -512694 -486915 -450640 -459775 -453902 -387993 -311604
44274 -311604 -279394 -251597 -152097 9131 145267 211467 239619 253506 234634 198036 211535
44263 211535 281181 300066 201504 98085 145625 299913 354110 235234 116191 164129 301884
44252 301884 327039 181712 -19059 -171308 -258425 -267243 -174970 -46440 -15806 -108693 -178112
44241 -178112 -93007 80525 169293 112691 -812 -90471 -173721 -283271 -379340 -396938 -337471
44230 -337471 -257857 -179019 -53108 158175 395394 527217 480610 330816 238983 302759
44220 302759 484891 672305 762209 696113 482263 225137 73724 70998 80967 -69574 -389831
44209 -389831 -719856 -901164 -881511 -679986 -363177 -71891 47534 -1443 -67257 -63673
44199 -63673 -81307 -204338 -327035 -294268 -153066 -89943 -140101 -148485 -52008 -7812 -138804
44188 -138804 -305308 -278102 -46083 198099 320447 340905 299089 193183 73499 45901
44178 45901 120785 173175 124002 65887 127250 288961 425664 464646 401617 212888 -112382
44167 -112382 -455520 -619285 -548600 -409848 -388119 -471566 -503264 -395763 -217402 -93281
44157 -93281 -96197 -222858 -395960 -474303 -335780 1369 374963 633093 768013 872199
44147 872199 1000123 1122146 1191373 1192248 1119165 968092 775771 616084 514140 404412
44137 404412 235446 88442 100432 253539 337111 188413 -93460 -262923 -214363 -46800
44127 -46800 129136 298599 427689 406993 220113 47573 58020 175295 206968 136105
44117 136105 92708 70724 -86597 -376716 -554196 -475148 -321380 -320921 -419211 -427069 -352326
44106 -352326 -340346 -373955 -303802 -152545 -112322 -201032 -186705 44722 277572 269996 89290
44095 89290 -20811 33930 180043 368795 586027 731585 692283 533116 445697 482083
44085 482083 485299 329142 103480 -6341 63881 230986 385482 452472 367456 98467
44075 98467 -266533 -518930 -503942 -305060 -179913 -268531 -432852 -458211 -341904 -253491
44065 -253491 -250759 -211573 -69786 64229 96709 101372 167329 238669 234633 198785 180346 92270
44053 92270 -133412 -355611 -394421 -308301 -276996 -275663 -131607 117789 226270 151335 165994
44042 165994 426570 693270 676031 449884 289916 238613 105566 -159753 -355619 -322164
44032 -322164 -151869 -32397 -11956 -6909 37226 81918 72887 21296 -11414 7275 48383
44021 48383 86145 158352 300316 433350 406587 173856 -142751 -387809 -493090 -445422
44011 -445422 -248947 10989 162635 106152 -74027 -229213 -319768 -388524 -421702 -341369
44001 -341369 -118032 184442 460458 613587 603367 498360 425763 404904 304945 54908
43991 54908 -189142 -220173 -70198 29835 -36087 -155725 -211878 -259235 -396077 -570028
43981 -570028 -619525 -463944 -169872 150708 433946 645078 726263 625804 387386 153330
43971 153330 21835 -64936 -205188 -333788 -273290 -21125 175267 134491 -6301 -3486
43961 -3486 141893 236005 224739 252746 393394 526364 527472 411021 234161 15536 -194608
43950 -194608 -309144 -328237 -328739 -278280 -28940 415087 794876 897672 824070 804366 865051
43939 865051 850726 691736 460598 208546 -60508 -257802 -240233 -22108 187054 219481
43929 219481 117005 9484 -64703 -134724 -178820 -144459 -69260 -86251 -272241 -529985 -663035
43918 -663035 -570543 -340072 -127458 23138 180602 364270 487761 516322 571911 760090
43908 760090 953993 910836 608131 305334 212283 238380 178685 35350 -8739 106048
43898 106048 214320 165040 23535 -47144 -11596 33563 25042 -10727 -53365 -133231 -256791
43887 -256791 -371859 -446069 -512898 -593629 -630900 -558242 -400010 -251605 -189997 -243780 -405008
43876 -405008 -608092 -734180 -713206 -606395 -522400 -473085 -389287 -264568 -190614 -235779 -364582
43865 -364582 -496798 -580917 -592733 -524400 -395119 -227367 -21568 182238 248188 69317
43855 69317 -240693 -410795 -318960 -124301 -34650 -58216 -70733 -17609 72911 200727 380969
43844 380969 554569 634406 631648 636452 677726 692154 634688 540454 468719 448077 478492 529884
43832 529884 539537 463978 334999 228401 191148 225682 301275 336009 230640 -37 -180909
43821 -180909 -157487 14251 159576 227482 313898 456841 549910 486553 273860 -23609
43811 -23609 -333772 -535115 -497632 -244765 20729 129493 109730 86688 122186 231260
43801 231260 439454 690694 785404 583340 243099 89958 223593 411426 424554 326413
43791 326413 313517 382415 326032 45048 -286201 -411191 -255443 48612 319586 440080
43781 440080 372957 165957 -57143 -174260 -151891 -36257 113463 240805 282782 224429
43771 224429 144530 122723 113960 14867 -149941 -232910 -178229 -96561 -74329 -50829 28926
43760 28926 78096 6244 -125088 -222288 -323172 -481243 -595391 -553689 -461582 -494418 -578538
43749 -578538 -490186 -267070 -221168 -469659 -743751 -799984 -750400 -782785 -789346 -552655 -160981
43738 -160981 53918 -54065 -323815 -570134 -751690 -847314 -800356 -657466 -577574 -612268
43728 -612268 -620945 -493454 -328503 -283152 -343749 -368095 -299050 -220068 -215120 -268096 -312820
43717 -312820 -320160 -313042 -325029 -358654 -374985 -326502 -209382 -76623 9577 32692 23972 16195
43705 16195 106 -71396 -225658 -412978 -531239 -535915 -512855 -599299 -816731 -1010815 -992028
43694 -992028 -739869 -441844 -305571 -343939 -387398 -314325 -205369 -219750 -372794 -520516
43684 -520516 -536825 -409323 -175342 113521 344843 395563 286066 172415 126564 50858
43674 50858 -107125 -202012 -96980 92339 138670 16242 -109309 -151205 -159700 -134655 -6317
43663 -6317 166111 195446 40745 -116490 -168784 -260583 -521514 -788386 -795946 -553754 -332498
43652 -332498 -311283 -417028 -503855 -515222 -433849 -227497 69926 316489 388019 305096 181909
43641 181909 86733 6688 -71905 -111143 -75744 -19034 -74463 -327416 -696574 -975623 -1005460
43630 -1005460 -784418 -421547 -48970 202208 236500 93893 -35756 -947 124652 140873
43620 140873 3735 -101408 -4812 229584 399629 406173 312580 208262 118220 54683 66896
43609 66896 184714 345715 420829 312063 24006 -333897 -609391 -718347 -730665 -809262
43599 -809262 -1008276 -1156668 -1024594 -621118 -247103 -197275 -454432 -732352 -785637 -616759
43589 -616759 -402755 -291563 -279985 -247143 -99102 104088 195136 102680 -48934 -105863
43579 -105863 -82433 -84001 -94135 -8515 126138 104505 -142985 -425182 -554947 -568513 -552653
43568 -552653 -431321 -126850 198673 314834 271419 314126 468118 486532 268690 54401
43558 54401 70670 214743 262866 209013 191243 220528 208795 178700 217367 269135 199745
43547 199745 50339 1192 69413 78029 -17762 -14789 206121 443972 449041 271500 139151
43536 139151 106212 53357 -28349 -8643 112344 144244 4359 -111020 16637 321151
43526 321151 534871 507617 325850 160719 106194 148264 205502 203182 162913 194614 342469
43515 342469 478152 428119 183465 -100950 -296543 -390634 -393780 -287663 -119503 -41840
43505 -41840 -156122 -358721 -434295 -295962 -60591 121325 237664 372989 541304 634290
43495 634290 547499 305116 28545 -176379 -258629 -201363 -49267 69266 60630 11675 86097
43484 86097 244254 233428 -43534 -317170 -281041 -4607 198128 216244 190254 154676 -46281
43473 -46281 -418954 -697892 -708890 -603241 -556169 -471967 -224301 10204 -44329 -335340
43463 -335340 -546019 -529888 -412254 -301634 -193642 -166631 -360375 -671893 -750544 -448645
43453 -448645 -69378 240 -250610 -521122 -595325 -505068 -378398 -290280 -246379 -207551 -128894
43442 -128894 -12908 108883 247161 414373 505517 367452 47943 -179400 -147097 -21087
43432 -21087 -72203 -332021 -607836 -738744 -695329 -516726 -305195 -215113 -294248 -388274 -337599
43421 -337599 -200046 -134041 -144917 -125693 -77531 -84469 -119452 -98689 -97643 -263433 -508315
43410 -508315 -561998 -388140 -277094 -406331 -559877 -462148 -190099 -39437 -114194 -266293
43400 -266293 -370886 -462991 -614694 -819179 -999496 -1055469 -939021 -744201 -646869 -680535
43390 -680535 -669710 -482385 -237540 -130355 -155664 -168879 -138123 -144535 -178516 -137272 -21410
43379 -21410 53269 61261 112797 255828 389992 429528 408322 361063 234476 -2841 -271118
43368 -271118 -480685 -632223 -742792 -761957 -650940 -481099 -366757 -337870 -341155 -323667
43358 -323667 -251344 -82407 202123 537996 786089 817091 604317 259636 -37968 -191763
43348 -191763 -252071 -295558 -293009 -186277 -50760 -43353 -186880 -341087 -404532 -401917 -340337
43337 -340337 -147582 163016 411683 444940 302671 106948 -93780 -273438 -356864 -327095
43327 -327095 -284733 -270328 -160971 96192 290426 209082 -10977 -52711 111992 201495
43317 201495 81263 -39449 52700 281402 448458 500085 486731 412220 273132 141506
43307 141506 75363 26594 -55811 -114131 -80143 -10023 -13122 -102556 -209251 -288077 -321198
43296 -321198 -271027 -122987 60415 198595 269132 282482 252614 245370 359381 575751 721752
43285 721752 687615 588482 585697 629049 531302 252075 -50375 -233102 -286501 -240396 -99372
43274 -99372 92800 233520 252123 172025 96470 181466 541009 1052007 1325204 1063602
43264 1063602 444356 -46886 -184092 -203239 -384322 -656663 -761497 -632769 -426143 -266709
43254 -266709 -152992 -68560 -22844 20547 128571 288836 395762 361894 198010 -1879
43244 -1879 -115332 -74190 49836 87737 -35783 -206311 -282832 -282134 -294940 -291801 -172187
43233 -172187 16919 90662 -5482 -91219 6911 227354 377601 373082 271766 145665 39522
43222 39522 19315 128600 278498 287112 81577 -202914 -381477 -433242 -487904 -614674 -711296
43211 -711296 -647586 -459241 -310498 -271259 -231293 -82289 103117 168213 94168 3286 -44121
43200 -44121 -113216 -220279 -246293 -130431 -32955 -143929 -380381 -453125 -253402 -9367
43190 -9367 10400 -189219 -415287 -565512 -664829 -690281 -555948 -299454 -115526 -118342 -189051
43179 -189051 -160973 -59506 -27861 -81009 -98031 -51276 -70643 -220231 -357311 -325467 -187864
43168 -187864 -126059 -155960 -106901 97858 292263 289440 154511 125657 288241 458917 436148
43157 436148 261426 133097 113382 57763 -135811 -334322 -331349 -136111 29971 17910
43147 17910 -96593 -178339 -221419 -283380 -323751 -239590 -41616 114671 92971 -91183 -305051
43136 -305051 -409730 -341860 -151265 29883 101888 85117 58048 36590 -18212 -98810 -152115
43125 -152115 -175204 -204108 -200401 -76810 124422 217930 128508 37294 146667 382062 475871
43114 475871 309802 32667 -149625 -166025 -56046 111169 251287 300742 284956 278914
43104 278914 285490 246422 185456 210732 325526 374315 269878 149443 173361 266869 229409
43093 229409 47725 -85308 -64342 -1070 -8691 -23900 49811 145950 130378 38738 67671
43082 67671 309138 599658 689409 511162 231492 56590 35812 69380 73260 81219 164930
43071 164930 303617 401107 424356 445180 509377 531778 395097 129572 -84823 -118512 -45352
43060 -45352 -50001 -193401 -320995 -240708 32449 278152 335838 286781 298317 356189 287885
43049 287885 43722 -199066 -268497 -204190 -144991 -123403 -90785 -64747 -112236 -224551 -330629
43038 -330629 -405075 -452419 -428544 -314076 -230374 -316138 -489989 -510977 -307327 -73775 12266
43027 12266 -4250 -20210 -66580 -197433 -323789 -324514 -241790 -217954 -298872 -431794 -592864
43016 -592864 -773153 -890124 -864149 -754779 -685655 -664799 -612783 -527010 -461687 -379010 -199868
43005 -199868 10155 100504 94237 181089 406896 578795 560224 457542 401104 336341 182145
42994 182145 22030 -42986 -83930 -184793 -223093 -47304 213195 278694 128559 13970
42984 13970 45380 40289 -133434 -315247 -305214 -164244 -74977 -42728 55175 199245 225863
42973 225863 95156 -24838 5880 114933 144105 66700 -10671 -14686 17903 28763 26611
42962 26611 43977 46475 -36897 -170323 -168603 117158 583222 929746 960219 756737 525761
42951 525761 349445 160012 -93645 -342104 -444358 -284686 144436 679531 1035092 1020508
42941 1020508 725440 412748 219751 56802 -179811 -417130 -512729 -468304 -419928 -445768
42931 -445768 -494375 -509688 -526369 -597027 -691944 -731696 -692201 -624904 -571176 -490918 -301221
42920 -301221 5243 288631 343686 90662 -320540 -631670 -706102 -613064 -495590 -413627
42910 -413627 -339241 -250799 -177390 -168839 -260840 -449521 -655536 -730626 -566454 -220457 106918
42899 106918 251475 225373 162791 151711 153947 87502 -48796 -159628 -155192 -42639 96398
42888 96398 197676 253514 270655 237975 157226 66715 -2670 -69469 -157163 -224405 -191615
42877 -191615 -42872 137843 244679 240958 170738 106011 86976 97436 102011 112078 176860
42866 176860 280787 311659 211927 115189 203377 425004 502332 284558 -30165 -128519 54224
42855 54224 325202 516970 623902 674853 638779 520967 442321 526818 742399 914614
42845 914614 896806 706481 494759 379527 316044 179078 -12861 -52973 179168 480093
42835 480093 526514 301111 121193 187935 303252 174339 -151258 -355714 -283302 -85852
42825 -85852 65544 202320 410497 626973 722281 698563 664621 650017 575698 410920 235286
42814 235286 105175 -32964 -220667 -365626 -356238 -254375 -235568 -325551 -336425 -132482
42804 -132482 158247 305726 266866 183970 153153 148474 154220 198834 229224 121811 -106260
42793 -106260 -243406 -143195 81590 233939 288764 343334 415503 456670 495622 584604 633530
42782 633530 490478 197802 -18095 -60975 -99897 -307580 -598819 -731123 -576511 -214213
42772 -214213 161506 352054 266511 23508 -116491 -6235 241801 414344 425820 319231
42762 319231 135722 -94499 -287719 -367785 -379980 -434473 -538318 -583386 -510973 -399974
42752 -399974 -368466 -449273 -573887 -626396 -515430 -252460 38885 238932 341514 395449
42742 395449 382888 263637 124533 141014 334705 483023 364194 27024 -280296 -415086
42732 -415086 -470098 -592302 -769909 -863210 -798271 -643049 -485844 -326244 -146068 -19325
42722 -19325 -40054 -158498 -215240 -161958 -118218 -151520 -138460 48383 332325 547424 662091
42711 662091 725194 674342 409037 27871 -224936 -274658 -283323 -361347 -406145 -299923 -87762
42700 -87762 137601 368640 591710 703872 639966 472272 289582 98362 -70248 -110843
42690 -110843 -23537 11511 -108240 -218483 -129510 78379 200980 230228 295652 377461 337271
42679 337271 191215 94248 63732 -26975 -170282 -205831 -128865 -152486 -365941 -573617 -605688
42668 -605688 -568435 -614564 -649080 -479453 -155497 46380 -48031 -333483 -553278 -510251
42658 -510251 -196014 190734 386039 305914 132750 106214 262979 425885 405544 173803
42648 173803 -116429 -257300 -179843 -22069 61430 116133 275928 463712 420205 86836
42638 86836 -259271 -366142 -301528 -240296 -156286 65974 362433 566510 660132 726512 728072
42627 728072 560782 288009 100040 56325 63688 88056 182922 317664 387780 403603 462318
42616 462318 517552 397161 96488 -157679 -204294 -115770 73 158830 354733 451561
42606 451561 367307 228604 199320 261811 286421 210080 29370 -269640 -631797 -867968
42596 -867968 -819226 -548658 -265875 -109496 -91988 -181830 -314641 -370498 -269986 -85533
42586 -85533 34082 40525 19475 70814 214001 377132 423820 242146 -120462 -451463 -569703
42575 -569703 -492176 -359866 -268621 -241676 -285223 -364767 -388299 -328096 -307432 -435965 -593847
42564 -593847 -531327 -195740 173200 311410 186098 -55611 -278585 -411300 -380185 -128384
42554 -128384 260830 535412 469103 112929 -216943 -274405 -158113 -142585 -268878 -280551
42544 -280551 -12472 350678 536043 538994 523724 488415 289431 -27565 -192208 -78939
42534 -78939 105187 119485 1859 -66334 -65186 -102734 -139430 25339 435164 814237 852729
42523 852729 582707 336296 336793 461118 464135 325170 239353 305866 383719 300427 80329
42512 80329 -112496 -170259 -98329 46105 175589 191554 84799 -23214 -34383 -25790 -140131
42501 -140131 -362456 -535669 -587183 -599917 -629655 -584758 -368052 -62502 115261 41532
42491 41532 -174808 -294625 -197949 -19110 11892 -142101 -289507 -295693 -273008 -379970 -552196
42480 -552196 -604315 -528120 -490918 -555643 -598554 -524251 -379490 -213642 -3329 221303 341591
42469 341591 324725 285800 287095 220649 1835 -251576 -371190 -373718 -403511 -500215 -558507
42458 -558507 -494454 -343421 -195321 -100994 -35212 83261 301680 534716 608016 434528
42448 434528 98407 -247635 -489292 -549612 -409929 -185677 -56681 -43066 35224 287607
42438 287607 560286 629626 488706 315162 235493 253322 348093 508837 697256 870567
42428 870567 999700 1003041 762358 308177 -114645 -296756 -288434 -250142 -207061 -129145 -126150
42417 -126150 -312705 -545937 -565251 -378286 -243446 -254646 -222510 -33814 148374 171157
42407 171157 139005 209469 333781 377637 341439 276518 122052 -165582 -420474 -429407 -247307
42396 -247307 -147878 -262688 -446246 -515302 -457700 -360635 -273755 -212899 -197223 -210580 -196247
42385 -196247 -148711 -149375 -251226 -378899 -410527 -326686 -208124 -101304 31346 203962 325402
42374 325402 296779 162058 76240 108927 158038 103755 -21952 -94456 -73565 -22728 23318
42363 23318 92985 168024 158790 44642 -54323 -23077 90773 138986 46980 -147686 -393134
42352 -393134 -666225 -914487 -1035961 -964030 -749801 -527041 -386091 -289362 -130021 116085
42342 116085 330603 390490 343406 366154 528413 673828 591905 264079 -120746 -375178
42332 -375178 -483131 -559358 -678774 -771504 -694767 -404844 -31049 241791 335814 297118
42322 297118 203659 127330 143375 271596 426510 540565 713332 1070801 1466375 1556127
42312 1556127 1296245 1148862 1558648 2349892 2920077 2998202 2928902 3165928 3782519 4639453
42302 4639453 5778370 7363975 9371933 11684288 14502921 18259667 22818085 26967122
42294 26967122 29137662 28756725 26690239 24251845 22000675 19685511 17098620 14538249
42286 14538249 12400873 10715473 9301151 8139358 7320882 6753658 6195266 5549603 4921687
42277 4921687 4385573 3888248 3395027 2949343 2552198 2144587 1756431 1516006 1445237 1392957
42267 1392957 1257696 1139738 1159471 1242339 1227651 1116236 1055722 1104697 1151313 1078486 896906
42256 896906 682540 476024 299371 209003 256171 403009 532283 562072 525140 504959
42246 504959 506430 443465 278199 115655 92306 197452 288788 284919 252362 275512 329916
42235 329916 341812 304947 266667 243075 220882 215609 254402 305429 283100 137401 -82396
42224 -82396 -243241 -199190 103751 546004 891280 983095 874853 733238 649144 591570
42214 591570 500369 343138 105795 -180365 -402340 -442854 -309146 -113210 79598 293112
42204 293112 519529 671401 712017 730283 794027 807450 632205 309685 38791 -62734
42194 -62734 -56673 -22374 85857 345830 699742 961324 975349 733736 368827 75157
42184 75157 -5964 98193 194611 108630 -118130 -262484 -170694 72505 255621 274453 198360
42173 198360 129328 79823 21372 -16541 19717 89834 68989 -83776 -239026 -256036 -187176
42162 -187176 -221254 -420170 -615663 -610936 -399231 -121807 107802 243694 239931 83651
42152 83651 -104668 -132883 52572 300678 439489 445496 382099 257813 40284 -227936
42142 -227936 -425074 -475413 -430318 -413810 -506898 -670965 -761632 -643574 -330136 3107
42132 3107 173111 144269 12087 -124379 -220710 -248052 -181307 -56508 10122 -83136 -297811
42121 -297811 -446598 -348042 -19081 299767 352640 108328 -236116 -476776 -567323 -568052 -528893
42110 -528893 -470929 -404308 -295061 -72877 256272 555466 688420 662456 573738 470336
42100 470336 358060 281162 278870 296807 260823 210214 229117 271585 211111 65183 -4076
42089 -4076 43899 34870 -156722 -393671 -443511 -263773 -13199 142362 136355 -9489 -194081
42078 -194081 -288016 -268213 -250267 -309146 -345661 -238058 -54089 23097 -60681 -195272 -290808
42067 -290808 -359473 -414910 -426065 -397523 -383263 -388131 -350415 -249077 -136775 -41407 69267
42056 69267 191113 246869 192574 79478 -31492 -130589 -189290 -132970 33333 155408 95028
42045 95028 -77123 -153093 -33084 184347 342017 370299 296752 192947 131431 133249 133182
42034 133182 41111 -142301 -303624 -319280 -153057 134187 414947 539295 432790 190974
42024 190974 13785 -4799 31458 -4125 -57438 36109 306976 597254 766079 832556 865409
42013 865409 845990 739006 614283 563995 533878 379472 103514 -94127 -57746 131139
42003 131139 270001 272567 216727 203140 237769 238695 122153 -95599 -270105 -257651 -92285
41992 -92285 40860 39664 -6070 6275 29934 -2923 -7531 128551 317410 367345 290901
41981 290901 311341 527464 763998 828022 741278 617781 470245 278227 128195 120818
41971 120818 199009 210601 109633 -19407 -105198 -150481 -177267 -207149 -264869 -314146 -242099
41960 -242099 -16634 192938 184730 -22108 -238481 -367103 -441450 -430871 -234395 78489
41950 78489 241379 129661 -39222 14060 278200 524117 618414 599881 526573 427151 366724
41939 366724 394478 435788 376020 235584 123241 40892 -98848 -267931 -328778 -280892 -304421
41928 -304421 -475408 -623902 -603061 -535070 -610850 -755620 -700527 -353286 83007 365080
41918 365080 430239 340580 153512 -83361 -301934 -454515 -548321 -602998 -604237 -517449 -325632
41907 -325632 -63116 158917 199764 32001 -188734 -282035 -255470 -262509 -358936 -429654 -388350
41896 -388350 -318564 -339153 -430357 -489208 -484488 -450033 -368825 -179966 95478 325480 397977
41885 397977 339800 279453 303638 362186 326092 149817 -54073 -147250 -137266 -125264 -100065
41874 -100065 68147 375619 578387 466739 148731 -89198 -144772 -164392 -274300 -422166
41864 -422166 -514425 -558632 -601380 -634002 -634371 -626541 -632486 -617272 -530677 -361662 -132868 94700
41852 94700 200120 89778 -141376 -238453 -66765 209211 322484 218273 64456 -1925
41842 -1925 -1215 9774 46428 138485 260926 373719 458892 481771 397032 239362 117696
41831 117696 52571 -79692 -329433 -491730 -318183 110491 411427 342825 54913 -169912
41821 -169912 -249003 -242006 -130929 123623 389785 466059 368317 303018 339943 334820 227702
41810 227702 172841 246836 253469 12458 -331789 -521579 -580884 -731977 -974964 -1036780 -775670
41799 -775670 -390934 -138846 -33440 53715 148189 171747 104954 23778 -60 40394 110284
41788 110284 175500 233177 297678 331264 241447 35941 -75841 105278 460715 643691
41778 643691 519551 320518 268007 248652 49215 -240797 -310282 -65368 238297 324277
41768 324277 177026 -51741 -258032 -411297 -466657 -370828 -147644 79324 164834 51181
41758 51181 -174069 -334865 -319970 -186571 -84540 -84287 -119287 -99117 -29849 5197 -43338
41747 -43338 -136259 -204360 -230173 -239527 -224221 -135105 16385 116650 88966 29473 93008
41736 93008 255560 320991 192549 8250 -57731 -15264 5374 -54956 -151673 -226115 -240189
41725 -240189 -183370 -120314 -153940 -256784 -234490 22969 338751 447063 335267 225151
41715 225151 247728 317999 338074 337313 350053 311740 176699 34788 6531 80822 143920
41704 143920 135358 99581 91310 88393 19831 -140785 -341009 -524555 -705208 -898859 -997363
41693 -997363 -835056 -438890 -88480 -7939 -85133 -38660 201225 444378 537937 522976
41683 522976 474479 363944 158589 -62723 -176139 -137423 -10724 69764 -21010 -267398
41673 -267398 -475467 -472565 -319376 -193042 -99651 102974 397741 563568 515383 460861
41663 460861 577767 724284 652626 378583 146081 99093 157379 174139 81097 -83692
41653 -83692 -181219 -59566 251345 494804 460287 247723 132012 211008 326353 310641
41643 310641 179806 75267 113832 294843 483733 511776 360089 200120 183142 262664
41633 262664 315129 340893 410384 495212 521405 531796 609934 680293 591350 396404 334586
41622 334586 483034 622318 528520 240838 -41623 -183469 -149933 33618 246657 309546
41612 309546 170255 -18238 -90074 -56428 -27825 -34969 -17168 76541 247497 445725 562024
41601 562024 514189 388384 371715 479078 502623 341642 206804 312102 510995 487319
41591 487319 226606 20951 15217 27834 -113523 -309810 -385885 -349397 -310446 -297989 -309039
41580 -309039 -415522 -654413 -892094 -954555 -840114 -669862 -487829 -259786 -24778 119328
41570 119328 174390 233536 305803 294773 175437 51431 -5678 -45836 -119199 -186157 -207786
41559 -207786 -215325 -228192 -210491 -168550 -170736 -196535 -102157 152195 364726 321206 65940
41548 65940 -194232 -357517 -438842 -413076 -255312 -88016 -73732 -172700 -203740 -129632 -61330
41537 -61330 17856 264434 648880 887204 826205 657848 583384 486665 170701 -242054
41527 -242054 -411082 -216335 119559 314894 265657 47754 -143567 -93154 225195 558690
41517 558690 637971 490210 343358 285989 223549 133633 123722 203708 220903 95624 -56035
41506 -56035 -110699 -89805 -46915 40706 171424 245202 198156 108505 74766 79434 54687 -7158
41494 -7158 -83403 -166969 -212899 -146928 -9791 22124 -135029 -330840 -384264 -320689 -259393
41483 -259393 -165068 87253 434952 629191 559085 408823 409699 552048 637147 537948 308863
41472 308863 75533 -84803 -147046 -103282 29494 200101 362903 507818 610251 581785
41462 581785 361187 67256 -55929 70325 214772 106273 -211889 -447931 -449906 -348301
41452 -348301 -297179 -272842 -215111 -194726 -299335 -462919 -548620 -533141 -490903 -453437 -396286
41441 -396286 -322334 -264262 -244259 -295144 -441425 -581054 -502483 -156620 186695 228267 19731
41430 19731 -136458 -120005 -93671 -157041 -149012 90386 445520 668043 688450 641613 642078
41419 642078 663416 622232 484396 282513 81277 -76752 -210672 -351481 -437066 -334706
41409 -334706 -32535 259242 300765 91936 -147367 -256228 -279458 -312326 -327384 -254540
41399 -254540 -149692 -136268 -188174 -123211 127736 374735 408069 299550 315091 552495
41389 552495 816881 874400 695320 408910 149591 9078 18341 95130 110117 73404 130881
41378 130881 288837 301458 -4891 -420973 -577501 -409468 -182166 -92912 -87663 -91064 -167731
41367 -167731 -350948 -502433 -482897 -347991 -263263 -310536 -455535 -606241 -626365 -409919
41357 -409919 -51350 163006 65562 -164657 -219153 -45636 135317 171017 161832 263559
41347 263559 445769 549649 524470 499090 602483 775262 815507 613911 296752 95086
41337 95086 96242 182303 207855 163586 134985 162982 203174 200218 158461 134532 165365 200753
41325 200753 134207 -64422 -279153 -369780 -332414 -259005 -174775 -41770 85508 68511 -105634
41314 -105634 -273661 -329359 -360345 -452298 -510064 -427965 -315110 -354855 -507363 -554484 -417412
41303 -417412 -232853 -103678 31072 225268 399151 470482 473934 451424 341380 100029
41293 100029 -144615 -193509 -13102 223275 327193 263504 135904 64856 85250 127498
41283 127498 95407 -23668 -143049 -180944 -142206 -73767 7090 85766 95180 -29369 -241366
41272 -241366 -397346 -397778 -270200 -108820 13111 60586 38465 17812 98443 277609 395785
41261 395785 293391 4871 -282357 -447500 -512296 -496330 -344811 -80466 103717 50184
41251 50184 -133999 -210871 -139291 -97769 -182811 -279659 -290327 -296863 -375307 -409155 -268601
41240 -268601 -81814 -129416 -484411 -914295 -1149303 -1123082 -945798 -770540 -712302 -779521
41230 -779521 -836503 -719667 -432439 -156714 -48619 -96478 -194868 -265880 -274718 -220564 -167704
41219 -167704 -210722 -351495 -470773 -469474 -376502 -271733 -176040 -83255 -35981 -83724 -197147
41208 -197147 -295050 -337320 -335905 -294517 -191001 -14251 203432 367407 336443 39985 -376255
41197 -376255 -611612 -509321 -241236 -103206 -172213 -270624 -234565 -86457 68347 194447
41187 194447 326427 494995 701332 917388 1086189 1164483 1170636 1136877 1022933 763895
41177 763895 417871 166210 116208 181261 213837 188117 183620 245746 342245 425800 468696
41166 468696 453089 384513 304358 249823 219152 199227 184598 142838 32629 -90192 -72013
41155 -72013 135238 344558 343654 190045 132600 240650 296452 124676 -134078 -205650 -37437
41144 -37437 166998 220898 136759 48462 56850 166143 295638 329407 204461 -25101 -231721
41133 -231721 -324844 -305705 -234223 -174920 -164206 -196690 -239720 -272397 -301667 -336041 -362449
41122 -362449 -351331 -266526 -91768 108502 190502 83756 -76340 -93335 7851 4911 -167077
41111 -167077 -277941 -143169 80536 134665 51966 63858 196890 237057 88897 -95750
41101 -95750 -193402 -269023 -375693 -411755 -296574 -117481 13623 103579 180042 204595 187301
41090 187301 227274 319778 288715 58423 -164972 -159129 3050 98164 91050 119023 225415
41079 225415 325909 384836 420395 384475 247697 161593 305080 580814 698664 579119
41069 579119 443761 465689 566272 638094 741808 948270 1158832 1227716 1144889 986417
41059 986417 800004 643293 611722 702548 748882 614251 379718 230625 227996 290894 330988
41048 330988 301915 187169 47099 13007 124088 230295 172141 -569 -118305 -153574
41038 -153574 -239739 -428409 -572995 -505384 -241291 35775 143976 38684 -169253 -313865
41028 -313865 -330072 -311958 -384839 -542359 -665121 -681227 -633282 -581090 -512244 -383570 -204692
41017 -204692 -39302 59900 89002 67512 -1160 -114435 -205669 -141240 143495 505961 683840
41006 683840 568445 325942 190778 200550 208653 104862 -74335 -227131 -275231 -178388 31029
40995 31029 204999 176694 -37999 -211264 -156688 30055 71936 -155596 -475402 -615852
40985 -615852 -493670 -240623 -11425 144540 239459 278331 266540 217900 128888 14374
40975 14374 -16584 162172 476731 637704 458675 88015 -212788 -407299 -602174 -724754
40965 -724754 -571863 -188275 99339 121136 75689 166091 270565 171995 -85214 -296906
40955 -296906 -401729 -438246 -329885 1956 370995 460424 234403 -28833 -139857 -195334
40945 -195334 -315314 -417397 -376215 -238309 -133972 -72594 50829 289458 562085 715969
40935 715969 650382 412692 165841 17776 -75273 -172398 -205158 -107812 -5708 -66682 -204139
40924 -204139 -177740 -3162 23561 -197090 -357371 -196162 79891 91652 -155837 -305149
40914 -305149 -164510 91228 241849 286928 321158 348967 332442 289081 235997 127027 -62416
40903 -62416 -252382 -342745 -335514 -299021 -242911 -108988 113451 331655 443225 455024 466678
40892 466678 533120 578522 477377 211011 -89348 -261380 -252014 -140025 -47776 -37941 -75567
40881 -75567 -87429 -69027 -106286 -251744 -411895 -436505 -316351 -200704 -192662 -218024 -151543
40870 -151543 4069 142884 211041 253806 321237 391666 396386 292006 115139 -21206 -13569
40859 -13569 126080 273083 313009 236009 111795 23510 29849 118458 173550 70709 -155017
40848 -155017 -316300 -303258 -225695 -256174 -407335 -550755 -590265 -518969 -362534 -182116
40838 -182116 -101243 -211586 -453594 -678821 -816607 -893273 -917876 -867333 -778703 -731666 -719527
40827 -719527 -651532 -513174 -411021 -409176 -423746 -344752 -179267 -7992 120641 176294 100296
40816 100296 -125593 -401085 -590529 -667583 -700945 -716320 -661142 -508184 -310514 -133971
40806 -133971 -5627 49495 -1078 -124274 -208319 -192308 -161618 -233850 -382723 -476676 -487687
40795 -487687 -539905 -701558 -840070 -788174 -589155 -449960 -463956 -504069 -418816 -224498
40785 -224498 -38169 96708 218604 310774 258937 -10809 -394141 -667674 -707171 -619527
40775 -619527 -613764 -746929 -863945 -810811 -620061 -418856 -247815 -97251 -51854 -209779
40765 -209779 -453011 -493464 -222037 142307 338430 351681 309264 235771 76093 -136758
40755 -136758 -315038 -464918 -633934 -742081 -640921 -351216 -85184 6328 -18900 -45454
40745 -45454 -82561 -219955 -466797 -702314 -773521 -631259 -390853 -237884 -233050 -244807 -133969
40734 -133969 45091 123024 58154 -22514 -20443 22448 31492 109 -61364 -171703 -307074
40723 -307074 -359909 -242994 1086 237816 359770 350058 268270 192743 148000 93206 15304
40712 15304 -4386 104444 254520 271396 127331 2854 70008 281830 416244 291281
40702 291281 -61396 -387553 -407788 -112670 172198 134141 -142469 -293660 -163921 25754
40692 25754 40339 -64187 -123024 -155202 -284781 -490168 -626741 -635845 -563300 -421107 -199879
40681 -199879 8313 65662 -27813 -142134 -208276 -263889 -303361 -238733 -62347 82947 75957
40670 75957 -32449 -119792 -168533 -249144 -365016 -409232 -288830 -38325 212274 355781
40660 355781 375548 315869 225444 147733 132964 204381 306282 330599 212244 -32063 -351879
40649 -351879 -681835 -902078 -880648 -628232 -343608 -213838 -203903 -129312 89785 342422
40639 342422 490609 523823 521255 529662 523433 454268 310010 135041 -1071 -64515 -77931
40628 -77931 -70730 -39222 14370 38157 -20503 -136208 -226986 -252603 -251470 -283473 -370650 -485260
40616 -485260 -562466 -541991 -440379 -365204 -405641 -520243 -590395 -575535 -540641 -519638 -443541
40605 -443541 -267737 -107272 -138299 -355004 -518086 -415078 -128647 46190 -44377 -239519
40595 -239519 -289160 -153717 22727 163280 322443 504505 586781 492990 321845 217970
40585 217970 203312 212464 205641 158390 24508 -180745 -319886 -266220 -62618 139107 250148
40574 250148 270213 208200 96407 37353 108500 247353 349744 443176 615559 794977
40564 794977 779804 521076 214546 51265 17808 20007 65093 196431 338575 352775 223805
40553 223805 73809 -23631 -150745 -411232 -725822 -838773 -579838 -99473 238707 238100
40543 238100 67711 12729 110708 172941 128635 156725 405279 723747 807029 554693 176491
40532 176491 -54192 -69834 -8974 -3944 -34116 -9823 51053 23661 -125298 -239578 -160416
40521 -160416 50556 183048 143210 38998 10375 78902 173173 211530 146998 5683 -119150
40510 -119150 -180656 -262894 -466881 -748831 -980273 -1125459 -1218457 -1206985 -1010672 -733291
40500 -733291 -601840 -643842 -633516 -441782 -233295 -192105 -242712 -208703 -95035 -26914 -20578
40489 -20578 -4357 6928 -62561 -194882 -301419 -362324 -410345 -424655 -377186 -337618 -391163
40478 -391163 -490413 -527964 -518938 -564391 -657693 -674276 -546679 -325153 -89943 63185 -6570
40467 -6570 -345644 -732147 -824231 -535159 -125824 112219 132526 64886 28656 82842 225912
40456 225912 357715 344831 201612 111854 195529 347167 391613 317941 258397 288816 349466
40445 349466 346739 263827 173623 172523 281557 400548 402452 285321 174829 162064 207055
40434 207055 220831 159676 8336 -231098 -475116 -576896 -488645 -331098 -221383 -114021
40424 -114021 79879 289016 345366 229334 104061 83622 97372 38198 -63937 -101185
40414 -101185 -50181 20260 74028 150254 275463 402753 463675 434695 326974 155193 -37650
40403 -37650 -152070 -93128 126248 381035 547055 587607 524240 379538 192295 50681
40393 50681 43599 168685 317189 356508 226750 -12332 -206461 -218279 -63569 84245
40383 84245 72095 -68681 -180102 -167349 -63393 70133 208545 315469 322118 209343
40373 209343 56949 -38140 -59223 -51662 -47483 -50323 -61062 -65220 -14853 112794 229886 175760
40361 175760 -104924 -446897 -602421 -521105 -426679 -550894 -839829 -1024596 -962953 -779345
40351 -779345 -644913 -571890 -507036 -479974 -514649 -501635 -334317 -107202 6294 34658 164552
40340 164552 419654 595504 554880 383225 182336 -77087 -375456 -515435 -361426 -82253
40330 -82253 40438 -25301 -73704 1946 65166 -50322 -312294 -517321 -486490 -233281 22903
40319 22903 52954 -116162 -195959 24107 404664 628410 571291 369953 185867 77296
40309 77296 81618 229756 437492 539157 486068 385875 307706 196853 43680 -25594 58105
40298 58105 153154 92263 -62776 -100597 51522 258520 373451 368074 269263 100202 -75160
40287 -75160 -154333 -107959 -34126 -51743 -164999 -248440 -139881 230478 730382 1050905 949716
40276 949716 517463 118000 5499 81236 100621 24264 28825 215342 464726 602871
40266 602871 577429 422140 160432 -169951 -458951 -569570 -429459 -70871 362151 649154
40256 649154 650292 476712 395346 498123 584705 465772 247452 164357 242831 325833 359664
40245 359664 426688 510440 473134 323894 298368 567034 1008900 1358163 1451417 1280188
40235 1280188 959716 720164 757777 986213 1086501 911702 680005 640533 729580 739692
40225 739692 666527 654279 705361 692907 605111 540244 486491 335269 110868 -29204 -36137
40214 -36137 -7633 34227 191021 467447 699820 768294 708917 568912 343983 123242
40204 123242 86291 247272 388226 368872 321908 396871 490090 422284 246036 157778 189871
40193 189871 209027 178291 209098 349943 503532 577340 566101 465462 259144 37013
40183 37013 -21604 133270 323716 351682 228941 112199 74991 63429 61037 156997 375762
40172 375762 533160 411668 90425 -50874 231258 695434 860808 570260 135728 -90248
40162 -90248 -86251 -19767 63367 217301 382273 419446 342466 323099 431334 516328 404863
40151 404863 119094 -159169 -276247 -219667 -92138 -2605 35012 82081 137370 88192 -125257
40140 -125257 -366464 -446921 -370031 -280941 -196054 21775 370134 585676 449902 93700
40130 93700 -152748 -149772 -52444 -58375 -183867 -308674 -349401 -338733 -356372 -404683 -375184
40119 -375184 -177716 108811 294188 302440 241718 209049 154596 38671 -9429 129821 302648
40108 302648 222417 -115449 -377026 -325751 -122951 -64443 -177975 -267163 -254466 -256753 -329985
40097 -329985 -348887 -212446 -24392 27074 -115484 -359288 -583261 -703052 -679006 -549341
40087 -549341 -420340 -348332 -264058 -87409 121092 216908 160450 51333 -22890 -70028 -111051
40076 -111051 -119456 -81226 -23291 63334 234778 464571 594337 506856 283491 95929 3011
40065 3011 -35878 -6347 146355 354450 437065 319133 119228 -31345 -132761 -204685 -159242
40054 -159242 73888 363144 471759 338888 144219 75370 138032 232337 316340 420552
40044 420552 559033 701678 810707 848892 772220 573051 330178 171561 176898 332099
40034 332099 557612 744254 789069 671420 507651 462587 569104 686236 677880 578413
40024 578413 513382 499590 428138 250246 72212 10697 34253 33280 -2261 15063 91731
40013 91731 92683 -77117 -303908 -372798 -224582 -12989 110085 175806 302168 478677 548156
40002 548156 405231 133023 -86021 -143205 -69847 8048 -44778 -259158 -481240 -476753 -193261
39991 -193261 136956 245647 130839 3851 -13778 17688 58313 186117 412131 561213
39981 561213 475557 240208 69324 33641 37905 23901 42113 114169 156082 89718 -39050
39970 -39050 -92334 33191 301178 535093 576060 483640 487882 655808 729095 466287 47230
39959 47230 -120460 24303 117802 -58451 -246372 -144954 95623 115237 -87901 -182177
39949 -182177 -45108 71569 -22656 -166777 -133036 36874 156362 178294 164828 101910
39939 101910 -52040 -204320 -210315 -92327 -8901 -13654 2245 120734 293619 449135 571507
39928 571507 648483 662294 658869 702515 741590 666368 531226 532471 683514 716986 466097
39917 466097 160910 122590 294517 346243 175953 11514 2911 18006 -62549 -120550 -32769
39906 -32769 87584 80779 15531 62936 202275 265902 215641 168689 169666 124574 -23943 -202437
39894 -202437 -304768 -273246 -95811 157194 316023 265987 101972 -4550 -53463 -157888
39884 -157888 -274566 -229003 -38341 47804 -64854 -120920 122158 519755 728957 644098
39874 644098 436635 250431 81508 -66381 -118523 -62658 -3021 -33375 -139945 -243181
39864 -243181 -265817 -174942 -32383 27642 -42964 -112169 -34212 139209 242919 251330 287269
39853 287269 389297 446016 394480 321316 307579 316497 305889 320007 386011 438174 438280 464084
39841 464084 574249 679810 666710 574571 534591 579581 629528 634119 625366 642577 683651
39830 683651 713009 663137 478175 222890 77619 126782 219913 169409 33748 48690 290350
39819 290350 564871 659167 570076 451708 450022 613616 847091 927212 700911 308131
39809 308131 65959 82708 155852 132699 162143 405064 662681 567185 99604 -339099
39799 -339099 -410893 -185578 64428 218817 324248 383781 309637 78182 -181346 -295860
39789 -295860 -222860 -102974 -124231 -307754 -444757 -299524 124534 572042 786291 718198
39779 718198 500600 303981 234914 289624 363100 359256 316642 365263 544261 738828 819145
39768 819145 758802 597436 398979 293660 431754 791833 1121021 1173067 951629 642598
39758 642598 391777 251551 252994 374774 481750 447472 332182 308645 411320 487233
39748 487233 412155 237514 91549 32858 34551 31031 -45973 -202273 -329064 -285722 -58152
39737 -58152 215621 377472 357674 185359 -23193 -109479 -3918 197157 366505 513991
39727 513991 706153 876274 887024 762380 665106 635224 560125 439001 436491 578975 639677
39716 639677 486531 331103 418019 635738 693854 584480 584970 813529 1037172 988539 697518
39705 697518 426010 382826 563492 792259 869643 719028 418306 98875 -131151 -154414
39695 -154414 130173 635335 1038414 1069507 812378 582263 542764 594826 616668 628973
39685 628973 686098 753006 754174 653365 456142 222490 87258 161586 388278 586897
39675 586897 660122 668125 696125 753324 815327 860334 844190 739276 612067 561092 571870
39664 571870 545640 474509 452753 495138 494141 407682 348310 415595 561999 698406 819899
39653 819899 949296 1057912 1119467 1151392 1138823 1021217 827166 715721 793234 973892
39643 973892 1096313 1085920 935103 647857 313737 126712 192939 388357 523449 576218
39633 576218 640013 719456 735493 694742 695040 758635 791560 733518 645971 616098 641398 642797
39621 642797 561612 433214 368679 434513 547848 550935 398851 187399 -14847 -223093
39611 -223093 -372603 -277320 103305 494169 590893 433877 307204 330604 371162 340049
39601 340049 335561 426985 491188 378164 124281 -96624 -165590 -99120 3857 46134 -662
39590 -662 -94475 -207699 -366936 -540188 -557796 -292768 103374 313444 228731 54295 -1779
39579 -1779 23560 -2084 -67765 -78200 -56354 -121510 -287930 -423995 -436679 -399700 -446597
39568 -446597 -586431 -686782 -639409 -491966 -374786 -328979 -286225 -217426 -183157 -179751 -67662
39557 -67662 212794 449618 366348 -9002 -361013 -473818 -423328 -359076 -286747 -153207
39547 -153207 3473 99838 112291 62139 -21183 -72732 -23939 95349 188621 250428 355988
39536 355988 466105 428426 250906 173825 333891 538408 547475 418618 356666 351385 223423
39525 223423 -27890 -180111 -99452 111487 297256 395864 381704 251295 117687 154901
39515 154901 378156 602250 667087 588611 457551 328962 258155 297480 381112 344040 144494
39504 144494 -46272 -67512 25057 77354 58908 43306 44254 10731 -49464 -68066 -31833 1991
39492 1991 9896 42543 157680 372930 670137 975734 1152947 1103993 894728 706254 645426
39481 645426 664752 674427 644761 562126 379597 101522 -135325 -176620 -51322 33286 -71697
39470 -71697 -298748 -486268 -582135 -638715 -656006 -561609 -368755 -234291 -280522 -433434 -529592
39459 -529592 -534845 -548276 -606277 -608304 -480020 -314639 -272514 -381215 -504617 -497818 -341596
39448 -341596 -130380 20927 46384 -46697 -179318 -236262 -143628 61757 249535 300229
39438 300229 191565 -15422 -235283 -370548 -316910 -48294 304730 558522 684825 816966
39428 816966 1003681 1078882 882571 518443 251356 197625 253774 293614 283707 227842 174848
39417 174848 287182 697669 1235040 1493155 1296904 936295 786998 837948 783459 485789
39407 485789 126695 -70770 -63344 85458 308482 503726 553702 463219 372182 356320 313178
39396 313178 132430 -105420 -212309 -136218 -19072 -13774 -121761 -229944 -254886 -215425
39386 -215425 -176262 -146829 -62348 117561 314065 383421 276343 100252 4901 47388 191112
39375 191112 384050 585915 750117 843315 883710 913548 925498 855225 667110 423368
39365 423368 241422 184603 211105 235015 221601 203074 210590 233248 262131 324731 419703
39354 419703 452094 324128 98896 -22710 58729 201584 205520 85187 54361 236558
39344 236558 498523 629556 619415 662898 881242 1118780 1095024 758704 408355 383600
39334 383600 664522 883681 766253 450372 280877 370028 513877 526898 481404 535529
39324 535529 658897 671023 495508 233302 -7842 -213657 -353339 -308330 -25792 329239
39314 329239 510692 471394 388691 398830 437190 401550 338417 334364 312651 122297 -187666
39303 -187666 -376549 -341125 -254848 -284140 -339781 -265550 -126804 -90519 -102610 51645 363196
39292 363196 542252 437178 282900 373377 646968 785254 638056 377022 263118 397606
39282 397606 678624 891291 865678 644605 465489 493588 634456 708424 713774 753173 780814
39271 780814 657047 448507 421005 653255 875198 825202 602372 505169 636259 831777
39261 831777 910154 834910 667701 497766 407301 400583 377456 262570 136452 147496 314234
39250 314234 503807 588289 536306 375761 172104 39669 67754 212504 340473 392543
39240 392543 428423 497541 548973 500399 335336 105686 -115251 -268729 -340651 -354178 -297282
39229 -297282 -99625 240006 547563 622420 487164 351765 312976 251917 94043 -1907
39219 -1907 144813 452967 672442 699607 638724 583845 517114 445643 474824 661613 894729
39208 894729 1007932 960935 847608 770496 765822 820727 905516 990108 1052931 1068517 994017
39197 994017 814202 610274 522523 603350 747501 804272 721609 554317 391553 320256
39187 320256 384515 503695 501870 326842 181615 296567 603523 807903 789148 730074
39177 730074 788268 854064 775754 637844 606246 627553 533849 382854 421290 697508 969837
39166 969837 1069442 1116510 1258984 1408877 1407289 1295786 1239185 1286297 1385391 1546916 1791983
39155 1791983 1989617 1957598 1736565 1575890 1595451 1623328 1461828 1191049 1069344 1174410
39145 1174410 1288625 1198638 1015586 1059192 1411180 1744562 1729270 1489373 1431973 1659623
39135 1659623 1836741 1709559 1467710 1415045 1531362 1603680 1593518 1586309 1525388 1318881
39125 1318881 1119013 1157246 1342062 1360050 1170126 1043345 1079854 1070228 947609 999322
39115 999322 1423836 1980157 2306653 2343904 2227200 2006935 1730782 1592260 1711999 1915636
39105 1915636 1984396 1991616 2139261 2395383 2573905 2677663 2879791 3221730 3586270 3917168
39095 3917168 4216695 4382816 4313718 4132713 4039586 3974055 3720755 3336917 3150121 3279100
39085 3279100 3470238 3511639 3521155 3679044 3924286 4094721 4180873 4265514 4347798 4374266 4336429
39074 4336429 4232383 4047735 3856499 3799925 3878001 3916333 3835946 3784624 3878932 3996581
39064 3996581 3992113 3960109 4076692 4284985 4352476 4194610 3965138 3855248 3945898 4212735
39054 4212735 4525128 4674601 4558590 4327144 4219547 4275190 4339284 4336175 4376929 4560508
39044 4560508 4799900 4921803 4879757 4817386 4938457 5318631 5826120 6246065 6500041 6699159
39034 6699159 6960857 7255718 7495344 7686483 7900829 8151796 8406872 8682007 9020512
39025 9020512 9406396 9796569 10220155 10760914 11462989 12324299 13330797 14399626 15346640
39016 15346640 16054453 16666545 17484250 18648661 20021136 21391910 22717471 24139932
39008 24139932 25852760 27955009 30368927 32916612 35564670 38577262 42326755 46959585
39000 46959585 52354796 58417712 65321224 73477159 83411125 95698877 110910896 129575969
38992 129575969 152268083 179646762 212036507 248493629 285960086 319286232 342497969
38985 342497969 351026463 343876832 324281259 298089462 270909520 246078685 224549823
38978 224549823 205906675 189225330 173519047 158166698 143246940 129333373 116885631
38971 116885631 105914632 96175163 87463868 79680068 72777350 66750733 61557399 56987456
38963 56987456 52735405 48674240 44937515 41633508 38596639 35565321 32531110 29742040
38955 29742040 27368405 25314974 23392664 21543450 19829834 18302913 16969040 15824584
38947 15824584 14835665 13921238 13036352 12237747 11576953 10960278 10242807 9474203 8907204
38938 8907204 8680956 8608473 8405281 8065062 7852902 7919599 8069592 7991313 7634042 7251809
38928 7251809 7087983 7106945 7082148 6899379 6681726 6585409 6559298 6413693 6090057 5711224
38918 5711224 5343400 4895898 4369252 4023083 4079811 4354222 4424171 4149622 3781689 3545176
38908 3545176 3384190 3204352 3088407 3091251 3044202 2802878 2543781 2559416 2838760 3097390
38898 3097390 3191129 3269139 3512769 3924836 4389859 4750300 4810183 4476959 3955277 3602851
38888 3602851 3516547 3439445 3153969 2768293 2497152 2358236 2258398 2214857 2274444 2324519
38878 2324519 2219749 2044081 2013723 2121821 2102117 1798889 1388539 1148777 1149242 1265990
38868 1265990 1389062 1497684 1587327 1631011 1613904 1556008 1497728 1471435 1467177 1430974 1332711
38857 1332711 1221974 1162704 1130023 1051380 947180 934649 1065307 1239891 1315909 1231053
38847 1231053 1008315 733942 555986 592981 787368 946284 983615 1014625 1143305 1283450
38837 1283450 1302817 1231770 1181960 1140649 1013465 827082 718624 729836 764973 765992 792202
38826 792202 899407 1055326 1199225 1287394 1276674 1174090 1099946 1167447 1285494 1224386
38816 1224386 912556 530631 271738 156689 141806 244242 455664 666261 796973 908075
38806 908075 1068261 1213388 1248695 1201233 1152228 1101084 1020905 970254 1007102 1045726 944551
38795 944551 711135 491858 371385 294388 179854 20937 -119448 -143646 14694 289642
38785 289642 502788 562804 575231 663056 771170 777059 704107 660542 640693 580329 560936
38774 560936 735812 1048316 1239098 1178260 1000614 854917 707964 494046 304109 300410
38764 300410 523157 862344 1161862 1317242 1346158 1382084 1523051 1703539 1819501 1929546
38754 1929546 2155917 2409433 2440971 2203875 1934922 1801367 1705690 1558753 1502026 1660897
38744 1660897 1861385 1823867 1535337 1229369 1071750 1043660 1071893 1098710 1052740 895032
38734 895032 684938 518605 449921 524146 769533 1059652 1127213 867364 517104 378073
38724 378073 464496 581644 632002 648702 629013 558570 534793 644032 762235 699446 512768
38713 512768 452352 603747 796814 874349 847858 776677 691874 659657 733026 821937 787485
38702 787485 666346 616485 653192 652785 609726 643919 735517 717356 578989 505367 537970
38691 537970 482382 270032 128541 224918 391867 401951 291253 207086 142238 42781 -10791
38680 -10791 26895 -14126 -263040 -509689 -447889 -123089 150022 255084 360763 550974
38670 550974 664480 566105 340937 133201 -19947 -104788 -38389 230777 614380 945538
38660 945538 1097327 1028320 786208 481420 198924 -56189 -280038 -394913 -339369 -178231
38650 -178231 -25648 80542 127192 45237 -163652 -302411 -177890 115879 308563 312625
38640 312625 259292 208135 87274 -49935 614 248859 396242 240547 -1083 24805
38630 24805 335268 621923 654700 492544 332822 309899 434935 611594 698606 630238
38620 630238 475385 343887 277609 274865 355356 530558 752712 947276 1054834 1014985
38610 1014985 790981 462107 207505 131195 172353 236953 321724 443616 554689 611954
38600 611954 627263 564623 323911 -49731 -285866 -200262 24724 79844 -37674 -71093
38590 -71093 68055 198845 214825 244347 374851 469524 403893 278078 222819 171062 25426
38579 25426 -90484 951 181725 124460 -241020 -574764 -539749 -207886 75638 133490
38569 133490 111136 214101 432072 589209 596437 549662 563012 595042 526037 368725 278603
38558 278603 324770 371160 279085 143917 193889 472753 755348 810759 650726 470437
38548 470437 424222 522031 683929 811139 825235 720846 598781 588054 690932 733732
38538 733732 534255 135539 -186053 -210829 -42950 13289 -144702 -271539 -114151 223029
38528 223029 414144 348924 229905 222647 223722 73211 -177794 -361795 -439526 -486357 -505686
38517 -505686 -420599 -222787 12134 240261 452080 584926 578787 511837 525317 599845 566840
38506 566840 378811 201073 161843 168389 81022 -58501 -102041 -4230 175675 411269 710403
38495 710403 1011627 1197470 1204988 1053403 802184 555954 447893 509642 598026 557536
38485 557536 417720 318657 285571 221225 107481 58067 141640 285518 399662 478714 526116
38474 526116 487260 340850 186321 160784 301784 536957 771434 946287 1043362 1068995
38464 1068995 1025780 905844 735173 590552 510442 416614 209548 -69975 -265358 -285284
38454 -285284 -168161 18376 218259 326152 239322 21239 -122574 -102022 -53624 -115911
38444 -115911 -215072 -180659 16861 249883 384161 358320 193473 18202 4680 174273
38434 174273 331936 292819 106223 -43882 -78951 -45098 29599 145987 244432 252558 207345
38423 207345 204065 238328 216360 108287 -18172 -98073 -102513 -11394 130205 175669 38043
38412 38043 -147077 -168876 -22056 115629 150469 133457 82200 -33399 -113585 22914 345717
38401 345717 584711 577688 439191 302648 138712 -38003 -42975 177829 335888 164995
38391 164995 -145690 -182340 106516 358593 325642 157896 93921 121628 90646 2787 34420
38380 34420 320940 799987 1238034 1386910 1163588 698471 189463 -249334 -552795 -626679
38370 -626679 -451471 -207784 -117567 -163677 -138243 23630 153407 137343 92001 152418 262740
38359 262740 310365 317571 340722 304311 131991 -27377 80146 455307 782418 785877 536699
38348 536699 336794 371378 545922 636742 541271 359685 247414 232124 222668 176694 170092
38337 170092 270882 431172 567943 680691 806044 907375 905383 795225 648675 514635
38327 514635 395877 311974 300423 345309 369598 313567 187645 65091 59264 256380 590611
38316 590611 829538 798444 609878 549714 716409 892115 818784 495899 134148 -97660
38306 -97660 -183392 -169608 -74495 98212 312999 503006 615632 656002 671283 675309 616790
38295 616790 464274 288679 185408 134021 36848 -97232 -125111 31628 265697 420664
38285 420664 450449 379659 222601 48198 18125 205314 432914 460046 309001 237981
38275 237981 367457 502809 405224 106010 -157972 -233372 -150936 15950 250968 520137
38265 520137 698822 664738 454071 258712 233472 335358 395022 323673 179766 33500
38255 33500 -130024 -315489 -421110 -347086 -152124 8694 72141 82363 55234 -22129 -61767
38244 -61767 72960 328769 448071 297464 64727 -3841 68781 96523 60505 110544 265641
38233 265641 340167 213190 -17337 -219802 -394785 -553345 -592099 -450335 -286133 -309018
38223 -309018 -473337 -510928 -278994 70272 296632 316208 191934 8676 -155502 -225989
38213 -225989 -198825 -157195 -146269 -99165 24119 101913 -11972 -261524 -450431 -514320 -561919
38202 -561919 -626899 -573006 -334725 -80249 6141 -23274 -3795 65644 57289 -31130 -55264
38191 -55264 44833 162974 190291 112799 -54243 -264446 -367768 -233906 14764 97857
38181 97857 -32994 -121495 -21940 66424 -42851 -180179 -109016 29988 -86093 -408686
38171 -408686 -531227 -277254 69996 217113 223258 256366 264497 123148 -75900 -135236 -56528
38160 -56528 -17617 -94388 -185363 -184988 -86479 54782 130380 1289 -342576 -684148 -788599
38149 -788599 -674702 -525452 -385770 -165813 67194 68566 -216024 -486500 -447860 -174180
38139 -174180 47713 100065 68666 1322 -133605 -273341 -272310 -130472 -27175 -59422 -104242
38128 -104242 -30407 97169 150309 162946 263161 433011 499978 372759 150011 -35431
38118 -35431 -162280 -259566 -305468 -273989 -221004 -234855 -326329 -434243 -514643 -554087 -515408
38107 -515408 -361332 -149220 -22772 -60363 -173236 -198941 -75532 104574 190826 100433
38097 100433 -119882 -318837 -348543 -192687 17244 144382 189303 248929 352778 414561
38087 414561 364958 260222 206330 223957 255733 279107 329734 405539 423108 309342 93412
38076 93412 -129713 -295014 -389464 -408458 -346672 -238017 -165299 -201275 -336839 -475294 -515273
38065 -515273 -452696 -379458 -352351 -297274 -113439 144658 293538 246983 97676 -70421
38055 -70421 -295577 -549717 -597859 -265289 234404 490263 406099 270929 284536 292210 108662
38044 108662 -162520 -333635 -441529 -602377 -717998 -611360 -359067 -194692 -128157 32288
38034 32288 275968 333315 110847 -112911 -79527 102219 184736 158642 187771 308911 416187
38023 416187 456051 435868 305565 33943 -234870 -304088 -205899 -180328 -346760 -553188
38013 -553188 -591224 -422541 -145785 130689 317465 355527 281819 217588 235403 297923 362074
38002 362074 451582 558371 558265 337374 -21392 -272677 -246346 -7933 215236 230367 14236
37991 14236 -294846 -526354 -629372 -706818 -880049 -1120776 -1249637 -1118018 -769863 -401044
37981 -401044 -169087 -65347 31552 207332 428292 582722 589699 479313 368331 331172
37971 331172 298187 140997 -120991 -291060 -254366 -183220 -333109 -660457 -827406 -634865
37961 -634865 -275339 -47991 24771 130614 319462 431560 361080 202791 83741 -9991
37951 -9991 -154181 -321530 -391028 -303662 -154367 -113597 -250895 -435342 -452927 -253949 -28763
37940 -28763 20110 -85363 -186376 -246086 -362333 -528536 -563858 -361103 -72066 67268
37930 67268 21302 -43432 -628 95554 116673 34685 -43298 -760 146462 258741 236914
37919 236914 135469 62429 18633 -63293 -153413 -148700 -86704 -166775 -456898 -710658 -628442
37908 -628442 -241803 103910 132586 -110622 -376469 -462943 -334203 -93749 109984 202646
37898 202646 240575 323417 459328 566219 592687 560360 473885 272213 -77464 -482409
37888 -482409 -775826 -856532 -755018 -579760 -421516 -299546 -185901 -81694 -49297 -130396
37878 -130396 -243459 -236834 -79779 65491 33087 -127096 -211834 -133130 -12194 24595 24989
37867 24989 98992 220415 272265 243842 229499 232350 134567 -86794 -275106 -323725 -346915
37856 -346915 -477510 -608210 -525704 -248391 -26815 -3838 -63201 -54766 9351 58792 102374
37845 102374 149865 127989 13942 -38562 134233 446928 618686 502716 253862 128760
37835 128760 193638 287128 243057 91300 9843 96448 243312 272257 147182 -15805 -117674
37824 -117674 -159053 -157081 -91409 26971 120231 128246 70070 -6109 -67072 -72865 -1221 78388
37812 78388 53625 -69694 -157186 -135922 -77247 -40502 23741 131236 175331 107559 72932
37801 72932 203376 378775 374101 176357 -28977 -144771 -244517 -372084 -439509 -365057 -185163
37790 -185163 5641 130582 138897 36645 -86147 -147639 -184011 -280552 -422037 -514980 -525889
37779 -525889 -481315 -369266 -183480 -41022 -89798 -283413 -397264 -301992 -97181 52467
37769 52467 96902 93506 126657 249885 417753 491269 409957 308937 332346 400483 348480
37758 348480 233546 262125 435030 539261 513336 528628 643926 686389 593396 565756 705907
37747 705907 790566 628011 390484 335216 411618 423457 390634 441697 499695 410610 286578
37736 286578 380434 663433 856280 874157 922723 1115944 1296125 1312176 1225922 1152347 1102883
37725 1102883 1062252 1034159 961005 793723 677967 841552 1229618 1486145 1397866 1138309
37715 1138309 963035 888511 813041 736244 677910 564738 391118 328260 468210 610325
37705 610325 530903 333033 266326 298942 179003 -99308 -215699 5864 316561 382639
37695 382639 208953 43045 -10746 -72755 -223822 -349775 -297188 -68137 207532 422624
37685 422624 534693 497752 267098 -87085 -362338 -419176 -358114 -393537 -561029 -682177
37675 -682177 -652288 -612588 -732124 -932302 -972301 -748315 -371027 4071 263236 278314
37665 278314 -32896 -525439 -863515 -840345 -565910 -268190 -36708 123792 121645 -127975
37655 -127975 -472074 -604760 -448181 -277327 -352949 -559670 -564875 -267409 90019 254472
37645 254472 236853 192171 172568 119776 18998 -77268 -153282 -237180 -300321 -257270 -96463
37634 -96463 73158 144840 118410 47896 -50275 -190668 -370511 -571914 -770143 -905299
37624 -905299 -902069 -770244 -635180 -601323 -619683 -558138 -375159 -151033 31219 149398
37614 149398 190071 128724 -5786 -122083 -167873 -185226 -219587 -232174 -172278 -95133 -112892
37603 -112892 -226997 -300590 -234478 -94932 -2914 45074 148958 316683 415613 347751 183267
37592 183267 56098 -2195 -38569 -41049 57250 235975 357365 320120 174790 48685 15850
37581 15850 79456 218770 388642 507297 512891 432381 356498 346832 389411 430399 433569 403086
37569 403086 361460 311797 241089 176670 202715 362821 562038 639356 543990 371581 225115
37558 225115 130964 105010 180359 309611 351600 246217 114923 94714 161134 221147 277023
37547 277023 344967 304182 44879 -258644 -262924 96568 472672 518684 268744 1389
37537 1389 -111971 -75261 69058 240592 262229 16947 -345158 -542122 -514474 -461919 -489792
37526 -489792 -423885 -97115 340140 573162 505829 315789 162347 24368 -141243 -250246
37516 -250246 -202644 -45981 80652 117018 106593 86799 46480 -17692 -81880 -132344 -157595
37505 -157595 -115226 12840 136112 126436 -1874 -80650 -3869 135317 187704 143623 100450
37494 100450 104415 124564 133616 111301 11848 -154945 -246113 -129467 102600 213115 132703
37483 132703 33234 41858 55852 -49616 -186191 -193675 -116296 -139882 -286109 -363430 -247452
37472 -247452 -41567 102691 179759 247847 265559 147363 -57314 -165687 -66911 139668
37462 139668 242466 133939 -78154 -168981 -16290 275226 488416 520477 444117 351052
37452 351052 235621 81350 -45561 -99754 -179226 -396800 -657730 -730894 -563722 -365299
37442 -365299 -317996 -367034 -397571 -462157 -659686 -889112 -929674 -740887 -501567 -351826
37432 -351826 -269923 -215990 -205299 -187826 -51241 158816 206070 -6375 -231855 -187410 56815
37421 56815 205741 171457 131105 175832 168526 21906 -112360 -72958 53796 73708 -13007
37410 -13007 -23579 119062 262881 225464 15690 -200170 -300544 -309875 -303861 -280859 -185050
37399 -185050 -33553 69106 73827 56621 80058 71817 -52065 -212227 -251191 -147892 4701
37388 4701 195478 474818 747951 824584 730340 726703 905921 1002784 788842 445896 309696
37377 309696 394850 440666 327590 162903 2305 -212268 -415199 -399921 -126314 175564
37367 175564 304486 304599 294864 269175 186071 104791 101299 153793 204915 229221 166695 -69508
37355 -69508 -419424 -649401 -619434 -456855 -348446 -294689 -212795 -149404 -202257 -314942 -336285
37344 -336285 -237198 -114267 -33077 -14631 -99524 -250038 -266726 -20824 273348 258857 -85384
37333 -85384 -401045 -426612 -293573 -271046 -416645 -586395 -630069 -474485 -153096 153042
37323 153042 233870 95350 -37559 -24821 36324 31997 10434 19630 -39080 -224098 -387480
37312 -387480 -393315 -356594 -440405 -539413 -430091 -163570 -24738 -108069 -206620 -167825 -110265
37301 -110265 -189147 -341298 -382938 -234720 35719 289311 378519 247846 22242 -109219
37291 -109219 -124554 -160468 -255880 -266109 -88258 181198 381866 442095 345808 118382 -84817
37280 -84817 -71921 95497 108450 -146908 -359069 -207497 171027 384923 323011 205491
37270 205491 182524 184155 156162 157049 178680 117271 -20527 -102755 -113252 -180497 -303971 -299889
37258 -299889 -128204 -29606 -173752 -379180 -377543 -186579 -9805 91108 185037 233043
37248 233043 120224 -108487 -281571 -370672 -507273 -704585 -778682 -616288 -335840 -90428
37238 -90428 125979 358037 511536 449170 196417 -75056 -228805 -228808 -78315 175134 385089
37227 385089 386240 170964 -90731 -239424 -268750 -251490 -204791 -104957 5351 21961 -88121
37216 -88121 -222197 -249020 -140288 48588 287044 570662 808597 819688 534641 156779
37206 156779 3736 164483 401383 440450 284477 162642 222398 377464 454785 383294
37196 383294 201329 -23150 -200457 -219465 -55732 139214 172926 56133 1013 124492
37186 124492 267498 219839 42965 2555 184387 353516 274338 29285 -119630 -97716
37176 -97716 -61558 -87784 -23202 255630 585485 689048 539855 373245 336044 317868 200443
37165 200443 86120 114623 180052 59338 -208365 -309865 -84969 240765 367069 295862
37155 295862 242076 296809 371379 405432 428931 433441 367086 274682 279596 395510 504255
37144 504255 549759 595533 646182 587373 388060 199334 138719 121653 38807 -38815 25
37133 25 73498 12882 -158173 -249422 -188376 -92424 -52870 -27478 18198 29967 -9172 -6533
37121 -6533 110034 285946 423514 487132 482748 425954 373845 388689 419753 327794 91917
37110 91917 -115182 -140439 -37475 53763 108229 165775 166494 9349 -244045 -380868 -274232
37099 -274232 4200 312632 551453 629383 473499 160569 -72952 -64736 87916 167934
37089 167934 109150 25365 10663 34142 33156 -3829 -72425 -164212 -199440 -53354 268501
37078 268501 558985 615392 473820 338638 308524 285353 153463 -64794 -261863 -358959
37068 -358959 -332491 -216471 -122368 -167528 -323875 -415305 -328030 -145877 -11379 50096 67309
37057 67309 -14537 -246197 -493917 -529338 -327212 -126577 -139526 -312423 -439554 -417838
37047 -417838 -308655 -209319 -146782 -85530 -101 59682 -6765 -211500 -383662 -310042 8031
37036 8031 328915 442738 386644 336875 369700 413126 388730 314147 265140 279544 304299
37025 304299 241453 73707 -81087 -114174 -106368 -244848 -540184 -770179 -776506 -677480 -671883
37014 -671883 -757052 -800228 -797012 -860832 -984959 -1013927 -882110 -715662 -639882 -618593 -552732
37003 -552732 -430011 -307925 -240629 -285332 -481345 -738103 -835180 -649885 -333862 -147540
36993 -147540 -145196 -145217 -17966 126601 109456 -42164 -101493 75456 364995 532257 527503
36982 527503 527381 653575 754941 594225 223443 7438 191897 569429 718569 516283
36972 516283 240756 160493 213868 195023 96163 76028 153424 146626 -42996 -261835 -319245
36961 -319245 -254496 -258764 -386278 -475175 -367727 -128135 -9817 -222570 -715382 -1175951
36951 -1175951 -1296833 -1077717 -803562 -685194 -625657 -437324 -176720 -81941 -216140 -368200
36941 -368200 -336083 -149798 28658 82991 -24462 -252612 -458149 -511696 -491650 -605657
36931 -605657 -853312 -956684 -743764 -409201 -220446 -137645 42922 292865 376336 228487
36921 228487 43859 -30410 -53661 -95957 -102987 -47288 -32575 -126004 -210167 -117665 162450
36910 162450 490121 715025 755364 617580 404013 241896 160644 97862 39904 53433
36900 53433 140067 181700 112834 46707 122062 290950 375154 305260 197643 188609 273885
36889 273885 342004 319434 240633 177979 138460 74570 -2439 5266 139345 276972 262506
36878 262506 117974 16790 58217 176541 274818 330882 349798 324655 279971 257820 239266
36867 239266 183320 152519 262017 475831 614954 629982 693860 917416 1135031 1126085 927247
36856 927247 753106 689378 640713 537860 427496 361332 331518 325430 346863 385525 438781
36845 438781 531023 635979 641209 496254 335258 319853 407512 427578 355351 330833 393997
36834 393997 389353 205319 -42364 -166298 -137086 -50692 48769 179514 279786 189147 -165142
36823 -165142 -616083 -868274 -784571 -528097 -383442 -459955 -625381 -710061 -677071 -569908
36813 -569908 -410875 -233549 -129273 -155912 -248003 -305376 -322322 -342977 -349447 -303489 -249273
36802 -249273 -249505 -250100 -139535 66951 230556 286309 323399 444923 635869 787032 781114
36791 781114 564445 211891 -94540 -231103 -252435 -273330 -290493 -230869 -110649 97
36781 97 117954 282034 391687 306068 92515 -30751 -3775 39214 53442 149463 320254
36770 320254 371826 238827 116277 131332 133496 4092 -59965 174116 583146 843419
36760 843419 856096 755612 595823 316424 -19776 -232300 -273348 -243488 -159178 59278
36750 59278 351374 511466 474741 384807 307309 106685 -272527 -607828 -656279 -479126
36740 -479126 -341576 -373886 -489486 -587041 -669451 -745361 -733254 -535813 -184630 138227
36730 138227 259781 201845 156263 237165 326687 254941 70272 -12307 84495 203853 185956
36719 185956 44325 -137422 -337619 -546895 -712008 -818650 -926647 -1044726 -1082590 -1010568
36709 -1010568 -936996 -915391 -812564 -528499 -231477 -167690 -297099 -338384 -172442 6373
36699 6373 -18435 -223969 -442920 -565213 -564106 -454897 -323153 -287681 -340996 -320349 -132821
36688 -132821 82804 133259 35803 -22272 58892 205683 315466 354331 316193 217249 148918
36677 148918 207254 329390 323078 123189 -95027 -150759 -110519 -183241 -417329 -638923 -688974
36666 -688974 -601886 -514310 -485501 -464451 -391039 -282607 -229056 -310457 -502790 -674887 -713725
36655 -713725 -648081 -610640 -680879 -799961 -830880 -670451 -337148 -8943 70100 -170260
36645 -170260 -488951 -558479 -344805 -130821 -123761 -203577 -165896 -56714 -78477 -249475 -371729
36634 -371729 -328481 -212365 -114888 26911 273722 510279 560022 405598 186366 22541
36624 22541 -58920 -61644 -944 44708 -36984 -265917 -523059 -663622 -643522 -514297 -338508
36613 -338508 -155211 -4269 76329 97049 125814 215078 324799 347681 226079 32299
36603 32299 -85307 -43594 88345 147381 30038 -207419 -409542 -483940 -483646 -515180 -593563
36592 -593563 -627963 -540493 -355690 -169803 -68858 -78304 -152483 -208152 -205980 -195960 -236460
36581 -236460 -284043 -243568 -131332 -84434 -163674 -245783 -190973 -45555 18469 -68153 -185790
36570 -185790 -158781 70103 374866 531213 414565 134237 -98659 -241347 -424215 -645759
36560 -645759 -658657 -307646 184188 477019 544153 599617 685298 627938 401767 231910
36550 231910 262724 379306 453172 521513 599125 548755 312281 80583 43801 122660 132069
36539 132069 74006 68928 111155 108291 89399 164129 315626 423438 467907 541585 675260
36528 675260 804993 886358 891483 728925 340391 -131066 -434747 -485045 -407643 -331386 -287170
36517 -287170 -299072 -400451 -538444 -612404 -622403 -640603 -646072 -556960 -422429 -389233 -461996
36506 -461996 -501166 -485486 -545881 -683397 -709599 -573250 -483787 -546293 -526182 -207183 227451
36495 227451 449911 466309 525342 642631 567095 237077 -50395 -31158 199993 373811
36485 373811 373667 253628 80030 -96874 -193923 -141869 43942 291154 520896 646043
36475 646043 603827 438937 281640 201886 159487 125630 143547 209763 212952 93291 -24987
36464 -24987 22258 217531 393193 440155 378617 264566 153805 141968 301937 552584
36454 552584 697504 636097 458385 306264 229340 213095 253052 328925 366155 295867 126538
36443 126538 -79614 -257769 -342383 -294920 -186931 -175329 -303514 -391752 -246416 54905
36433 54905 224714 119831 -99231 -205281 -175261 -138601 -146295 -109473 53545 296457 479868
36422 479868 487780 322566 119605 48387 163376 365375 520446 568708 494772 279420
36412 279420 -30727 -262789 -251107 -37117 159462 189034 112545 72577 109642 160578 182998
36401 182998 210818 288731 386468 399770 261966 64802 12151 188344 414155 432456 220298
36390 220298 -3588 -86538 -105063 -165895 -212518 -166970 -135932 -276884 -509716 -574189 -397469
36379 -397469 -208689 -209335 -302233 -282900 -169154 -150692 -260288 -294995 -102135 212855 440117
36368 440117 505845 460485 327894 111867 -85630 -106904 71254 297130 423973 429139
36358 429139 324807 87707 -224047 -394836 -243923 143293 505795 702583 779739 758909
36348 758909 549018 147180 -227098 -342483 -228168 -99637 -47938 48506 273851 466950
36338 466950 366864 -72256 -601455 -920747 -937224 -759338 -520568 -304149 -200329 -285948
36328 -285948 -490996 -606941 -528704 -399443 -397420 -464197 -408116 -224384 -105501 -122610 -109468
36317 -109468 62024 276735 357357 295964 178634 19274 -173730 -271579 -148159 112744
36307 112744 281708 237607 54186 -124731 -195930 -139271 -57630 -112177 -306492 -415394
36297 -415394 -262730 20198 180588 197154 234579 316937 313354 237844 273864 438716 495291
36286 495291 309537 54266 -76592 -122753 -158863 -72874 217137 495241 472926 192556
36276 192556 -49579 -122654 -142788 -162148 -64831 163413 311683 222677 27503 -33077 93378
36265 93378 273102 391845 428589 382783 261986 136144 102262 172287 254119 261345 204677
36254 204677 164211 197613 281789 327493 255537 82250 -71772 -85722 39325 184051 243636
36243 243636 222425 171611 81130 -87725 -271948 -316522 -167729 29056 105827 72669 36059
36232 36059 -10730 -150587 -318331 -312599 -88730 136490 175731 119522 159396 280903 302833
36221 302833 166257 23293 43394 244323 506673 665911 615475 410365 241118 220251
36211 220251 240196 141034 -40153 -119596 -28452 117000 187293 145649 3138 -181123 -264484
36200 -264484 -147286 57594 144947 118723 190462 441115 682385 733057 649221 576210 539338
36189 539338 501142 471513 429361 282967 55729 -34461 138693 365783 346232 88710
36179 88710 -142938 -216781 -231743 -250605 -179498 31212 260485 376881 392319 387440 392039
36168 392039 395622 383867 321226 178234 143 -131394 -205212 -254235 -244980 -133573 -21652
36157 -21652 -72858 -240325 -278447 -108497 31068 -65036 -259520 -309501 -260744 -351132 -596784
36146 -596784 -754526 -715394 -676080 -817228 -1013644 -1019512 -816559 -610607 -539970 -546001 -531370
36135 -531370 -505939 -516387 -517211 -401198 -147330 121265 249397 199917 77424 14842 55059
36124 55059 142956 213293 267217 356262 497587 625314 649174 555710 413521 269299 94636
36113 94636 -122201 -290283 -307872 -215717 -162005 -216362 -320987 -434593 -590825 -756629
36103 -756629 -772366 -558467 -292618 -231853 -394116 -555617 -553130 -450098 -384416 -385764 -402170
36092 -402170 -405677 -393251 -340599 -221079 -41007 177127 404729 572436 584774 427029
36082 427029 224502 135497 188870 265640 244629 139973 76235 129155 222166 229096 169618
36071 169618 207924 411582 623432 683394 672436 752989 834268 657265 245631 -7729
36061 -7729 151434 474321 558504 381227 227914 210817 162011 -21152 -218265 -319172
36051 -319172 -354110 -304999 -35814 434902 787358 727750 358490 46840 -9198 73201
36041 73201 101548 32162 -48593 -43900 78007 253841 359298 318530 166442 -27573 -239951
36030 -239951 -438567 -522686 -421785 -210898 -19062 145864 365110 621365 774484 741579
36020 741579 590851 431221 306730 222383 170587 96172 -64412 -261711 -344730 -251294
36010 -251294 -103219 -47503 -78091 -85747 -16980 97168 219177 330237 410843 465576 538106
35999 538106 641609 706192 652273 481614 246743 -12234 -231293 -295523 -165820 5822
35989 5822 20681 -109688 -180529 -86836 35545 16792 -123057 -248773 -310295 -343943 -326419
35978 -326419 -171097 112407 364159 434391 339525 209105 119737 40830 -73472 -206771
35968 -206771 -314935 -386113 -421604 -389069 -261864 -105959 -54675 -157509 -306429 -363969
35958 -363969 -322519 -272415 -247376 -192905 -89706 -19432 -69621 -224521 -377855 -416618 -290136
35947 -290136 -62196 87128 -8698 -314859 -585372 -596040 -364397 -112844 -51436 -214127
35937 -214127 -450161 -549220 -441439 -300456 -357282 -573773 -633139 -349245 53622 225004
35927 225004 133193 16503 -20161 -78559 -146257 -27845 285867 465890 270960 -79562
35917 -79562 -198222 -50547 71418 -447 -162127 -302867 -435810 -527766 -456445 -236109
35907 -236109 -86364 -155873 -318595 -346329 -167552 118877 355742 376703 95928 -335283
35897 -335283 -587477 -493169 -228599 -59631 -40043 -82582 -166755 -282190 -291493 -88544 166962
35886 166962 204886 11685 -170414 -192096 -119727 -12916 166233 366630 410877 243847
35876 243847 21476 -141184 -310147 -515278 -610042 -509236 -384339 -436385 -617694 -756737
35866 -756737 -814003 -814923 -675665 -352343 -68283 -105234 -384952 -522139 -323217 -2697
35856 -2697 144727 75103 -71006 -170745 -155756 -1260 211350 322879 266725 130557 12698
35845 12698 -76593 -140794 -154370 -144525 -191242 -291167 -340489 -300458 -250403 -229990 -177927 -87229
35833 -87229 -55196 -95467 -76772 38137 74054 -82112 -253342 -207619 11018 185582 245873
35822 245873 268173 247294 108008 -100282 -241017 -290514 -294256 -179452 131704 445376
35812 445376 432781 99311 -162702 -92852 121221 181560 91465 41627 80790 122484 150795
35801 150795 202504 228898 177697 155542 313865 597776 785467 776719 689117 656803 669069
35790 669069 631885 480564 212351 -101035 -325587 -376316 -315521 -257482 -197553 -47671
35780 -47671 171289 312164 302829 234183 198141 161741 78123 13213 52993 151666 186290
35769 186290 134885 98201 145118 223555 247029 201852 126951 28761 -126491 -333422 -505634
35758 -505634 -553996 -501891 -474595 -539694 -590708 -455873 -131952 157775 192409 6916 -153492
35747 -153492 -135608 -57259 -128730 -349455 -489292 -383331 -132883 57077 138639 186313
35737 186313 168186 -45903 -413414 -655651 -590064 -386267 -336223 -471531 -591045 -602463
35727 -602463 -616306 -693772 -720232 -611803 -475108 -441208 -463279 -413753 -301566 -249612 -288725
35716 -288725 -308573 -229884 -124916 -116143 -200206 -223132 -41466 301184 584382 624244 455722
35705 455722 257181 123280 2586 -144091 -249651 -256205 -206160 -128981 55187 384096
35695 384096 675522 667993 340853 -39251 -206916 -114641 145480 475289 749654 807064
35685 807064 609720 350759 259042 315497 297841 113411 -65808 -71248 -3764 -87835 -332115
35674 -332115 -515314 -513555 -454677 -468067 -453103 -255187 43151 214227 223444 252020 362259
35663 362259 370866 153732 -123375 -234507 -204725 -207083 -250210 -173906 82635 393275 617415
35652 617415 700954 615560 369143 95262 -30111 1682 46239 48141 94386 182207 139803
35641 139803 -104208 -349889 -388534 -303846 -322428 -450834 -470270 -273296 -19598 70034
35631 70034 -67014 -349425 -650792 -831027 -779304 -508435 -164914 91090 180204 84977
35621 84977 -174474 -506347 -760383 -841368 -789251 -716861 -692428 -702723 -702011 -672758 -650539
35610 -650539 -690174 -787437 -850893 -795030 -650363 -526753 -475948 -459096 -446919 -456382 -458381
35599 -458381 -352281 -108909 133054 207277 115225 -11040 -110074 -239671 -416215 -527699
35589 -527699 -475507 -321043 -194642 -96197 102589 439451 742701 801591 609251 358563
35579 358563 210770 148095 69846 -47865 -146451 -190512 -206140 -219761 -210290 -130012 50038
35568 50038 303116 529533 603379 483571 265494 80200 -37102 -125816 -176382 -117277
35558 -117277 62121 255210 340201 286860 141220 -33911 -170510 -207083 -138579 -23436
35548 -23436 85871 180332 244217 226925 106174 -63993 -202596 -259893 -213878 -82194 32943
35537 32943 6985 -134788 -198074 -61817 146096 233037 226690 317196 542414 702054 614162
35526 614162 315719 -35890 -328251 -493625 -465161 -241050 68040 338496 537937 674462
35516 674462 710567 619386 491340 486078 662561 908065 1050299 1017733 886534 774769
35506 774769 686982 494373 122032 -273097 -420047 -253774 -4215 93779 66701 84137
35496 84137 183508 260353 266318 240557 158143 -66383 -375981 -536953 -408454 -131317 65822
35485 65822 161817 306479 534139 678036 610465 439787 366477 400602 344202 75963 -246048
35474 -246048 -352801 -199367 -25202 -54269 -232875 -343928 -309109 -247439 -245027 -218526 -81373
35463 -81373 71330 82790 -3649 34481 267411 438484 250999 -223680 -576388 -523101
35453 -523101 -204067 50711 125855 149290 206359 235842 215864 235963 296101 223442 -65386
35442 -65386 -371180 -464876 -416566 -453913 -573303 -557070 -367818 -243295 -327761 -470182 -517425
35431 -517425 -566138 -726777 -831233 -631574 -186320 204196 403580 541597 715500 826772
35421 826772 774530 615927 445777 272861 114515 77878 218711 404571 443634 307243
35411 307243 125511 -4000 -102379 -208904 -282354 -238797 -58774 164680 291556 264511
35401 264511 171218 148199 225278 308191 310381 232113 95033 -109373 -346736 -493591 -461332
35390 -461332 -334426 -292258 -396164 -531382 -567506 -500669 -406458 -314040 -184362 5688
35380 5688 206333 336121 364779 344461 361311 461020 615596 742946 752542 607399 383139
35369 383139 245982 307638 489693 586842 481335 235309 -46097 -347335 -666735 -893254
35359 -893254 -887508 -668414 -405252 -219922 -107361 -65050 -159078 -380917 -555056 -521633
35349 -521633 -355549 -266634 -295377 -245721 46599 492984 855244 978602 858486 566692
35339 566692 210893 -88665 -286795 -445480 -588011 -579470 -301095 77102 189295 -97344
35329 -97344 -506827 -702719 -666771 -602371 -600271 -590975 -546315 -510325 -448406 -275345 -56060
35318 -56060 18958 -88720 -197017 -183465 -144545 -169061 -146460 26031 197037 140725 -100466
35307 -100466 -274155 -284115 -277836 -356857 -417270 -355861 -259958 -271390 -370481 -417760 -356892 -277442
35295 -277442 -294437 -426074 -576632 -606310 -443334 -158047 93375 213159 225967 203942
35285 203942 181224 153757 105696 13272 -122504 -223597 -181883 -4955 141522 103421 -78500
35274 -78500 -218777 -212748 -152239 -195671 -359382 -481549 -405621 -172337 11793 -6637 -197595
35263 -197595 -447433 -696426 -907938 -992959 -900762 -743117 -674262 -653241 -495863 -194985
35253 -194985 704 -73649 -247848 -255897 -102953 -11330 -74140 -163361 -173226 -169658 -254401
35242 -254401 -423824 -623413 -830567 -1012859 -1087208 -995827 -778152 -520476 -277694 -77971
35232 -77971 53411 126831 201192 307594 387282 359113 233914 110882 61016 60497 56548
35221 56548 61972 138630 283799 378463 297346 64985 -149812 -214589 -163474 -116865 -118412
35210 -118412 -107482 -29010 88831 165994 144083 39152 -50334 -15058 147997 321811 411952
35199 411952 449984 492039 485476 354826 176943 113831 163993 146847 -8726 -120378 -5068
35188 -5068 249569 402992 359944 200047 -20043 -301890 -549250 -580623 -379145 -179348
35178 -179348 -184927 -301836 -295076 -151959 -110805 -297943 -495648 -388435 35854 461206
35168 461206 602278 465055 231437 20911 -139272 -204015 -123584 38573 129120 86066
35158 86066 9781 12840 79548 128393 140809 151942 162121 141107 98807 76662 76016 61534
35146 61534 34201 34036 59146 47195 -32351 -118966 -137092 -98615 -79258 -105174 -116608 -57399
35134 -57399 47518 143332 239506 382510 532631 555406 395493 198476 166970 314398
35124 314398 454334 438078 309795 201433 164809 157848 128362 59710 -12243 10615 217532
35113 217532 568246 911332 1151619 1298472 1310176 1054825 557093 139102 107421 368852
35103 368852 567658 560535 513979 531539 470599 233927 -8039 -63016 -249 11067 2208
35092 2208 109198 258586 204864 -104090 -405332 -427469 -182962 96570 207342 112780
35082 112780 -67483 -161255 -101453 3060 15596 -33277 -7066 96692 122019 5336 -104058
35071 -104058 -54895 101670 214024 227555 176197 77479 -41743 -96351 -50913 -10539 -67274
35060 -67274 -117491 3860 240784 351230 237144 66205 20143 84615 164413 258980 405948
35049 405948 546016 563125 417328 171717 -54357 -113700 83621 425673 633011 549626
35039 549626 329576 227887 288665 372668 407999 429997 419670 316859 202875 253484 450993
35028 450993 548240 422157 277341 354669 595505 773320 833814 893124 981151 1031562 1109857
35017 1109857 1391770 1844493 2155964 2118639 1917638 1873032 2018710 2131530 2103736 2052979
35007 2052979 2047505 1952277 1664449 1337953 1203457 1247483 1249055 1112857 987368 1015974 1132413
34996 1132413 1187853 1146108 1032058 797902 411597 25342 -136728 -79413 -58218 -241412
34986 -241412 -492711 -577957 -467590 -314474 -212330 -115117 25280 160281 209289 162289
34976 162289 95832 104254 208173 330940 397757 440139 525246 601236 555206 450895 519239
34965 519239 806018 1020987 923996 700304 701730 930580 1089965 1095782 1171656 1373151 1394051
34954 1394051 1046791 639865 597203 887780 1117391 1064761 834636 546240 188660 -175546
34944 -175546 -342710 -233011 -46867 -25619 -167997 -297148 -323196 -317155 -360174 -429452 -451971
34933 -451971 -408872 -347534 -305334 -260958 -187675 -128253 -153715 -243476 -286187 -233349 -165865
34922 -165865 -148822 -113603 17701 168899 197697 99614 -5524 -55951 -78247 -59230 54862
34911 54862 222930 325095 338220 345196 338649 189744 -109883 -338567 -298617 -62047 157835
34900 157835 276572 347140 383307 330138 181056 392 -155707 -250179 -238690 -141332 -102222
34889 -102222 -245025 -474039 -547706 -372415 -111617 31787 36941 13432 20993 34803 51182
34878 51182 124974 270442 386180 353741 215382 168169 303300 408966 176570 -381442
34868 -381442 -877415 -993040 -834600 -716066 -721601 -682909 -517975 -352919 -291679 -278983
34858 -278983 -257159 -280050 -386380 -514132 -629713 -787903 -954968 -936453 -648642 -335803
34848 -335803 -307971 -522767 -635849 -450929 -114899 156546 334322 465286 488736 328344
34838 328344 77518 -73757 -82220 -93230 -225046 -414798 -517568 -478987 -351888 -197241
34828 -197241 -47784 44883 10636 -154704 -347402 -438448 -380353 -211490 6037 206575
34818 206575 313318 283265 157101 3381 -177534 -413877 -628820 -660431 -464838 -202037
34808 -202037 -47125 1067 42446 96714 122118 151592 265926 443042 558573 542403 436014
34797 436014 308043 223958 275649 493184 726654 782852 706097 738113 939947 1064405
34787 1064405 927620 699137 621181 605858 384535 -17966 -251859 -109340 225706 464789
34777 464789 536936 522389 455184 339864 234850 168369 59549 -139774 -303189 -280800
34767 -280800 -139315 -85490 -161869 -188082 -43636 146466 202412 154033 181671 339388 479836
34756 479836 477880 406004 403503 448055 380777 146731 -113425 -247045 -251397 -187455 -51407
34745 -51407 148383 288030 280774 280607 511929 877303 975393 621482 145299 -7302 174579
34734 174579 318500 178283 -131942 -378307 -454737 -363239 -153042 39475 49898 -108184
34724 -108184 -205641 -70229 183376 298251 194009 34142 -7878 46975 44716 -82172
34714 -82172 -208860 -159717 54081 198881 68479 -274670 -578664 -685062 -637047 -530068
34704 -530068 -385185 -199484 -12927 122622 164694 58523 -194037 -419113 -369436 -17509
34694 -17509 371366 550983 561676 575919 599232 489588 205279 -137513 -428051 -628671
34684 -628671 -690907 -559192 -285000 -17388 149276 225091 220362 109577 -74163 -220105
34674 -220105 -264146 -254967 -264988 -308471 -367222 -416246 -402478 -280605 -92686 66128 168700
34663 168700 245557 250754 76757 -248363 -513545 -556967 -437774 -297659 -169674 -28320
34653 -28320 88213 149228 234689 399555 492191 302030 -105611 -382452 -287742 39741
34643 39741 265885 216083 -24700 -276830 -427105 -452910 -372969 -206599 24914 263240
34633 263240 413052 425616 368986 351109 371338 320748 147931 -51148 -145304 -102349 32834
34622 32834 221671 418854 525147 447089 205032 -73416 -262109 -299762 -183709 14140
34612 14140 130625 11905 -317979 -644726 -769610 -692371 -552132 -437158 -324020 -179250
34602 -179250 -26958 110318 259740 423411 500529 373319 78746 -185217 -274462 -266411
34592 -266411 -335617 -484461 -508037 -277266 33780 118302 -85422 -307790 -276465 -26562
34582 -26562 195513 252416 211276 149272 19377 -230619 -509813 -648812 -571536 -335126
34572 -335126 -36844 239329 398696 353307 116982 -144102 -210609 -1646 325019 506814
34562 506814 452410 340968 370796 464522 378990 98842 -106387 -112668 -183581 -558463 -989604
34551 -989604 -1020439 -647258 -333125 -329762 -364057 -147121 155345 226318 113473 116412 303687
34540 303687 463844 469393 392464 285436 132037 24300 105555 284353 273404 10677
34530 10677 -199098 -94491 197844 379105 357894 239203 86369 -94763 -218790 -173959
34520 -173959 6311 175509 262555 305223 322573 286445 213784 164261 133540 52588 -86233
34509 -86233 -188364 -168992 -45242 100818 205678 264973 325956 432867 554782 598509
34499 598509 524150 398583 290947 181765 42353 -71419 -105613 -127205 -235879 -398319
34489 -398319 -495924 -501080 -464663 -361217 -127306 137954 210590 48134 -118147 -95579 25352
34478 25352 63840 33463 53932 83491 -37375 -291671 -444046 -352728 -171745 -146738 -298640
34467 -298640 -412326 -308437 -41483 188915 274812 295634 363778 425648 302270 -57117
34457 -57117 -454617 -644015 -587755 -436528 -317033 -252521 -251441 -324670 -395445 -325969 -88758
34446 -88758 186419 380329 491248 521595 395948 113200 -126858 -121248 49474 101277
34436 101277 -78401 -294251 -326240 -202077 -100242 -98423 -136600 -155670 -141032 -58460 123658
34425 123658 332223 412106 295361 89822 -35118 -12060 93169 170785 162526 97059 50344
34414 50344 58126 74922 45642 -3082 5925 87735 170694 180283 93378 -69679 -226164 -230550
34402 -230550 -23516 207972 178185 -125939 -381280 -347261 -189798 -214070 -404156 -470117
34392 -470117 -300876 -104784 -63647 -88403 -19978 119499 208001 211679 155258 19771 -185969
34381 -185969 -335667 -310535 -160167 -14364 111499 289346 494763 594889 522592 347460
34371 347460 162749 -2116 -145121 -249220 -287135 -216255 -1181 283060 425259 284374
34361 284374 -81 -148963 -102370 -84135 -266025 -523006 -617228 -510250 -376333 -370086
34351 -370086 -481380 -583158 -547748 -350396 -117784 -33902 -142830 -291389 -320149 -247764
34341 -247764 -192058 -176547 -130652 -52115 -38685 -129477 -211112 -140005 85272 317057 405524
34330 405524 325863 165414 6563 -150384 -330172 -484652 -525984 -462878 -413316 -438291
34320 -438291 -452875 -377223 -289914 -317454 -431312 -494578 -484572 -512103 -600404 -603670 -419797
34309 -419797 -159427 555 46284 93718 175298 184110 35589 -210650 -423533 -537042
34299 -537042 -579567 -605515 -642379 -699954 -790584 -906285 -982900 -934326 -754685 -554227 -444658
34288 -444658 -407969 -335526 -180154 5658 175168 329764 434450 409520 277858 212812
34278 212812 318435 429719 284249 -112774 -442657 -444525 -223306 -103926 -242423 -477909
34268 -477909 -559077 -434307 -279327 -275521 -418936 -566660 -626580 -632579 -632350 -594047 -489585
34257 -489585 -399155 -419874 -492396 -444897 -235002 -28026 30656 16794 95593 257111 320258
34246 320258 199206 45028 74998 336944 693935 983138 1122604 1096156 924095 681497
34236 681497 496747 471300 582543 684188 626425 385896 75529 -172597 -324690 -444330
34226 -444330 -591034 -739398 -802104 -722870 -536815 -333015 -159618 13273 213442 366857
34216 366857 336543 90418 -215394 -377485 -350204 -250586 -171765 -80484 65610 185700
34206 185700 154656 -12075 -146803 -121534 17381 136574 174328 158995 117023 43459 -40851
34195 -40851 -77372 -41412 25717 85670 155402 246907 300728 252869 152067 127235 219948
34184 219948 322755 321776 234394 150214 100321 73913 119824 305253 563162 705011 643213
34173 643213 501851 427780 382178 236776 17170 -103163 -56779 11421 -55996 -229595
34163 -229595 -358257 -346174 -193751 52325 290004 364853 205192 -59042 -213358 -191392
34153 -191392 -102118 -39803 12831 73480 85150 25152 -11759 60967 175247 193038 107327
34142 107327 56976 143965 325045 497614 608904 644785 582756 422605 234397 112074
34132 112074 72073 35821 -70631 -220074 -305764 -250312 -73732 141102 316601 399031
34122 399031 351074 182806 -13913 -117561 -86106 13445 87281 87031 5723 -123583 -197647
34111 -197647 -95024 169363 395235 390672 194627 26669 22415 98812 95684 -20188 -131450
34100 -131450 -115824 18801 144928 159173 104219 108113 199346 260640 214821 168574 268479
34089 268479 472653 594914 552601 437389 343730 269099 204960 178415 151805 22611 -197184
34078 -197184 -325575 -228677 11628 242882 440853 636955 747155 641090 345114 31505
34068 31505 -179977 -288191 -303314 -214730 -73111 25854 69231 132222 229621 268327 189837
34057 189837 63746 -20222 -79388 -187661 -338832 -424872 -350086 -140815 69205 177570
34047 177570 235725 378400 599340 680596 443849 21395 -252419 -215200 -24777 72141
34037 72141 -4878 -175238 -331175 -396705 -340391 -203499 -68659 37173 155506 294368
34027 294368 392578 420002 435975 504997 621152 751001 879647 978235 999473 944266 866580
34016 866580 789539 697138 624224 647729 757949 852270 888366 908993 878180 673777 334598
34005 334598 126006 205550 378085 361884 165472 435 -61585 -108426 -145877 -97972 -21292
33994 -21292 -61107 -177534 -157983 51482 252891 297252 257922 214398 80544 -211091 -522403
33983 -522403 -662887 -616499 -491482 -352651 -221010 -131415 -64132 83335 324521 473309
33973 473309 353568 63021 -116596 -50692 119698 162839 -19580 -327720 -544528 -511788
33963 -511788 -291137 -108556 -89977 -131608 -98582 -36437 -59208 -124845 -91592 47728 152849
33952 152849 143080 73385 15755 4449 86938 279559 473273 537975 527862 616295 805361
33941 805361 890320 773937 618317 568398 505413 252022 -99447 -267772 -143277 114446
33931 114446 326545 472069 591976 673939 703494 715780 707769 578010 258787 -124476
33921 -124476 -328660 -243320 2414 203410 280966 277649 220614 96131 -47967 -93702 -6165
33910 -6165 88262 60407 -44604 -89442 -61968 -82784 -198752 -307153 -327719 -320323 -346813
33899 -346813 -323115 -136911 139335 289731 216299 50041 -38377 -59258 -167296 -433236
33889 -433236 -721870 -830089 -724151 -586890 -597192 -700617 -672829 -413645 -91185 56110
33879 56110 -7328 -115850 -134804 -93737 -86683 -130116 -164569 -149447 -108538 -96883 -153771 -281126
33867 -281126 -438776 -550927 -539845 -391619 -204368 -135253 -248387 -422775 -468013 -338329
33857 -338329 -168669 -82187 -47050 22821 111836 146144 135764 151810 187392 176881 158658
33846 158658 261351 464456 523955 270617 -114359 -290521 -192386 -97230 -231030 -472536
33836 -472536 -540094 -344498 -26410 266372 471078 517136 340035 40892 -133283 -72598
33826 -72598 53921 54966 -3584 59684 214097 260246 184201 209909 415951 540418 344496
33815 344496 -1846 -126943 38305 202789 145958 -23330 -89082 -13198 101484 186829
33805 186829 221572 156663 -43910 -315597 -529193 -600104 -523934 -352370 -186097 -139848
33795 -139848 -241514 -385748 -436505 -357318 -217438 -116883 -132373 -262654 -374674 -291125
33785 -291125 -20752 177487 82859 -190885 -335218 -254048 -155425 -213408 -323305 -289069
33775 -289069 -110387 52842 113917 116470 106699 85143 70170 83258 63475 -85049 -327532
33764 -327532 -483442 -432959 -265733 -168797 -226266 -386229 -567657 -719619 -798115 -762173
33754 -762173 -610405 -394387 -199489 -119083 -198357 -359802 -433531 -334417 -177789 -133953
33744 -133953 -190020 -169152 -453 153524 103639 -124914 -342251 -414008 -336294 -146159
33734 -146159 116726 357029 440184 310110 52402 -170702 -223092 -68617 183949 325474
33724 325474 224573 -27643 -223069 -286892 -332148 -453733 -579901 -583172 -453685 -300264
33714 -300264 -239160 -317922 -471179 -519068 -319754 16781 192088 86719 -73179 -51306
33704 -51306 42820 -52359 -299321 -379782 -156648 158129 356250 484481 616805 624581 387664
33693 387664 70800 -48756 50480 146025 100352 -20043 -128401 -221308 -280489 -243221 -116567
33682 -116567 6970 80171 134497 172324 156833 122700 143070 150323 -35669 -412731 -687243
33671 -687243 -590580 -197481 192295 387674 388579 242343 10530 -163038 -153454 -50837 -87372
33660 -87372 -310667 -475309 -352913 -40353 161128 114450 -32096 -83992 -45738 -80461
33650 -80461 -291874 -608814 -860379 -910483 -732117 -423291 -177251 -165371 -371464 -566876
33640 -566876 -529777 -290404 -87031 -74023 -158902 -153380 8373 257976 511630 709034
33630 709034 782478 685911 456705 199015 11671 -55205 -27920 -24003 -157771 -369823 -436121
33619 -436121 -232369 94767 321903 417285 474162 475516 335467 132012 55575 97824 28249
33608 28249 -236418 -458323 -407025 -180583 -34721 -35750 -72591 -111347 -220818 -373287 -421872
33597 -421872 -320095 -226043 -314643 -544725 -664318 -451832 33954 456913 528299 339708
33587 339708 263891 483405 763045 790552 590904 427816 403924 382240 268117 147871
33577 147871 120548 168361 232313 269948 213404 21718 -194782 -255989 -152698 -43837 25627
33566 25627 206065 549849 835176 844576 673618 574905 592879 556728 392149 235566 217310
33555 217310 299108 387170 482037 629210 788224 839345 718702 505349 356156 352492 421859
33544 421859 432947 354972 266736 202405 78047 -167736 -433455 -551763 -490963 -358856
33534 -358856 -222293 -43677 171617 283420 174206 -51965 -145559 -7481 181434 188629
33524 188629 26066 -78748 13288 201623 332796 407704 501981 580960 544280 410521
33514 410521 304456 273857 269308 301576 444451 652187 761345 745245 781737 956753 1076170
33503 1076170 932649 623051 416971 403656 452731 454780 410664 322692 182291 49447
33493 49447 -22555 -118288 -335085 -544593 -498854 -214269 -32080 -192797 -523228 -679866
$$ [...]
##END NTUPLES=NMR SPECTRUM
##END=
