##TITLE=31Pdec_DE-82msdek_TFA
 CDCl3, 64 sc
 27.3.2025
##JCAMPDX= 6.0         $$ Bruker NMR JCAMP-DX V2.0
##DATA TYPE= NMR SPECTRUM
##DATA CLASS= NTUPLES
##ORIGIN= UXNMR, Bruker Analytische Messtechnik GmbH
##OWNER= root
$$ XWIN-NMR		Version 3.5
$$ Thu Mar 27 13:51:54 2025 Russian Standard Time (UT+4h)  she@DPX200
##.OBSERVE FREQUENCY= 81.013821
##.OBSERVE NUCLEUS= ^31P
##.ACQUISITION MODE= SIMULTANEOUS
##.ACQUISITION SCHEME= undefined
##.AVERAGES= 64
##.DIGITISER RES= 17
##SPECTROMETER/DATA SYSTEM= spect
##.PULSE SEQUENCE= zgpg30
##.SOLVENT NAME= CDCl3
##.SHIFT REFERENCE= (INTERNAL, CDCl3, 0, 198.062)
##AUDIT TRAIL= $$ (NUMBER, WHEN, WHO, WHERE, WHAT)
$$ ##TITLE= Audit trail, XWIN-NMR		Version 3.5
$$ ##JCAMPDX= 5.01
$$ ##ORIGIN= Bruker BioSpin GmbH
$$ ##OWNER= she
$$ F:/spectra/data/she/nmr/P31/2/pdata/1/auditp.txt
$$ ##AUDIT TRAIL=  $$ (NUMBER, WHEN, WHO, WHERE, WHAT)
(   1,<2025-03-27 13:50:01.00 +0400>,<she>,<DPX200>,
      <created by zg, POWCHK disabled, PULCHK disabled
       configuration hash MD5:
       00 E9 B6 7A A2 85 ED C7 34 08 36 98 17 FE 4E 26
       data hash MD5: 32K
       01 A7 0E BF 47 C7 52 CE 87 60 E0 40 DD 66 9C 06>)
(   2,<2025-03-27 13:50:03.23 +0400>,<she>,<DPX200>,
      <Start of raw data processing
       efp BC_mod = 2 LB = 1.5 FT_mod = 6 PKNL = 1 PHC0 = 1349.76 PHC1 = 184.4942 SI = 64K 
       data hash MD5: 64K
       12 72 55 33 B7 17 98 24 EA 3A 6C AD 83 27 01 4F>)
(   3,<2025-03-27 13:51:13.90 +0400>,<she>,<DPX200>,
      <pk PHC0 = 39.12751 PHC1 = 0 
       data hash MD5: 64K
       39 D7 A0 12 DE 93 81 D8 2C 6B 4A 24 E2 E0 B7 2B>)
$$ ##END=
$$ 
$$ hash MD5
$$ 66 25 9E C6 A7 2D 8F E8 77 E1 5A B3 71 AC 48 ED
##$RELAX= 
##$RELAX= 
##$RELAX= 
##$RELAX= 
##$RELAX= 
##$RELAX= 
##$RELAX= 
##$RELAX= 
$$ Bruker specific parameters
$$ --------------------------
##$DU= <F:/spectra>
##$EXPNO= 2
##$NAME= <P31>
##$PROCNO= 1
##$TYPE= <nmr>
##$USER= <she>
##$AMP= (0..31)
100 100 100 100 100 100 100 100 100 100 100 100 100 100 100 100 100 100 
100 100 100 100 100 100 100 100 100 100 100 100 100 100 
##$AQSEQ= 0
##$AQ_mod= 1
##$AUNM= <au_zg>
##$AUTOPOS= <>
##$BF1= 81.014009
##$BF2= 200.13
##$BF3= 200.13
##$BF4= 200.13
##$BF5= 200.13
##$BF6= 200.13
##$BF7= 200.13
##$BF8= 200.13
##$BYTORDA= 1
##$CFDGTYP= 0
##$CFRGTYP= 5
##$CHEMSTR= <none>
##$CNST= (0..31)
1 1 145 1 1 1 1 1 1 1 1 1 1 1 1 1 1 1 1 1 1 1 1 1 1 1 1 1 1 1 1 1 
##$CPDPRG= <waltz16>
##$CPDPRG1= <>
##$CPDPRG2= <waltz16>
##$CPDPRG3= <>
##$CPDPRG4= <mlev>
##$CPDPRG5= <mlev>
##$CPDPRG6= <mlev>
##$CPDPRG7= <mlev>
##$CPDPRG8= <mlev>
##$CPDPRGB= <>
##$CPDPRGT= <>
##$D= (0..31)
0 1 0 0 0 0 0 0 0 0.06 0 0.03 2e-05 3e-06 0 0 0.0002 0 0 0 0 0 0 0 0 0 
0 0 0 0 0 0 
##$DATE= 1743069000
##$DBL= (0..7)
120 120 120 11 120 120 24 19 
##$DBP= (0..7)
150 150 150 150 150 150 150 150 
##$DBP07= 0
##$DBPNAM0= <>
##$DBPNAM1= <>
##$DBPNAM2= <>
##$DBPNAM3= <>
##$DBPNAM4= <>
##$DBPNAM5= <>
##$DBPNAM6= <>
##$DBPNAM7= <>
##$DBPOAL= (0..7)
0.5 0.5 0.5 0.5 0.5 0.5 0.5 0.5 
##$DBPOFFS= (0..7)
$$ [...]
##$SUBNAM2= <"">
##$SUBNAM3= <"">
##$SUBNAM4= <"">
##$SUBNAM5= <"">
##$SUBNAM6= <"">
##$SUBNAM7= <"">
##$SUBNAM8= <"">
##$SUBNAM9= <"">
##$SW= 400.765351723535
##$SWIBOX= (0..15)
0 1 3 0 0 0 0 0 0 0 0 0 0 0 0 0 
##$SW_h= 32467.5324675325
##$TD= 32768
##$TD0= 1
##$TE= 0
##$TE2= 300
##$TE3= 300
##$TEG= 300
##$TL= (0..7)
0 120 53 12 22 120 120 120 
##$TP= (0..7)
150 150 150 150 150 150 150 150 
##$TP07= 0
##$TPNAME0= <>
##$TPNAME1= <>
##$TPNAME2= <>
##$TPNAME3= <>
##$TPNAME4= <>
##$TPNAME5= <>
##$TPNAME6= <>
##$TPNAME7= <>
##$TPOAL= (0..7)
0.5 0.5 0.5 0.5 0.5 0.5 0.5 0.5 
##$TPOFFS= (0..7)
0 0 0 0 0 0 0 0 
##$TUNHIN= 0
##$TUNHOUT= 0
##$TUNXOUT= 0
##$USERA1= <user>
##$USERA2= <user>
##$USERA3= <user>
##$USERA4= <user>
##$USERA5= <user>
##$V9= 5
##$VALIST= <valist>
##$VCLIST= <CCCCCCCCCCCCCCC>
##$VD= 0
##$VDLIST= <DDDDDDDDDDDDDDD>
##$VPLIST= <PPPPPPPPPPPPPPP>
##$VTLIST= <TTTTTTTTTTTTTTT>
##$WBST= 1024
##$WBSW= 4
##$XGAIN= (0..3)
0 0 0 0 
##$XL= 0
##$YL= 0
##$YMAX_a= 3234
##$YMIN_a= -25548
##$ZGOPTNS= <>
##$ZL1= 120
##$ZL2= 120
##$ZL3= 120
##$ZL4= 120
##$ABSF1= 0
##$ABSF2= 0
##$ABSG= 0
##$ABSL= 0
##$ALPHA= 0
##$AQORDER= 0
##$ASSFAC= 0
##$ASSFACI= 0
##$ASSFACX= 0
##$ASSWID= 0
##$AUNMP= <proc_1d>
##$AZFE= 0.1
##$AZFW= 0.5
##$BCFW= 0
##$BC_mod= 2
##$BYTORDP= 0
##$COROFFS= 0
##$CY= -3
##$DATMOD= 1
##$DC= 0
##$DFILT= <>
##$DTYPP= 0
##$F1P= 0
##$F2P= 0
##$FCOR= 1
##$FTSIZE= 65536
##$FT_mod= 6
##$GAMMA= 0
##$GB= 0
##$INTBC= 1
##$INTSCL= 9.790993e-09
##$ISEN= 30
##$LB= 1.5
##$LEV0= 0
##$LPBIN= 0
##$MAXI= 10000
##$MC2= 0
##$MEAN= 0
##$ME_mod= 0
##$MI= 50
##$NCOEF= 0
##$NC_proc= -8
##$NLEV= 6
##$NOISF1= 182.463
##$NOISF2= 159.3651
##$NSP= 0
##$NTH_PI= 0
##$NZP= 0
##$OFFSET= 198.0616
##$PC= 4
##$PHC0= 1388.888
##$PHC1= 184.4942
##$PH_mod= 1
##$PKNL= yes
##$PPARMOD= 0
##$PSCAL= 0
##$PSIGN= 0
##$REVERSE= no
##$SF= 81.0140089999434
##$SI= 65536
##$SIGF1= 159.3651
##$SIGF2= -187.1042
##$SINO= 113.3802
##$SIOLD= 16384
##$SREGLST= <1H.CDCl3>
##$SSB= 0
##$STSI= 65536
##$STSR= 0
##$SW_p= 32467.5324675325
##$SYMM= 0
##$S_DEV= 0
##$TDeff= 32768
##$TDoff= 0
##$TI= <>
##$TILT= no
##$TM1= 0
##$TM2= 0
##$TOPLEV= 0
##$USERP1= <user>
##$USERP2= <user>
##$USERP3= <user>
##$USERP4= <user>
##$USERP5= <user>
##$WDW= 1
##$XDIM= 65536
##$YMAX_p= 27571300
##$YMIN_p= -306863256
$$ End of Bruker specific parameters
$$ ---------------------------------
##NTUPLES= NMR SPECTRUM
##VAR_NAME=  FREQUENCY,     SPECTRUM/REAL,   SPECTRUM/IMAG
##SYMBOL=    X,             R,               I
##VAR_TYPE=  INDEPENDENT,   DEPENDENT,       DEPENDENT
##VAR_FORM=  AFFN,          ASDF,            ASDF
##VAR_DIM=   65536,         65536,           65536
##UNITS=     HZ,            ARBITRARY UNITS, ARBITRARY UNITS
##FACTOR=    0.49542278885378, 1,            1
##FIRST=     16045.7642231865, 0,            0
##LAST=      -16421.768244346, 0,            0
##MIN=       -16421.768244346, -306863256,   0
##MAX=       16045.7642231865, 27571300,     0
$$ Real data points
##PAGE= N=1
##DATA TABLE= (X++(R..R)), XYDATA
$$ [...]
##PAGE= N=2
##DATA TABLE= (X++(I..I)), XYDATA
6709d798040K763032J473658o51695k422585k919083j609435N70114J339220o0303
$$ -4798040 -2035008 -561350 -1213045 -3635630 -6554713 -8164148 -7594034 -6254814 -6315117
6700f315117j341301l86445J433852J531681L13251J27304R69910P10676o72555
$$ -6315117 -7656418 -8042863 -6609011 -5077330 -4764079 -4636775 -3666865 -2956189 -3628744
6691c628744p11409J225529K591578J616086l56754j556059j988017j747066L337
$$ -3628744 -4340153 -3114624 -523046 1093040 736286 -819773 -2807790 -4554856 -4551519
6682d551519K722560L807542K201029M17339Q42072K038407J119133j804229m019335
$$ -4551519 -1828959 1978583 4179612 4596951 5439023 7477430 8596563 6792334 2772999
6673B772999l966252k347744l74288R83974P37240j035570k312068j242874J185017
$$ 2772999 -1193253 -3540997 -3915285 -2931311 -2194071 -3229641 -5541709 -6784583 -5599566
6664e599566K285989J151821n98362j249300o36713M60478J212370J108950M31005
$$ -5599566 -3313577 -2161756 -2760118 -4009418 -4646131 -4185653 -2973283 -1864333 -1433328
6655a433328L1056m8145p90246k131718k182859j29730J697392R91995p14970
$$ -1433328 -1402272 -1450417 -2240663 -4372381 -6555240 -6684970 -4987578 -3995583 -4710553
6646d710553m30657J176734Q84149j064237n76440L351565N768180K724912k398179
$$ -4710553 -5141210 -3964476 -3080327 -4144564 -4721004 -1369439 4398741 7123653 4725474
6637D725474l477930l42299J634887j82618k512810k040399k62847k28823j502446
$$ 4725474 1247544 905245 2540132 2357514 -155296 -2195695 -2458542 -2687365 -4189811
6628d189811j424480K98913J443801J139811R24143J592829J597359l11009k757516
$$ -4189811 -5614291 -5315378 -3871577 -2731766 -1807623 -214794 1382565 1071556 -1685960
6619a685960l478935k068908L40477K910942M996391N237006K850193m96788k111878
$$ -1685960 -5164895 -7233803 -6893326 -3982384 1014007 6251013 9101206 8604418 6492540
6610F492540j648327j194082j824767k176107j125784K46074O62461P38690J323383
$$ 6492540 4844213 3650131 1825364 -350743 -1476527 -1230453 -567992 170698 1494081
6601A494081J309678o56301l262619l875709k544554k066479l552723m382430
$$ 1494081 2803759 2147458 -1115161 -4990870 -7535424 -9601903 -13154626 -17537056
6593a7537056j974328K184612M214146K696174n6539j392067j118217m24261L15769
$$ -17537056 -19511384 -17326772 -13112626 -10416452 -10472991 -11865058 -12983275 -13407536 -13091767
6584a3091767J354544K162875J888167R95754P99770J172867N27783j231202j770566
$$ -13091767 -11737223 -9574348 -7686181 -6690427 -5890657 -4717790 -4190007 -5421209 -7191775
6575g191775J16640J901010O98407k107638k775223j059907l73065j753449j879170
$$ -7191775 -7075135 -5174125 -4475718 -6583356 -9358579 -10418486 -10791551 -12545000 -14424170
6566a4424170J134673L828251K333607j648482l405200j829309K26530R33589
$$ -14424170 -13289497 -9461246 -7127639 -8776121 -12181321 -14010630 -13784100 -12850511
6558a2850511R90180P73253j69163p82230O70367L029640L035726M54530j153956
$$ -12850511 -11860331 -11087078 -11256241 -12038471 -11368104 -8338464 -5302738 -4848208 -6002164
6549f002164k6695J048508m12116k268346j152708K226818M357280L959013K659053
$$ -6002164 -6028859 -4980351 -5392467 -7660813 -8813521 -6586703 -2229423 1729590 4388643
6540D388643J580868L39146q39855q76321j01933l68228k113982l259862k115265
$$ 4388643 5969511 6308657 5468802 4592481 4490548 4122320 2008338 -1251524 -3366789
6531c366789M8270O70194o53182j833491j349740l38036p98684k395759k531433
$$ -3366789 -3318519 -2648325 -3301507 -5134998 -6484738 -6822774 -7621458 -10017217 -12548650
6522a2548650l8012K661217K502292j4879j559783o42422P58759O95038r603K23739
$$ -12548650 -12586662 -9925445 -7423153 -7438032 -8997815 -9640237 -8881478 -8186440 -8196043 -7972304
6512g972304R83130R39579K53660q45J38947r7108n24891m53538k43745o49921
$$ -7972304 -6989174 -6049595 -5795935 -5796780 -5657833 -5754941 -6279832 -6733370 -6977115 -7627036
6502g627036j035054r9586J736533K498667J435310Q6177J37431J390415K334883
$$ -7627036 -8662090 -8761676 -7025143 -4526476 -3091166 -3004989 -2867558 -1477143 857740
6493H57740J941133N61390m92938l27832K85161l39689k278148l294016j741707
$$ 857740 2798873 3360263 2867325 2539493 2824654 2484965 206817 -3087199 -4828906
6484d828906R29473K081679J281254n5870j381479k886756l257542o43896L676865
$$ -4828906 -3899433 -1817754 -536500 -592370 -1973849 -4860605 -8118147 -8762043 -5085178
6475e085178N435508K377101k884223o075454n562591k569213R37659L308337
$$ -5085178 350330 2727431 -156792 -6232246 -11794837 -14364050 -13426391 -10118054
6467a0118054L722437K895076K180197J458863m34575k828612l239608j271702
$$ -10118054 -6395617 -3500541 -1320344 138519 -296056 -3124668 -6364276 -7635978
6459g635978K63058k85059q56223J87989N10824k079782m573908k578008K158427
$$ -7635978 -7372920 -7657979 -8514202 -8326213 -7815389 -9895171 -14469079 -17047087 -14888660
6450a4888660L392389k47603k867859q038M910288N809247K220313j232424j523738
$$ -14888660 -11496271 -11743874 -14611733 -14619771 -9709483 -3900236 -1679923 -2912347 -4436085
6441d436085J44448J425346J380172R9007j752301k763655j911719k5675J165897
$$ -4436085 -4291637 -2866291 -1486119 -1387112 -3139413 -5903068 -7814787 -7840462 -6674565
6432f674565J254717J068476P08633o10440k642448l657252k517829j66288J501253
$$ -6674565 -5419848 -4351372 -3642739 -4253179 -6895627 -10552879 -13070708 -13236996 -11735743
6423a1735743J564867O02727j04348L22365J595437K523825K282015J128766l55416
$$ -11735743 -10170876 -9568149 -9672497 -9350132 -7754695 -5230870 -2948855 -1820089 -2175505
6414b175505j923586k940463k170033L63453K244543J241307j499668k828479
$$ -2175505 -4099091 -7039554 -9209587 -8846134 -6601591 -5360284 -6859952 -9688431
6406i688431j872569o74688n34145l59377O19593J155966L91728l95446k22657
$$ -9688431 -11561000 -12235688 -12769833 -13129210 -12509617 -11353651 -10961923 -11357369 -11580026
6397a1580026m08972j907446k543795J75317M635032O581007M634075J455436
$$ -11580026 -11988998 -13896444 -16440239 -16264922 -11629890 -5048883 -414808 1040628
6389A040628n53028j720715k691445k453850l16175K163634K911265J819655K62909
$$ 1040628 487600 -1233115 -3924560 -6378410 -6694585 -4530951 -1619686 199969 462878
6380D62878q59349j554260k105279k846930l720850l542478r76590L023157N217808
$$ 462878 -396471 -1950731 -4056010 -6902940 -10623790 -14166268 -15142858 -12119701 -6901893
6371f901893L722254M47864j367427r47868J60981R63994J802037K637048K440113
$$ -6901893 -3179639 -2731775 -4099202 -5047070 -4886089 -3922095 -2120058 516990 2957103
6362B957103O82564j662299k983560k436369o06041Q57781P20053l58060n57482
$$ 2957103 3639667 1977368 -1006192 -3442561 -4048602 -3190821 -2470768 -2828828 -3386310
6353c386310N07540J154625L01746q03841q37696p37703j785529k708787j319251
$$ -3386310 -2878770 -1724145 -1422399 -2226240 -3063936 -3801639 -5587168 -8295955 -9615206
6344i615206J637033L020281J606736o60659j809783j728806p42004R93236K134866
$$ -9615206 -7978173 -4957892 -3351156 -4011815 -5821598 -7550404 -8292408 -7299172 -5164306
6335e164306R83383j436549j896545K13911J464369m56221k985973k582846l334
$$ -5164306 -4180923 -5617472 -7514017 -7300106 -5835737 -6291958 -9277931 -11860777 -11864111
6326a1864111J309385M14859p32458r80437q47727k59073J410439L050527K539277
$$ -11864111 -10554726 -10139867 -10872325 -11852762 -12700489 -12959562 -11549123 -8498596 -5959319
6317e959319J61046j302792m75469R90143J332573R04556N97053K40430k74739
$$ -5959319 -5798273 -7101065 -7576534 -6586391 -5253818 -4349262 -3752209 -3511779 -3786518
6308c786518k21498L68892J31345j237467j758290q6339J828844J152068j627843
$$ -3786518 -4008016 -3639124 -3507779 -4745246 -6503536 -6589875 -4761031 -3608963 -5236806
6299e236806l167300j814610L77138P28239n42343r71234O51548K652779K705501
$$ -5236806 -8404106 -10218716 -9841578 -9113339 -9655682 -10626916 -9975368 -7322589 -4617088
6290d617088J009692J44129J437082K751517J297212k090977l615371j619726
$$ -4617088 -3607396 -3463267 -2026185 725332 2022544 -68433 -3683804 -5303530
6282e303530J216126J749422M12276k10250P47448J969370K404974K190414J588856
$$ -5303530 -4087404 -2337982 -1925706 -2135956 -1388508 580862 2985836 5176250 6765106
6273F765106O98284j09976q31084k288112m476603n356676l324013j49589R99446
$$ 6765106 7463390 7353414 6522330 4234218 -242385 -5599061 -8923074 -9072663 -8073217
6264h073217L1196m03865M24690M69834n71358K20850L794574N922360K635990
$$ -8073217 -8042021 -8445886 -8021196 -7551362 -8122720 -7901870 -4107296 1815064 4451054
6255D451054l391404n815588k884879J128766K437339J744961J117891N73220
$$ 4451054 1059650 -4755938 -7640817 -6512051 -4074712 -2329751 -1211860 -638640
6247f38640m90267j279627j120662r89804j595417j656886q8423J682240J822611
$$ -638640 -1128907 -2408534 -3529196 -4519000 -6114417 -7771303 -7859726 -6177486 -4354875
6238d354875J194263J788671L013687K444664n993j644722j103496j09368l02574
$$ -4354875 -3160612 -1371941 1641746 4086410 4080417 2435695 1332199 1222831 920257
6229I20257r08377q86713r47094j581640j236386J168120L489184K884371J54268
$$ 920257 11880 -874833 -1821927 -3403567 -4639953 -3471833 17351 2901722 3055990
6220C055990j275947l24165P27588L31237k78435j12144n90627k731592m357461
$$ 3055990 1780043 1455878 2183466 2514703 2236268 2124124 1533497 -1198095 -5555556
6211e555556k692802J339132L919896L137533Q34650m48916m08835k37918n55371
$$ -5555556 -8248358 -6909226 -2989330 148203 982853 533937 125102 -112816 -668187
6202f68187j141168j811527k439861k422555j038513J481034L677760L994981
$$ -668187 -1809355 -3620882 -6060743 -8483298 -9521811 -8040777 -4363017 -368036
6194c68036K244425j83235j755640k291302k576300k682519j722921L21506J796424
$$ -368036 1876389 1693154 -62486 -2353788 -4930088 -7612607 -9335528 -9014022 -7217598
6185g217598J540605Q46689J563156K861345K123669q57555l056726k532974j146152
$$ -7217598 -5676993 -4830304 -3267148 -405803 1717866 860311 -2196415 -4729389 -5875541
6176e875541j161115j341273O83448L532737L353835M4027j808998K02911K183720
$$ -5875541 -7036656 -8377929 -7694481 -4161744 -807909 -763882 -2572880 -2369969 -186249
6167a86249j83709m370147m144153R81955M527040K305865j817340k231302K17719
$$ -186249 -369958 -4740105 -8884258 -7902303 -3375263 -1069398 -2886738 -5118040 -4900321
6158d900321O30634j642506k307800N84834L695316L966188K749693K137936J019330
$$ -4900321 -4269687 -5912193 -8219993 -7635159 -3939843 26345 2776038 4913974 5933304
6149E933304j935657m329094l160903j45145M18722j626357k075488Q45115L734370
$$ 5933304 3997647 -331447 -3492350 -3637495 -3218773 -4845130 -6920618 -6075503 -2341133
6140b341133L417791J344433M39053O23838J76351p31877q35137n99989j280529
$$ -2341133 1076658 2421091 2860144 3483982 3660333 2928456 2093319 1493330 212801
6131B12801k103328j355161K13390J34531j495111j568439J171554L507813J881325
$$ 212801 -1890527 -3245688 -3032298 -2897767 -4392878 -5961317 -4789763 -1281950 599375
6122E99375k529202m994418k877565J646272M442085L663091Q63554j235336j477959
$$ 599375 -1929827 -6924245 -9801810 -8155538 -3713453 -50362 813192 -422144 -1900103
6113a900103q99841r76675j700840j832527q13900M67471J076990J238630J442371
$$ -1900103 -2799944 -3776619 -5477459 -7309986 -8123886 -7656415 -6579425 -5340795 -3898424
6104c898424J188016j79234j765548j734885J25052J798382J696944P06061M65310
$$ -3898424 -2710408 -2889642 -4655190 -6390075 -6265023 -4466641 -2769697 -2063636 -1598326
6095a598326O80442j33490j801633k507074j732626r15117n78334O22240K648766
$$ -1598326 -917884 -1051374 -2853007 -5360081 -7092707 -8007824 -8586158 -7963918 -5315152
6086e315152K705330l23103k607834m02287L407469K768511j937511l590139Q66234
$$ -5315152 -2609822 -2932925 -5540759 -5943046 -2535577 232934 -1704577 -5294716 -4428482
6077d428482N182513K956104k874578m797034j575154J575122J741765R68114
$$ -4428482 754031 3710135 835557 -3961477 -5536631 -3961509 -2219744 -1251630
6069a251630N65747r61412l184869k556774J793144N557137N039332J677084j479267
$$ -1251630 -685883 -1647295 -4832164 -7388938 -5595794 -38657 5000675 6677759 5198492
6060E198492l832243n085729l228500J500340M235956J683094k169878j651787
$$ 5198492 1366249 -3719480 -6947980 -5447640 -1211684 471410 -1698468 -3350255
6052c350255J595068J294959k941756m722819j335574J799415J15114k591275
$$ -3350255 -1755187 -460228 -3401984 -8124803 -9460377 -7660962 -7545848 -10137123
6044a0137123m62342M699993N930616J584584k495093j645305J693104K553142
$$ -10137123 -10599465 -5899472 31144 1615728 -879365 -2524670 -831566 1721576
6036A721576L15832j764659j810382j015827o54856j40460J183394K152704J146885
$$ 1721576 2037408 272749 -1537633 -2553460 -3208316 -3348776 -2165382 -12678 1134207
6027A134207j335922k862275j932083L34950J763292J550872M97673m99347j136043
$$ 1134207 -201715 -3063990 -4996073 -4661123 -2897831 -1346959 -849286 -1348633 -2484676
6018b484676j131117j71436J221471J707727O88094p32090j111896o62142q80552
$$ -2484676 -3615793 -3787229 -2565758 -858031 -169937 -902027 -2013923 -2676065 -3556617
6009c556617k086625k397469q1432L556955M968139K438540j628747l315827j359790
$$ -3556617 -5643242 -8040711 -8122143 -4565188 402951 2841491 1212744 -2103083 -3462873
6000c462873K214005M869897N487377L921234O62479k547440l485792j805307
$$ -3462873 -1248868 3621029 9108406 13029640 13692119 11144679 7658887 5853580
5992E853580N29265J801666K182686K204457J465782L6261p88079p96978j953707
$$ 5853580 6382845 8184511 10367197 12571654 14037436 14073697 13285618 12488640 10534933
5983A0534933m914909o421790l357614J904455L989517J879669k41945K21217
$$ 10534933 5620024 -801766 -4159380 -2254925 1734592 3614261 3372316 3593533
5975C593533R71259k91311j808157j240312K9176o41620k551075k876862j191289
$$ 3593533 4564792 4273481 2465324 1225012 1254188 612568 -1938507 -4815369 -6006658
5966f006658L76319O99952M90686O3679r25676j645126o55945J444525K365984
$$ -6006658 -5630339 -4930387 -4439701 -4376022 -5301698 -6946824 -7602769 -6158244 -3792260
5957c792260J527789P98717J151243Q98673j359700l784947l136470J062679N560794
$$ -3792260 -2264471 -1465754 -314511 584162 -775538 -4560485 -7696955 -6634276 -1073482
5948a073482O518624L009243k376066n918037n856837l383628q22571N68425P07797
$$ -1073482 5445142 8454385 6078319 160282 -5696555 -9080183 -9902754 -9334329 -8626532
5939h626532l16663k045898k959140j647875J186925L318585L780316L610343
$$ -8626532 -8943195 -10989093 -13948233 -15596108 -14409183 -11090598 -7310282 -3699939
5931c699939L519553K629714N22161j089693l94708J709029K570811J224648o98657
$$ -3699939 -180386 2449328 2971489 1881796 1487088 3196117 5766928 6991576 6292919
5922F292919j490301j262633r08584n73639j45524k77269j476593k461398j077608
$$ 6292919 4802618 3539985 2631401 2057762 1912238 1634969 158376 -2303022 -3380630
5913c380630K481840M706031K506065k529572n326671l161309J170926K945041
$$ -3380630 -898790 3807241 6313306 3783734 -1542937 -4704246 -3533320 -588279
5905e88279J065493j396119j527157L48133K041075K352619J744091J088169P09100
$$ -588279 477214 -918905 -2446062 -2097929 -56854 2295765 4039856 5128025 5837125
5896E837125M02121j95898j205719k203822k427283j452640M00314K336645L564377
$$ 5837125 6239246 6043348 4837629 2633807 206524 -1246116 -845802 1490843 5055220
5887E055220L553166K209818O4404j846195k603986k176623j535888j660005k264196
$$ 5055220 8608386 10818204 10882608 9036413 6432427 4255804 2719916 1059911 -1204285
5878a204285k067610p81505l4416j160230k698150j993462P06804K067474M10111
$$ -1204285 -3271895 -4053400 -4087816 -5248046 -7946196 -9939658 -9232854 -7165380 -6755269
5869f755269j690348j208969R69171J836044R28111M09543J200031J854968J313293
$$ -6755269 -8445617 -9654586 -8685415 -6849371 -5921260 -5511717 -4311686 -2456718 -1143425
5860a143425L05779k71254l39860J76652J168239J261994q94218m007050m974881
$$ -1143425 -837646 -1108900 -1448760 -1272108 -103869 1158125 263907 -3743143 -8718024
5851h718024k794380L57993K216600K476457J626950K80250M856J991466M245798
$$ -8718024 -11512404 -11154411 -8937811 -6461354 -4834404 -4554154 -4549298 -2557832 1687966
5842A687966L191397r04081l369964j507738J765465K597869J212901k34874j552665
$$ 1687966 4879363 3975282 605318 -902420 863045 3460914 4673815 4438941 2886276
5833B886276l109735l388523j506906J26029p16534k106485j216046O67548O72881
$$ 2886276 -223459 -3611982 -5118888 -4992859 -5709393 -7815878 -9031924 -8364376 -7691495
5824g691495j68864J003798K840324J501458k196270l389904j258541l33795k380361
$$ -7691495 -7860359 -6856561 -4016237 -2514779 -4711049 -8100953 -9359494 -9693289 -12073650
5815a2073650l145870J53076L719433L254666N51075k18037Q41776Q95371j11325
$$ -12073650 -15219520 -15066444 -11347011 -8092345 -7541270 -7759307 -6917531 -6022160 -6133485
5806f133485n3977R45634Q64958m54535j412858j647400j765295j024476J525029
$$ -6133485 -6187462 -5241828 -4376870 -4831405 -6244263 -7891663 -9656958 -10681434 -9156405
5797i156405M287499M589508K443553J09735j426701k645184k861708q02175K198801
$$ -9156405 -4868906 -279398 2164155 2273890 847189 -1797995 -4659703 -5461878 -3263077
5788c263077K829504K65609k583860k878022o60715K429124M850669N060049K191047
$$ -3263077 -433573 -167964 -2751824 -5629846 -6290561 -3861437 989232 6049281 8240328
5779H240328k097675m321349k825841M34511K310590J510433r17375k804788k420271
$$ 8240328 6142653 1821304 -1004537 -570026 1740564 3250997 2333622 -471166 -2891437
5770b891437q1123J781961J311016m67119j330858r39226l15524O10690K217650
$$ -2891437 -2972560 -1190599 120417 -346702 -1677560 -2616786 -2932310 -2321620 -103970
5761a03970K806924M62397k869563k928994O55541L459512K639703M47962k78058
$$ -103970 2702954 3165351 295788 -2633206 -1977665 1481847 4121550 4569512 4291454
5752D291454l43758j414440k321800j317283M20571P07606o5122k10690Q4726
$$ 4291454 3947696 2533256 211456 -1105827 -685256 22350 -42772 -253462 -168736
5743a68736k01660l20653P39398J562981M32320j042767l1115K532290K939426
$$ -168736 -370396 -691049 48349 1611330 2043650 1000883 969768 3502058 6441484
5734F441484N82103j129246l79572L40048j315457l626158l597205j395943M43015
$$ 6441484 7023587 5894341 5514769 5854817 4539360 913202 -2684003 -4079946 -3636931
5725c636931Q81790J094039J830221K093381Q14277j294341k295553j357443n7662
$$ -3636931 -2755141 -1661102 169119 2262500 3076777 1782436 -513117 -1870560 -1928222
5716a928222o71238l016276m098212j807459K053481L957073L170983K154782
$$ -1928222 -2599460 -5615736 -9713948 -11521407 -9467926 -5510853 -2339870 -185088
5708a85088K618217L330876K450647K66805j431847j679081j106278r39039j715859
$$ -185088 2433129 5764005 8214652 8481457 7049610 5370529 4264251 3325212 1609353
5699A609353k674973k446286q25511N80183L54273o19815l34440J427466K837402
$$ 1609353 -1065620 -3511906 -4337417 -3757234 -3402961 -4022776 -4357216 -2929750 -92348
5690i2348K524536Q61278j103344k415926k071416P1137K113102J730635o96128
$$ -92348 2432188 3293466 2190122 -225804 -2297220 -2226083 -112981 1617654 921526
5681I21526k317335j502860M92726J848743K106206J215069j132646m106671n505985
$$ 921526 -1395809 -2898669 -2405943 -557200 1549006 2764075 1631429 -2475242 -7981227
5672g981227m214208j614436K91512Q64983M20912m75024p09209N16275J904265
$$ -7981227 -12195435 -13809871 -13518359 -12653376 -12232464 -12707488 -13416697 -12900422 -10996157
5663a0996157J246733r60758j637965J53954J557396O18222m91282N81119K136151
$$ -10996157 -9749424 -10710182 -12348147 -12194193 -10636797 -10018575 -10509857 -9928738 -7792587
5654g792587J451358k98895p1239J595625J381927j055177k252529l94186J925606
$$ -7792587 -6341229 -6640124 -6711363 -5115738 -3733811 -4788988 -7041517 -7435703 -5510097
5645e510097J604152r11695k875427k846333j800403j447247k053288j846890
$$ -5510097 -3905945 -4817640 -7693067 -10539400 -12339803 -13787050 -15840338 -17687228
5637a7687228P32289L931642L812145j25939k942295o76605L478468L427103r06389
$$ -17687228 -16954939 -13023297 -9211152 -9337091 -12279386 -12955991 -9477523 -6050420 -6956809
5628f956809l818399k595050n73124m32287M5561K912279N501114M670724K081941
$$ -6956809 -10775208 -13370258 -13943382 -14375669 -14330108 -11417829 -5916715 -1245991 835950
5619H35950J151796J377433R6321j877490j174418K042085L491182J046240k257902
$$ 835950 1987746 3365179 3461500 1584010 409592 2451677 5942859 6989099 4731197
5610D731197l001477j996888j927986k695959j987779M68405K071198J108620
$$ 4731197 1729720 -267168 -2195154 -4891113 -6878892 -6410487 -4339289 -3230669
5602c230669q85336j640508j341952j542308j929333o73439J950159L033066J335968
$$ -3230669 -4116005 -5756513 -7098465 -8640773 -10570106 -11243545 -9293386 -6260320 -4924352
5593d924352m18657K96988J607598L62963k103681j553769K059100L654372N03321
$$ -4924352 -5343009 -5046021 -3438423 -3075460 -5179141 -6732910 -4673810 -1019438 -516117
5584e16117l501009l536669m99965J260561M94371l44922J49263O24253Q424o92012
$$ -516117 -4017126 -7553795 -8053760 -6793199 -6298828 -6643750 -6494487 -5870234 -5861810 -6553822
5574f553822l42255N68388R06231L86198m71256j112865j384600j534472j659265
$$ -6553822 -6896077 -6327689 -5421458 -5035260 -5506516 -6619381 -8003981 -9538453 -11197718
5565a1197718j100302Q16512L229801M187329L169009J672345N57870j209596
$$ -11197718 -12298020 -11481508 -8251707 -4064378 -895369 776976 1334846 125250
5557A25250l788895m631496j869060J987401K657810k39128k878414k409792J00489
$$ 125250 -3663645 -8295141 -10164201 -8176800 -5518990 -5758118 -8636532 -11046324 -10945835
5548a0945835K031865K155212Q14593q10892j181707J27166J204965j18214k834989
$$ -10945835 -8913970 -6758758 -5944165 -6755057 -7936764 -7809598 -6604633 -6722847 -9557836
5539i557836l524083r76343K160674L132901K268334J270840M68180n24812j085020
$$ -9557836 -13081919 -14058262 -11897588 -8764687 -6496353 -5225513 -4757333 -5282145 -6367165
5530f367165n81491j9558o09204j353128k54437K179802K896449M57132k654982
$$ -6367165 -6948656 -6968214 -7577418 -8930546 -9184983 -7005181 -4108732 -3651600 -6306582
5521f306582l263416j691174p61490j173008m00055K951273N972256M850536L34267
$$ -6306582 -9569998 -11261172 -12022662 -13195670 -13595725 -10644452 -4672196 178340 512607
5512E12607k838342j927053R25162K392447K044358J353646P73192j60877j111874
$$ 512607 -2325735 -4252788 -3327626 -935179 1109179 2462825 3236017 3075140 1963266
5503A963266j297691q28734k46023M03500Q06993K2513j615544j828716K88026
$$ 1963266 665575 -163159 -409182 -5682 801311 823824 -791720 -2620436 -2332410
5494b332410J845402j88967m002889m785644j233552K896131L958989K306064
$$ -2332410 -487008 -675975 -4678864 -9464508 -10698060 -7801929 -3842940 -1536876
5486a536876M13198l28432m6241M33087K4030j593686l142178l247557k405011
$$ -1536876 -1123678 -1452110 -1498351 -1065264 -1041234 -2634920 -5777098 -9024655 -11429666
5477a1429666j827412j180925L17459J601386J460438J466399L506859N319630
$$ -11429666 -13257078 -14438003 -14120544 -12519158 -11058720 -9592321 -6085462 -765832
5469g65832L181846j246030k387316J99914N84013l496204o003139k188722L220157
$$ -765832 2416014 1169984 -1217332 -1017418 -433405 -3929609 -9932748 -12121470 -8901313
5460h901313L288633l83926j115588J858198L368181J763707P79331J858982J730926
$$ -8901313 -5612680 -5996606 -7112194 -5253996 -1885815 -122108 657223 2516205 4247131
5451D247131r63140k895259k056167j048168j815236k081831j49245J250254l30268
$$ 4247131 3283991 388732 -1667435 -2715603 -4530839 -6612670 -6761915 -5511661 -5841929
5442e841929k124813j70199M270542O431312M579697J160230j371278k424027
$$ -5841929 -7966742 -8136941 -3866399 2564913 7144610 8304840 6933562 4509535
5434D509535j907878l04788M25997j001642k617550j658003Q95272J450198o39765
$$ 4509535 2601657 2296869 2722866 1721224 -896326 -2554329 -1659057 -208859 -848624
5425h48624k076129p15803J593078K359470J674586O37851p45274k261179k426507
$$ -848624 -2924753 -3640556 -2047478 311992 1986578 2624429 1879155 -382024 -2808531
5416b808531q52601K46493q83389k648578k589475j114102o6581R23695L263528
$$ -2808531 -3661132 -3414639 -4298028 -6946606 -9536081 -10650183 -10716764 -9793069 -6529541
5407f529541N418220M057401m98938l679470k613470N28288K476743K886699K479992
$$ -6529541 -1111321 2946080 2447142 -1232328 -3845798 -3317510 -840767 2045932 4525924
5398D525924M45175l232567n257374k578488K643362N071242K838821p80593k186007
$$ 4525924 4971099 1738532 -3518842 -6097330 -3453968 1617274 4456095 3675502 1489495
5389A489495j110935O78893J685158J088365r91648l004476l324328k268374j269168
$$ 1489495 378560 1057453 2742611 3830976 2839328 -165148 -3489476 -5757850 -7027018
5380g027018m83457O94903J312140q8721k136679j612012J555839L459088J654423
$$ -7027018 -7510475 -6815572 -5503432 -5592153 -7728832 -9340844 -7785005 -4325917 -2671494
5371b671494j457187k315830o93962J333404K634636L206630K907198J898489
$$ -2671494 -4128681 -6444511 -7138473 -5805069 -3170433 36197 2943395 4841884
5363D841884R77378J56056j439450l245517l118500q73537N85334n32939k146512
$$ 4841884 5819262 5975318 4535868 1290351 -1828149 -2701686 -2116352 -2649291 -4795803
5354d795803j830496m47797K19734P33474J848930J701731j178003m134074l668653
$$ -4795803 -6626299 -7074096 -6854362 -6120888 -4271958 -2570227 -3748230 -7882304 -11550957
5345a1550957q57762O04212L65657R31468K201281J510861q66302j223053J623007
$$ -11550957 -12408719 -11804507 -11438850 -10507382 -8306101 -6795240 -7661542 -8884595 -7261588
5336g261588M249581L876188J822854K16764j086719k411809k398906n16407J130747
$$ -7261588 -3012007 864181 2687035 2903799 1817080 -594729 -2993635 -3510042 -2379295
5327b379295O82586q16249j451781j208806j009713q24009m63206o93713j918224
$$ -2379295 -1696709 -2512958 -3964739 -5173545 -6183258 -7007267 -7470473 -8164186 -10082410
5318a0082410k984663k621783j003370R13756K326355K387283Q03622q37611l48875
$$ -10082410 -13067073 -15688856 -16692226 -15778470 -13452115 -11064832 -10261210 -11098821 -11447696
5309a1447696J782863K581345Q51598j104659j122536r0997J49159m77917j186541
$$ -11447696 -9664833 -7083488 -6231890 -7336549 -8459085 -8550082 -8400923 -8878840 -10065381
5300a0065381j756265j552061N48128L543320M095324J088483j864081r87636
$$ -10065381 -11821646 -13373707 -12825579 -9282259 -5186935 -4098452 -5962533 -6950169
5292f950169K467364M243789K745802K8218j675379j815931p76574M19003L21223
$$ -6950169 -4482805 -239016 2506786 2535004 859625 -956306 -1732880 -1313877 -992654
5283i92654j124459j867060n90910R98901O95691p67460j044306K48259J546077
$$ -992654 -2117113 -3984173 -4575083 -3576182 -2880491 -3647951 -4692257 -4443998 -2897921
5274b897921J803557Q12470j503272l776973l022055J180679M123757J521814
$$ -2897921 -1094364 -281894 -1785166 -5562139 -8584194 -7403515 -3279758 -1757944
5266a757944l637006m389172L96526M445857L100569r00042k559252j290587L71080
$$ -1757944 -5394950 -9784122 -9387596 -4941739 -1841170 -2741212 -5300464 -6591051 -6219971
5257f219971J381563K112034J840902k38644k592383k886663j434535n76591q99254
$$ -6219971 -4838408 -2726374 -885472 -1124116 -3716499 -6603162 -8037697 -8614288 -9513542
5248i513542n68645J233021K501996J251541j285956j963457J14138K305207J924779
$$ -9513542 -10082187 -8849166 -6347170 -5095629 -6381585 -8345042 -8230904 -5925697 -4000918
5239d000918j68971r26884M21989J273191l87565k895412l288657j328488P52704
$$ -4000918 -4169889 -5096773 -4674784 -3401593 -3789158 -6684570 -9973227 -11301715 -10549011
5230a0549011J499269J175930K31896r22160j077164M46540J858378P98858j818905
$$ -10549011 -9049742 -7873812 -7641916 -8564076 -9641240 -9194700 -7336322 -6537464 -8356369
5221h356369k593798o07766J306590J120394M60533J433622L311960M301412M235371
$$ -8356369 -10950167 -11557933 -10251343 -9130949 -8670416 -7236794 -3924834 376578 4611949
5212D611949L379000Q72004k960955m776115k070390K282928K951125o88035l766938
$$ 4611949 7990949 8862953 5901998 1125883 -944507 1338421 4289546 3601511 -165427
5203a65427k712117N64034K445984K501617K410214K208729M50089k660439m781124
$$ -165427 -2877544 -2313510 132474 2634091 5044305 7253034 7703123 5042684 261560
5194B61560m267754j846138P39077K300466K147649M3596k805201l852445j732936
$$ 261560 -4006194 -5852332 -5113255 -2812789 -665140 -621544 -3426745 -7279190 -9012126
5185i012126J686653L074688J476344q08880j460129r10852r85472j837234j813572
$$ -9012126 -7325473 -4250785 -2774441 -3583321 -5043450 -5954302 -6939774 -8777008 -10590580
5176a0590580j43922J797999K374520J663291Q26495L76760L1435k62130l08994
$$ -10590580 -10734502 -8936503 -6561983 -4898692 -4072197 -3695437 -3664002 -3926132 -4235126
5167d235126n15044j495025k522498j693085J320915L673563K293836j703270
$$ -4235126 -4750170 -6245195 -8767693 -10460778 -9139863 -5466300 -3172464 -4875734
5159d875734l645999j221186K212832K102408r92221k393819j89496K200710J292143
$$ -4875734 -8521733 -9742919 -7530087 -5427679 -6419900 -8813719 -9003215 -6802505 -5510362
5150e510362j650100l101282k272452r58084M4492J288809K160036J205260q08263
$$ -5510362 -7160462 -10261744 -12534196 -13492280 -13447788 -12158979 -9998943 -8793683 -9601946
5141i601946j065091J246513L534950L593145K530922K351503K537523J211507
$$ -9601946 -10667037 -9420524 -5885574 -2292429 238493 2589996 5127519 6339026
5133F339026j417581l018793k277824k83397J233512J524861N31377j505103l456161
$$ 6339026 4921445 1902652 -375172 -658569 574943 2099804 2631181 1126078 -2330083
5124b330083l508017j068345J986842L021592J610525p8518j76302M96985j68253
$$ -2330083 -5838100 -6906445 -4919603 -1898011 -287486 -366004 -542306 -45321 -213574
5115b13574k262905l339048j585038J632690L312245K233741j22660j643649j553341
$$ -213574 -2476479 -5815527 -7400565 -5767875 -2455630 -221889 -344549 -1988198 -3541539
5106c541539m87245M48100N64066P6912l34146o62750j582582k799516k576206
$$ -3541539 -4028784 -3580684 -3016618 -2939706 -3273852 -3936602 -5519184 -8318700 -10894906
5097a0894906k48055J824017Q80739k122071l408250j473519J274282K577499
$$ -10894906 -11142961 -9318944 -8438205 -10560276 -13968526 -15442045 -14167763 -11590264
5089a1590264L224978M364015M535459J942014j987827m086097l606087k319735
$$ -11590264 -8365286 -4001271 534188 2476202 488375 -3597722 -7203809 -9523544
5081i523544j184838K24759J277417M90846j340118j362404Q99191K342482J140500
$$ -9523544 -10708382 -10483623 -9206206 -8715360 -10055478 -11417882 -10518691 -8176209 -7035709
5072g035709k23004Q43661K630471K217306O61884R39669K234997J216370j479358
$$ -7035709 -7258713 -6415052 -3784581 -1567275 -905391 34278 2269275 3485645 2006287
5063B006287j602395R90706R01798l863886p169748l526560K885384L906414p19988
$$ 2006287 403892 1394598 2296396 -1567490 -8737238 -12263798 -9378414 -5472000 -6191988
5054f191988l727442j437241K176558K951740J796661P71594n54701k192058j764253
$$ -6191988 -9919430 -11356671 -9180113 -6228373 -4431712 -3660118 -4214819 -6406877 -8171130
5045h171130J426814L989334L131909O90062l54853l25063p84908r97840N0776
$$ -8171130 -6744316 -2754982 376927 1066989 712136 387073 -397835 -1395675 -1344899
5036a344899N95001j149293l073137j877061J644159L688578K863886J045026
$$ -1344899 -749898 -1899191 -4972328 -6849389 -5205230 -1516652 1347234 2392260
5028B392260m45082k017993l367675k981533m82229K672918M847767N060750K953487
$$ 2392260 1947178 -70815 -3438490 -6420023 -6902252 -4229334 618433 5679183 8632670
5019H632670l40429k308118j789700m09137J86554N08611Q38195n39715l873796
$$ 8632670 8292241 5984123 4194423 3785286 3971840 4480451 5318646 4778931 905135
5010I05135n594456l197906Q0700p9105j983288o95330L556033N456943K764581
$$ 905135 -4689321 -7887227 -7806527 -7885632 -9868920 -10564250 -7008217 -1551274 1213307
5001A213307j054506k692720k535367j715692l26763N59483o37849k693297k672095
$$ 1213307 158801 -2533919 -5069286 -6784978 -7111741 -6552258 -7190107 -9883404 -12555499
4992a2555499p90166j01350j155548j538901j025320k050803m196578l571580
$$ -12555499 -13345665 -13447015 -14602563 -16141464 -17166784 -19217587 -23414165 -26985745
4984b6985745O68834M229336M109331K498278K181426K526158K227845J791171
$$ -26985745 -26316911 -22087575 -17978244 -15479966 -13298540 -10772382 -8544537 -6753366
4976f753366J117304j198110m081143l830303n477K862357J857557l01804l12484
$$ -6753366 -5636062 -6834172 -10915315 -14745618 -14751095 -11888738 -10031181 -10332985 -10645469
4967a0645469R96060J706961K284810L022143K042248j128469l689220l902430
$$ -10645469 -9649409 -7942448 -5657638 -2635495 -593247 -1721716 -5410936 -9313366
4959i313366l492489l485691k165864L74265P67661j475184j754950J899069M404414
$$ -9313366 -12805855 -16291546 -18457410 -18083145 -17315484 -18790668 -20545618 -18646549 -14242135
4950a4242135J599002k533594k119436J510184K869298R73857q95263j383568
$$ -14242135 -12643133 -15176727 -17296163 -15785979 -12916681 -11942824 -12838087 -14221655
4942a4221655j556637j327740j75031N07588k47418n90787P62507J772640J022121
$$ -14221655 -15778292 -17106032 -17281063 -16773475 -17020893 -17611680 -16849173 -15076533 -14054412
4933a4054412O70027J888085J783461r36883k089635J191383M635170L461965
$$ -14054412 -13384385 -11496300 -9712839 -10649722 -12739357 -11547974 -6912804 -3450839
4925c450839J22210p55865n04937k614273n042875l855763j030859r59007k100933
$$ -3450839 -3328629 -4084494 -4589431 -7203704 -12246579 -16102342 -17133201 -18092208 -20193141
4916b0193141J00018M349555N243061K166026o95221j758686k844307m048917
$$ -20193141 -20093123 -15743568 -10500507 -8334481 -9029702 -10788388 -13632695 -17681612
4908a7681612l937884l301542l387433k612421J28774K100538J377315O02353
$$ -17681612 -21619496 -24921038 -28308471 -30920892 -30792118 -28691580 -27314265 -26711912
4900b6711912J446583R42769j659459j609760J937807K098442l023556m361074
$$ -26711912 -25265329 -24322560 -25982019 -27591779 -25653972 -23555530 -26579086 -30940160
4892c0940160K197665N930224q21997p750952m383776O05373l976887r396788
$$ -30940160 -28742495 -22812271 -23634268 -31385220 -35768996 -35163623 -39140510 -48537298
4884d8537298l102760N582661J555792o390952j810191N002624n523977k0363751
$$ -48537298 -51640058 -46057397 -44501605 -50892557 -52702748 -47700124 -53224101 -73587852
4876g3587852j2997877J937597j2194014l6163649k189296R4638273J56856373
$$ -73587852 -86585729 -84648132 -96842146 -133005795 -135195091 -40556818 116299555
4869A16299555J05981430n618691o4390773m2623244q590848r874359k1220849
$$ 116299555 222280985 216662294 152271521 109648277 101057429 91183070 69962221
4862F9962221j2228887J571084j487058r347569m940689J654805l256054r533635
$$ 69962221 57733334 59304418 57817360 48469791 43529102 45183907 41927853 32394218
4854C2394218m138929L510870K07037o405242l626551K435566j63557o266658
$$ 32394218 28255289 31766159 31973196 25567954 21941403 24376969 24213412 17946754
4846A7946754l956724L354998M319798J30022k11937K250551N5260m892097m614298
$$ 17946754 13990030 17345028 21664826 21794848 21582911 23833462 23888722 18996625 14382327
4837A4382327R0022J809543j02881o14308Q0360j696509l716527j235179K952489
$$ 14382327 14472349 16281892 16179011 15564703 15645063 13948554 10232027 8996848 11949337
4828A1949337K142255k866079n371246l602825j327433J6008J550063J767535
$$ 11949337 14091592 11225513 5854267 2251442 924009 940017 2490080 4257615
4820D257615r16490k874456k64474L277827J755987k925487l885686l60637K251480
$$ 4257615 3341125 466669 202195 3480022 5236009 2310522 -1575164 -1935801 315679
4811C15679J967553J912176L188676L369123J844166M15521q23180k483112k177697
$$ 315679 2283232 4195408 7384084 10753207 12597373 13012894 12189714 9706602 7528905
4802G528905K016007N892819L663546k737395n736582l213369o48037j656310
$$ 7528905 9544912 15437731 19101277 16363882 10627300 7413931 6765894 5109584
4794E109584l026719j021102K747746M200214K074934j474205l352788j941389
$$ 5109584 2082865 1061763 3809509 8009723 10084657 8610452 5257664 3316275
4786C316275J266257K801628J409307m15757o19451n86740j555493j400100J494648
$$ 3316275 4582532 7384160 8793467 8377710 7758259 7171519 5616026 4215926 5710574
4777E710574M365520M177870K553896K171494J425679k133044n902978n584473
$$ 5710574 10076094 14253964 16807860 18979354 20405033 18271989 12369011 6784538
4769F784538k235029j33418M08055J951598L452378J691158j730389j815692J406643
$$ 6784538 4549509 4416091 4824146 6775744 10228122 11919280 10188891 8373199 9779842
4760I779842K626307M695k391179k126474j944469l649473m284643j415299K421417
$$ 9779842 12406149 12410844 10019665 7893191 5948722 2299249 -1985394 -3400693 -979276
4751i79276L681265K616892J313326L3288j696058k818953k290429j242527j341939
$$ -979276 2701989 5318881 6632207 6665495 4969437 2150484 -139945 -1382472 -2724411
4742b724411k046620j378427R83443K733047J466436k029910l777636j082886
$$ -2724411 -4771031 -6149458 -5166015 -2432968 -966532 -2996442 -6774078 -7856964
4734g856964L424632M563358J612543p15598N44899K391880J233977j443781k330377
$$ -7856964 -4432332 131026 1743569 1027971 1572870 3964750 5198727 3754946 1424569
4725A424569j745297j706688j583348j72395O58977p73785j740397O02642L213226
$$ 1424569 -320728 -2027416 -3610764 -3783159 -3124182 -3897967 -5638364 -5035722 -1822496
4716a822496J473631k551384k876439N47788J843567r47884l020768r17346K776675
$$ -1822496 -348865 -2900249 -5776688 -5228900 -3385333 -4333217 -7353985 -8271331 -5494656
4707e494656M537064M246403K651985n53366m134683n077391k807669j33386J109646
$$ -5494656 -957592 3288811 5940796 5387430 1252747 -3824644 -6632313 -6765699 -5656053
4698e656053J792912K320223J689087L30495r5636j46615j687459l427983k133795
$$ -5656053 -3863141 -1542918 146169 476664 381028 234413 -1453046 -4881029 -7014824
4689g014824J370284K627229P67784j37838J742348K994937J113797j521655k204563
$$ -7014824 -5644540 -3017311 -2249527 -2387365 -645017 2349920 3463717 1942062 -262501
4680b62501j746472j359959j53879J781498K019847M4659j132992j897P52834
$$ -262501 -2008973 -3368932 -3522811 -1741313 278534 323193 -809799 -811696 -58862
4671e8862r74543l096350l040433j489227j3426J547630L073618K954835J020658
$$ -58862 -1033405 -4129755 -7170188 -8659415 -8672841 -7125211 -4051593 -1096758 -76100
4662g6100o03750j165554k119729l044278j323390K366104L369827K81771k330022
$$ -76100 -679850 -1845404 -3965133 -7009411 -8332801 -5966697 -2596870 -2315099 -4645121
4653d645121j315844L00169m87800j164532J057881L407745K270974k98474l00644
$$ -4645121 -5960965 -5660796 -6148596 -7313128 -6255247 -2847502 -576528 -875002 -1175646
4644a175646J313415J070451l88742K41196K704816L692082K306532M17135j209092
$$ -1175646 137769 1208220 819478 1060674 3765490 7457572 9764104 10181239 8972147
4635H972147k841480l189295j175618Q18748l04736l231795l819661j164079J593798
$$ 8972147 6130667 2941372 1765754 2584502 2279766 -952029 -4771690 -5935769 -4341971
4626d341971K017615O24650j114934k077553j353085O47964J764611Q58510m27873
$$ -4341971 -2324356 -1699706 -2814640 -4892193 -6245278 -5597314 -3832703 -2974193 -3402066
4617c402066o63540j021248k104476j346796K660566N904669L711152j962773
$$ -3402066 -4065606 -5086854 -7191330 -8538126 -5877560 27109 3738261 1775488
4609A775488m869327l077675l61016N68896J163880K711924L449869J797306o13554
$$ 1775488 -3093839 -6171514 -6532530 -5963634 -4799754 -2087830 1362039 3159345 2545791
4600B545791j111633M04143J374981m05076l985072n611905k958690J159409J713199
$$ 2545791 1434158 1838301 3213282 2808206 -1176866 -6788771 -9747461 -8588052 -6874853
4591f874853j479562l110753k43502L279988L014206M35705n15639J82306K23801
$$ -6874853 -8354415 -11465168 -11708670 -8428682 -5414476 -4978771 -5494410 -5312104 -5088303
4582e088303j07290M79045L80008k013162l771484j307204L008092L893116J433283
$$ -5088303 -5195593 -4716548 -4336540 -6349702 -10121186 -11428390 -8420298 -4527182 -3093899
4573c093899K28477J191654P31751j841702k680598l48343J509445L33930j499194
$$ -3093899 -2865422 -1673768 -942017 -2783719 -5464317 -5812660 -4303215 -3969285 -5468479
4564e468479j081690Q80556K156074J798469k97924l313884m398963j370212L077231
$$ -5468479 -6550169 -5669613 -3513539 -1715070 -2012994 -5326878 -9725841 -11096053 -8018822
4555h018822L977607J308319n6747J702657K739578N33062j831912j186902M93988
$$ -8018822 -4041215 -2732896 -2789643 -1086986 1652592 2185654 353742 -833160 -339172
4546c39172j06700k085362k152650K42941K606152K671191P6741l557436n014372
$$ -339172 -445872 -2531234 -4683884 -4440943 -1834791 836400 913141 -2644295 -7658667
4537g658667k151479K711764M628034K340004j29192N25299K553072K686557R11884
$$ -7658667 -9810146 -7098382 -2470348 -130344 -259536 265763 2818835 5505392 6417276
4528F417276p28133j611679k292041k599359k177887j528027r53638L8556J115132
$$ 6417276 5689143 4077464 1785423 -813936 -2991823 -4519850 -5473488 -5434932 -4319800
4519d319800P00850j589948l854702m300140l055548r58759J377293K695078J741171
$$ -4319800 -3618950 -5208898 -9063600 -13363740 -16419288 -17378047 -16000754 -13305676 -11564505
4510a1564505l95265j031991K44137J013224P764j161469j039570p9031J435837
$$ -11564505 -11959770 -12991761 -12747624 -11734400 -11726636 -12888105 -13927675 -14006706 -12570869
4501a2570869L860069N598381L808946p62967l425437j947707L72814K17413j049134
$$ -12570869 -8710800 -3112419 696527 -66440 -3491877 -5439584 -5066770 -4849357 -5898491
4492e898491r35851l19292q89127j255288N15105K800783K617646K13768j782797
$$ -5898491 -6834342 -7153634 -8042761 -9298049 -8782944 -5982161 -3364515 -3150747 -4933544
4483d933544k231581j571486J94519K557980L184720O76790k642854l574335k347397
$$ -4933544 -7165125 -8736611 -8542092 -5984112 -2799392 -2122602 -4765456 -8339791 -10687188
4474a0687188j321701q87409K08550J594460J597695L42102k39119P68760K505587
$$ -10687188 -12008889 -12896298 -12687748 -11093288 -9495593 -9153491 -9392610 -8623850 -6118263
4465f118263L830906L798261J670019j653200l421926k240187k30074q1445j437216
$$ -6118263 -2287357 1510904 3180923 1527723 -1894203 -4134390 -4364464 -4445909 -5883125
4456e883125k238703j895194p81137J455941M221724M497297N39552m203989m560854
$$ -5883125 -8121828 -10017022 -10798159 -9342218 -5120494 -623197 -83645 -4287634 -8848488
4447h848488m28430L282088L152862M72872j896450k613926j496244R90384L102251
$$ -8848488 -9276918 -5994830 -2841968 -2369096 -4265546 -6879472 -8375716 -7385332 -4283081
4438d283081K884259N45523j766231k631180k292153j292299k4943N91382j95502
$$ -4283081 -1398822 -853299 -2619530 -5250710 -7542863 -8835162 -8860105 -8268723 -8464225
4429h464225j702263k650979k781351k235094l45640L013362N747418N442237
$$ -8464225 -10166488 -12817467 -15598818 -17833912 -18179552 -15166190 -9418772 -3976535
4421c976535K504619m54068j730884j307623L29181J930063J249664k183353m934062
$$ -3976535 -1471916 -1925984 -3656868 -4964491 -4635310 -2705247 -1455583 -3638936 -8572998
4412h572998l294124J428058M256780K945183m1059j887756k458144k393069j406848
$$ -8572998 -11867122 -10439064 -6182284 -3237101 -3278160 -5165916 -7624060 -10017129 -11423977
4403a1423977K45210J140660R29351J172034K645263L630033K343457l05556j862334
$$ -11423977 -11178767 -10038107 -9108756 -7936722 -5291459 -1661426 682031 376475 -1485859
4394a485859j379315r0267M99594K01876j43955J4430K41843j35392q61822j013834
$$ -1485859 -2865174 -2955441 -2455847 -2253971 -2397926 -2383496 -2141653 -2277045 -3138867 -4152701
4384d152701l66830M67223J263014K181099K465967J056511j049590j332010M75667
$$ -4152701 -4519531 -4052308 -2789294 -608195 1857772 2914283 1864693 532683 1008350
4375A008350J709289J093348O65035J433222O41951l310219o364222l823774K030959
$$ 1008350 2717639 3810987 4476022 5909244 6551195 3240976 -3123246 -6947020 -4916061
4366d916061M405287J381799k086133j846524M68920J440621Q74437O21854R49814
$$ -4916061 -510774 871025 -1215108 -3061632 -2592712 -1152091 -277654 344200 1294014
4357A294014L78240j816326m193522m166931p70298L257918L688205K14517k553372
$$ 1294014 1672254 -144072 -4337594 -8504525 -9274823 -6016905 -2328700 -2114183 -4667555
4348d667555j470369N54971m09890k568548j526431J767322K178146r31674k386230
$$ -4667555 -6137924 -5582953 -5992843 -8561391 -10087822 -8320500 -6142354 -7074028 -9460258
4339i460258L99048L496755L074510Q20062p9032l6915p55798j195138M71913
$$ -9460258 -9061210 -5564455 -2489945 -1669883 -1748915 -1785830 -2541628 -3736766 -3264853
4330c264853L040299L681123J899789l43972j464582j423903j017236j163574
$$ -3264853 -224554 3456569 5356358 5012386 3547804 2123901 1106665 -56909
4322e6909j908900j690539P99117L825296L981336P80483k670401m068687m051276
$$ -56909 -1965809 -3656348 -2857231 968065 4949401 5729884 3059483 -1009204 -5060480
4313e060480l338084j336416J057422J007912j745188l302253j086737K185279
$$ -5060480 -8398564 -9734980 -8677558 -7669646 -9414834 -12717087 -13803824 -11618545
4305a1618545K841079J557633R91679Q32534p22311k487977j748452O96073J291022
$$ -11618545 -8777466 -7219833 -6228154 -5395620 -6117931 -8605908 -10354360 -9658287 -8367265
4296h367265m88122j216940Q33964K900279K267638N43522Q48947K702925K758432
$$ -8367265 -8855387 -10072327 -9238363 -6338084 -4070446 -3526924 -2677977 24948 2783380
4287B783380J02464k150246j364579R32391J729560J179042J705590L076555J978662
$$ 2783380 2885844 735598 -628981 303410 2032970 3212012 4917602 7994157 9972819
4278I972819k424971n952279m836621j051753Q58162J95205k60460M25440N22828
$$ 9972819 7547848 1595569 -3241052 -4292805 -3434643 -3239438 -3499898 -3074458 -2551630
4269b551630l50193m93044L14034K07170j177618j864907j009053p6647J34964
$$ -2551630 -2901823 -3394867 -3080833 -2873663 -4051281 -5916188 -6925241 -7001888 -6866924
4260f866924N47349J122098L14923j802627k904286j982800p33532l71035R7398
$$ -6866924 -6319575 -5197477 -4882554 -6685181 -9589467 -11572267 -12305799 -12676834 -12579436
4251a2579436J380705K444311K568051K296657J615954j38327k071487k365989
$$ -12579436 -11198731 -8754420 -6186369 -3889712 -2273758 -2412085 -4483572 -6849561
4243f849561j458039j366815j757367n19434J533992J123202j590077k481852
$$ -6849561 -8307600 -9674415 -11431782 -11951216 -10417224 -9294022 -10884099 -13365951
4235a3365951j87743J750403J278693J017374K497982K647181m00693k883983
$$ -13365951 -13553694 -11803291 -10524598 -9507224 -7009242 -4362061 -4762754 -7646737
4227g646737j095835K525842L392960J515970m5555n98238j416977k221964j964685
$$ -7646737 -8742572 -6216730 -2823770 -1307800 -1353355 -1951593 -3368570 -5590534 -7555219
4218g555219j313402j172754o92837N13970N63410j515720l270854k290441J70120
$$ -7555219 -8868621 -10041375 -10734212 -10220242 -9656832 -11172552 -14443406 -16733847 -16563727
4209a6563727J463769R70702p32427l083615m109734j527969K749512L542927
$$ -16563727 -15099958 -14129256 -14861683 -17945298 -22055032 -23583001 -20833489 -17290562
4201a7290562J07943k016844L70660L177187K296736J31504K46596R76299l34780
$$ -17290562 -17182619 -19199463 -18828803 -15651616 -13354880 -13223376 -12976780 -12000481 -12335261
4192a2335261j697898o93535L23999j076238k095551N826J975509K54282k003401
$$ -12335261 -14033159 -14726694 -14402695 -15478933 -17574484 -17568658 -15593149 -15338867 -17342268
4183a7342268m36465K353373J468731j373282j258133R66728Q75574j218798j637411
$$ -17342268 -17778733 -15425360 -13956629 -15329911 -16588044 -15621316 -14745742 -15964540 -17601951
4174a7601951n72072r08622k193393k183796j638320j709112l09296L135853M205134
$$ -17601951 -18174023 -19082645 -21276038 -23459834 -25098154 -26807266 -27116562 -23980709 -19775575
4165a9775575Q77656j597113J50844J054975k114223l014034K066714M529363
$$ -19775575 -18897919 -20495032 -20344188 -19289213 -21403436 -24417470 -22350756 -17821393
4157a7821393j794438p035200j426365N825005J811700o413903m624138J787676
$$ -17821393 -19615831 -26651031 -28077396 -22252391 -20440691 -26854594 -31478732 -29691056
4149b9691056j716778r983606p791801j181355o862975j5928616o834317P706842
$$ -29691056 -31407834 -41391440 -49183241 -50364596 -57227571 -73156187 -79990504 -72283662
4141g2283662m850502k8212841n55381Q6160181J45243701J01281402k977808
$$ -72283662 -77134164 -105347005 -105902386 -19742205 125501496 226782898 223805090
4134B23805090o2277646m5082942j2152789j1610656k3017625j5295125j08005
$$ 223805090 161527444 116444502 104291713 92681057 69663432 54368307 54260302
4127E4260302m95804q777263o597995J233301P40986l815282j129807M102393
$$ 54260302 53764498 44987235 38389240 39622541 40363527 36548245 35418438 39520831
4119C9520831J203572n595739n719156j721371k692689o647659n640680j368621
$$ 39520831 40724403 35128664 29409508 27688137 24995448 18347789 12707109 11338488
4111A1338488p61107k070390P23096M872994L469356j243068j660347J513070
$$ 11338488 10577381 8506991 9230087 14103081 17572437 16329369 14669022 16182092
4103A6182092J202436l034607n023891l216045j731305j408986P07096L576601
$$ 16182092 17384528 14349921 9326030 6109985 4378680 2969694 3676790 7253391
4095G253391K639382j743993l901159j443282J995423K987450J989927O11935
$$ 7253391 9892773 8148780 4247621 2804339 4799762 7787212 9777139 10389074
4087A0389074m06820n63695k40596j077612l142163l854623k235772r80771j409904
$$ 10389074 9982254 9418559 9177963 8100351 4958188 1103565 -1132207 -2112978 -3522882
4078c522882n55485K928567M631658J132977l442966l282525M64129K718252K593381
$$ -3522882 -4078367 -1149800 3481858 4614835 1171869 -2110656 -1646527 1071725 3665106
4069C665106K345085J597110p68607j909310Q70134L825620J759615k831299l176651
$$ 3665106 6010191 7607301 6838694 4929384 5799518 9625138 11384753 8553454 5376803
4060E376803O81749K197872p15402k973875j326405J217956J513273M77061n81621
$$ 5376803 6058552 8256424 7541022 4567147 3240742 4458698 5971971 6449032 5867411
4051E867411k170799l381403j644877K425211M592179L026527M26168j128214
$$ 5867411 3696612 315209 -1329668 1095543 5687722 8714249 9140417 8012203
4043H012203k697286m288358l110130J405501N028315M174680P68041j074975
$$ 8012203 5314917 1026559 -2083571 -678070 4350245 8524925 9292966 8217991
4035H217991n68814J72831L312m39773o49887r88067j871390l084566l649623
$$ 8217991 7649177 7822008 7825320 7385547 6735660 5747593 3876203 791637 -2857986
4026b857986k628169p10036K1928q59237r40401J156336K733788R56518k004924
$$ -2857986 -5486155 -6196191 -6174263 -7033500 -7973901 -6817565 -4083777 -3127259 -5132183
4017e132183j838397J075635K329925O00687q03995K5300Q44505j44157j230541
$$ -5132183 -6970580 -5894945 -3565020 -2964333 -3768328 -3743028 -2898523 -3042680 -4273221
4008d273221n49284J045995K172597K849158K819542J143410j086989q72227K157420
$$ -4273221 -4822505 -3776510 -1603913 1245245 4064787 5208197 4121208 3248981 5406401
3999E406401M395113L245102N65287p03027n01202k47105j64832k39485j443406
$$ 5406401 9801514 13046616 13611903 12908876 12407674 12160569 11995737 11756252 10312846
3990A0312846l681395m545630k439105O93924J840572O73861j016772k185734
$$ 10312846 6631451 2085821 -353284 340640 2181212 2855073 1838301 -347433
3982c47433k879316k885814j930800n62329N32421J532761K853433M068261M098113
$$ -347433 -3226749 -6112563 -8043363 -8605692 -8073271 -6540510 -3687077 381184 4479297
3973D479297K127214j474522m451779l869742L16394L962939L429757N71447j16817
$$ 4479297 6606511 5131989 680210 -3189532 -2873138 1089801 4519558 5091005 4974188
3964D974188J515939J354905j861707m249904k942497j68937Q99929N91122O70211
$$ 4974188 6490127 7845032 5983325 1733421 -1209076 -1378013 -478084 113038 783249
3955G83249J143262J430739J775366J541619o55458l294872k324728K368899N048239
$$ 783249 1926511 3357250 5132616 6674235 6018777 2723905 399177 2768076 7816315
3946G816315J965479k855235l600213p78294J107467P34353j52437j282016k961634
$$ 7816315 9781794 6926559 3326346 2548052 3655519 4389872 4237435 2955419 -6215
3937f215k821360R61611M807513L859455j84096j391487Q71037J297885j966535
$$ -6215 -2827575 -1865964 2941549 6801004 6616908 5225421 6096458 7394343 5427808
3928E427808m052623j583522J818953J577563r14023j261361J158874L095770
$$ 5427808 1375185 -208337 1610616 3188179 2274156 1012795 2171669 5267439
3920E267439K333646j47188j941968j469636N99427J490386n87297l377575k984898
$$ 5267439 7601085 7453897 5511929 4042293 4641720 6132106 5544809 2167234 -817664
3911h17664M56800K616197J156013j348477j922240j041657j69622R76755K270491
$$ -817664 -360864 2255333 3411346 2062869 140629 -901028 -1070650 -93895 2176596
3902B176596J650178j283703l115224j353049J321176J161213o93116n71309J248938
$$ 2176596 3826774 2543071 -572153 -1925202 -604026 557187 -135929 -707238 541700
3893E41700J186591j261795k570126r79847R81379Q31304n37966j184547q31193
$$ 541700 1728291 466496 -2103630 -3083477 -2102098 -1270794 -1808760 -2993307 -3824500
3884c824500J06836J630089K908509K301902J46528o42577J481168L920634L031294
$$ -3824500 -3717664 -2087575 820934 3122836 3269364 2626787 4107955 8028589 11059883
3875A1059883j197608n248454n991446l150649J201417M198114L960735J215040
$$ 11059883 9862275 4613821 -1377625 -4528274 -3326857 871257 4831992 6047032
3867F047032j213704j367917o0503P43895L29875q69172k414401l501574k689813
$$ 6047032 4833328 3465411 3404908 4148803 4478678 3609506 1195105 -2306469 -4996282
3858d996282J69740K607715K199868N2054n49581J197868K604203J445660j310735
$$ -4996282 -4826542 -2218827 -18959 33095 -516486 681382 3285585 4731245 3420510
3849C420510l478387m254574l733647j725351J319045L519295L388659J663670
$$ 3420510 -57877 -4312451 -8046098 -9771449 -8452404 -4933109 -1544450 119220
3841A19220N2561q78388j249328n26304J425059K793799J619405j120927k434318
$$ 119220 171781 -706607 -1955935 -2482239 -1057180 1736619 3356024 2235097 -199221
3832a99221j365030Q8435L78177L30532R01438J392254J191761J107954J303000
$$ -199221 -1564251 -1475816 -1097639 -767107 134331 1526585 2718346 3826300 5129300
3823E129300L1379l267109n410187l019389K288006N411898M310559J931824J208746
$$ 5129300 5160679 1893570 -3516617 -6536006 -4248000 1163898 5474457 7406281 8615027
3814H615027J314598K77809j376151j771512q28347j09807l60958q98967r37418
$$ 8615027 9929625 10207434 8831283 7059771 6231424 6121617 5760659 4861692 3924274
3805C924274k73654Q20569J522326J072208J47851L17152J295074O72390k118626
$$ 3924274 3650620 4471189 5993515 7065723 7213574 7530726 8825800 9498190 7379564
3796G379564l819263j830181J361688J674330k14896l67577J290490O26247l113149
$$ 7379564 3560301 1730120 3091808 4766138 4551242 4183665 5474155 6100402 2987253
3787B987253m914526j796433J926649J151765k128096k385288O33634K199620
$$ 2987253 -1927273 -3723706 -1797057 -645292 -2773388 -5158676 -4525042 -2325422
3779b325422N47916j027925l06282O16079m93531k575581l624749l249432j518231
$$ -2325422 -1777506 -2805431 -3111713 -2495634 -2989165 -5564746 -9189495 -12438927 -13957158
3770a3957158J670340M662864M579303J460318r61234l75970J086923Q78147k4839
$$ -13957158 -12286818 -7623954 -3044651 -1584333 -2545567 -2921537 -1834614 -956467 -981306
3761i81306K17210N41824q21434k486588j731494J108457L206323L221083J944099
$$ -981306 -764096 -222272 -1043706 -3530294 -5261788 -4153331 -947008 2274075 4218174
3752D218174R3197j714974j943396j05940J295557k2398k040007j142319J922338
$$ 4218174 4311371 2596397 653001 547061 1842618 1820220 -219787 -1362106 560232
3743E60232K902825O61453j418702j186488n48667j199196j522578J46375K344270
$$ 560232 3463057 4124510 2705808 1519320 970653 -228543 -1751121 -1604746 739524
3734G39524K765648J279430j068188l558418m696622k459560K195100M702379
$$ 739524 3505172 4784602 3716414 157996 -4538626 -6998186 -4803086 -100707
3726a00707K351992j746361k737286j75156K546273L223077K407443J170981J82619
$$ -100707 2251285 504924 -2232362 -2407518 138755 3361832 5769275 6940256 7122875
3717G122875K66786J305648J238473j365999m344003m161714q50729J857952J479583
$$ 7122875 7389661 8695309 9933782 8567783 4223780 62066 -788663 1069289 2548872
3708B548872n14759j432984p34012K41944M81421K13756K17749P73486J210829
$$ 2548872 2034113 601129 -132883 109061 590482 804238 1021987 1795473 3006302
3699C006302O76578n34375j131627o62118j53766l24348m24654J83087O35417
$$ 3006302 3682880 3148505 2016878 1354760 1200994 876646 451992 635079 1270496
3690A270496K5148r74721j309684j156221r28948o9549J460033J888913n5167
$$ 1270496 1295644 320923 -988761 -2144982 -3073930 -3143479 -1683446 205467 150300
3681A50300k691818l442630k339054j204581l39200J329123L348399L684755J566572
$$ 150300 -2541518 -5984148 -8323202 -9527783 -9866983 -8537860 -5189461 -1504706 61866
3672F1866j622113m007769m116942j166967L285695N217490K471480j845735l331743
$$ 61866 -1560247 -5568016 -9684958 -10851925 -7566230 -2348740 122740 -1722995 -5054738
3663e054738k337645k251359l004110j332912K641014M632246L044250J226992
$$ -5054738 -7392383 -9643742 -12647852 -13980764 -11339750 -6707504 -3663254 -2436262
3655b436262J116117J25559k810969l591740L83827M490792L103507j776104l736839
$$ -2436262 -1320145 -1194586 -4005555 -7597295 -7213468 -2722676 380831 -1395273 -5132112
3646e132112j504880N82114L56152N9338Q68364R09634k20913k9435K069877K965312
$$ -5132112 -6636992 -6054878 -5698726 -5639388 -4771024 -3861390 -4082303 -4111738 -2041861 923451
3636I23451J049852p18714L63276K230315J534092r39390j831876n16527O23741
$$ 923451 1973303 1254589 1617865 3848180 5382272 4442882 2611006 2094479 2718220
3627B718220L21070m17582r36458j678190k132558q39286J860400L416876K356193
$$ 2718220 3039290 2621708 1685250 7060 -2125498 -2964784 -1104384 2312492 4668685
3618D668685O8712j520376k137166k047384q74566R53600J508243N2078j241266
$$ 4668685 4737397 3217021 1079855 -967529 -1842095 -888495 619748 671826 -569440
3609e69440m87296O25440l97757k180615j243876K126238L934738K730467J410666
$$ -569440 -1056736 -431296 -829053 -3009668 -4253544 -2127306 1807432 4537899 5948565
3600E948565J585144Q03808k167359l814214j345098K053470J957878k96211m91535
$$ 5948565 7533709 8337517 6170158 2355944 1010846 3064316 5022194 4725983 4234448
3591D234448R49216K23796k384616k712490l41353M17068j762613k760085l44964
$$ 4234448 5183664 5407460 3022844 310354 -30999 386069 -1376544 -4136629 -4481593
3582d481593J911517J026366m64250L58921J551390M96824q50745K52349J810758
$$ -4481593 -2570076 -1543710 -2007960 -1649039 -97649 399175 -451570 -199221 1611537
3573A611537N71244j727451j107586J635871K385738R62428J082314L298771L731031
$$ 1611537 2182781 455330 -652256 983615 3369353 4331781 5414095 8712866 12443897
3564A2443897O80630k616962l374495k954554l271592l307598j561274Q94188
$$ 12443897 13124527 10507565 7133070 4178516 906924 -2400674 -3961948 -3067760
3556c067760K046209J577461K27306j536427k859970k496863p75883K90973K5673
$$ -3067760 -1021551 555910 783216 -753211 -3613181 -6110044 -6885927 -6594954 -6569281
3547f569281J95099J820765L007336J730132r20050k231400j431474L8547R16042
$$ -6569281 -6374182 -4553417 -1546081 184051 -735999 -2967399 -4398873 -4360326 -3444284
3538c444284J061660N50480n84510j737532j967368j054365J74336O69679K30868
$$ -3444284 -2382624 -1832144 -2416654 -4154186 -6121554 -7175919 -7001583 -6331904 -6101036
3529f101036j81801N23560J956145K310463P56111j034854r08772R15604K390591
$$ -6101036 -6282837 -5759277 -3803132 -1492669 -736558 -1771412 -2680184 -1764580 626011
3520F26011K340457J033725j091211l148648k971243O85876N150536N889906K097127
$$ 626011 2966468 4000193 2908982 -239666 -3210909 -2525033 2625503 8515409 10612536
3511A0612536k299974l740844k516033n60529J161461J803404K37824k489582
$$ 10612536 8312562 4571718 2055685 1495156 2656617 4460021 4697845 2208263
3503B208263k911683K64532L418960K492146j362383l288603r46880L222136N428473
$$ 2208263 -703420 -438888 2980072 5472218 4109835 821232 -125648 3096488 8524961
3494H524961M163987P43743k065045k193766l14572P12951o35648k561914k586147
$$ 8524961 12688948 13432691 11367646 9173880 8859308 9572259 8936611 6374697 3788550
3485C788550q43411Q31546J776708K409405K289720O45532j646294k854604k956080
$$ 3788550 2945139 3776685 5553393 7962798 10252518 10898050 9251756 6397152 3441072
3476C441072l253975l567309k214809P48081K625258J587575o81169j392043n64142
$$ 3441072 187097 -3380212 -5595021 -4846940 -2221682 -634107 -1315276 -2707319 -3271461
3467c271461o85032k705160m209884k507056J513193M167441L580269J772438
$$ -3271461 -3956493 -6661653 -10871537 -13378593 -11865400 -7697959 -4117690 -2345252
3459b345252J287620J462105L0789k698057m048720l131007j760916p28031J576969
$$ -2345252 -1057632 404473 435262 -2262795 -6311515 -9442522 -11203438 -11931469 -10354500
3450a0354500N321666P179785M691361L67851j493118m94309L52780l81554j300320
$$ -10354500 -5032834 2146951 6838312 7206163 5713045 5218736 5571516 5189962 3889642
3441C889642j454009j632873k045206j443401N48529K206961J770522m81045k759678
$$ 3889642 2435633 802760 -1242446 -2685847 -2137318 69643 1840165 1359120 -1400558
3432a400558l496755k416514p07287K5080l24473r4056J643899L356268L161052
$$ -1400558 -4897313 -7313827 -8021114 -7996034 -8320507 -8414563 -6770664 -3414396 -253344
3423b53344J589473N31393L90010K34719n2257R0877L16442O9187J53637J290427
$$ -253344 1336129 1867522 2257532 2492251 2439994 2530871 2847313 2916500 3070137 4360564
3413D360564J935889K74499k289736k754774j229362n44031j208315o98600J527560
$$ 4360564 6296453 6570952 4281216 1526442 297080 -246951 -1455266 -2153866 -626306
3404f26306K422995L90037j831711j581064k52133j09743n9348J987264M566248
$$ -626306 1796689 2186726 355015 -1226049 -1478182 -1587925 -1647273 339991 4906239
3395D906239M201533O25591k776979l534809k463937j454397j168370j329403
$$ 4906239 9107772 9733363 6956384 3421575 957638 -496759 -1665129 -2994532
3387b994532j607038j683219j367782p80636Q1143J434679K746731K638012Q18759
$$ -2994532 -4601570 -6284789 -7652571 -8433207 -8352064 -6917385 -4170654 -1532642 -713883
3378g13883q28403n13022Q15549O91811j256481k473208o04385L379605N657588
$$ -713883 -1542286 -2055308 -1239759 -547948 -1804429 -4277637 -4882022 -1502417 4155171
3369D155171L274786k315575n862477l656492J926099M982972L282946M49298
$$ 4155171 7429957 5114382 -748095 -4404587 -2478488 2504484 5787430 6236728
3361F236728J84457J368627J027390n67068j040630m39477r00856k431956k561879
$$ 6236728 6421185 7789812 8817202 8250134 7209504 6770027 5869171 3437215 875336
3352H75336m12225J879025K306242J057900r73472l252237m635595l818236j534875
$$ 875336 463111 2342136 4648378 5706278 4732806 1480569 -3155026 -6973262 -8508137
3343h508137r5477K12O38682K443140L204310J474484o95642o93323Q28942J311639
$$ -8508137 -8603614 -8603402 -7964720 -5521580 -2317270 -842786 -1538428 -2231751 -1402809 -91170
3333i1170J39457j101549j300030o65400M21117J461420J356708j93946j373816
$$ -91170 48287 -1053262 -2353292 -3018692 -2597575 -1136155 220553 26607 -1347209
3324a347209m01342J455389J370906p00898j877025r42494j84701j338101k448715
$$ -1347209 -1748551 -293162 1077744 376846 -1500179 -2442673 -2627374 -3965475 -6414190
3315f414190j068588J496389K117978Q91032Q74607K814848L560092J031429k040188
$$ -6414190 -7482778 -5986389 -3868411 -2977379 -2102772 712076 4272168 5303597 3263409
3306C263409j636939J921419M352327K788008j314013m437242m410938j645609
$$ 3263409 1626470 3547889 7900216 10688224 9374211 4936969 526031 -1119578
3298a119578J329055J529051j596555m825025m431746q84559J831831J837672
$$ -1119578 209477 1738528 141973 -4683052 -9114798 -9999357 -8167526 -6329854
3290f329854J503820K826410L800046K009433o97066q64853O14390m26007m349371
$$ -6329854 -4826034 -1999624 1800422 3809855 3112789 2247936 2862326 2436319 -1913052
3281a913052o153847k628080K630512M081153J508522q58031r22709p11642j939359
$$ -1913052 -8066899 -10694979 -8064467 -3983314 -2474792 -3332823 -4255532 -4967174 -6906533
3272f906533l067936k052370L42693J760173J525419J003414J234190J750669
$$ -6906533 -9974469 -12026839 -11684146 -9923973 -8398554 -7395140 -6160950 -4410281
3264d410281J814944J609641J632997J591612O86682j051683k364795k112935
$$ -4410281 -2595337 -985696 647301 2238913 2925595 1873912 -490883 -2603818
3256b603818p56575Q5747l61116j071854o55362Q03976K057394K457751K352639
$$ -2603818 -3360393 -3274646 -3635762 -4707616 -5362978 -4559002 -2501608 -43857 2308782
3247B308782J768265J17266k129996k874889r64416J475773J200754j730055l675652
$$ 2308782 4077047 4194313 2064317 -810572 -1774988 -299215 901539 -828516 -4504168
3238d504168k140168J087950K637766J728240M1285j148015j559470n80106K009350
$$ -4504168 -6644336 -5556386 -2918620 -1190380 -1149095 -2297110 -3856580 -4436686 -2427336
3229b427336M129617K923941j200250m398515m171853k122410q04449k08577P37897
$$ -2427336 1702281 4626222 3425972 -972543 -5144396 -7266806 -8071255 -8279832 -7541935
3220g541935J289276K13583j180299k43491K987594N383829M569631J332957j916199
$$ -7541935 -6252659 -6039076 -7219375 -7462866 -4475272 908557 5478188 6811145 4894946
3211D894946l376759k519043l46202Q01426n43657k733501k765414m85821J108376
$$ 4894946 1518187 -1000856 -1347058 -545632 -1089289 -3822790 -6588204 -7074025 -5965649
3202e965649L37745p85463M4040J801815J895954J43548j152274m35922J577645
$$ -5965649 -5627904 -6413367 -6369327 -4567512 -2671558 -2528010 -3680284 -4116206 -2538561
3193b538561L217225L199785J075813k129090l930749k580840O23933K466721
$$ -2538561 678664 3878449 4954262 2825172 -1105577 -3686417 -3062484 -595763
3185e95763J451764o97958j360420J24030K202022K970371J954882M11557j11111
$$ -595763 856001 158043 -1202377 -1078347 1123675 4094046 6048928 6460485 6349374
3176F349374K87481r0983j952894l354017k058724R28701K153675L05074k008711
$$ 6349374 6636855 6545872 4592978 1238961 -819763 108938 2262613 2567687 558976
3167E58976k093875r29354j219084k852631k855177j5228K799426K309316o07194
$$ 558976 -1534899 -2464253 -3683337 -6535968 -9391145 -9406373 -6606947 -4297631 -4904825
3158d904825j923076K39911L182978L232184M33382j796007j225281O54798J067461
$$ -4904825 -6827901 -6587990 -3405012 -172828 260554 -1535453 -2760734 -2105936 -1038475
3149a038475n20008k370673l011653k364531q35105J077237K213038J454408m74884
$$ -1038475 -1558483 -3929156 -6940809 -9305340 -10140445 -9063208 -6850170 -5395762 -5870646
3140e870646j380585n07308M24240J44225J35280K159281M733231M561026J118387
$$ -5870646 -7251231 -7758539 -7334299 -7190074 -7054794 -4895513 -162282 4398744 5517131
3131E517131k589186l925344l008652j035100J185035K375515J267623q37280
$$ 5517131 2927945 -997399 -4006051 -5041151 -3856116 -1480601 -212978 -1050258
3123a050258p37228J778305K661083l96752l795065l328383q15968p13089k194107
$$ -1050258 -1787486 -9181 2651902 2255150 -1539915 -4868298 -5684266 -6397355 -8591462
3114h591462o28831L625039M656498O00293k755288j015193K068477J306903j483231
$$ -8591462 -9220293 -5595254 -938756 -338463 -3093751 -4108944 -2040467 -733564 -2216795
3105b216795j367243J167730J993311J216382K308670M351213K443030l314309
$$ -2216795 -3584038 -2416308 -422997 793385 3102055 7453268 9896298 6581989
3097F581989o148600k436165K654477K905183k82817j359187O01885J553991o25537
$$ 6581989 433389 -2002776 651701 3556884 3274067 1914880 2516765 4070756 3445219
3088C445219l429733l903072k162480j10597J101767J517087J571164J537165
$$ 3445219 15486 -3887586 -6050066 -6160663 -5058896 -3541809 -1970645 -433480
3080d33480J375164J011209O85629N49401K01784l73574J02025K411898M436842
$$ -433480 941684 1952893 2638522 3187923 3389707 3016133 3118158 5530056 9966898
3071I966898L031799j353116m663581m647085l311009k755592j945145J33370
$$ 9966898 12998697 11645581 6982000 2334915 -976094 -3731686 -5676831 -5543461
3063e543461J354567k15578k297230j374269J913847L929301L359964J840605
$$ -5543461 -4188894 -4404472 -6701702 -8075971 -6162124 -2232823 1127141 2967746
3055B967746K81225j627171k791228j490576J185233K247374J311940O85684Q34875
$$ 2967746 3248971 1621800 -1169428 -2660004 -1474771 772603 2084543 2770227 3605102
3046C605102k47965k475340k712174K5870K362607J739020K13901M14496J028187
$$ 3605102 3357137 881797 -1830377 -1804507 558100 2297120 2511021 2925517 3953704
3037C953704k11398j702449k73651L171347M457387K166016q68504k254411k723781
$$ 3953704 3742306 2039857 1766206 4937553 9394940 11560956 10692452 8438041 5714260
3028E714260l282783k926865r80480O59880n9506j961121j979305M41630K380574
$$ 5714260 2431477 -495388 -1475868 -815988 -875494 -2836615 -4815920 -4374290 -1993716
3019a993716J394908j154114j971320k04904J690517J561908L04904o3202L51026
$$ -1993716 -598808 -1752922 -3724242 -3929146 -2238629 -676721 -371817 -435019 -83993
3010h3993j090q54683k13265J821447K055011j163412m433559l225285J643952
$$ -83993 -85083 -939766 -1153031 668416 2723427 1560015 -2873544 -6098829 -4454877
3001d454877M568639K457206j448145k391572l69951P25214j058780l494088l772905
$$ -4454877 113762 2570968 1122823 -1268749 -1638700 -913486 -1972266 -5466354 -9239259
2992i239259j929708K43177J820311K766270K566931P70408j441075j983610m26258
$$ -9239259 -11168967 -10925790 -9105479 -6339209 -3772278 -3001870 -4442945 -6426555 -6852813
2983f852813J484968K111390J524673N86451k04302m18053M32562J943174K776891
$$ -6852813 -5367845 -3256455 -1731782 -1145331 -1349633 -1767686 -1335124 608050 3384941
2974C384941K219867P67861j164123l528835n083235l698549L89574L696110L731532
$$ 3384941 5604808 6372669 5208546 1679711 -3403524 -7102073 -6712499 -3016389 715143
2965G15143K227814J906220K050936L74970k288182k938301j353662k30041n00205
$$ 715143 2942957 4849177 6900113 7275083 4986901 2048600 694938 464897 -35308
2956c5308m16268L54135j88212k114947k378236L12911K952975K747626R95126
$$ -35308 -451576 -97441 -285653 -2400600 -4778836 -4465925 -1512950 1234676 2229802
2947B229802Q3509l39791j326625j476921P11280L231400K852929o2773k208726
$$ 2229802 2313311 1973520 646895 -830026 -118746 3112654 5965583 5902810 3694084
2938C694084k109176j378822j580668k335891k472678j237658J226475L196836
$$ 3694084 1584908 206086 -1374582 -3710473 -6183151 -7420809 -6194334 -2997498
2930b997498K265047j407288m162101l197699k36956J511258K104786L338642
$$ -2997498 -732451 -2139739 -6301840 -9499539 -9736495 -8225237 -6120451 -2781809
2922b781809M201881K136924j781640l360859j398307P17621M08641q10599q16652
$$ -2781809 1420072 3556996 1775356 -1585503 -2983810 -2266189 -1857548 -2668147 -3484799
2913c484799k60254n46298j074739n66659O52942J354671J066160M3350j061946
$$ -3484799 -3745053 -4291351 -5366090 -5932749 -5279807 -3925136 -2858976 -2815626 -3877572
2904c877572j044722O15754K152800J386314n69567l10163K483984L908822J489516
$$ -3877572 -4922294 -4306540 -2153740 -767426 -1336993 -1647156 836828 4745650 6235166
2895F235166k161513l354443k196495j058905n73663J37298J032337J532698J942919
$$ 6235166 4073653 719210 -1477285 -2536190 -3109853 -2972555 -1940218 -407520 1535399
2886A535399K315497J437867r12417k454380j553217j30105p18753k306949k241270
$$ 1535399 3850896 5288763 4376346 1921966 368749 238644 -480109 -2787058 -5028328
2877e028328q38566n13213j222991o72416J152943J608411J26569l89363J727140
$$ -5028328 -5866894 -6380107 -7603098 -8275514 -7122571 -5514160 -5387591 -5776954 -4049814
2868d049814L945458L214624L05791j601735j179054J74479Q93952R27668Q85163
$$ -4049814 -104356 3110268 3416059 1814324 635270 809749 1703701 2631369 3516532
2859C516532O72087l95693k173295l038412j732827K36146q2018k563188l198305
$$ 3516532 4188619 3792926 1619631 -1418781 -3151608 -2915462 -2997480 -5560668 -8758973
2850h758973K07120L879612K910019j378598l060418j12326L149477K747074q5668
$$ -8758973 -8551853 -4672241 -1762222 -3140820 -6201238 -6313564 -3164087 -417013 -502681
2841e02681k154018k603433j943300q5103K254732K902472J311832j04019J93607
$$ -502681 -2656699 -5260132 -7203432 -7288535 -5033803 -2131331 -819499 -923518 -729911
2832g29911M09952q44161j382079P51900L033659K059781o10492p77565J329539
$$ -729911 -319959 -1164120 -2546199 -1794299 1239360 3299141 2688649 1911084 3240623
2823C240623J173906k754152o250448n305705j194473J941567K037610K00206
$$ 3240623 4414529 1660377 -4590071 -9895776 -11090249 -9148682 -7111072 -6910866
2815f910866j215055n36002J746516L004069J482874r28664j049323Q75098J664931
$$ -6910866 -8125921 -8661923 -6915407 -3911338 -2428464 -3357128 -4406451 -3531353 -1866422
2806a866422L60155n55158L20344J216666R11892Q59453J658323J003327k134770
$$ -1866422 -1506267 -2061425 -1741081 -524415 387477 1246930 2905253 3908580 1773810
2797A773810m538861l340461q81205j048022k788662j775838K397251N259758
$$ 1773810 -2765051 -6105512 -6986717 -8034739 -10823401 -12599239 -10201988 -4942230
2789d942230L988228R39621l57953M12150J322484J176027J81957o99007k32544
$$ -4942230 -954002 -14381 -372334 39816 1362300 2538327 2720284 2021277 1788733
2780A788733J830522L566457K590119o83379l219096l168190j682008n56177r6028
$$ 1788733 3619255 7185712 9775831 9092452 5873356 2705166 1023158 466981 370953
2771C70953J2150k81507n82225p9614O95480P144k108303k920535n75704K957192
$$ 370953 383103 101596 -480629 -560243 135237 142381 -1965922 -4886457 -5462161 -2504969
2761b504969M142512J951529j692403m364874m616601k184631J561011M092590
$$ -2504969 1637543 3589072 1896669 -2468205 -7084806 -9269437 -7708426 -3615836
2753c615836M080045K678129J458774K47524j501476k485718j011454J842307
$$ -3615836 464209 3142338 4601112 4848636 3347160 861442 -150012 1692295
2745A692295K898931R95737j523369k052537q97279k66140j143928k313341k177379
$$ 1692295 4591226 5586963 4063594 2011057 1113778 847638 -296290 -2609631 -4787010
2736d787010o22581J186486K301057K564634J808989k87312k723215k909253J34819
$$ -4787010 -5409591 -4223105 -1922048 642586 2451575 2164263 -558952 -3468205 -3333386
2727c333386L059947J509986l506308n687854j405613N143002P100363L252639
$$ -3333386 -273439 1236547 -2269761 -7957615 -9363228 -4220226 2880137 6132776
2719F132776j519381k722016m03723K422595K956938N15173k761922l566542j389676
$$ 6132776 4613395 1891379 1487656 3910251 6867189 7382362 4620440 1053898 -335778
2710c35778L18442j104708l332688k541619M40782J473929o9668m02491K149658
$$ -335778 -17336 -1122044 -4454732 -6996351 -6555569 -5081640 -5151308 -5553799 -3404141
2701c404141M186725K587698q68691k594270k040622r65204q7958R46450J763769
$$ -3404141 782584 3370282 2501591 -92679 -2133301 -3098505 -3186463 -2240013 -476244
2692d76244J675736R45299Q4653j002059j961278j579167J65540J191423P7742
$$ -476244 1199492 2144791 2229444 1227385 -733893 -2313060 -2147520 -956097 -878355
2683h78355j652571j701692k28559P98200M81296l97868r10491p89559l24312
$$ -878355 -2530926 -4232618 -4461177 -3662977 -3181681 -3579549 -4490040 -5279599 -5603911
2674e603911k49295q29519p06971J611733M559348M252432k12186m690158n140304
$$ -5603911 -5853206 -6682725 -7389696 -5777963 -1218615 3033817 2821631 -1868527 -7008831
2665g008831k500938j60207J025425K189001K955226K124349P43101R18514K065734
$$ -7008831 -9509769 -9669976 -8644551 -6455550 -3500324 -1375975 -632874 285640 2351374
2656B351374J652667n21112j984571j632259j051067j373528j614739r26352j25579
$$ 2351374 4004041 3482929 1498358 -133901 -1184968 -2558496 -4173235 -5099587 -5225166
2647e225166k3887p6980M28465J192868J496365J050930J89068j25330Q69419
$$ -5225166 -5249053 -5326033 -4897568 -3704700 -2208335 -1157405 -968337 -1093667 -224248
2638b24248K129510J478649q88200j703489M91742K294669M79623k408135j947590
$$ -224248 1905262 3383911 2495711 792222 1283964 3578633 4058256 1650121 -297469
2629b97469O52473N76271k012459j942795J786915L586897L60527l226495k218165
$$ -297469 355004 931275 -1081184 -3023979 -1237064 2349833 2710360 -516135 -2734300
2620b734300J176722K108488Q10089O92685J744229J126221j270550k582899j525117
$$ -2734300 -1557578 550910 1360999 2053684 3797913 4924134 3653584 1070685 -454432
2611d54432N49376K356248L224545J990350j381002m063324l508905j356273r28459
$$ -454432 94944 2451192 5675737 7666087 6285085 2221761 -1287144 -2643417 -3571876
2602c571876j870523j003994K026820L851751K342025q38016l038289l158650
$$ -3571876 -5442399 -6446393 -4419573 -567822 1774203 936187 -2102102 -5260752
2594e260752j234103J702347L211632J673823r88613j566106l99544p31218l089929
$$ -5260752 -6494855 -4792508 -1580876 92947 -895666 -2461772 -2861316 -3592534 -6682463
2585f682463m007661j338664K478923L941612K521611j25474k341856k536238
$$ -6682463 -10690124 -12028788 -9549865 -5608253 -3086642 -3212116 -5553972 -8090210
2577h090210J82834L786020M296142Q62222k476336k075288O11744K008563J872270
$$ -8090210 -7907376 -4121356 174786 1037008 -1439328 -3514616 -2902872 -894309 977961
2568I77961K553173M078050L594212j0162l769582m127811j231373J459686J249255
$$ 977961 3531134 7609184 11203396 11193234 7423652 3295841 2064468 3524154 4773409
2559D773409j054899k587862k003765p49204o27470j370268j769575k051900l076189
$$ 4773409 3718510 1130648 -873117 -1622321 -2249791 -3620059 -5389634 -7441534 -10517723
2550a0517723l760901j910825K096071M895121M211403J345331j086379j838499
$$ -10517723 -14278624 -16189449 -14093378 -9198257 -4986854 -3641523 -4727902 -6566401
2542f566401q60557J198461K440011J142821j250428j259798J389599K894035
$$ -6566401 -7426958 -6228497 -3788486 -2645665 -3896093 -5155891 -3766292 -872257
2534h72257J455551M73799K742877N127691L292775j054221k756324j340428r76217
$$ -872257 583294 1057093 3799970 8927661 12220436 11166215 8409891 7069463 6093246
2525F093246k828134l287781q04356R98988o20329k847381j910078R12953J517954
$$ 6093246 3265112 -22669 -827025 171963 -448366 -3295747 -5205825 -4292872 -2774918
2516b774918p25895k411615j137965J672383L053902J758461r57317k677043j856424
$$ -2774918 -3500813 -5912428 -7050393 -5378010 -2324108 -565647 -1522964 -4200007 -6056431
2507f056431Q49161L252340L675092K014943p47796l039776l163619j008184Q16972
$$ -6056431 -5207270 -1954930 1720162 3735105 2987309 -52467 -3216086 -4224270 -3407298
2498c407298l76052l347836l925335o79067K918798L245214R67425r83881j551994
$$ -3407298 -3783350 -7131186 -11056521 -11735588 -8816790 -5571576 -4604151 -5588032 -7140026
2489g140026j408702o10979R42108K005215J493540N12946N34938O67790o06585
$$ -7140026 -8548728 -9159707 -8217599 -6212384 -4718844 -4205898 -3670960 -3003170 -3609755
2480c609755k061417j313059P92060R75965j103058j978919R6315K270828J648892
$$ -3609755 -5671172 -6984231 -6192171 -5216206 -6319264 -8298183 -8201868 -5931040 -4282148
2471d282148k25030n4618K088615L247149K125374M19349j38267K24130N15890
$$ -4282148 -4507178 -4561796 -2473181 773968 2899342 3318691 3180424 3404554 3920444
2462C920444M52000K46550O5000L8787R7720k40809j213334k094480j935868q40099
$$ 3920444 4372444 4618994 4683994 4722781 4820501 4579692 3366358 1271878 -663990 -1504089
2452a504089L29263J199918J777340J397007o20051l027394l119381j53347L027832
$$ -1504089 -1174826 25092 1802432 3199439 2579388 -448006 -3567387 -3720734 -692902
2443f92902L201515O80751j616872k367349k884753l784741l155504L24271M214808
$$ -692902 2508613 3189364 1572492 -794857 -3679610 -7464351 -10619855 -10295584 -6080776
2434f080776M715745J699572j028407p35866J114272J520172j56938k179810k881221
$$ -6080776 -1365031 334541 -693866 -1429732 -315460 1204712 1047774 -1132036 -4013257
2425d013257j732354Q88877L520608M117549K206425k26161j323394j734475k729589
$$ -4013257 -5745611 -4856734 -1336126 2781423 4987848 4761687 3438293 1703818 -1025771
2416a025771l313577j795806O68295J280136J38250J21145J774444K061946l62795
$$ -1025771 -4339348 -6135154 -5466859 -4186723 -4048473 -3927328 -2152884 -90938 -453733
2407d53733k336702j108350J071999N27431k046103l028676j569492N86O07143
$$ -453733 -2790435 -3898785 -2826786 -2299355 -4345458 -7374134 -8943626 -8943040 -8335897
2398h335897J401535K427059K090314N16614J2055J180706J634711j45311k391078
$$ -8335897 -6934362 -4507303 -2416989 -1900375 -1888320 -707614 927097 781786 -1609292
2389a609292k933452k050570r12723M48450J882914K077532P71023N337J004144
$$ -1609292 -4542744 -6593314 -7506037 -7057587 -5174673 -3097141 -2326118 -2320781 -1316637
2380a316637J712625m4314k645790k881166r04663K50648l99226o58882Q14782
$$ -1316637 395988 351674 -2294116 -5175282 -6079945 -5829297 -6228523 -6887405 -6072623
2371f072623K440952K582486J917772J677279J528747O56059n00522r23621m67136
$$ -6072623 -3631671 -1049185 868587 2545866 4074613 4730672 4230150 3306529 2839393
2362B839393L03326P76470J85218j867914l962337l466332K7936L147346K446074
$$ 2839393 3142719 3919189 4104407 2236493 -1725844 -5192176 -5164240 -2016894 429180
2353D29180j029597k848753p59674K756874L981837K324256N6501j186815j932534
$$ 429180 -600417 -3449170 -4208844 -1451970 2529867 4854123 4910624 3723809 1791275
2344A791275k940715l384504k035672M45784J822885J076589k77394l09202Q34947
$$ 1791275 -1149440 -4533944 -6569616 -6123832 -4300947 -3224358 -3501752 -3810954 -2976007
2335b976007J525665R89732k02005j489594k616568k710313r01513J649425K115213
$$ -2976007 -1450342 -460610 -662615 -2152209 -4768777 -7479090 -8380603 -6731178 -4615965
2326d615965m82779l433102l415723n72455K002098K364021J692014K013541L354378
$$ -4615965 -5098744 -8531846 -11947569 -12520024 -10517926 -8153905 -6461891 -4448350 -1093972
2317a093972L922613K505410r5663k034226k360004j597282n32368P01513J737205
$$ -1093972 2828641 5334051 5238388 3204162 844158 -753124 -1285492 -583979 1153226
2308A153226J212941j428245l802837k639708J419704L587876J111676k574723
$$ 1153226 2366167 937922 -2864915 -5504623 -4084919 -497043 614633 -1960090
2300a960090k398882J326599L688571K209310n43710j651438j475149j239798
$$ -1960090 -4358972 -3032373 656198 2865508 2321798 670360 -804789 -2044587
2292b044587k82351J910139L295467J774379j229717k404801j077347L71638K78395
$$ -2044587 -2326938 -416799 2878668 4653047 3423330 1018529 -58818 312820 591215
2283E91215n30699q51887p59876n87618o8175P53464J160202R84259R26595J051929
$$ 591215 60516 -791371 -1551247 -2138865 -2207040 -1453576 -293374 690885 1617480 2669409
2273B669409L23798j476712k612579j439330J117897K378731R73519j801125l601521
$$ 2669409 2993207 1516495 -1096084 -2535414 -1417517 961214 1934733 133608 -3467913
2264c467913l351734j928269r28847q68852p46268L21506J491845J274689Q4231
$$ -3467913 -6819647 -8747916 -9676763 -10545615 -11291883 -10970377 -9478532 -8203843 -8119612
2255h119612J13788K018001L316040J522372k187353m184006k834293q4117J377669
$$ -8119612 -8005824 -5987823 -2671783 -1149411 -3336764 -7520770 -10355063 -10439180 -9061511
2246i061511J007237J33723Q0081J151320K661651L441220K853752J603571J028114
$$ -9061511 -8054274 -7920551 -7840470 -6689150 -4027499 -586279 2267473 3871044 4899158
2237D899158J426622J636816M45632k017610m342034m931473l299603q28781J84680
$$ 4899158 6325780 7962596 8408228 6390618 2048584 -2882889 -6182492 -7011273 -6826593
2228f826593r15150k020728q73730J657603K623787J267459J65582J386093L438523
$$ -6826593 -7741743 -9762471 -10636201 -8978598 -6354811 -5087352 -4921770 -3535677 -97154
2219i7154L433213R46466j779810k684879j635768O0274P83672k23579j931799
$$ -97154 3336059 4282525 2502715 -182164 -1817932 -1757658 -973986 -1197565 -3129364
2210c129364k411102j324516m69177r41041j222813L41680K510626K748079J034438
$$ -3129364 -5540466 -6864982 -7334159 -8275200 -9498013 -9156333 -6645707 -3897628 -2863190
2201b863190l19538l05909j53548m93624j48541J398633K449692J326736j169964
$$ -2863190 -3182728 -3488637 -3642185 -4135809 -4284350 -2885717 -436025 890711 -279253
2192b79253k695384j964768K22644J879401J573709J13066J97662L036976N794534
$$ -279253 -2974637 -4939405 -4716761 -2837360 -1263651 -1150585 -952923 2084053 7878587
2183G878587M550478l03183m271199m708837l506230k877694k017143n3281J087895
$$ 7878587 12429065 12125882 7854683 3145846 -360384 -3238078 -5255221 -5308502 -4220607
2174d220607L0805n89837J973159N197454M416017K83621j899970l83704P22543
$$ -4220607 -4189802 -4779639 -2806480 2390974 6806991 7090612 5190642 4806938 5529481
2165E529481j334319l429016k023123R36391J331933p00447j710757o71459J98498
$$ 5529481 4195162 766146 -1256977 -320586 1011347 310900 -1399857 -2071316 -1872818
2156a872818l04606q97280o62449l09101k02213K31874O94072R2247j044761p53704
$$ -1872818 -2177424 -3074704 -3737153 -4046254 -4248467 -4016593 -3322521 -3230274 -4275035 -5028739
2146e028739R92633J687496K29384j155194o49513M9567j094523k300131m41200
$$ -5028739 -4036106 -2348610 -2119226 -3274420 -3923933 -3874366 -4968889 -7269020 -7710220
2137g710220L312330M137920K59600m282095m831980j555310J909026L136018
$$ -7710220 -4397890 -259970 -370 -4282465 -9114445 -10669755 -8760729 -5624711
2129e624711K293780L78773j631333k514231j675732j05312R72251J940395L663018
$$ -5624711 -3330931 -2952158 -4583491 -7097722 -8773454 -8878766 -7906515 -5966120 -2303102
2120b303102N001010L681973l4638k720988j888653Q42543K020227O76765j168709
$$ -2303102 2697908 6379881 6345243 3624255 1735602 2578145 4598372 5275137 4106428
2111D106428j707734j352027j362670j787878j588759l56641R05531R62837p5806
$$ 4106428 2398694 1046667 -316003 -2103881 -3692640 -4049281 -3143750 -2180913 -2256719
2102b256719q98683o96933n1039J74825j6451l78429j219405k355889k213921
$$ -2256719 -3155402 -3852335 -3903374 -3728549 -3745000 -4123429 -5342834 -7698723 -9912644
2093i912644P9370K247180J119786k373649l398903K62603M622960M684806J033946
$$ -9912644 -9833274 -7586094 -6466308 -8839957 -12238860 -11976257 -7353297 -2668491 -1634545
2084a634545j741096j740735j246510j821954j689547P76055L763352M233040
$$ -1634545 -3375641 -5116376 -6362886 -8184840 -9874387 -9098332 -5334980 -1101940
2076a101940J896362q18328k026212k118082k375546k893524k342467J95157L421655
$$ -1101940 794422 -23906 -2050118 -4168200 -6543746 -9437270 -11779737 -11584580 -8162925
2067h162925M707313L244414J228188Q21313J198410M55027p26039j58811J545757
$$ -8162925 -3455612 -211198 1016990 1838303 3036713 3491740 2765701 2606890 4152647
2058D152647J227765j635179l488219k046336J46446r7717j675345j580545o8434
$$ 4152647 5380412 3745233 257014 -1789322 -1642876 -1740593 -3415938 -4996483 -5064917
2049e064917L25666l12421N54810K971086L682207J235215j481380j454686K91144
$$ -5064917 -4739251 -5051672 -4496862 -1525776 2156431 3391646 1910266 455580 746724
2040G46724P63068o08431j788749j310282K87459J715646K138156J343051j16830
$$ 746724 1509792 901361 -887388 -2197670 -1910211 -194565 1943591 3286642 3169812
2031C169812j036449o71423L25823O96362J28635n64004o79603m53671n51482
$$ 3169812 2133363 1461940 1787763 2484125 2612760 2048756 1369153 915482 364000
2022C64000j055941j210631l73660P74696O08118j249329k735575j612342J273071
$$ 364000 -691941 -1902572 -2276232 -1501536 -893418 -2142747 -4878322 -6490664 -5217593
2013e217593K552087N76386k371568k946674o16045K361508L804811L212845J258367
$$ -5217593 -2665506 -2089120 -4460688 -7407362 -8023407 -5661899 -1857088 1355757 2614124
2004B614124q63162j805209j051127L05107M91207j123794l434176m513143k964191
$$ 2614124 1750962 -54247 -1105374 -800267 -309060 -1432854 -4867030 -9380173 -12344364
1995a2344364P48381L811463L171524p05456l371204j407291L007024M709159
$$ -12344364 -11595983 -7784520 -4612996 -5318452 -8689656 -10096947 -7089923 -2380764
1987b380764K239567p12066q04327P93865R90539p86884k656381l277275k723816
$$ -2380764 -141197 -853263 -1657590 -863725 126814 -660070 -3316451 -6593726 -9317542
1978i317542j228088R54570K690451K620562P82961j403802k592985k166873j29554
$$ -9317542 -10545630 -9591060 -6900609 -4280047 -3497086 -4900888 -7493873 -9660746 -9790300
1969i790300K423433L356054J625308q83520j281787O23040K255884K022131J182285
$$ -9790300 -7366867 -4010813 -2385505 -3269025 -4550812 -3927772 -1671888 350243 1532528
1960A532528J300619J667773O09596j787813l636006l356068r18570K373563M501449
$$ 1532528 2833147 4500920 5110516 3322703 -313303 -3669371 -4587941 -2214378 2287071
1951B287071L898404J053686j599731k369473k297771l393569n438605n981876
$$ 2287071 6185475 7239161 5639430 3269957 972186 -2421383 -7859988 -13841864
1943a3841864l474635P92294M037407M393004K045364r23836j756655O66698M232299
$$ -13841864 -17316499 -16524205 -12486798 -8093794 -6048430 -6972266 -8728921 -8062223 -3829924
1934c829924N330250K863136l10487p71453J283527K440226N55438k412006k858299
$$ -3829924 1500326 4363462 4052975 3281522 4565049 7005275 7560713 5148707 2290408
1925B290408k19232K077201P88672l005797n163902l531187j44670J970471K395234
$$ 2290408 2071176 4148377 4937049 1931252 -3232650 -6763837 -6908507 -4938036 -2542802
1916b542802K389687J974295L78269j135002J64708M144005O486197L701285j922376
$$ -2542802 -153115 1821180 2199449 1064447 1229155 5373160 11859357 15560642 13638266
1907A3638266m698280k467439J152449J900440J10429p65054M15543R58002j387769
$$ 13638266 8939986 6472547 7624996 9525436 9635865 8870811 9286354 10244356 8856587
1898H856587m686611n045856j709319K075155L355162K673694K119225J965297
$$ 8856587 4169976 -875880 -2585199 -510044 2845118 5518812 7638037 9603334
1890I603334R64215j040904k763922l413463l272491k514451j174954k82744j111401
$$ 9603334 10567549 9526645 6762723 3349260 76769 -2437682 -3612636 -3895380 -5006781
1881e006781k941865l410606j699070L64925J095491R99160J083981J051175N65647
$$ -5006781 -7948646 -11359252 -13058322 -12693397 -11597906 -10598746 -9514765 -8463590 -7897943
1872g897943N33477J354690J468879l14525k321709k085433P0906J789410K142271
$$ -7897943 -7364466 -6009776 -4540897 -4855422 -7177131 -9262564 -9191658 -7402248 -5259977
1863e259977J920270J309552J30388j76839J870481M234238K988618j751088n159307
$$ -5259977 -3339707 -2030155 -1899767 -2076606 -206125 4028113 7016731 5265643 106336
1854A06336m312416j852940j061914r81848M89889J940621R88353q22750k84477
$$ 106336 -4206080 -6059020 -7120934 -8102782 -7612893 -5672272 -4683919 -5506669 -5791146
1845e791146J692558J430865r48643j508550N34533J227485j050067k186342R30106
$$ -5791146 -4098588 -2667723 -3616366 -5124916 -4590383 -3362898 -4412965 -6599307 -5669201
1836e669201M802566M577357J393327k98498k01310j539269m267037m650239j857880
$$ -5669201 -866635 3710722 5104049 4805551 4604241 3064972 -1202065 -5852304 -7710184
1827g710184L14016m11547j555379o75361P61364P72598N03095J480052K188699
$$ -7710184 -7396168 -7807715 -9363094 -10038455 -9277091 -8504493 -8001398 -6521346 -4332647
1818d332647P05586j487943j653546l9706J190232J677297K191715J713454j002329
$$ -4332647 -3627061 -5115004 -6768550 -6808256 -5618024 -3940727 -1749012 -35558 -1037887
1809a037887l826154l243973K26959K452098J676835K78242M5649k24279j228677
$$ -1037887 -4864041 -8108014 -7881055 -5428957 -3752122 -3473880 -3428231 -3652510 -4881187
1800d881187j244197L24985J008051o94077k365580j458551O51814J326734R91814
$$ -4881187 -6125384 -5800399 -4792348 -5486425 -7852005 -9310556 -8658742 -7332008 -6340194
1791f340194J497868K128756R89547q83551p34639J066253J255408r73129k481410
$$ -6340194 -4842326 -2713570 -1724023 -2607574 -3342213 -2275960 -1020552 -1993681 -4475091
1782d475091j076509J240290J539647J11461n78485M23632J778864K094879J545246
$$ -4475091 -5551600 -4311310 -2771663 -2660202 -3238687 -2815055 -1036191 1058688 2603934
1773B603934J324753K069595K795321J677730j432437l789141k550224J212680
$$ 2603934 3928687 5998282 8793603 10471333 9038896 5249755 2699531 3912211
1765C912211L157958J040451k301714k718097k40800J188259p75979l724269l829172
$$ 3912211 7070169 8110620 5808906 3090809 2850009 4038268 3262289 -461980 -4291152
1756d291152r94209J200229O08355n53599P28638L390275L614792O64858j767644
$$ -4291152 -5285361 -4085132 -3476777 -4030376 -3301738 88537 3703329 4368187 2600543
1747B600543j033877O62840P1143j973063k253126m20686R21154O96288M27691
$$ 2600543 1566666 2229506 2300649 327586 -1925540 -2346226 -1425072 -728784 -301093
1738c01093Q12666O13314m15673o56694K62377M31636q86760j582808k73893J108858
$$ -301093 511573 1124887 709214 52520 314897 746533 -140227 -1723035 -1996928 -888070
1728h88070O51613J8482J669127M168507L796263L06585k359842j604549N40291
$$ -888070 -236457 -217975 1451152 5619659 9415922 9722507 7362665 5758116 6298407
1719F298407Q68534n84936j407197o42031L29146L17153j47819k31929l76190
$$ 6298407 7166941 6582005 5174808 4532777 4861923 5179076 5031257 4799328 4423138
1710D423138j492047l214007m030683l148508j397941q6022L43443K06304j27169
$$ 4423138 2931091 -282916 -4313599 -7462107 -8860048 -8946070 -8602627 -8396323 -8523492
1701h523492k96014J22013J147758K264152L118129L747222L764982K357574j29277
$$ -8523492 -8819506 -8697493 -7549735 -5285583 -2167454 1579768 5344750 7702324 7573047
1692G573047j694082r87628P13265J144255p4066j563866k386108k487825j662922
$$ 7573047 5878965 4891337 5604602 6748857 6674791 5110925 2724817 236992 -1425930
1683a425930N9608J414032J129965j48684q86248j015775j302517j109452O12677
$$ -1425930 -1366322 47710 1177675 1028991 142743 -873032 -2175549 -3285001 -2672324
1674b672324K540838K154570k46883j713177j152128n21042q88239o90661Q40391
$$ -2672324 -131486 2023084 1776201 63024 -1089104 -1610146 -2498385 -3189046 -2348655
1665b348655J773757P42669p47894j131114j196588j748462j550332J10181J302987
$$ -2348655 -574898 167771 -580123 -1711237 -2907825 -4656287 -6206619 -6096438 -4793451
1656d793451M16948r84729q58944j19503n61875j230847K9461K677173M036596
$$ -4793451 -4376503 -5361232 -6220176 -6339679 -6901554 -8132401 -8102940 -5425767 -1389171
1647a389171K890872J50649k962123n128067m641440j364833K140378L568287
$$ -1389171 1501701 1652350 -1309773 -6437840 -11079280 -12444113 -10303735 -6735448
1639f735448L497647L070862J382349j877605l607427j154588K696071L010042
$$ -6735448 -3237801 -166939 1215410 -662195 -4269622 -5424210 -2728139 281903
1631B81903o4958j931888q59395J91669p02213j700599j320366r32958j444715
$$ 281903 216945 -1714943 -2574338 -2382669 -3084882 -4785481 -6105847 -7038805 -8483520
1622h483520j184032R29210L120763L527465K642255J404870n56371l016965l875791
$$ -8483520 -9667552 -8738342 -5617579 -2090114 552141 1957011 1400640 -1616325 -5492116
1613e492116j822902J414834L224015L135112K344370J515052L82854j255390
$$ -5492116 -7315018 -5900184 -2676169 458943 2803313 4318365 4701219 3445829
1605C445829k969384l670837k412727r2344O75534q68244j572527J288820M909377
$$ 3445829 476445 -3194392 -5607119 -5699463 -5023929 -5892173 -7464700 -6175880 -1266503
1596a266503M159256n70190l397171j446971J472295J324849n99391j161350m62522
$$ -1266503 2892753 2322563 -1074608 -2521579 -1049284 275565 -323826 -1485176 -1947698
1587a947698k75334m12832J02959M97730k69679j324907j481806j091715m05900
$$ -1947698 -2223032 -2635864 -2532905 -2035175 -2304854 -3629761 -5111567 -6203282 -6609182
1578f609182J421867L640331L182023n94798l316243j158506L324708M578558
$$ -6609182 -5187315 -1546984 1635039 1040241 -2276002 -3434508 -109800 4468758
1570D468758J445200k411539l992109l279584j213035J145099K116905J091071
$$ 4468758 5913958 3502419 -489690 -3769274 -4982309 -3837210 -1720305 -629234
1562f29234o2020K18015M52889r27095j895080K732K417422Q86467l905066o450237
$$ -629234 -691254 -473239 -20350 -947445 -2842525 -2839793 -422371 464096 -3440970 -9891207
1552i891207m185192k08586K400463M084650N109026L290562j528568m549907
$$ -9891207 -14076399 -14284985 -11884522 -7799872 -2690846 599716 -928852 -5478759
1544e478759j583497M462939O507099K104806l842864n514942k764186K770M4801
$$ -5478759 -7062256 -2599317 3907782 6012588 2169724 -3345218 -6109404 -6106634 -6061833
$$ [...]
##END NTUPLES=NMR SPECTRUM
##END=
