##TITLE=31Pdec_DE-82mm_TFA
 CDCl3, 64 sc
 27.3.2025
##JCAMPDX= 6.0         $$ Bruker NMR JCAMP-DX V2.0
##DATA TYPE= NMR SPECTRUM
##DATA CLASS= NTUPLES
##ORIGIN= UXNMR, Bruker Analytische Messtechnik GmbH
##OWNER= root
$$ XWIN-NMR		Version 3.5
$$ Thu Mar 27 14:01:15 2025 Russian Standard Time (UT+4h)  she@DPX200
##.OBSERVE FREQUENCY= 81.013821
##.OBSERVE NUCLEUS= ^31P
##.ACQUISITION MODE= SIMULTANEOUS
##.ACQUISITION SCHEME= undefined
##.AVERAGES= 64
##.DIGITISER RES= 17
##SPECTROMETER/DATA SYSTEM= spect
##.PULSE SEQUENCE= zgpg30
##.SOLVENT NAME= CDCl3
##.SHIFT REFERENCE= (INTERNAL, CDCl3, 0, 198.062)
##AUDIT TRAIL= $$ (NUMBER, WHEN, WHO, WHERE, WHAT)
$$ ##TITLE= Audit trail, XWIN-NMR		Version 3.5
$$ ##JCAMPDX= 5.01
$$ ##ORIGIN= Bruker BioSpin GmbH
$$ ##OWNER= she
$$ F:/spectra/data/she/nmr/P31/2/pdata/1/auditp.txt
$$ ##AUDIT TRAIL=  $$ (NUMBER, WHEN, WHO, WHERE, WHAT)
(   1,<2025-03-27 13:59:50.46 +0400>,<she>,<DPX200>,
      <created by zg, POWCHK disabled, PULCHK disabled
       configuration hash MD5:
       00 E9 B6 7A A2 85 ED C7 34 08 36 98 17 FE 4E 26
       data hash MD5: 32K
       C7 56 C4 10 05 A8 C9 34 78 B9 A1 82 31 AB E6 B3>)
(   2,<2025-03-27 13:59:53.28 +0400>,<she>,<DPX200>,
      <Start of raw data processing
       efp BC_mod = 2 LB = 1.5 FT_mod = 6 PKNL = 1 PHC0 = 1388.888 PHC1 = 184.4942 SI = 64K 
       data hash MD5: 64K
       A8 63 DC C2 E9 A2 F6 09 1C CB 9E A1 25 A7 F3 63>)
(   3,<2025-03-27 14:00:38.87 +0400>,<she>,<DPX200>,
      <pk PHC0 = 34.62717 PHC1 = -175.4 
       data hash MD5: 64K
       48 20 EA 3D 73 28 63 8A 80 A7 D5 6F 41 FF 73 FE>)
(   4,<2025-03-27 14:00:43.65 +0400>,<she>,<DPX200>,
      <abs ABSG = 5 
       data hash MD5: 64K
       6E 79 C9 8D 43 2A 55 BB C6 63 84 3D CA DE E5 40>)
$$ ##END=
$$ 
$$ hash MD5
$$ CA 8A B0 EF CF C0 1A 89 62 37 57 C2 BE 5A 75 CC
##$RELAX= 
##$RELAX= 
##$RELAX= 
##$RELAX= 
##$RELAX= 
##$RELAX= 
##$RELAX= 
##$RELAX= 
$$ Bruker specific parameters
$$ --------------------------
##$DU= <F:/spectra>
##$EXPNO= 2
##$NAME= <P31>
##$PROCNO= 1
##$TYPE= <nmr>
##$USER= <she>
##$AMP= (0..31)
100 100 100 100 100 100 100 100 100 100 100 100 100 100 100 100 100 100 
100 100 100 100 100 100 100 100 100 100 100 100 100 100 
##$AQSEQ= 0
##$AQ_mod= 1
##$AUNM= <au_zg>
##$AUTOPOS= <>
##$BF1= 81.014009
##$BF2= 200.13
##$BF3= 200.13
##$BF4= 200.13
##$BF5= 200.13
##$BF6= 200.13
##$BF7= 200.13
##$BF8= 200.13
##$BYTORDA= 1
##$CFDGTYP= 0
##$CFRGTYP= 5
##$CHEMSTR= <none>
##$CNST= (0..31)
1 1 145 1 1 1 1 1 1 1 1 1 1 1 1 1 1 1 1 1 1 1 1 1 1 1 1 1 1 1 1 1 
##$CPDPRG= <waltz16>
##$CPDPRG1= <>
##$CPDPRG2= <waltz16>
##$CPDPRG3= <>
##$CPDPRG4= <mlev>
##$CPDPRG5= <mlev>
##$CPDPRG6= <mlev>
##$CPDPRG7= <mlev>
##$CPDPRG8= <mlev>
##$CPDPRGB= <>
##$CPDPRGT= <>
##$D= (0..31)
0 1 0 0 0 0 0 0 0 0.06 0 0.03 2e-05 3e-06 0 0 0.0002 0 0 0 0 0 0 0 0 0 
0 0 0 0 0 0 
##$DATE= 1743069589
##$DBL= (0..7)
120 120 120 11 120 120 24 19 
##$DBP= (0..7)
150 150 150 150 150 150 150 150 
##$DBP07= 0
##$DBPNAM0= <>
##$DBPNAM1= <>
$$ [...]
##$SUBNAM3= <"">
##$SUBNAM4= <"">
##$SUBNAM5= <"">
##$SUBNAM6= <"">
##$SUBNAM7= <"">
##$SUBNAM8= <"">
##$SUBNAM9= <"">
##$SW= 400.765351723535
##$SWIBOX= (0..15)
0 1 3 0 0 0 0 0 0 0 0 0 0 0 0 0 
##$SW_h= 32467.5324675325
##$TD= 32768
##$TD0= 1
##$TE= 0
##$TE2= 300
##$TE3= 300
##$TEG= 300
##$TL= (0..7)
0 120 53 12 22 120 120 120 
##$TP= (0..7)
150 150 150 150 150 150 150 150 
##$TP07= 0
##$TPNAME0= <>
##$TPNAME1= <>
##$TPNAME2= <>
##$TPNAME3= <>
##$TPNAME4= <>
##$TPNAME5= <>
##$TPNAME6= <>
##$TPNAME7= <>
##$TPOAL= (0..7)
0.5 0.5 0.5 0.5 0.5 0.5 0.5 0.5 
##$TPOFFS= (0..7)
0 0 0 0 0 0 0 0 
##$TUNHIN= 0
##$TUNHOUT= 0
##$TUNXOUT= 0
##$USERA1= <user>
##$USERA2= <user>
##$USERA3= <user>
##$USERA4= <user>
##$USERA5= <user>
##$V9= 5
##$VALIST= <valist>
##$VCLIST= <CCCCCCCCCCCCCCC>
##$VD= 0
##$VDLIST= <DDDDDDDDDDDDDDD>
##$VPLIST= <PPPPPPPPPPPPPPP>
##$VTLIST= <TTTTTTTTTTTTTTT>
##$WBST= 1024
##$WBSW= 4
##$XGAIN= (0..3)
0 0 0 0 
##$XL= 0
##$YL= 0
##$YMAX_a= 7330
##$YMIN_a= -24500
##$ZGOPTNS= <>
##$ZL1= 120
##$ZL2= 120
##$ZL3= 120
##$ZL4= 120
##$ABSF1= 198.0616
##$ABSF2= -202.7028
##$ABSG= 5
##$ABSL= 3
##$ALPHA= 0
##$AQORDER= 0
##$ASSFAC= 0
##$ASSFACI= 0
##$ASSFACX= 0
##$ASSWID= 0
##$AUNMP= <proc_1d>
##$AZFE= 0.1
##$AZFW= 0.5
##$BCFW= 0
##$BC_mod= 2
##$BYTORDP= 0
##$COROFFS= 0
##$CY= -3
##$DATMOD= 1
##$DC= 0
##$DFILT= <>
##$DTYPP= 0
##$F1P= 0
##$F2P= 0
##$FCOR= 1
##$FTSIZE= 65536
##$FT_mod= 6
##$GAMMA= 0
##$GB= 0
##$INTBC= 1
##$INTSCL= 9.790993e-09
##$ISEN= 30
##$LB= 1.5
##$LEV0= 0
##$LPBIN= 0
##$MAXI= 10000
##$MC2= 0
##$MEAN= 0
##$ME_mod= 0
##$MI= 50
##$NCOEF= 0
##$NC_proc= -8
##$NLEV= 6
##$NOISF1= 182.463
##$NOISF2= 159.3651
##$NSP= 0
##$NTH_PI= 0
##$NZP= 0
##$OFFSET= 198.0616
##$PC= 4
##$PHC0= 1423.515
##$PHC1= 9.094208
##$PH_mod= 1
##$PKNL= yes
##$PPARMOD= 0
##$PSCAL= 0
##$PSIGN= 0
##$REVERSE= no
##$SF= 81.0140089999434
##$SI= 65536
##$SIGF1= 159.3651
##$SIGF2= -187.1042
##$SINO= 113.3802
##$SIOLD= 16384
##$SREGLST= <1H.CDCl3>
##$SSB= 0
##$STSI= 65536
##$STSR= 0
##$SW_p= 32467.5324675325
##$SYMM= 0
##$S_DEV= 0
##$TDeff= 32768
##$TDoff= 0
##$TI= <>
##$TILT= no
##$TM1= 0
##$TM2= 0
##$TOPLEV= 0
##$USERP1= <user>
##$USERP2= <user>
##$USERP3= <user>
##$USERP4= <user>
##$USERP5= <user>
##$WDW= 1
##$XDIM= 65536
##$YMAX_p= 40284641
##$YMIN_p= -293622490
$$ End of Bruker specific parameters
$$ ---------------------------------
##NTUPLES= NMR SPECTRUM
##VAR_NAME=  FREQUENCY,     SPECTRUM/REAL,   SPECTRUM/IMAG
##SYMBOL=    X,             R,               I
##VAR_TYPE=  INDEPENDENT,   DEPENDENT,       DEPENDENT
##VAR_FORM=  AFFN,          ASDF,            ASDF
##VAR_DIM=   65536,         65536,           65536
##UNITS=     HZ,            ARBITRARY UNITS, ARBITRARY UNITS
##FACTOR=    0.49542278885378, 1,            1
##FIRST=     16045.7642231865, 0,            0
##LAST=      -16421.768244346, 0,            0
##MIN=       -16421.768244346, -293622490,   0
##MAX=       16045.7642231865, 40284641,     0
$$ Real data points
##PAGE= N=1
##DATA TABLE= (X++(R..R)), XYDATA
$$ [...]
##PAGE= N=2
##DATA TABLE= (X++(I..I)), XYDATA
7482A999844l54699k1980J133465J861252J570917O20382l92597j152911j436397
$$ 1999844 1645145 1623165 2756630 4617882 6188799 6809181 6416584 5263673 3827276
7473C827276q99418L97652J426876R68350p81829k143354j984424j109637r64412
$$ 3827276 2927858 3325510 4752386 5720736 4938907 2795553 811129 -298508 -1262920
7464a262920j645457k085498j711900r30492k10138M08493R48078J296017J343293
$$ -1262920 -2908377 -4993875 -6705775 -7636267 -7846405 -7437912 -6489834 -5193817 -3850524
7455c850524J004747L69921m8761J53323M37976O2065k71462Q56987K738466K567360
$$ -3850524 -2845777 -2475856 -2524617 -2371294 -1933318 -1871253 -2142715 -1285728 1452738 4020098
7445D020098m63013l276302k959446o73558P08479Q68793J158328J281188K76119
$$ 4020098 3557085 280783 -2678663 -3352221 -2643742 -1774949 -616621 664567 940686
7436I40686n85070L26454J270214m78828l176554k415727J444434K935883j49936
$$ 940686 355616 682070 1952284 1473456 -1703098 -4118825 -2674391 261492 111556
7427A11556l286776k443144J14540N65102k21226N99415K144602J512985q13984
$$ 111556 -3175220 -5618364 -5503824 -4938722 -5159948 -4560533 -2415931 -902946 -1716930
7418a716930j727501n09323Q24035J399670K117286K914370K640081J293804l45947
$$ -1716930 -3444431 -3953754 -3129719 -1730049 387237 3301607 5941688 7235492 6889545
7409F889545k494754m883569m796646m01142M736356M885063J37938l178282j108324
$$ 6889545 4394791 -488778 -5285424 -5686566 -950210 3934853 4072791 894509 -213815
7400b13815K985958L828777R97848k080139l136226k445312j032586J54966L57416
$$ -213815 2772143 6600920 7598768 5518629 2382403 -62909 -1095495 -940529 -583113
7391e83113j47050l01814j82275r53135k147355j444439J335498K652489O6487
$$ -583113 -730163 -1031977 -1214252 -2167387 -4314742 -5759181 -4423683 -1771194 -1704707
7382a704707l546599l585783n1739K884721K759591J036850k35736p85421p71544
$$ -1704707 -5251306 -8837089 -8888828 -6004107 -3244516 -2207666 -2443402 -3228823 -4000367
7373d000367N6680J062999R32733k6669L4539J351146J768286K27316j273472
$$ -4000367 -3943687 -2880688 -1947955 -1974624 -1940085 -588939 1179347 1406663 133191
7364A33191p77658O16627P70132j93407p61302p69134q75448n12056R23498J756100
$$ 133191 -644467 -27840 742292 548885 -212417 -981551 -1856999 -2369055 -1445557 310543
7354C10543J11238k096135r65377L062705M621276Q95865l940367m541823j580873
$$ 310543 421781 -1674354 -2639731 422974 5044250 5940115 1999748 -2542075 -4122948
7345d122948N42083P96540J604408K891390J501048k537286m252672q90674L133449
$$ -4122948 -3580865 -2784325 -1179917 1711473 3212521 675235 -3577437 -4468111 -1334662
7336a334662K129931k654901m949733k301506J351136K034380O03424j29534J32995
$$ -1334662 795269 -1859632 -6809365 -9110871 -7759735 -5725355 -5121931 -5251465 -5118470
7327e118470o4172o75832k93601J153322J993964J162824n24647j645382j636598
$$ -5118470 -5182642 -5858474 -6152075 -4998753 -3004789 -1841965 -2366612 -4011994 -5648592
7318e648592p74519L95995J232611J199724K79149j057510k271163k808689k013911
$$ -5648592 -6423111 -6027116 -4794505 -3594781 -3315632 -4373142 -6644305 -9452994 -11466905
7309a1466905K07637K630873L570775K821138J843778J598063J260487o5428j475850
$$ -11466905 -11259268 -8628395 -5057620 -2236482 -392704 1205359 2465846 2400418 924568
7300I24568j518275n73653k40035o76776n48098K97874K98940j017029j943532
$$ 924568 -593707 -1167360 -1407395 -2084171 -2632269 -2334395 -2035455 -3052484 -4996016
7291d996016j547946j500339k988139l723712q35140M250346O842066M866982
$$ -4996016 -6543962 -8044301 -11032440 -14756152 -15591292 -11340946 -4498880 368102
7283C68102J060069j104168j234853r79404j253425j718113j680993o10382J276661
$$ 368102 1428171 324003 -910850 -1890254 -3143679 -4861792 -6542785 -7153167 -5876506
7274e876506K598623K162494P89034K52055M84970n4501j178842r31179N39457
$$ -5876506 -3277883 -1115389 -326355 -74300 410670 356169 -822673 -1753852 -1214395
7265a214395L02044k437764l949374j340774K309573J931176j991877m034120
$$ -1214395 -912351 -3350115 -7299489 -8640263 -6330690 -4399514 -6391391 -10425511
7257a0425511j653463J713771K243069Q09124N77524K072534L099260K317724
$$ -10425511 -12078974 -10365203 -8122134 -7313010 -6735486 -4662952 -1563692 754032
7249G54032O41046n96687j109236j090060m79209N46213J086831M46567n88900
$$ 754032 1395078 798391 -310845 -1400905 -1880114 -1333901 -247070 199497 -389403
7240c89403l74710J316047K626117K107470R02437R20485J635202R53142r63886
$$ -389403 -764113 551934 3178051 5285521 6187958 7108443 8743645 9696787 8732901
7231H732901j550758q4800R19798n4887q84369M07968J922441R03773j638249
$$ 8732901 7182143 7097343 8017141 7962254 7077885 7485853 9408294 10312067 8673818
7222H673818k715109k198382k211466k745553j837634K34882R14537k05226p06308
$$ 8673818 5958709 3760327 1548861 -1196692 -3034326 -2799444 -1884907 -2090133 -2796441
7213b796441J80088J19849k042891l933019l260741q97056J387065L455986N072398
$$ -2796441 -2616353 -2496504 -4539395 -8472414 -11733155 -12630211 -11243146 -7787160 -2714762
7204b714762M325339M92502l390677l602404l82361K692079L131203J403132p99188
$$ -2714762 1610577 2103079 -1287598 -4890002 -5272363 -2580284 550919 1954051 1154863
7195A154863k177681k125257j056864k82704m79067p51773j39592P48190P54062
$$ 1154863 -1022818 -3148075 -4204939 -4487643 -4966710 -5718483 -5858075 -5109885 -4355823
7186d355823J07347M9668R69518K042202K460479K147986J442231O23921m23145
$$ -4355823 -4248476 -4198808 -3229290 -1187088 1273391 3421377 4863608 5487529 5064384
7177E064384k097832m013271m397169k018707J330991K287800L74015j141850
$$ 5064384 2966552 -1046719 -5443888 -7462595 -6131604 -3843804 -3469789 -4611639
7169d611639J42090K490654K955569J583716O09414Q71996J271330R79916K57798
$$ -4611639 -4469549 -1978895 976674 2560390 3169804 4041800 5313130 6293046 6550844
7160F550844m56665q40523o47876l90077j053363k249248k218465q10728l62510
$$ 6550844 6094179 5253656 4605780 4215703 3162340 913092 -1305373 -2116101 -2478611
7151b478611j864097k612968k72555K915185L305402J488732Q03111J355470J16265
$$ -2478611 -4342708 -6955676 -7228231 -4313046 -1007644 481088 1284199 2639669 2755934
7142B755934l058848m221286j395167K174697K762838Q97205p80579j588209k227170
$$ 2755934 -302914 -4524200 -5919367 -3744670 -981832 -84627 -865206 -2453415 -4680585
7133d680585k238745p45219J387569K359154J811257Q53038L69921N42743J276155
$$ -4680585 -6919330 -7664549 -6276980 -3917826 -2106569 -1253531 -883610 -340867 935288
7124I35288J930044J360757o65164k682639k976664j248391J530403L863557M011872
$$ 935288 2865332 4226089 3560925 878286 -2098378 -3346769 -1816366 2047191 6059063
7115F059063J222032k421279l137118R8183L691970L688389O20659j755111j503229
$$ 6059063 7281095 4859816 1722698 1820881 5512851 9201240 9821899 8066788 6563559
7106F563559p1779O14579K87317n23245j415058j660498m70675J544119K410329
$$ 6563559 6491780 7106359 7393676 6870431 5455373 3794875 3324200 4868319 7278648
7097G278648J114165r48578j636040o50860K81563l46724k037160k967524k165779
$$ 7278648 8392813 7444235 5808195 5157335 5438898 5092174 3055014 87490 -2078289
7088b078289n00963O07952P85586L80284o57138k186623k656243n82235K494672
$$ -2078289 -2579252 -1971300 -1185714 -805430 -1462568 -3649191 -6305434 -6887669 -4392997
7079d392997L017468M75657j169038Q09877L327478J972936j736291k131517J789838
$$ -4392997 -1375529 -899872 -2068910 -1259033 2068445 4041381 2305090 173573 1963411
7070A963411M250720J066133m146524n222478j881010R20766L68973j495703k037046
$$ 1963411 6214131 7280264 3133740 -2088738 -3969748 -3048982 -2680009 -4175712 -6212758
7061f212758j240447j4185J617122L280446L497494J685198o68971k081872k798573
$$ -6212758 -7453205 -7467390 -5850268 -2569822 927672 2612870 1943899 -137973 -2936546
7052b936546l154693j938598J556593M959888M810076J068507k469107k741366
$$ -2936546 -6091239 -8029837 -6473244 -1513356 3296720 4365227 1896120 -845246
7044h45246o83912Q33384Q44357P49406J648178K598226J802615j046731m015219
$$ -845246 -1529158 -695774 148583 897989 2546167 5144393 6947008 5900277 1885058
7035A885058m665686k629249j75129J93607j460824k687999j561090J282992L640969
$$ 1885058 -2780628 -5409877 -5585006 -5391399 -6852223 -9540222 -11101312 -9818320 -6177351
7026f177351M087811L002007J796516J575765K327792L154748L259679K511703
$$ -6177351 -2089540 912467 2708983 4284748 6612540 9767288 13026967 15538670
7018A5538670R67471j439540m038278n042595l435745q97992j60733j337687j757873
$$ 15538670 16506141 15066601 11028323 5985728 2549983 1651991 1491258 153571 -1604302
7009a604302j4875J806297J220377r77438j910771n71655J187790J230370o73357
$$ -1604302 -1619177 187120 1407497 430059 -1480712 -2052367 -864577 365793 -307564
7000c07564k959286l518981j281885K371207M245744K503855j165898l457622
$$ -307564 -3266850 -6785831 -8067716 -5696509 -1450765 1053090 -112808 -3570430
6992c570430k923531n98623J901096L451248L328425J770364L42108L10798R93941
$$ -3570430 -6493961 -7092584 -5191488 -1740240 1588185 3358549 3700657 4011455 5005396
6983E005396J002170M32502K30249J40284p15463j805757j919220j453255j603891
$$ 5005396 6007566 6440068 6670317 6810601 6095138 4289381 2370161 916906 -686985
6974f86985j720236k64216J791346J782017j05191o24953J258609K542501J219452
$$ -686985 -2407221 -2671437 -880091 901926 796735 171782 1430391 3972892 5192344
6965E192344n24243n00668l63587j982651l075825p56086K604242J953180k595093
$$ 5192344 4668101 4167433 3803846 1821195 -1254630 -2010716 593526 2546706 -48387
6956d8387n242174k501329K360153M332323K795858O35782k85612l46620k03017
$$ -48387 -5290561 -7791890 -5431737 -1099414 1696444 2332226 2046614 1699994 1496977
6947A496977J20380M30647J44385q95610j962643j983979o13853J076110J400650
$$ 1496977 1617357 2048004 2192389 1296779 -665864 -2649843 -3263696 -2187586 -786936
6938g86936O6019j200687q35204M37870Q42468K55122Q4120Q24735J519216J592111
$$ -786936 -720917 -1921604 -2756808 -2318938 -1476470 -1221348 -1137228 -312493 1206723 2798834
6928B798834J428069J010488j54990j434691j275314L82773J629765J188531j49704
$$ 2798834 4226903 5237391 5082401 3647710 2372396 2755169 4384934 5573465 5423761
6919E423761j264838k008603k044947n73722J573005J790508n61928k319168o84925
$$ 5423761 4158923 2150320 105373 -468349 1104656 2895164 2333236 14068 -670857
6910f70857K457038L130648R04467j196555j740522k273490l318149k629623Q45839
$$ -670857 1786181 4916829 5821296 4624741 2884219 610729 -2707420 -5337043 -4491204
6901d491204M021944L163557j091931m450068m004943p16391K690152M410011
$$ -4491204 -469260 2694297 1602366 -2847702 -6852645 -7569036 -4878884 -468873
6893d68873M057099K170016q335j145405r78785n86973j122201k433606l181417
$$ -468873 3588226 5758242 5749907 4604502 3625717 3038744 1916543 -517063 -3698480
6884c698480k286077j78432J491433J532555M57073l25578l46656k58138j28686
$$ -3698480 -5984557 -6162989 -4671556 -3139001 -2681928 -3007506 -3354162 -3612300 -3740986
6875c740986J048637L248183M162451J904076j668370k624816k38018J747489
$$ -3740986 -2692349 555834 4718285 6622361 4953991 2329175 2091157 3838646
6867C838646K64774k729219l073109k13898K354038K087075K32021q48542q60637
$$ 3838646 4103420 1374201 -1698908 -1912806 441232 2528307 2760328 1911786 1051149
6858A051149p83724o14069K81875J400090J433072J76142j264722k141720k705861
$$ 1051149 267425 -346644 -64769 1335321 2768393 2944535 1679813 -461907 -3167768
6849c167768l034263k445314o59562J310730K187023J935102J605447J812678
$$ -3167768 -6202031 -8647345 -9306907 -7996177 -5809154 -3874052 -2268605 -455927
6841d55927J938811J038085p11528j821307j030764J043843K307318J532501j76944
$$ -455927 1482884 2520969 1809441 -11866 -1042630 1213 2308531 3841032 3664088
6832C664088q59848k24701K41929l87261j197078r43244J36707Q37054O41922
$$ 3664088 2804240 2579539 2821468 2434207 1237129 293885 430592 1267646 1909568
6823A909568l2365p44411j141346n71234J057080K096390N40894k793446m174661
$$ 1909568 1877203 1132792 -8554 -579788 477292 2573682 3114576 321130 -3853531
6814c853531j503352K279635K441181j312024m217809k570775J769707M280143
$$ -3853531 -5356883 -3077248 -636067 -1948091 -6165900 -8736675 -6966968 -2686825
6806b686825L370201J113981m57867j322068j830936j486900k28914O36117n1541
$$ -2686825 683376 1797357 1339490 17422 -1813514 -3300414 -3529328 -2893211 -2944752
6797b944752j658832k474340j552974O18578K647633L040649J323517j070662
$$ -2944752 -4603584 -7077924 -8630898 -8012320 -5364687 -2324038 -1000521 -2071183
6789b071183j812895k09019K002956K944774K727881K452369K115519Q73030j221146
$$ -2071183 -3884078 -4093097 -2090141 854633 3582514 6034883 8150402 9023432 7802286
6780G802286l165792m395814m862517m021014j377689J836199L247150K229598
$$ 7802286 4636494 240680 -4621837 -8642851 -10020540 -8184341 -4937191 -2707593
6772b707593P91130P35413J265923O30498r06895j403183j81363J198774J174113
$$ -2707593 -1916463 -1181050 84873 715371 -191524 -1594707 -1776070 -577296 596817
6763E96817J05951n79242k50919O00705J266918J333904O65606m91711j579442
$$ 596817 702768 123526 -127393 473312 1740230 3074134 3739740 3248029 1668587
6754A668587k293363k710596k495585p97054K092752L743963J977995j794980
$$ 1668587 -624776 -3335372 -5830957 -6628011 -4535259 -791296 1186699 -608281
6746f08281l518825j396793J865998K708333R18433j202454k210002k020227m18829
$$ -608281 -4127106 -5523899 -3657901 -949568 -31135 -1233589 -3443591 -5463818 -5882647
6737e882647K268263L727206J828889j766904l087713j305290L30731j34554m31387
$$ -5882647 -3614384 112822 1941711 174807 -2912906 -4218196 -3887465 -4022019 -4453406
6728d453406J563183L595356K244806j506936l219331q22873L197258N194697
$$ -4453406 -2890223 705133 2949939 1443003 -1776328 -2599201 598057 5792754
6720E792754L785318J34627l247170m170560k769702j420177j445910j202229
$$ 5792754 9578072 9712699 6465529 2294969 -474733 -1894910 -3340820 -4543049
6712d543049P16223K148158L69651k820979l039375r3442J576275L7965j124690
$$ -4543049 -3826826 -1678668 -1309017 -4129996 -7169371 -7262813 -5686538 -5648573 -6773263
6703f773263R46990L395496K382188m10337m38999K323544L447774J225903p74430
$$ -6773263 -5826273 -2430777 -48589 -458926 -897925 1425619 4873393 6099296 5324866
6694E324866M63743K818735K574593r9523k132290k534462l121494m378370l875241
$$ 5324866 5788609 8607344 11181937 11082414 8950124 6415662 3294168 -1084202 -4959443
6685d959443k98896L331076L089509k46530j992829j36476J935636P23871k108256
$$ -4959443 -5258339 -1927263 1162246 915716 -1077113 -1213589 722047 1445918 -662338
6676f62338k478662j67041J175796p8583j252007P6076K254436K187831k18063
$$ -662338 -3141000 -3308041 -2132245 -2210828 -3462835 -3386759 -1132323 1055508 837445
6667H37445k292948k175309m30762J212186J381516j47513k096755k606282j294373
$$ 837445 -1455503 -3630812 -4061574 -2849388 -1467872 -1615385 -3712140 -6318422 -7612795
6658g612795K66837P53297P08171J101102J564677J437796J401820K223773K636538
$$ -7612795 -7345958 -6592661 -5884490 -4783388 -3218711 -1780915 -379095 1844678 4481216
6649D481216P25365k591630l744426j044443K686089L431859R36373j329959r16527
$$ 4481216 5206581 2614951 -1129475 -2173918 512171 3944030 4880403 3550444 2633917
6640B633917P07184Q14997m95033q30090K93166L26441k128768m304967k843751
$$ 2633917 3341101 4156098 3661065 2830975 3124141 3450582 1321814 -2983153 -5826904
6631e826904R52639K543182N75730j421782o04542J148622P47112j078491j132758
$$ -5826904 -4874265 -2331083 -1755353 -3177135 -3781677 -2633055 -1885943 -2964434 -4097192
6622d097192J106393K694436J581151o14210j030590O34504J882378O57831j992416
$$ -4097192 -2990799 -296363 1284788 670578 -360012 274492 2156870 2814701 822285
6613H22285l067054j317414J185953J902027J090550O49092O82321k10176j524154
$$ 822285 -2244769 -3562183 -2376230 -474203 616347 1265439 1947760 1737584 213430
6604B13430r08090J643376K819108P55271k072404k712839j886347j855569k494305
$$ 213430 -694660 948716 3767824 4523095 2450691 -262148 -2148495 -4004064 -6498369
6595f498369k312933j495278q84605M53425L365851N533754L861458n14053l019421
$$ -6498369 -8811302 -10306580 -11191185 -10737760 -7371909 -1838155 2023303 1509250 -1510171
6586a510171j589257J116953J801173K97277j279752j212086L73641J449280j10147
$$ -1510171 -3099428 -1982475 -181302 115975 -1163777 -2375863 -2002222 -552942 -663089
6577f63089l416961m584415j755959J659942J616224n11330l74501K076116K544513
$$ -663089 -4080050 -8664465 -10420424 -8760482 -7144258 -7655588 -8030089 -5953973 -3409460
6568c409460m09735k968228j980049R11023K687034K929289K592253J817136O81870
$$ -3409460 -3819195 -6787423 -8767472 -7856449 -5169415 -2240126 352127 2169263 2851133
6559B851133k60392j208527k449080k287788R32673M558665L858150n45153k591492
$$ 2851133 2590741 1382214 -1066866 -3354654 -2421981 2136684 5994834 5449681 2858189
6550B858189r549J930466r45459m845613m462305j555497j208875k954947k213251
$$ 2858189 2848640 4779106 3833647 -1011966 -5474271 -7029768 -8238643 -11193590 -13406841
6541a3406841J264234K930414J037601j138094j132054k93891k8898N67128K005684
$$ -13406841 -12142607 -9212193 -8174592 -9312686 -10444740 -10738631 -10767529 -10200401 -8194717
6532h194717K868205K232795R38171j95667r10153l53644J684069K745408N17372
$$ -8194717 -5326512 -3093717 -2155546 -2351213 -3261366 -3615010 -1930941 814467 1331839
6523A331839k514523j519973L091447N265554J973378k379911k734473l53792
$$ 1331839 -1182684 -2702657 388790 5654344 7627722 5247811 2513338 2159546
6515B159546M52320p45948j046976K56578Q91694k54537j645328j857916j276040
$$ 2159546 2611866 1865918 818942 1075520 1967214 1712677 67349 -1790567 -3066607
6506c066607p20542k95398P2128K59585K62567L4228o60218j431687j058571P53460
$$ -3066607 -3787149 -4082547 -4010419 -3750834 -3488267 -3454039 -4114257 -5545944 -6604515 -5851055
6496e851055K140842J108040j598471l172744k263455l71432N30413M35929N73096
$$ -5851055 -3710213 -2602173 -4200644 -7373388 -9636843 -10008275 -9477862 -9041933 -8468837
6487h468837J102237Q24730o59674j627524k39589K420645K997490K90414k608393
$$ -8468837 -7366600 -6541870 -7201544 -8829068 -9068657 -6648012 -3650522 -3360108 -5968501
6478e968501k214471O35993K296342J655566R36295J225530P64482j151046j998041
$$ -5968501 -8182972 -7546979 -5250637 -3595071 -2658776 -1433246 -668764 -1819810 -3817851
6469c817851m6121K224088J733300j99574m4653J893121J655818j911082m725996
$$ -3817851 -3863972 -1639884 93416 -106158 -150811 1742310 3398128 1487046 -3238950
6460c238950l100664J055031K971038J195942j484273k430765j783656n74205
$$ -3238950 -6339614 -5284583 -2313545 -1117603 -2601876 -5032641 -6816297 -7390502
6452g390502J184246L149403L336582N18820k827868k726485P55094K890811O85012
$$ -7390502 -6206256 -3056853 279729 798549 -2029319 -4755804 -4000710 -1109899 -424887
6443d24887k616368j955188K379589N355010M138258P63051k164808m404864n552490
$$ -424887 -3041255 -4996443 -2616854 2738156 6876414 7639465 5474657 1069793 -4482697
6434d482697l558761J620045N849380N480338K310603P86236J620304J503325
$$ -4482697 -8041458 -6421413 -572033 4908305 7218908 8005144 9625448 11128773
6426A1128773j379907m718943n329897k749657R10292L104860K615546M09827
$$ 11128773 9748866 5029923 -299974 -3049631 -2139339 965521 3581067 3990894
6418C990894j262777j422708j261725j627880j262184O28482J835852O5895k843976
$$ 3990894 2728117 1305409 43684 -1584196 -2846380 -2217898 -382046 -316151 -3160127
6409c160127l071860o09731Q29166k27423j136262j25693Q52436J29552m12863
$$ -3160127 -6231987 -6841718 -6012552 -6239975 -7376237 -7501930 -6649494 -6519942 -6932805
6400f932805J211522L191598K640703L19044o55511K32285M05300j504013l523765
$$ -6932805 -5721283 -2529685 111018 430062 -225449 6836 412136 -1091877 -4615642
6391d615642l012094K37023L954581N410592L514096j28148k420230j833430J15423
$$ -4615642 -7627736 -7390713 -3436132 1974460 5488556 5360408 2940178 1106748 1222171
6382A222171J046576N23263k33383m07222m6984O86250J251244M14604k150399
$$ 1222171 2268747 2792010 2558627 2151405 2104421 2790671 4041915 4456519 2306120
6373B306120m409430l813662n15613K666349L441332K018635J17951p40240j36177
$$ 2306120 -2103310 -5916972 -6432585 -3766236 -324904 1693731 1811682 1071442 935265
6364I35265Q85323N75229j349286k791300j737544J025131L115716L710809L620313
$$ 935265 1820588 2395817 1046531 -1744769 -3482313 -2457182 658534 4369343 7989656
6355G989656K914458R18613j513550k233502p97198Q58434J195978N35214n69637
$$ 7989656 10904114 11822727 10309177 8075675 7278477 8136911 9332889 9868103 9298466
6346I298466k066041k956597j699588Q98733J725941k65137k135770j198653J074420
$$ 9298466 7232425 4275828 2576240 3474973 5200914 4935777 2800007 1601354 2675774
6337B675774J561963l00j461212j721903j267186l41823R82284J733504J199136
$$ 2675774 4237737 4237437 2776225 1054322 -212864 -554687 427597 2161101 3360237
6328C360237L21211l3817r62656l332450n063940l592090p2140K121077K369510
$$ 3360237 3681448 3647631 2684975 -647475 -5711415 -9303505 -9375645 -7254568 -4885058
6319d885058K659579K866190M98387m142746o755489m696736m62149K262862K878520
$$ -4885058 -2225479 640711 1139098 -3003648 -9759137 -14455873 -14918022 -12655160 -9776640
6310i776640K337260O38103j584114j805119J071702M256235M657513K919308
$$ -9776640 -7439380 -6801277 -8385391 -10190510 -9118808 -4862573 -205060 2714248
6302B714248J258636l33120k420757k937974N9184L780205L444942o42611l170773
$$ 2714248 3972884 3639764 1219007 -1718967 -1659783 2120422 5565364 4922753 1751980
6293A751980j408154J456109J701132M1912o23344M89259K014650K617315J543593
$$ 1751980 343826 1799935 3501067 3542979 2919635 3408894 5423544 8040859 9584452
6284I584452j283763m382910n447226l936972j467560P62364K792285L781759
$$ 9584452 8300689 3917779 -1529447 -5466419 -6933979 -6171615 -3379330 402429
6276D02429K058307j457678k881076m41621K604827K423632l03357k210945k098425
$$ 402429 2460736 1003058 -1878018 -2319639 285188 2708820 2405463 194518 -1903907
6267a903907j145369r718J276342J764611Q42915n2848K47606m1086k743197n329899
$$ -1903907 -3049276 -3058994 -1782652 -18041 824874 772026 1019632 978546 -1764651 -7094550
6257g094550l549494J837290N206249L565142o7646j867494j830218j340450J24372
$$ -7094550 -10644044 -8806754 -3600505 -35363 -103009 -1970503 -3800721 -5141171 -5016799
6248e016799K888081M380898K048244k315366m151756j630635K617111M887719
$$ -5016799 -2128718 2252180 4300424 1985058 -2166698 -3797333 -1180222 3707497
6240C707497L761557M82720k375077k805645j129815M08722M78632R8196L37298
$$ 3707497 7469054 7951774 5576697 2771052 1641237 2049959 2528591 2626787 2964085
6231B964085J78959j507401l209695k503143Q6807J586112Q94968K8773O31185
$$ 2964085 3143044 1635643 -1574052 -4077195 -3990388 -2404276 -1509308 -1480535 -849350
6222h49350J781841K173741K035612J452750r05688n116133p772048n439642J68540
$$ -849350 932491 3106232 5141844 6594594 5688906 572773 -7199275 -12638917 -12470377
6213a2470377L516757K258930J13423J251129M236395M264323K95531l252835
$$ -12470377 -8953620 -6694690 -6581267 -5330138 -1093743 3170580 3466111 213276
6205B13276k406504J437405L891347K990412L54412j829756k781379k470535j091377
$$ 213276 -2193228 -755823 3135524 6125936 6480348 4650592 1869213 -601322 -1692699
6196a692699M54635J014915N07644k68059j098142k256064k986474j925284M87509
$$ -1692699 -1238064 -223149 284495 16436 -1081706 -3337770 -6324244 -8249528 -7762019
6187g762019J871332J112890M4874P06144K427950L180802K605189J891116J387905
$$ -7762019 -5890687 -4777797 -4732923 -4026779 -1598829 1581973 4187162 6078278 7466183
6178G466183K22489j840377l670169m065063k853751p87607R37544J360084O71345
$$ 7466183 7688672 5848295 2178126 -1886937 -4740688 -5528295 -4590751 -3230667 -2559322
6169b559322R2352L22545Q15777J096304J599781K332383K143023O95661l10913
$$ -2559322 -2466970 -2144425 -1328648 -232344 1367437 3699820 5842843 6538504 6227591
6160F227591L02168Q77268m94999k326229j628655J179369K490835O51345k229714
$$ 6227591 6529759 7407027 6912028 4585799 2957144 4136513 6627348 7278693 5048979
6151E048979l916751m279506l234614K2347M206162N622449K908964m79607r10162
$$ 5048979 1132228 -3147278 -6381892 -6359545 -2153383 3469066 6378030 5898423 4988261
6142D988261N61672N63140j341974k777183k590733j733242q70656O3049M12375
$$ 4988261 5549933 6113073 4771099 1993916 -596817 -2330059 -3200715 -3137666 -2725291
6133b725291m50485j272175m39018Q92185J2689k843697m162792k049894J258932
$$ -2725291 -3175776 -4447951 -4886969 -3994784 -3982095 -6825792 -10988584 -13038478 -11779546
6124a1779546K973101L316353L779368L914021K278492m92504j969401j197412
$$ -11779546 -8806445 -5490092 -1710724 2203297 4481789 3989285 2019884 822472
6116H22472J18191J6573j439782k819385l291835l102041k464401r65081J513929
$$ 822472 940663 957236 -482546 -3301931 -6593766 -9695807 -12160208 -13125289 -11611360
6107a1611360L819868M317663K735855N31539q22274j194725j124163p59043k39507
$$ -11611360 -7791492 -3473829 -737974 -206435 -1028709 -2223434 -3347597 -4106640 -4346147
6098d346147k63742j149433j883206j271422L41340J640839K260271K871877L608411
$$ -4346147 -4609889 -5759322 -7642528 -8913950 -8572610 -6931771 -4671500 -1799623 1808788
6089A808788L723781K777449R67173j550539m334688n834939m553519j272670
$$ 1808788 5532569 8310018 9277191 7726652 3391964 -2442975 -6996494 -8269164
6081h269164J363932J811575Q11298m76974j738690k438570j456037J082719L080904
$$ -8269164 -6905232 -5093657 -4282359 -4759333 -6498023 -8936593 -10392630 -9309911 -6229007
6072f229007K828938J053830l79403p81503o92740o34993q03055j143078r77136
$$ -6229007 -3400069 -2346239 -2725642 -3507145 -4199885 -4834878 -5637933 -6781011 -7758147
6063g758147M17750K195594K352536P20196j53044J364751L135168K175208q25911
$$ -7758147 -7340397 -5144803 -2792267 -2072071 -2225115 -860364 2274804 4450012 3624101
6054C624101k527195j837581r57057j384573j668195j55680K197165L295513K821289
$$ 3624101 1096906 -740675 -1697732 -3082305 -4750500 -4906180 -2709015 586498 3407787
6045C407787K143685K036597J868665R40639l44485r25629l91718L68757L5916
$$ 3407787 5551472 7588069 9456734 10397373 10052888 9127259 8735541 9104298 9140214
6036I140214j489193k700368k234026o36072L02414l03436j718778k754542k719589
$$ 9140214 7651021 4950653 2716627 2080555 2382969 2079533 360755 -2393787 -5113376
6027e113376j425863O27717K074755J845448O61176K20915P59731Q38050l0256
$$ -5113376 -6539239 -5911522 -3836767 -1991319 -1330143 -1109228 -349497 488553 458297
6018D58297k48145J281249K967770K656747R56850L29512J139666R47950j588530
$$ 458297 210152 1491401 4459171 7115918 8072768 8402280 9541946 10489896 8901366
6009H901366m178109l818008r75673J098529P48920m35734n58948L4194J48763
$$ 8901366 4723257 905249 -70424 1028105 1777025 1341291 782343 816537 965300
6000I65300l6431J91614J84626j018647k294856j453844J200084K725290J729469
$$ 965300 928869 1120483 1305109 286462 -2008394 -3462238 -2262154 463136 2192605
5991B192605L65109P77440J786380J211465l42059q20365o56717k009824m271872
$$ 2192605 2557714 3335154 5121534 6332999 5990940 5170575 4513858 2504034 -1767838
5982a767838l924162R5134M021514M146393J599870j19202m26684j388058l165196
$$ -1767838 -5692000 -5596866 -1575352 2571041 4170911 4051709 3625025 2236967 -928229
5973i28229l252730p43272J678581J489845j44761n72091K11667J29478r81644
$$ -928229 -4180959 -4924231 -3245650 -1755805 -1900566 -2472657 -2260990 -2131512 -3113156
5964c113156q25536J373126K970517J600233j146199k012769r08052o64583k159411
$$ -3113156 -3938692 -2565566 404951 2005184 858985 -1153784 -2061836 -2726419 -4885830
5955d885830k711213m12923K554158K969507J155603J6813M44598M15090j283754
$$ -4885830 -7597043 -8009966 -5455808 -2486301 -1330698 -1313885 -869287 -454197 -1737951
5946a737951k912976k250841N32397L479517N023462M542851J940069j876650
$$ -1737951 -4650927 -6901768 -6369371 -2889854 2133608 6676459 8616528 6739878
5938F739878m640499m370261j623805P77828O50021j419000l081131k868696j293465
$$ 6739878 2099379 -2270882 -3894687 -3116859 -2466838 -3885838 -6966969 -9835665 -11129130
5929a1129130M13472J768879K812303L112148K051844J45908q93570Q4538K357892
$$ -11129130 -10715658 -8946779 -6134476 -3022328 -970484 -824576 -1718146 -1633608 724284
5920G24284M152270M316581K885679N62396j816944l550846m164279l294258r17935
$$ 724284 4876554 9193135 12078814 12641210 10824266 7273420 3109141 -185117 -1103052
5911a103052J798729K651439P67033j646986j767661j28765K80203j011070j094679
$$ -1103052 695677 3347116 4114149 2467163 699502 570737 850940 -160130 -1254809
5902a254809J086741K216625k40303l492946l446893q85377L03534o10690r87331
$$ -1254809 -168068 2048557 1808254 -1684692 -5131585 -6016962 -5713428 -6324118 -7311449
5893g311449R2178Q93318Q91583J314979J750992M32192j725800j671864N30357
$$ -7311449 -7219271 -6325953 -5434370 -4119391 -2368399 -1936207 -3662007 -5333871 -4803514
5884d803514J458179L48629N51624L205312M406941J534451k057280k233125k66694
$$ -4803514 -3345335 -2996706 -2445082 760230 5167171 6701622 4644342 2411217 2144523
5875B144523N7548j511952k555375k442755k047677j072361O82835J401326J55317
$$ 2144523 2202071 690119 -1865256 -4308011 -6355688 -7428049 -6745214 -5343888 -5188571
5866e188571n37971J106018J986704j110345m874504l398158K426018N612746
$$ -5188571 -5726542 -4620524 -2633820 -3744165 -8618669 -12016827 -9590809 -3978063
5858c978063L223665k48596o51623M54947K40686o82439p80408p40813j186359
$$ -3978063 -754398 -1002994 -1654617 -1199670 -958984 -1641423 -2421831 -3162644 -4349003
5849d349003o17076J544859K826769J432070n73645o68929l1492j160746l314280
$$ -4349003 -4966079 -3421220 -594451 837619 263974 -404955 -436447 -1597193 -4911473
5840d911473l652362j721101L07872J176484J571210K006278K116416J946827
$$ -4911473 -8563835 -10284936 -9977064 -8800580 -7229370 -5223092 -3106676 -1159849
5832a159849J899330J434488l66495k872792m083414k960171n19213J411359J673510
$$ -1159849 739481 2173969 1807474 -1065318 -5148732 -8108903 -8628116 -7216757 -5543247
5823e543247K85693j583662k323834j356167K43657J051053P46836j23208r87606
$$ -5543247 -5257554 -6841216 -9165050 -10521217 -10277560 -9226507 -8479671 -8602879 -9590485
5814i590485j204890j64218J640021K542645J793007Q45493J313756K418830K034443
$$ -9590485 -10795375 -10959593 -9319572 -6776927 -4983920 -4138427 -2824671 -405841 1628602
5805A628602j21594j975631j876096n24283K60067k81079j392030j922204j415762
$$ 1628602 1507008 -468623 -2344719 -2869002 -2608935 -2890014 -4282044 -6204248 -7620010
5796g620010k95015P44453J368848J519614R89102k32613j190263n44036J570109
$$ -7620010 -7915025 -7170572 -5801724 -4282110 -3293008 -3525621 -4715884 -5259920 -3689811
5787c689811L134253K526889O13826l69498K92396R89879m5704k487016m192439
$$ -3689811 -555558 1971331 2585157 2215659 2508055 3497934 3452230 965214 -3227225
5778c227225l517809j036415J196546J929523J743549J672197J701626J436988
$$ -3227225 -6745034 -7781449 -6584903 -4655380 -2911831 -1239634 461992 1898980
5770A898980J393123K171108K767808J485259j314385l079671k236944J2177J691172
$$ 1898980 3292103 5463211 8231019 9716278 8401893 5322222 3085278 3097455 4788627
5761D788627K325167K318197J509485k95354k216342k989922k408152j335804
$$ 4788627 7113794 9431991 10941476 10646122 8429780 5439858 3031706 1695902
5753A695902o77029o85885p52953J38970J825355K125554o42568m307812m516904
$$ 1695902 1018873 332988 -419965 -280995 1544360 3669914 3027346 -1280466 -5797370
5744e797370o39397K710611J845739q92726r69913J461040K267197J38404j425037
$$ -5797370 -6436767 -3726156 -1880417 -2773143 -3743056 -2282016 -14819 123585 -1301452
5735a301452K40237K788560K367112r27889l553756l483201k224353j753799j593573
$$ -1301452 -1061215 1727345 4094457 3166568 -387188 -3870389 -6094742 -7848541 -9442114
5726i442114l31052J176552M61471k324658l259456K64534M921031N039556M13196
$$ -9442114 -9773166 -8596614 -8135143 -10459801 -13719257 -13454723 -8533692 -3494136 -3080940
5717c080940l116718j747899J372114J555831m95347p92936J156007K086101P86981
$$ -3080940 -6197658 -7945557 -6573443 -5017612 -5512959 -6305895 -5149888 -3063787 -2276806
5708b276806j63803R18017K102263J227524p94679j772111j356027p90592r57775
$$ -2276806 -2440609 -1522592 579671 1807195 1012516 -759595 -2115622 -2906214 -3863989
5699c863989j903889l072933l098707p97404K689130M364681L195518J717865
$$ -3863989 -5767878 -8840811 -11939518 -12736922 -10047792 -5683111 -2487593 -769728
5691g69728K176371K870295R70079k189630k138906K073171N686931M441589K54958
$$ -769728 1406643 4276938 5247017 3057387 918481 2991652 8678583 13120172 13375130
5682A3375130k022789j591845j692675l262811l153729p8739J971679l64382l626191
$$ 13375130 11352341 9760496 8067821 4805010 1651281 1572542 3544221 3179839 -446352
5673d46352j978826L598941N955147J983290l044437l365287l68186R17120n75575
$$ -446352 -2425178 1173763 7128910 9112200 6067763 2702476 2334290 3251410 2675835
5664B675835j989656k007980j934591k166986j457471L07654J678046K128255
$$ 2675835 686179 -1321801 -3256392 -5423378 -6880849 -6573195 -4895149 -2766894
5656b766894K387938K312057J002960q79342j522395r39859j019857k157169k369676
$$ -2766894 -378956 1933101 2936061 2056719 534324 -405535 -1425392 -3582561 -5952237
5647e952237o10818J305900J262174l85157j653504j295713M18952K146377K291452
$$ -5952237 -6563055 -5257155 -3994981 -4380138 -6033642 -7329355 -6910403 -4764026 -2472574
5638b472574O07859q79270l1597K238260K823026Q05754j099739m18912J657646
$$ -2472574 -1864715 -2743985 -2775582 -537322 2285704 3091458 1991719 1572807 3230453
5629C230453K141561K56650j975162k606923j944913j730237k706477l475290
$$ 3230453 5372014 5628664 3653502 1046579 -898334 -2628571 -5335048 -8810338
5621h810338k253106M25147K120164K104127K551804M536570N091131J349552
$$ -8810338 -11063444 -10638297 -8518133 -6414006 -3862202 674368 5765499 7115051
5613G115051l849359m573574Q9009M585898M407411J213862j071935j640224j785583
$$ 7115051 3265692 -1307882 -1218873 3367025 7774436 8988298 7916363 6276139 4490556
5604D490556j462544k6357J287379O91597j052952j382448L64407J905604R66330
$$ 4490556 3028012 3001655 4289034 4980631 3927679 2545231 2909638 4815242 5781572
5595E781572j856974l599632k106690J356280L237122K026686L20939J000841
$$ 5781572 3924598 324966 -1781724 -425444 2811678 4838364 5159303 6160144
5587F160144K722861K088499n63660j539599j94547l18111l400305n085773j634779
$$ 6160144 8883005 10971504 10407844 8868245 8673698 8355587 4955282 -130491 -1765270
5578a765270L662498M699729R02553k915311l754004l219825l306996l236010
$$ -1765270 1897228 6596957 7499510 4584199 830195 -2389630 -5696626 -8932636
5570h932636j502009J384327L369254L042800J090671L1121J724928M545266M598285
$$ -8932636 -10434645 -9050318 -5681064 -2638264 -1547593 -1516472 208456 4753722 9352007
5561I352007Q74578k864145l149316j516319j460401k661801j888292J268748
$$ 9352007 10226585 7362440 4213124 2696805 1236404 -1425397 -3313689 -2044941
5553b044941L393831K232659m31510j600649m95279J418858K146878P00229j750398
$$ -2044941 1348890 3581549 3150039 1549390 1054111 2472969 4619847 5320076 3569678
5544C569678k641386j217234J74126k75400o92697J148773L137931J521328k625757
$$ 3569678 928292 -288942 -114816 -390216 -1082913 65860 3203791 4725119 2099362
5535B099362m333526k288006n35132j472188k077430M47114L672079M028569K441143
$$ 2099362 -2234164 -4522170 -5057302 -6529490 -8606920 -8159806 -4487727 -459158 1981985
5526A981985J843297J623815q25436m291241m314300K2898L977595L329907l03414
$$ 1981985 3825282 5449097 4623661 332420 -3981880 -3958982 18613 3348520 3045106
5517C045106k321392j192745P46670J452471J464348J792911J772897M22614j341263
$$ 3045106 723714 -469031 277639 1730110 3194458 4987369 6760266 7182880 5841617
5508E841617j734154r76571j144582k823454l951586l020338j452441j068059
$$ 5841617 4107463 3130892 1986310 -837144 -4788730 -7809068 -9261509 -10329568
5500a0329568r39503P41093K877954K669187K60710j063252J49967J499550Q69122
$$ -10329568 -11269071 -10527978 -7650024 -4980837 -4720127 -5783379 -5633412 -4133862 -3264740
5491c264740l35134K4608J240431J410936Q47081J014555J180961p73341m266978
$$ -3264740 -3599874 -3575266 -2334835 -923899 -76818 937737 2118698 1345357 -2921621
5482b921621n653194k897589J494917L613986K798095J557002J652293K186281
$$ -2921621 -8574815 -11472404 -9977487 -6363501 -3565406 -2008404 -356111 1830170
5474A830170J822865J150157J495360K255664J300089j665855l862715k804042
$$ 1830170 3653035 4803192 6298552 8554216 9854305 8188450 4325735 1521693
5466A521693J72943J415966l72875k717828k858438j047185M45538M01321m77110
$$ 1521693 1694636 3110602 2737727 19899 -2838539 -3885724 -3440186 -3038865 -3515975
5457c515975j144406j331909j019594J01979J954588L392640L146877J513771
$$ -3515975 -4660381 -5992290 -7011884 -6909905 -4955317 -1562677 1584200 3097971
5449C097971J82251p3125m92352k094534l364265k060833J065128K697482J423052
$$ 3097971 3280222 3207097 2714745 620211 -2744054 -4804887 -3739759 -1042277 380775
5440C80775n95115j169572p78892m34323M20501J832250J762803o24968k368724
$$ 380775 -214340 -1383912 -2162804 -2597127 -2176626 -344376 1418427 793459 -1575265
5431a575265p82558J750395J104538j792555k275671K28242R32090k477806n595198
$$ -1575265 -2357823 -607428 497110 -1295445 -3571116 -3342874 -2410784 -4888590 -10483788
5422a0483788l595924J784158M854654L374289K53025j017751l2951J185408Q90821
$$ -10483788 -14079712 -12295554 -7440900 -4066611 -3813586 -4831337 -4864288 -3678880 -2788059
5413b788059m94976r01820N67841J947805J075014p75494n44031J575198K131563
$$ -2788059 -3283035 -4184855 -3617014 -1669209 -594195 -1369689 -1913720 -338522 1793041
5404A793041l270j784258j106252O444m74030q47159R13595L039422K716142O04625
$$ 1793041 1789771 5513 -1100739 -1094295 -1568325 -2415484 -1501889 1537533 4253675 4858300
5394D858300r01528j872458l562056m704180l213118m49264M01239m06210K88254
$$ 4858300 3956772 2084314 -1477742 -6181922 -9395040 -9844304 -9443065 -9849275 -9561021
5385i561021K908354M279227K874049Q84319Q8008n29933j601903j422687P75705
$$ -9561021 -6652667 -2373440 500609 1384928 1472936 943003 -658900 -2081587 -1305882
5376a305882K582976J806158k24714j071624q82855j160300j471629k58294J849744
$$ -1305882 1277094 3083252 2858538 1786914 904059 -256241 -1727870 -1986164 -136420
5367a36420K279160J75604k286135k747172j339837R7673M90945M61984J092629
$$ -136420 2142740 2318344 32209 -2714963 -4054800 -3957127 -3466182 -3004198 -1911569
5358a911569K279249K641660J234061r98590k122716j451093m1040J017471J724226
$$ -1911569 367680 3009340 4243401 3244811 1122095 -328998 -370038 647433 2371659
5349B371659K362902K785508K968030L045468K234580p00282m784993o302251
$$ 2371659 4734561 7520069 10488099 13533567 15768147 15067865 10282872 3980621
5341C980621k943457K482297M848284K907107K34970k23118K18479q79315k759993
$$ 3980621 1037164 3519461 8367745 11274852 11509822 11286704 11505183 10625868 7865875
5332G865875k745741o10146J022569N78894m74916j75469J149210J606884J61970
$$ 7865875 5120134 4509988 5532557 6111451 5636535 5461066 6610276 8217160 8379130
5323H379130k493367m678769m776764k482322L62222J137498o02964k452079k132468
$$ 8379130 5885763 1206994 -3569770 -6052092 -5689870 -4552372 -5155336 -7607415 -9739883
5314i739883q5729J809654K819881L257146K931650J555100N0587m16206l69357
$$ -9739883 -9825612 -8015958 -5196077 -1938931 992719 2547819 2598406 2182200 1812843
5305A812843j195576k671661l210841k433117j500754q90511L7206J029796P77648
$$ 1812843 617267 -2054394 -5265235 -7698352 -9199106 -10089617 -10052411 -9022615 -8244967
5296h244967o67213j495034r11306j32580K41227J430741L716728M876393L306388
$$ -8244967 -8912180 -10407214 -11318520 -11451100 -11209873 -9779132 -6062404 -1186011 2120377
5287B120377P49808k12433K32872J77954q72067k193252l691717m962998l904192
$$ 2120377 2870185 2657752 2890624 3068578 2196511 3259 -3688458 -8651456 -12555648
5278a2555648N22466M995289M959317J046317j310055O02666L322380K888941
$$ -12555648 -12033182 -7037893 -2078576 -1032259 -2342314 -1739648 1582732 4471673
5270D471673M76545m30088J31730p18515l299254m356373j831803K192334M294161
$$ 4471673 4948218 4518130 4649860 3931345 632091 -3724282 -5556085 -3363751 930410
5261I30410L480984J213062o73539j022737K42598J638314J214273q32205j958598
$$ 930410 4411394 5624456 4950917 3928180 4170778 5809092 7023365 6191160 4232562
5252D232562q85429K16779j024860l339322l806147k487743j790086j806158k07328
$$ 4232562 3347133 3563912 2539052 -800270 -4606417 -7094160 -8884246 -10690404 -10897732
5243a0897732K889398M127069K302568M93526P83662R22408r68459k392952r26458
$$ -10897732 -8008334 -3881265 -1578697 -1085171 -301509 620899 -347560 -2740512 -3666970
5234c666970J045573N93375j22713K027810M269641J811561l171628l937018k36008
$$ -3666970 -2621397 -2028022 -2150735 -122925 4146716 5958277 2786649 -1150369 -1386377
5225a386377Q65356l477976p172625m835129O11956L705763L923842L255634J582544
$$ -1386377 -521021 -3998997 -11171622 -16006751 -15394795 -11689032 -7765190 -4509556 -2927012
5216b927012q90102j172613J662366L177348J06723l502904k116243K464058L945898
$$ -2927012 -3817114 -4989727 -3327361 -150013 -43290 -3546194 -5662437 -3198379 747519
5207G47519R61407k274758l251373l265240k885721r00423J928792K844679J539973
$$ 747519 1708926 -565832 -3817205 -7082445 -9968166 -10868589 -8939797 -6095118 -4555145
5198d555145P36865J699145K506128J371917j061861l024605k992472j88903M010492
$$ -4555145 -3818280 -2119135 386993 1758910 697049 -2327556 -5320028 -5508931 -1498439
5189a498439N991351L669097n95133l126707l425024k908113j343804J785251
$$ -1498439 4492912 8162009 7566876 4440169 1015145 -1892968 -3236772 -1451521
5181a451521M122005K908207l61098j762205o11662N20109N26550M84090M79105
$$ -1451521 2670484 5578691 5217593 3455388 2843726 3363835 3890385 4374475 4853580
5172D853580k15609n62296N62137J045094j651480n199334m805816n22323K797247
$$ 4853580 4637971 4075675 4637812 5682906 4031426 -1167908 -5973724 -6496047 -3698800
5163c698800K759292J641171J152686J73748j435851j619295k6311R31994J3564
$$ -3698800 -939508 701663 1854349 2028097 592246 -1027049 -1053360 -121366 -107802
5154a07802j386871k119887k133029o91148K337857M085680K062366r93831q11834
$$ -107802 -1494673 -3614560 -5747589 -6438737 -4100880 -15200 2047166 1053335 241501
5145B41501J064457l9353k848632j537631L485777M791690n9895m187204k454988
$$ 241501 1305958 1266605 -1582027 -3119658 366119 5157809 5097914 910710 -1544278
5136a544278J073433J183750l02111J99405Q55357j445716m670360n153189l565598
$$ -1544278 -470845 712905 410794 610199 1465556 19840 -4650520 -9803709 -13369307
5127a3369307k220532k84021L221070N269420K946812j221052k819139j742645
$$ -13369307 -15589839 -15873860 -12652790 -7383370 -4436558 -5657610 -8476749 -10219394
5119a0219394o05732J60389J387542K094351J349854O16554P97994M6688k192101
$$ -10219394 -10825126 -10664737 -9277195 -7182844 -5832990 -5216436 -4418442 -4371754 -6563855
5110f563855k731235L3411K386080J076677j200465o38432J424027J934370J788308
$$ -6563855 -9295090 -9261679 -6875599 -5798922 -6999387 -7637819 -6213792 -4279422 -2491114
5101b491114K848628L233889J110980o18444P98396K197228k35772l682106l315512
$$ -2491114 357514 3591403 4702383 4083939 4882335 7079563 6843791 3161685 -153827
5092a53827o28366m370l53090K019008N043096L794079k65384j461042J29455
$$ -153827 -782193 -786563 -1139653 879355 5922451 9716530 9451146 7990104 8119559
5083H119559m75173l362161l744542j472057j396895l831039l865194j293594
$$ 8119559 7644386 4282225 537683 -934374 -2331269 -6162308 -10027502 -11321096
5075a1321096j690915n406876n084795K113686Q614429P591248K408593l59729
$$ -11321096 -13012011 -18418887 -23503682 -21389996 -12775567 -5184319 -2775726 -3135455
5067c135455n78805j397789k153474o81183J415275J471110M79764K80672o55411
$$ -3135455 -3714260 -5112049 -7265523 -7946706 -6531431 -5060321 -4580557 -4299885 -4955296
5058d955296l783115n919681l333484J804840M067435K444105Q19836J655645
$$ -4955296 -8738411 -14658092 -17991576 -16186736 -12119301 -9675196 -8855360 -7199715
5050g199715L328284L544564K038091k19886k009626k164381q32262l8177j257647
$$ -7199715 -3871431 -326867 1711224 1491338 -518288 -2682669 -3514931 -3553108 -4810755
5041d810755l039419k806066m97660J351300R99321n42036j117328J9244J684329
$$ -4810755 -7850174 -10656240 -11153900 -9802600 -8803279 -9345315 -10462643 -10443399 -8759070
5032h759070K410364K079181J539435R89466q5475j296695j414785o51338p47274
$$ -8759070 -6348706 -4269525 -2730090 -1740624 -1826099 -3122794 -4537579 -5188917 -5936191
5023e936191j730900j236252J203682K279955O1387k123465o97238K152182K082796
$$ -5936191 -7667091 -8903343 -7699661 -5419706 -5358319 -7481784 -8179022 -6026840 -3944044
5014c944044j53399l92657J669117K571788J484473P22700M09313j421513l477722
$$ -3944044 -4097443 -4490100 -2820983 -249195 1235278 1957978 2367291 945778 -2531944
5005b531944k158362J623123K729729p8852k415625j976628j682355l125968l182047
$$ -2531944 -4690306 -3067183 -337454 -416306 -2831931 -4808559 -6490914 -9616882 -12798929
4996a2798929n7671K958248L099935K370206K789719K306203p16732l323976k500157
$$ -12798929 -12856600 -9898352 -6798417 -4428211 -1638492 667711 -49021 -3372997 -5873154
4987e873154l14308l83220k069446k174966k23822J519858J717566P65893p16830
$$ -5873154 -6187462 -6570682 -8640128 -10815094 -11038916 -9519058 -7801492 -7035599 -7752429
4978g752429j980220j911403k73533J897178L672035M484159L328071K10033k099785
$$ -7752429 -9732649 -11644052 -11917585 -10020407 -6348372 -1864213 1463858 1673891 -425894
4969d25894j025573J542051J661574n41801j596062r96482j513144l126513k387568
$$ -425894 -1451467 90584 1752158 1210357 -385705 -1382187 -2895331 -6021844 -8409412
4960h409412J342709M478200M908422L805993J398953l010692o459282m662236
$$ -8409412 -7066703 -2588503 2319919 6125912 7524865 4514173 -1945109 -6607345
4952f607345K31165J601246q76828o64471L789572N856197K418760p37968L56483
$$ -6607345 -6376180 -4774934 -5651762 -6316233 -2526661 3329536 5748296 5010328 5366811
4943E366811J057809k359614n209192l135009l27553j606697l473354r65045K797397
$$ 5366811 6424620 4065006 -1144186 -4279195 -4606748 -6213445 -9686799 -10651844 -7854447
4934g854447K091432j502133k538438p65851M46187P65542J416723R84411j313398
$$ -7854447 -5763015 -7265148 -9803586 -10569437 -10123250 -9357708 -7940985 -6956574 -8269972
4925h269972k330407m07451P54313j131854k076126O08259K359035n17382l503416
$$ -8269972 -10600379 -11007830 -10253517 -11385371 -13461497 -12853238 -10494203 -11011585 -14515001
4916a4515001j831765J012024N25423o9859L028286N253278J534762l232274j868557
$$ -14515001 -16346766 -15334742 -14809319 -14879178 -11850892 -6597614 -5062852 -8295126 -10163683
4907a0163683K608255K702534o14213j464161o97719k843873n663231l870115
$$ -10163683 -7555428 -4852894 -5467107 -6931268 -7628987 -10472860 -16136091 -20006206
4899b0006206L13152R32100r35934l34120J587819O81657j440844j363876j370470
$$ -20006206 -19693054 -18760954 -19696888 -20031008 -18443189 -17761532 -19202376 -20566252 -21936722
4890b1936722l595653l430458J349395L341790j631196m746287J18138L258724
$$ -21936722 -25532375 -28962833 -27613438 -24271648 -25902844 -30649131 -30530993 -27272269
4882b7272269l059907p997696k027825K758594m491136q668036K781958P047238
$$ -27272269 -30332176 -38329872 -40357697 -37599103 -42090239 -50758275 -47976317 -40929079
4874d0929079j5328529k5616474K9606695J19844929J42824604N8744999m7589720
$$ -40929079 -56257608 -81874082 -52267387 67577542 210402146 269147145 221557425
4867B21557425p6934632l7154458n746807j2421982k1629088j0851999p96226
$$ 221557425 144622793 107468335 101721528 89299546 67670458 56818459 56022233
4860E6022233o278998j0900747k953835L745999j150504o263756k330349J723076
$$ 56022233 49743235 38842488 35888653 39634652 38484148 32220392 29890043 31613119
4852C1613119j562798m814136k672061j953281n558927n044735J890032M598220
$$ 31613119 30050321 25236185 22564124 20610843 15051916 10007181 11897213 16495433
4844A6495433j037107l983939J769172N694772n1719o141558k853734L077855
$$ 16495433 15458326 11474387 13243559 18938331 18886612 12745054 9891320 12969175
4836A2969175J528118l273205j794775L556189L886947l40858j587124J175392
$$ 12969175 14497293 11224088 9429313 12985502 16872449 16531591 14944467 16119859
4828A6119859K161952p12602l855772m584389l169021m57566J795558J146404
$$ 16119859 18281811 17569209 13713437 9129048 5960027 5502461 7298019 8444423
4820H444423j428036j572802J398634K680804J90451j582429L64794K229102O79250
$$ 8444423 7016387 5443585 6842219 9523023 9713474 8131045 8495839 10724941 11404191
4811A1404191j052606L44483J703996q21271m571475m934819k766735j658706
$$ 11404191 10351585 10696068 12400064 11578793 7007318 2072499 -694236 -2352942
4803b352942j598263n65458R35590J598661K307567L366708K345364j387373l822861
$$ -2352942 -3951205 -4516663 -3581073 -1982412 325155 3691863 6037227 4649854 826993
4794H26993k079651P92961Q90371m68339p1339J308055Q95938j046670k246766
$$ 826993 -1252658 -459697 430674 -37665 -109004 1199051 2094989 1048319 -1198447
4785a198447k067903r11061J335482L525873L138256M78921o79641Q34695J254441
$$ -1198447 -3266350 -4177411 -2841929 683944 3822200 4301121 3621480 4456175 5710616
4776E710616j469920l535859j633261J266599J011462r25173n87958J879097L533710
$$ 5710616 4240696 704837 -928424 338175 1349637 424464 -163494 1715603 5249313
4767E249313L707267L410435K203972l33163k324294k225837j357361j047712
$$ 5249313 8956580 12367015 14570987 14237824 11913530 9687693 8330332 7282620
4759G282620l05678J065774Q37667j233858j605775J123047L032659J363952p12958
$$ 7282620 6976942 8042716 8880383 7646525 6040750 7163797 10196456 11560408 10847450
4750A0847450j61148K74657k172880l916617q80731L435497K910973j230877k639057
$$ 10847450 10686302 10960959 8788079 4871462 3990731 7426228 10337201 9106324 6467267
4741F467267N6803K349173J805009M39717j66270m41895j89439O49813j64500
$$ 6467267 6524070 8873243 10678252 11117969 10951699 10509804 10320365 10970178 10805678
4732A0805678l649591n754267k564084K511028K993727n94360j665426J982424
$$ 10805678 7156087 1401820 -1162264 1348764 4342491 3748131 2082705 4065129
4724D065129N487878N080062K441499j05909k797874n250155n339087l062920
$$ 4065129 9553007 14633069 17074568 16968659 14170785 8920630 3581543 518623
4716E18623j188978p19547K00882J930811K228861O32641l28933L28544L06716
$$ 518623 -670355 -1389902 -1189020 741791 2970652 3603293 3274360 3602904 3909620
4707C909620j659371l430964l014781j252878M24206J902414K814970K022160
$$ 3909620 2250249 -1180715 -4195496 -5448374 -5024168 -3121754 -306784 1715376
4699A715376n5149j177025m47878N38782L79490n63420j584803k320916j967711
$$ 1715376 1660227 483202 35324 574106 953596 390176 -1194627 -3515543 -5483254
4690e483254k20329J265225R36977K67202J585455L747316L557867R70702j037836
$$ -5483254 -5703583 -4438358 -3501381 -3234179 -1648724 2098592 5656459 6627161 5589325
4681E589325j372791j378630q64804J525799L787016J834977l420921n602033
$$ 5589325 4216534 2837904 1973100 3498899 7285915 9120892 5699971 97938
4673I7938j630831L735779M758459J906716p15014j406783j069148l07666M19497
$$ 97938 -1532893 2202886 6961345 8868061 8153047 6746264 5677116 5369450 5788947
4664E788947q8729j835103k673478j410743K35194O97138J119228K612167L425769
$$ 5788947 5700218 3865115 1191637 -219106 16088 713226 1832454 4444621 7870390
4655G870390J635255j262798k303955j303976n43797j086445j706538j075394
$$ 7870390 9505645 8242847 5938892 4634916 4091119 3004674 1298136 222742
4647B22742O24011J965998J381397j166810l192110j940458J732461L692105J708544
$$ 222742 846753 2812751 4194148 3027338 -164772 -2105230 -372769 3319336 5027880
4638E027880j744169l100227j980074k82094R25934J561822J158233n05125k331334
$$ 5027880 3283711 183484 -1796590 -2078684 -1152750 409072 1567305 1062180 -1269154
4629a269154l112857k940946k222396n99903J733666L016686J976519n4791p41652
$$ -1269154 -4382011 -7322957 -9545353 -10145256 -8411590 -5394904 -3418385 -3473176 -4214828
4620d214828K32420J159947P11137q89735k502848k814489j038096K109497M571879
$$ -4214828 -3982408 -2822461 -2111324 -3001059 -5503907 -8318396 -9356492 -7246995 -2675116
4611b675116M830537L210734J016225q01780j763723j721864j220567j175202
$$ -2675116 2155421 5366155 6382380 5580600 3816877 2095013 874446 -300756
4603c00756j739463k200356k076639j392541j7299J954789L289143K667656P20997
$$ -300756 -2040219 -4240575 -6317214 -7709755 -7727054 -5772265 -2483122 184534 905531
4594I05531n93857o62446n54018p87265p69629n16856p75831j261642r48778k01866
$$ 905531 311674 -350772 -904790 -1692055 -2461684 -2978540 -3754371 -5016013 -5964791 -6166657
4584f166657k51943n93588K94231J596097Q57941j538034k236796j01220K266505
$$ -6166657 -6418600 -7012188 -6717957 -5121860 -4263919 -5801953 -8038749 -8139969 -5873464
4575e873464L291943M434711N742884M210911n20882l490598j491359J243698
$$ -5873464 -2581521 1853190 7596074 11806985 11286103 7795505 6304146 7547844
4567G547844o09399m727438m607686K01596L551312J921937j632927l446322l828973
$$ 7547844 6938445 2211007 -2396679 -2195083 1356229 3278166 1645239 -1801083 -5630056
4558e630056l968587k688994J002630M989380O273420M617549K231503R62739
$$ -5630056 -9598643 -12287637 -11285007 -6295627 -22207 4595342 6826845 7789584
4550G789584R87238J320956P53667j021988k824880l200430k156485q52393O0003
$$ 7789584 8776822 10097778 10851445 9829457 7004577 3804147 1647662 795269 855272
4541H55272O75844R39675Q71503J145878J914656J691838p09593l641394m187422
$$ 855272 1531116 2470791 3342294 4488172 6402828 8094666 7385073 3743679 -443743
4532d43743k070224J82600Q68583N64826p8444j293014k347341j491191J025049
$$ -443743 -2513967 -2331367 -1462784 -897958 -976402 -2269416 -4616757 -6107948 -5082899
4523e082899K325666R51720o26612L82022K737178L023163Q48188o94081K38411
$$ -5082899 -2757233 -1805513 -2432125 -2050103 687075 3710238 4558426 3864345 4102756
4514D102756J737777J338993m15115j273019q52383q75195k158137l354112l143603
$$ 4102756 5840533 7179526 6764411 5491392 4639009 3763814 1605677 -1748435 -4892038
4505d892038j986591p58209Q45633L030759M185858K495056j152748l886797m400563
$$ -4892038 -6878629 -7636838 -6791205 -3760446 425412 2920468 1767720 -2119077 -6519640
4496f519640l772492k794500r78156J237840K000702J062026Q07899K561646M249957
$$ -6519640 -10292132 -13086632 -14064788 -12826948 -10826246 -9764220 -8956321 -6394675 -2144718
4487b144718L953671L389059M750719N993089L322144k273161n316028l377491
$$ -2144718 1808953 5198012 9948731 15941820 19263964 16990803 11674775 8297284
4479H297284l94251o96871l011796l135298l55823K102668K205949J443795J640421
$$ 8297284 7903033 7206162 4194366 1059068 703245 2805913 5011862 6455657 8096078
4470H096078K146153J596877N74900M87490P47437n80005l290844m547448k785046
$$ 8096078 10242231 11839108 12414008 12901498 13648935 13068930 9778086 5230638 2445592
4461B445592m7035J099441J067422J463736J535986l76478k797535k447010K42012
$$ 2445592 2398557 3497998 4565420 6029156 7565142 7188664 4391129 1944119 2186131
4452B186131J076008j298472k939236r44826J752237J266318r16379p65092J505150
$$ 2186131 3262139 1963667 -975569 -1920395 -168158 1098160 181781 -583311 921839
4443I21839K302959J064550P15624J833790J388730j523463l206554r09168K618759
$$ 921839 3224798 4289348 5004972 6838762 8227492 6704029 3497475 2588307 5207066
4434E207066K961494J11121k220169j993273o91567j80118k43711J48302Q14083
$$ 5207066 8168560 8279681 6059512 4066239 3374672 3194554 2950843 3099145 3913228
4425C913228P81834J17411O7440J018723J338190m95529l035568l074987k20491
$$ 3913228 4695062 4812473 4879913 5898636 7236826 6741297 3705729 630742 410251
4416D10251J853400J90967l221582m172054j846503Q21075J649647J246224O59944
$$ 410251 2263651 2454618 -766964 -4939018 -6785521 -5964446 -4314799 -3068575 -2408631
4407b408631j70466r97033o45701J147957K894406L108113J642374r74474l900278
$$ -2408631 -2579097 -3576130 -4221831 -3073874 -179468 2928645 4571019 3596545 -303733
4398c03733n354097l557198Q02773M501937N072429L124973R29773m9096K93803
$$ -303733 -5657830 -9215028 -8412255 -3910318 1162111 4287084 5216857 5167761 5461564
4389E461564J241276J582991M67270j411723k284302j307096O94270K456945L174583
$$ 5461564 6702840 8285831 8753101 7341378 5057076 3749980 4444250 6901195 10075778
4380A0075778K324660P5865k073372k568401j799143j314135j192095k11603J332329
$$ 10075778 12400438 12476303 10402931 7834530 6035387 4721252 3529157 3317554 4649883
4371D649883J491132l5108j028705l25405K38488r33082k343885j960989o85150
$$ 4649883 6141015 6105907 5077202 4751797 4990285 4057203 1713318 -247671 -932821
4362i32821o34831j294305l33349K207691L484006K038862Q890O5884J848179
$$ -932821 -1567652 -2861957 -3195306 -987615 2496391 4535253 4544143 4610027 6458206
4353F458206K798532J587135p07680k512719l496425l965630l503649j330186
$$ 6458206 9256738 10843873 10136193 7623474 4127049 161419 -3342230 -4672416
4345d672416K032226M497554M410210K261023r3552j395379j628154j330097j033197
$$ -4672416 -2640190 1857364 6267574 8528597 8435045 7039666 5411512 4081415 3048218
4336C048218r32128m84891J017207K874233L042351Q22194j684370k265228j579250
$$ 3048218 2116090 1631199 2648406 5522639 8564990 9387184 7702814 5437586 3858336
4327C858336j574355k069599j418556J21550N89195j83350j97727J162575K026070
$$ 3858336 2283981 214382 -1204174 -1082624 -493429 -676779 -874506 288069 2314139
4318B314139J258471J26544l19204r46825k178343k237102L28549L890250N233907
$$ 2314139 3572610 3699154 3379950 2433125 254782 -1982320 -1653771 2236479 7470386
4309G470386K987014j310226m569651m272726o97184K750288L095448J491003
$$ 7470386 10457400 9147174 4577523 304797 -392387 2357901 5453349 6944352
4301F944352J045892J534920K1710l045740l227537O27167L428545J391648j966737
$$ 6944352 7990244 9525164 9546874 6501134 3273597 3900764 7329309 8720957 6754220
4292F754220j731301M28289k39345k849305k236160J889780L740986L21164m172301
$$ 6754220 5022919 5451208 5211863 2362558 126398 2016178 5757164 6078328 1906027
4283A906027m779443k053175M62401J283851Q63164n95802k323724k139771P59394
$$ 1906027 -2873416 -4926591 -4464190 -3180339 -2317175 -2912977 -5236701 -7376472 -6617078
4274f617078L565632K986593k38311k257177j175446Q59776Q82427j157434k693098
$$ -6617078 -3051446 -64853 -303164 -2560341 -3735787 -2876011 -1993584 -3151018 -5844116
4265e844116j921745M3546P82768j22691n00615J267295L727502M161715K020477
$$ -5844116 -7765861 -7722315 -6939547 -7062238 -7562853 -6295558 -2568056 1593659 3614136
4256C614136r10654l014946l726749k525031O62368M005088M930332L212475J087602
$$ 3614136 2703482 -311464 -4038213 -6563244 -5900876 -1895788 3034544 6247019 7334621
4247G334621Q954o80559j472822j489536m86457J98993k9835J27965J208784J285768
$$ 7334621 7343575 6663016 5190194 3700658 3214201 3413194 3383359 3511324 4720108 6005876
4237F005876j046954l765514l895592j663116L00026R79680J539326K311490K082039
$$ 6005876 4958922 1193408 -2702184 -4365300 -4065274 -3085594 -1546268 765222 2847261
4228B847261O91743k16762R8531J58612j206027k709525k358390j90507J956597
$$ 2847261 3539004 3322242 3420773 3579385 2373358 -336167 -2694557 -2885064 -928467
4219i28467K569485J409278p10907k117794j298351J039220J936803k36346l069346
$$ -928467 1641018 3050296 2339389 221595 -1076756 -37536 1899267 1662921 -1406425
4210a406425k956657j10303J737118P80908m74893M97991K105042J120585k142387
$$ -1406425 -4363082 -4473385 -2736267 -1955359 -2430252 -1932261 172781 1293366 -849021
4201h49021l950289k199491J094102K832378K389097J228175N07901L71774P99110
$$ -849021 -4799310 -6998801 -5904699 -3072321 -683224 544951 1052852 1424626 2223736
4192B223736J803232K825922K814941J254595j090944k676652k562573j295515
$$ 2223736 4026968 6852890 9667831 10922426 9831482 7154830 4592257 3296742
4184C296742j41208N30814J410113K546304K588855P26847j525880k035898j076880
$$ 3296742 3155534 3686348 5096461 7642765 10231620 10958467 9432587 7396689 6319809
4175F319809q42463j955648k486109j094232P57446J059635K89619L94857J493268
$$ 6319809 5477346 3521698 1035589 -58643 698803 1758438 2048057 2442914 3936182
4166C936182J662665K13361q07744L41759J853465L42745l978478o607950m613698
$$ 3936182 5598847 5812208 5004464 5346223 7199688 7542433 3563955 -3043995 -7657693
4157g657693r66396l50027k229300k009298J268385L163627J061379j624859j171178
$$ -7657693 -8624089 -8974116 -11203416 -13212714 -11944329 -8780702 -7719323 -9344182 -10515360
4148a0515360Q72959J395320R64323J042890j4841k871870l209948J340070M129143
$$ -10515360 -9642401 -8247081 -7282758 -6239868 -6254709 -9126579 -12336527 -10996457 -6867314
4139f867314j618798r402342o201404P137535J4581190P515525l222330m340375
$$ -6867314 -8486112 -17888454 -24089858 -16952323 -2371133 5144392 1922062 -2418313
4131b418313J636467M131297J782746P93305J728267k69997m670192n679105k464674
$$ -2418313 -781846 3349451 5132197 5925502 7653769 7383772 2713580 -2965525 -5430199
4122e430199q9762m57016n94932J84856n05972j655037M32375M416796M783017
$$ -5430199 -5519961 -5976977 -6571909 -6387053 -6893025 -8548062 -8115687 -3698891 1084126
4113A084126J230254o79927O52644O65121j956610k283856J419241L632652J100884
$$ 1084126 2314380 1634453 2287097 2952218 995608 -1288248 130993 3763645 4864529
4104D864529j334678N63625K954051R59442k911424l708338k325522k314196k607351
$$ 4864529 3529851 4093476 7047527 8006969 5095545 1387207 -938315 -3252511 -5859862
4095e859862j62400L240268L411876R01389j72703J132450K269228K158670J556093
$$ -5859862 -6022262 -2781994 629882 1531271 1358568 2491018 4760246 6918916 8475009
4086H475009o1792l151324n017554k893251J022809K268283P94565K49331J558961
$$ 8475009 8413217 5261893 244339 -2648912 -1626103 642180 1436745 1686076 3245037
4077C245037K219575J555724J641188K659660J969894j297591m477183n077481
$$ 3245037 5464612 7020336 8661524 11321184 13291078 11993487 7516304 2438823
4069B438823l264043l79959K086720K226911l95553k763697j617970J635824K753696
$$ 2438823 -825220 -1205179 881541 3108452 2712899 -50798 -1668768 -32944 2720752
4060B720752J066700N0922J369584K604166J753385L3925j011132j681254k209456
$$ 2720752 3787452 3838374 5207958 7812124 9565509 9599434 8588302 6907048 4697592
4051D697592j969540j597237k519780l475939j389559K985325M612345J562187
$$ 4697592 2728052 1130815 -1388965 -4864904 -6254463 -3269138 1343207 2905394
4043B905394j417802R1040L425167L248972j98587k200426j368002j138923l300934
$$ 2905394 1487592 1578632 5003799 8252771 8054184 5853758 4485756 3346833 45899
4034D5899m695768k149657K487870M609647K611377o32447j560153K10308J968721
$$ 45899 -4649869 -6799526 -4311656 297991 2909368 2276921 716768 927076 2895797
4025B895797J260104j254648k594369j173064J044519R64724j554323l468445
$$ 2895797 4155901 2901253 306884 -866180 178339 1143063 -411260 -3879705
4017c879705k614116n03855j070j275080j781113l9588K420991L450956K927162
$$ -3879705 -6493821 -6997676 -6998746 -8273826 -10054939 -10094527 -7673536 -4222580 -1295418
4008a295418J898428N89387j020909j745648n29166J275018J283426l74485j239858
$$ -1295418 603010 1192397 171488 -1574160 -2103326 -828308 455118 80633 -1159225
3999a159225l40910P02320P52576O23251P96149N23272J26420J054887K379391
$$ -1159225 -1500135 -797815 -45239 578012 1374161 1897433 2023853 3078740 5458131
3990E458131Q19946l683031o173377l407079J149396K682259J974034K390728
$$ 5458131 6278077 2595046 -3578331 -6985410 -5836014 -3153755 -1179721 1211007
3982A211007K963232L48510l981114m866575j621649R04847J51889q95364K68710
$$ 1211007 4174239 4522749 541635 -4324940 -5946589 -5041742 -4889853 -5785217 -5516507
3973e516507J691774J323100P41583J626836K208186L44048k599020l764688k624419
$$ -5516507 -3824733 -2501633 -1760050 -133214 2074972 2419020 -180000 -3944688 -6569107
3964f569107n65108J363363K444519K049876R92381J043551J868796J080188j313224
$$ -6569107 -7134215 -5770852 -3326333 -1276457 -284076 759475 2628271 3708459 2395235
3955B395235j822433R83725L228257J145575l013195m176870j616169R12422J029878
$$ 2395235 572802 1556527 4784784 5930359 2917164 -1259706 -2875875 -1963453 -933575
3946i33575K4089l55012j27519J22382K56042J39373j04632L22488J490237J680857
$$ -933575 -909486 -1264498 -1392017 -1269635 -1013593 -874220 -978852 -656364 833873 2514730
3936B514730l14560k614472k304668L05064J919011Q31212j042629j251504L7130
$$ 2514730 2200170 -414302 -2718970 -2413906 -494895 336317 -706312 -1957816 -1920686
3927a920686R40477O11886k5318J33959P55296K66703k122212m794694n002671
$$ -1920686 -980209 -368323 -393641 -259682 495614 762317 -1359895 -6154589 -11157260
3918a1157260k045342J808585L993839M092747L104391J814547R11079J177746
$$ -11157260 -13202602 -11394017 -7400178 -3307431 -203040 1611507 2522586 3700332
3910C700332K081634J458059j623931m654049m302109p61349K388860K577613
$$ 3700332 5781966 7240025 5616094 962045 -3340064 -4101413 -1712553 865060
3902H65060R07078J92308J501643L115182K543761n47936l645625m188478k649780
$$ 865060 1772138 1964446 3466089 6581271 9125032 8577096 4931471 742993 -1906787
3893a906787j438435j080627J00505K103216K159160p35063l073784j427582K334522
$$ -1906787 -3345222 -4425849 -4325344 -2222128 -62968 -798031 -3871815 -5299397 -2964875
3884b964875L674749J828352O7238K03795N24457n34326j980075k454152k140837
$$ -2964875 709874 2538226 2605464 2809259 3333716 2799390 819315 -1634837 -3775674
3875c775674j408419J35004J997108K298753M73989j168683l75818J676319J911422
$$ -3775674 -5184093 -5049089 -3051981 -753228 -279239 -1447922 -1823740 -147421 1764001
3866A764001j88760j732351n51736J544237J196349j627950l315959j549821J642048
$$ 1764001 1575241 -157110 -708846 835391 2031740 403790 -2912169 -4461990 -2819942
3857b819942L223097L431503M087794M254546J511243k802721m118128j403693
$$ -2819942 403155 3834658 7922452 12176998 13688241 10885520 6767392 5363699
3849E363699J024631L50934o40407O58091J351107j835122n708718m815024m17709
$$ 5363699 6388330 6739264 6098857 6756948 8108055 6272933 564215 -4250809 -4668518
3840d668518J121844j617738l162299k08195L342511K816369o02187k790028k573846
$$ -4668518 -3546674 -5164412 -8326711 -8534906 -5192395 -2376026 -2978213 -5768241 -8342087
3831h342087j380553K84239K567970M128636L404825J305726K18295P05276J079010
$$ -8342087 -9722640 -9438401 -6870431 -2741795 663030 1968756 2187051 2892327 3971337
3822C971337R9739j411330j831749p43847O11503P76878p7267k52083J109474
$$ 3971337 4071076 2659746 827997 84150 695653 1472531 1395264 1143181 2252655
3813B252655K613214K544462J224760K7051q68901j805441j838688j69958J427914
$$ 2252655 4865869 7410331 8635091 8662142 7793241 5987800 4149112 3979154 5407068
3804E407068O48860j327229j257078P88529J324962o71661j948320n84683O14394
$$ 5407068 6055928 4728699 3471621 4260150 5585112 4913451 2965131 2380448 2994842
3795B994842j112541l691230l406176n35197J471664R61761o69128j704134j598235
$$ 2994842 1882301 -1808929 -5215105 -5750302 -4278638 -3316877 -3986005 -5690139 -7288374
3786g288374m26823J155382J969604J726289J479328J597635Q20449j307651k894743
$$ -7288374 -7715197 -6559815 -4590211 -2863922 -1384594 213041 1033490 -274161 -3168904
3777c168904k401032j105751p82952o09167J155155L774208M952424M174432K660994
$$ -3168904 -5569936 -6675687 -7458639 -8067806 -6912651 -3138443 1813981 5988413 8649407
3768H649407Q90433j294928k873587k638715j595573j737571k618911j791525
$$ 8649407 9539840 8244912 5371325 2732610 1137037 -600534 -3219445 -5010970
3760e010970J166082L583751L282890J158491n69070r98588o27987p4700M09532
$$ -5010970 -3844888 -261137 3021753 4180244 3611174 2612586 1984599 1909899 2319431
3751B319431P58541Q76336M59371o04468j388063m76100J854993L199770J983237
$$ 2319431 3077972 3954308 4413679 3809211 2421148 1945048 3800041 6999811 8983048
3742H983048l20107j422377j457693k049596l123577k922473q29923J751015L070474
$$ 8983048 8662941 7240564 5782871 3733275 609698 -2312775 -3142698 -1391683 1678791
3733A678791K111246j153503m814270n481405k038523K002418K515896K81067
$$ 1678791 3790037 2636534 -2177736 -7659141 -9697664 -7695246 -5179350 -4898283
3725d898283m83521J591092L655944L382175J452855r05246l154332l667988p20000
$$ -4898283 -5381804 -3790712 -134768 3247407 4700262 3795016 640684 -3027304 -3747304
3716c747304L632886M723595J956141J21315J801131K963742l35395m988534n457847
$$ -3747304 -114418 4609177 6565318 6686633 8487764 11451506 11116111 6127577 669730
3707F69730k426269j209354l056644l860655j403694J635439K850791L260489
$$ 669730 -1756539 -2965893 -6022537 -9883192 -11286886 -9651447 -6800656 -3540167
3699c540167L603038K141510j251648k836327j84258L472829L720107J306546
$$ -3540167 62871 2204381 952733 -1883594 -2067852 1404977 5125084 6431630
3691F431630m0301k06929k169188n460033n520795r26292L374939K754545o22366
$$ 6431630 6391329 6184400 4015212 -1444821 -6965616 -7891908 -4516969 -1762424 -2384790
3682b384790j437262J062339K949156K076038M86751J40529M4854r29527j409292
$$ -2384790 -3822052 -2759713 189443 2265481 2752232 2892761 2937615 2008088 598796
3673E98796R9832K184197K302973N09360r14845j053659j345752k768330l944602
$$ 598796 698628 2882825 5185798 5695158 4780313 3726654 2380902 -387428 -4332030
3664d332030k984876j91034K038245J772525m52707k260751k027990o52510j90807
$$ -4332030 -7316906 -7507940 -5469695 -3697170 -4149877 -6410628 -8438618 -9091128 -9281935
3655i281935p95533k59619K596227N356071M576738M59951l001336k847122l85181
$$ -9281935 -10077468 -10337087 -7740860 -2384789 2191949 2651900 -349436 -3196558 -3581739
3646c581739J156444O86579l34342n49525j75857k1213l65422j024878j541961
$$ -3581739 -2425295 -1738716 -2073058 -2622583 -2798440 -2819653 -3185075 -4209953 -5751914
3637e751914j061603R61262L403493L862407J470552j381132j596008O10180K007262
$$ -5751914 -6813517 -5852255 -2448762 1413645 2884197 1503065 -92943 517237 2524499
3628B524499R12443o59935m88539M28967J10085n47931O62229K675838J989719
$$ 2524499 3436942 2777007 2288468 2717435 2827520 2279589 2941818 5617656 7607375
3619G607375j516958l510034j537602J136379O01849j819966k207435l88430L88093
$$ 7607375 6090417 2580383 1042781 2179160 2781009 961043 -1246392 -1634822 -1246729
3610a246729q73157j737593j009457p55713k459127m105544k859025J154199N146648
$$ -1246729 -2119886 -3857479 -4866936 -5622649 -8081776 -12187320 -15046345 -13892146 -8745498
3601h745498O553488M770008J234478j483659j727344l56465O35464R70973J916751
$$ -8745498 -2192010 2577998 3812476 2328817 601473 245008 880472 1851445 3768196
3592C768196L292658K995827L68287k137812k115527l43101Q24993P79986N28502
$$ 3768196 7060854 10056681 10424968 8287156 6171629 5828528 6653521 7433507 7962009
3583G962009L16277m63880j366383j002323N84033J312311l15341l051975m378557
$$ 7962009 8278286 7814406 6448023 5445700 6029733 7342044 7026703 3974728 -403829
3574d03829l575284k194734j577873j229005k95278O16588O06550O49237K366926
$$ -403829 -3979113 -6173847 -7751720 -8980725 -9276003 -8659415 -8052865 -7403628 -5036702
3565e036702M676434M353488Q98689j882830j014314J427243J759465J03681r74217
$$ -5036702 -360268 3993220 4891909 3009079 1994765 3422008 5181473 5285154 4310937
3556D310937j371920k800718m198175k536778J556334L631488J982285O8905P38708
$$ 4310937 2939017 138299 -4059876 -6596654 -5040320 -1408832 573453 642358 1381066
3547A381066K207626K105329J568023K220897K465102M05274k154877k472321
$$ 1381066 3588692 5694021 7262044 9482941 11948043 12353317 10198440 7726119
3539G726119j574098k238427l796006l168810l62579J260948K58127j168541j265472
$$ 7726119 6152021 3913594 117588 -3051222 -3413801 -2152853 -1894726 -3063267 -4328739
3530d328739r96586j130589l06905K187792M205531L500433J146008L6998Q26527
$$ -4328739 -5325325 -6455914 -6762819 -4575027 -369496 3130937 4276945 4313943 5140470
3521E140470J409126K93687j396124j931554j564194j719348k240302j327331
$$ 5140470 6549596 6843283 5447159 3515605 1951411 232063 -2008239 -3335570
3513c335570J347382L367464K751170P36951n99226j901358m711386p212425n824331
$$ -3335570 -1988188 1379276 4130446 4867397 4268171 2366813 -2344573 -9556998 -15381329
3504a5381329j105155K211059J989778J151104J851075K038692M63524J71110
$$ -15381329 -16486484 -14275425 -12285647 -11134543 -9283468 -7244776 -6781252 -6610142
3496f610142K946144M707471J678622k456701j717864K411764L194197o79516
$$ -6610142 -3663998 1043473 2722095 265394 -1452470 959294 4153491 3473975
3488C473975l671060k642717n80403J7370P97324K421242J902050j738402m216880
$$ 3473975 -197085 -2839802 -3420205 -3402835 -2605511 -184269 1717781 -20621 -4237501
3479d237501j981399K545666N007127M770215L444937J389019r12879j349151
$$ -4237501 -6218900 -3673234 1333893 6104108 9549045 10938064 10025185 8676034
3471H676034L86142J004908j150996k464124J42436L043210R26523m358010n978360
$$ 8676034 9062176 10067084 8916088 6451964 6594400 9637610 10564133 6206123 227763
3462B27763k153775J969097K554857J371582O86248o11454l292780m677992k591091
$$ 227763 -1926012 43085 2597942 3969524 4655772 4044318 751538 -3926454 -6517545
3453f517545N96847J211859m52556j225433n2442J176776J225011J078476J659530
$$ -6517545 -5920698 -4708839 -5161395 -6386828 -6439270 -5262494 -4037483 -2959007 -1299477
3444a299477K243232J951427J213499P06368n2444j768771l557627l539460j511003
$$ -1299477 943755 2895182 4108681 4815049 4762605 2993834 -563793 -4103253 -5614256
3435e614256K60706j91659j841706k013937K7949K327719L009665K178321P62627
$$ -5614256 -5353550 -5545209 -7386915 -9400852 -9372903 -7045184 -4035519 -1857198 -1094571
3426a094571p43216j602126o91623J611925K884752J655322k24742j15095J411421
$$ -1094571 -1837787 -3439913 -4131536 -2519611 365141 2020463 1795721 1680626 3092047
3417C092047J384299j019583l129418k544760l13977P86238l5556r12817l7047
$$ 3092047 4476346 3456763 327345 -2217415 -2531392 -1745154 -1780710 -2693527 -2730574
3408b730574K003162L012719J974714L24019l1345O56972N21373r29023k071302
$$ -2730574 -727412 2285307 4260021 4584040 4552695 5209667 5731040 4802017 2730715
3399B730715j904801j617825k222379k447484r17236R46450O24227j570184k735239
$$ 2730715 825914 -791911 -3014290 -5461774 -6379010 -5432560 -4808333 -6378517 -9113756
3390i113756j434403Q38637K441505L446674L990331L017906J98165k379855k218972
$$ -9113756 -10548159 -9709522 -7268017 -3821343 168988 3186894 3385059 1005204 -1213768
3381a213768L75549K508054K129038K38434p49376k19303j5660j608166l541887
$$ -1213768 -838219 1669835 3798873 4037307 3287931 3068628 3052968 1444802 -2097085
3372b097085l056048k3604K530922K379545O24977q49229k332631m543547n680247
$$ -2097085 -5153133 -5176737 -2645815 -266270 358707 -490522 -2823153 -7366700 -13046947
3363a3046947l336164J214335L760917K486686n8667q06300M68648K334726L838396
$$ -13046947 -16383111 -15168776 -11407859 -8921173 -8979840 -9786140 -9317492 -6982766 -3144370
3354c144370M324386L182941J095535p1744K76171O48030K5316n74463k62242
$$ -3144370 1180016 4362957 5458492 5386748 5662919 6310949 6336265 5761802 5499560
3345E499560p8614j001552j872978j314393l60505r06486k337668k047689Q08275
$$ 5499560 5420946 4419394 2546416 1232023 871518 -34968 -2372636 -4420325 -3612050
3336c612050L998468M839089K767969p01683l333298l530518j635159M9748l77718
$$ -3612050 386418 5225507 7993476 7291793 3958495 427977 -1207182 -1157434 -1535152
3327a535152k044956k406089o56682J322623J735014J182880J335691K210283
$$ -1535152 -3580108 -5986197 -6642879 -5320256 -3585242 -2402362 -1066671 1143612
3319A143612K045602j15269k660048k926446m11561K252787K187242j84522j519933
$$ 1143612 3189214 3073945 413897 -2512549 -2924110 -671323 1515919 1331397 -188536
3310a88536K70519L343345M176305J647886k156437m595830m686728k943673m28145
$$ -188536 81983 3425328 7601633 9249519 7093082 2497252 -2189476 -5133149 -5561294
3301e561294J650565K339390J589947K44799p69271j001981m72560K91124L51686
$$ -5561294 -3910729 -1571339 18608 263407 -505864 -1507845 -1980405 -1689281 -1337595
3292a337595o91898j778507j258163R80970L018699L040674J347366l70731j164983
$$ -1337595 -2029493 -3808000 -5066163 -4085193 -1066494 1974180 3321546 2950815 1785832
3283A785832j347600j261335p63859j61204m71391j939678l054168k121204N01778
$$ 1785832 438232 -823103 -1586962 -1748166 -2219557 -4159235 -7213403 -9334607 -8832829
3274h832829K804366L578606L270377K392586P04738j363443k071949n60272J369929
$$ -8832829 -6028463 -2449857 820520 3213106 3917844 2554401 482452 -77820 1292109
3265A292109J293891o19079k070786j906661j106587o18180k07602J46273l06923
$$ 1292109 2586000 1966921 -103865 -2010526 -3117113 -3735293 -3942895 -3796622 -4103545
3256d103545j377384j428353J40335J341439J56959k296103k929179o46830K484869
$$ -4103545 -5480929 -6909282 -6768947 -5427508 -5270549 -7566652 -10495831 -11142661 -8657792
3247h657792M057256L786963K702455J211839q54270k817803l167197j478773
$$ -8657792 -4600536 -813573 1888882 3100721 2246451 -571352 -3738549 -5217322
3239e217322N65472J043548K52450L2543P04032M74769j329646k406799o68902
$$ -5217322 -4651850 -3608302 -3355852 -3323309 -2619277 -2144508 -3474154 -5880953 -6549855
3230f549855K183358K762428Q42169o98273m73560Q912q2232O69308K584333L119377
$$ -6549855 -4366497 -1604069 -761900 -1460173 -1933733 -1924821 -2007053 -1337745 1246588 4365965
3220D365965O71284k240044k146993O59544K999905L023240J232396j420817l894367
$$ 4365965 5037249 2797205 650212 1309756 4309661 7332901 8565297 7144480 3250113
3211C250113m421809k181888P92661J711756P10316K25273J073592J610568Q16495
$$ 3250113 -1171696 -3353584 -2560923 -849167 -138851 86422 1160014 2770582 3587077
3202C587077j83752j52179O43705J297624J169753k25410k608134m201433l395233
$$ 3587077 3403325 3251146 3894851 5192475 6362228 6136818 3528684 -672749 -4067982
3193d067982j152527J56974K65442J014342K623327K737475L23657k022758j557464
$$ -4067982 -5220509 -5063535 -4798093 -3783751 -1160424 1577051 1900708 -122050 -1679514
3184a679514N97346J070334j045552l088582k284990J082697M161271M476611
$$ -1679514 -1082168 -11834 -1057386 -4145968 -6430958 -5348261 -1186990 3289621
3176C289621K257309K9873j37468J174845J621424j96027l465106o091946o100628
$$ 3289621 5546930 5576803 5439335 6614180 8235604 8039577 4574471 -1517475 -7618103
3167g618103k836359K005648N208282N291047M186524M056779L659451N39356
$$ -7618103 -10454462 -8448814 -3240532 2050515 6237039 10293818 13953269 14492625
3159A4492625m010490n738338l400611l96764L67320k83411r05229j967173l180400
$$ 14492625 10482135 4743797 1343186 946422 1313742 1030331 125102 -1842071 -5022471
3150e022471j980400K306121N802778M997774J805329J39035j54824j655845l570601
$$ -5022471 -7002871 -4696750 1106028 6103802 7909131 8048166 7893342 6237497 2666896
3141B666896k684943N33937J932749J91043j471803j211541j450067l716768m855577
$$ 2666896 -18047 515890 2448639 2639682 1167879 -43662 -1493729 -5210497 -10066074
3132a0066074j708146L296996M858664J647338k571429l828403j551638K058753
$$ -10066074 -11774220 -8477224 -3618560 -1971222 -4542651 -8371054 -9922692 -7863939
3124g863939M104201K881456m46422k409892r73910J821222K470801N27442j367561
$$ -7863939 -3759738 -878282 -1324704 -3734596 -4708506 -2887284 -416483 110959 -1256602
3115a256602j464562p26235o20510j216975k033523k961466l517485k708600o91987
$$ -1256602 -2721164 -3447399 -4067909 -5284884 -7318407 -10279873 -13797358 -16505958 -17197945
3106a7197945O60006P3166j127771o44621J667534L625146L572185K182808J099456
$$ -17197945 -16537939 -16464773 -17592544 -18237165 -16569631 -12944485 -9372300 -7189492 -6090036
3097f090036P77302M27946l71494r15271m05569Q14114J583958J333520O00415
$$ -6090036 -5312734 -4884788 -5256282 -6171553 -6577122 -5763008 -4179050 -2845530 -2245115
3088b245115P7719j66568j45894N35403J692652J755272m89931l421430l687468
$$ -2245115 -2167396 -2333964 -2479858 -1944455 -251803 1503469 1013538 -2407892 -6095360
3079f095360m63282L069327L624124J667193r0415m82380m5903J205993L159393
$$ -6095360 -6558642 -3489315 134809 1802002 1711587 1229207 1183304 2389297 5548690
3070E548690L464582k15431n351847n921259m30219N018669M519669K00581j535780
$$ 5548690 9013272 8797841 3445994 -2475265 -2905484 2113185 6632854 6833435 5297655
3061E297655N82649J846779m74055l322477l215953j287299o11957j341970j259567
$$ 5297655 5880304 7727083 7253028 3930551 714598 -572701 -1184658 -2526628 -3786195
3052c786195L66459J982854K239891J476175Q37537R36724J270211O35556j298709
$$ -3786195 -3419736 -1436882 803009 2279184 3116721 4053445 5323656 5959212 4660503
3043D660503k802278j687616J535042L573218K221838r80123k926874k630485
$$ 4660503 1858225 170609 1705651 5278869 7500707 6520584 3593710 963225
3035I63225j611519j474819k255910k822333k231606q60319j13686m23177j59619
$$ 963225 -648294 -2123113 -4379023 -7201356 -9432962 -10293281 -10406967 -10830144 -10989763
3026a0989763J966062M009632K750206j323342l810181k124560J286242K841661
$$ -10989763 -9023701 -5014069 -2263863 -3587205 -7397386 -9521946 -8235704 -5394043
3018e394043K266508J227375P1670j506897k395685j322246R55666K781851L674931
$$ -5394043 -3127535 -1900160 -1828490 -3335387 -5731072 -7053318 -6097652 -3315801 359130
3009C59130L575641J871553p74472j716802J9256J458860m7508k409903k123959
$$ 359130 3934771 5806324 5031852 3315050 3334306 4793166 4745658 2335755 211796
3000B11796N463O09691l36124m4585J510786J522361k66765j057288l20650o79858
$$ 211796 217259 826950 490826 446241 1957027 3479388 3212623 2155335 1834685 1154827
2990A154827k443588k213384J233788M217228L656197J309579J398o31836j744191
$$ 1154827 -1288761 -3502145 -2268357 1948871 5605068 6914647 6916045 6284209 4540018
2981D540018k054193l72635J293257N13611j662907k556077j848659r81583k13658
$$ 4540018 2485825 2113190 3406447 3920058 2257151 -298926 -2147585 -3129168 -3342826
2972c342826R84607J965173J821991J088195M49669p77300k842893l889268k322765
$$ -3342826 -2358219 -393046 1428945 2517140 2966809 2189509 -653384 -4542652 -6865417
2963f865417N93269K537096K924274K085610k02084l130084m102406k192702j03087
$$ -6865417 -6272148 -3735052 -810778 1274832 1072748 -2057336 -6159742 -8352444 -8455531
2954h455531N6756K68914K518931M185362K139007r43843L6860M225369N810013
$$ -8455531 -8398775 -8129861 -5610930 -1425568 713439 -230404 -193544 4031825 9841838
2945I841838L109955M61991K80972l91406l221007m469122j311860K435273J570478
$$ 9841838 12951793 13413784 13694756 13303350 10082343 5613221 4301361 6736634 8307112
2936H307112k635531m639051k901670j228450k174171l325190j303792L262300
$$ 8307112 5671581 1032530 -1869140 -3097590 -5271761 -8596951 -9900743 -6638443
2928f638443O459413N629756J931262j396837k496956k112152j580969q60064
$$ -6638443 -179030 5450726 7381988 5985151 3488195 1376043 -204926 -1064990
2920a064990M48794J182519k25172k840230l677488j610864J028698J591995K87510
$$ -1064990 -616196 566323 341151 -2499079 -6176567 -7787431 -6758733 -5166738 -4879228
2911d879228p05281m1237J740824L034515K504278M91815q09040K50508K313055
$$ -4879228 -5584509 -5625746 -3884922 -850407 1653871 2145686 1336646 1587154 3900209
2902C900209K520245L72163j864492k626950k614705k552805j969786r61709o13390
$$ 3900209 6420454 6792617 4928125 2301175 -313530 -2866335 -4836121 -5797830 -6411220
2893f411220o87329M64692K528183K694485J54664j916011j128152L71670j04437
$$ -6411220 -7098549 -6633857 -4105674 -1411189 -1256525 -3172536 -4300688 -3929018 -4033455
2884d033455q48752J224728M567773M603143P47884k565542k290599k80598O55009
$$ -4033455 -4882207 -3657479 910294 5513437 6261321 3695779 1405180 1124582 1779591
2875A779591P35691J429281K284554J783459n9432j826431k668207k733051k096472
$$ 1779591 2515282 3944563 6229117 8012576 7953144 6126713 3458506 725455 -1371017
2866a371017m87287J853302L713267L663433J362747j927959m398854n191898
$$ -1371017 -1858304 -5002 3708265 7371698 8734445 6806486 2407632 -2784266
2858b784266m379469j916819J856265M681838L808359J42556j568456J049298
$$ -2784266 -7163735 -9080554 -7224289 -2542451 1265908 1408464 -159992 889306
2850H89306L942958K099263k718652m125552n17295K630415J014134k620976l477748
$$ 889306 4832264 6931527 4212875 87323 -429972 2200443 3214577 593601 -2884147
2841b884147j772377j032314j748486j066802J858514M120020L280088M40118
$$ -2884147 -4656524 -5688838 -7437324 -8504126 -6645612 -2525592 754496 1194614
2833A194614j943918l085021l388176k669343o25771J670985K425737J339655
$$ 1194614 -749304 -3834325 -7222501 -9891844 -10517615 -8846630 -6420893 -5081238
2825e081238O7129J12496J026457J202194k3866j714229k559769k084650o57247
$$ -5081238 -5014109 -4901613 -3875156 -2672962 -2696828 -4411057 -6970826 -9055476 -9712723
2816i712723R38849J768904J386986N80303O56391J522474J526902P3713p81691
$$ -9712723 -8773874 -7004970 -5617984 -5037681 -4381290 -2858816 -1331914 -1258201 -2039892
2807b039892J082060M393594N568264L192962m22581k484149k687236k252475
$$ -2039892 -957832 3435762 9004026 12196988 11774407 9290258 6603022 4350547
2799D350547j711576r41241k86057k41614n24856n49623n23470j194821k661087
$$ 4350547 2638971 1697730 1411673 1170059 645203 95580 -427890 -1622711 -4283798
2790d283798m024260m076645k053562J736977N493433O710553M322493P5751k792552
$$ -4283798 -8308058 -12384703 -14438265 -12701288 -7207855 -497302 3825191 3900942 1108390
2781A108390k418068J98315K328122K010560k57004k052512j412062J210300L495226
$$ 1108390 -1309678 -1111363 1216759 3227319 2970315 917803 -494259 716041 4211267
2772D211267L636193J847324k66960j257229q28173P5425J34664r51573k101274
$$ 4211267 7847460 9694784 9427824 8170595 7342422 7417847 7552511 6600938 4499664
2763D499664k297964j874784j604323j265346m23994K3652j048622k623941k437682
$$ 4499664 2201700 326916 -1277407 -2542753 -2966747 -2943095 -3991717 -6615658 -9053340
2754i053340m19523J076774J013230J058197K113672K178712k65957l028368l084290
$$ -9053340 -9472863 -8396089 -7382859 -6324662 -4210990 -2032278 -2298235 -5326603 -8410893
2745h410893j127760k46090r29686n78783K010962M572157M516787K019933q52923
$$ -8410893 -9538653 -9784743 -10714429 -11293212 -9282250 -4710093 -193306 1826627 973704
2736I73704k401760j948972K11843K606487L386061K115196J36989j037868r39795
$$ 973704 -1428056 -3377028 -3165185 -558698 2827363 4942559 5079548 4041680 3101885
2727C101885J00440J207686J053856q68110k944573k939853j025890L62221R4889
$$ 3101885 3202325 4410011 5463867 4595757 1651184 -1288669 -2314559 -1952338 -1857449
2718a857449j97255Q37418J803891Q66515r43558r81467R81277K194583P54340
$$ -1857449 -2054704 -1217286 586605 1453120 509562 -471905 509372 2703955 3458295
2709C458295j741614k342046n64957J190549R38434l65671l45253J391670K725490
$$ 3458295 1716681 -625365 -1190322 227 938661 572990 227737 1619407 4344897
2700D344897K101268O55460K77425P97165O94984k36531r20883j288059k306020
$$ 4344897 6446165 7101625 7379050 8176215 8871199 8634668 7713785 6425726 4119706
2691D119706l589344l241066p20795K156335L848291M663894M796273L119087
$$ 4119706 530362 -2710704 -3431499 -1275164 2573127 7237021 12033294 15152381
2683A5152381m25611l289462l290935j644491r11204j241807r70332J24350P31031
$$ 15152381 14726770 11437308 8146373 6501882 5590678 4348871 3378539 3502889 4233920
2674D233920N90667O26855P34243j26891j653597k386519k252557k444808k509666
$$ 4233920 4824587 5451442 6185685 6058794 4405197 2018678 -233879 -2678687 -5188353
2665e188353m07078L520204N424306K716098k047333m229078k733076l20353Q20443
$$ -5188353 -5595431 -2075227 3349079 6065177 4017844 -211234 -2944310 -3264663 -2444220
2656b444220J291875K177186K774674J779283m26688j933316j571136k42779J72314
$$ -2444220 -1152345 1024841 3799515 5578798 5152110 3218794 1647658 1404879 1577193
2647A577193j126412l074048l764109k093478J220923L795585L192031n91086
$$ 1577193 450781 -2623267 -6387376 -8480854 -7259931 -3464346 -272315 -863401
2639h63401m272857m223721o33149K582882K608640Q04531q3307J80456J59525
$$ -863401 -5136258 -9359979 -9993128 -7410246 -4801606 -3997075 -4080382 -3899926 -3740401
2630c740401k27369j82424l52381j602613k194716K79248M207026N040758J849319
$$ -3740401 -3967770 -4150194 -4502575 -6105188 -8299904 -8020656 -3813630 1227128 3076447
2621C076447j025210l75141J500193J131276p55607j316543m71756k00705o23162
$$ 3076447 2051237 1676096 3176289 4307565 3551958 2235415 1763659 1562954 939792
2612I39792k32010R45439J542079J512300J717631J494442m02403k816958l189288
$$ 939792 707782 1653221 3195300 4707600 6425231 7919673 7517270 4700312 1511024
2603A511024j550943o02611j434491j939175k94479K311768L476980K419711K79201
$$ 1511024 -39919 -642530 -2077021 -4016196 -4310675 -1998907 1478073 3897784 4176985
2594D176985j050901j14096K565716M054481J906719k335839m443175k603026
$$ 4176985 3126084 3011988 5577704 9632185 11538904 9203065 4759890 2156864
2586B156864O80586K178166J418522p6421j145073j567684j580803j556997j378047
$$ 2156864 2837450 5015616 6434138 6357717 5212644 3644960 2064157 507160 -870887
2577h70887k69576J578041J976133o03047l929733m277508j581842O70003P45452
$$ -870887 -1140463 437578 2413711 1810664 -2119069 -6396577 -7978419 -7308416 -6562964
2568f562964L75154O46040J53006j359682j494878M75717J538415j1746r98025
$$ -6562964 -6187810 -5541770 -5388764 -6748446 -8243324 -7767607 -6229192 -6240938 -7238963
2559g238963J576963M938142M343459M17181j913710p39329J037167R74250L9550
$$ -7238963 -5662000 -723858 3619601 4036782 2123072 1383743 2420910 3395160 3434710
2550C434710k22824o3452j99622o12969j221559j765466j125708J086999K732931
$$ 3434710 3211886 3148434 2948812 2335843 1114284 -651182 -1776890 -689891 2043040
2541B043040J555366j020385j513437L48549J344457M1313j180834l59154J136333
$$ 2043040 3598406 2578021 1064584 1413133 2757590 2798903 1618069 1258915 2395248
2532B395248J414410Q73219M65014l00490j761650k721247k478619k201928k497950
$$ 2395248 3809658 4682877 5147891 4847401 3085751 364504 -2114115 -4316043 -6813993
2523f813993j778359P96719K776414J516703j564626k655429p49674J477900J768404
$$ -6813993 -8592352 -7795633 -5019219 -3502516 -5067142 -7722571 -8472245 -6994345 -5225941
2514e225941Q16601M51503J258006K543339L251536K475068K03150k091820k618569
$$ -5225941 -4409340 -3957837 -2699831 -156492 3095044 5570112 5773262 3681442 1062873
2505A062873j349208o8940m6433n37882j50574R87652J293442o4501j760772j740020
$$ 1062873 -286335 -355275 -401708 -939590 -1090164 -102512 1190930 1126429 -634343 -2374363
2495b374363R4527J480049O10945j348883j597330P76252L789220N075601M100913
$$ -2374363 -2279836 -799787 -188842 -1537725 -3135055 -2358803 1430417 6506018 10606931
2486A0606931J623612j573865m521374n704338m147333o61422K669302M147998
$$ 10606931 12230543 10656678 6135304 430966 -3716367 -4377789 -1708487 2439511
2478B439511L428002J329871q72891k235221k459374j489663O56996L107284L959333
$$ 2439511 5867513 7197384 6324493 4089272 1629898 140235 797231 3904515 7863848
2469G863848K168651q14129k731047l435277m277339m895268l245331N91186L378406
$$ 7863848 10032499 9218370 6487323 3052046 -1225293 -6120561 -9365892 -8774706 -5396300
2460e396300K965920J212868P60593R96380j96717k193279k272546r6593J455418
$$ -5396300 -2430380 -1217512 -456919 539461 342744 -1850535 -4123081 -4219674 -2764256
2451b764256M65395j407157j546160J29165J660190J991979J919973K312963K674008
$$ -2764256 -2298861 -3706018 -5252178 -5123013 -3462823 -1470844 449129 2762092 5436100
2442E436100K020740N18273o92536j216418j840409k758344k612518n76709J615219
$$ 5436100 7456840 7975113 7282577 6066159 4225750 1467406 -1145112 -1721821 -106602
2433a06602J631976L4817m27478J017082K155347J422283J6118o16980j014784
$$ -106602 1525374 1560191 1132713 2149795 4305142 5727425 5743543 5126563 4111779
2424D111779k029937l066413l480520l718877l582717j611427K031334M451627
$$ 4111779 2081842 -984571 -4465091 -8183968 -11766685 -13378112 -11346778 -6895151
2416f895151L964788K684199K644865K097371q61072l577032k435051N38621J26329
$$ -6895151 -2930363 -246164 2398701 4496072 3635000 57968 -2377083 -1838462 -1712133
2407a712133l435718m042513R07758O103025N783811J293318k032589k225194
$$ -1712133 -5147851 -9190364 -8282606 -2179581 3604230 4897548 2864959 639765
2399F39765j319357p92736r1168J063593J850973J842747J485117J188907J099637
$$ 639765 -679592 -1472328 -1563496 -499903 1351070 3193817 4678934 5867841 6967478
2390F967478J317920J452781P29795o39016j256908o00202J7120m01724r01631
$$ 6967478 8285398 9738179 10467974 9828958 8572050 7971848 7988968 7587244 6685613
2381F685613m95982j78576j142551k328957k056753j148379j759973l439392l220953
$$ 6685613 6189631 6011055 4868504 2539547 482794 -665585 -2425558 -5864950 -9085903
2372i085903j45534K946313L311313J824268R87721J187518J103998P74819J605242
$$ -9085903 -9231437 -6285124 -2973811 -1149543 -161822 1025696 2129694 2904513 4509755
2363D509755L303730L360420O80043k179619k129814K24952J442919j42343k643852
$$ 4509755 7813485 11173905 11853948 9674329 7544515 7769467 9212386 9070043 6426191
2354F426191l531712k449124o31683P71974R86545k94070k085863k565095j217929
$$ 6426191 2894479 445355 -186328 585646 1572191 1278121 -807742 -3372837 -4590766
2345d590766N89635J789602K728124L284451K046112r91196k956503j631898J150113
$$ -4590766 -4001131 -2211529 516595 3801046 5847158 4855962 1899459 267561 1417674
2336A417674K114022J123343M03279M51301n5860j012648r06762J17160L60309
$$ 1417674 3531696 4655039 5058318 5509619 5453759 4441111 3534349 3651509 4011818
2327D011818l34840o14666n42564j237111j797032l01576K089029K192450L53621
$$ 4011818 3676978 3062312 2519748 1282637 -514395 -815971 1273058 3465508 3819129
2318C819129K44369K099971J465586l001608n799003k449424L297949M778292
$$ 3819129 4063498 6163469 7629055 4627447 -1171556 -3620980 -323031 4455261
2310D455261J584014j540218k442096k803152l011189j245056K244914M435312
$$ 4455261 6039275 4499057 2056961 -746191 -3757380 -5002436 -2757522 1677790
2302A677790L745494J528521q77721l194470m074560j653248K708523M486319
$$ 1677790 5423284 6951805 6074084 2879614 -1194946 -2848194 -139671 4346648
2294D346648J511979k854517l781947o74769K682349K823970K47502j564240l81147
$$ 4346648 5858627 3004110 -777837 -1452606 1229743 4053713 4301215 2736975 2355828
2285B355828J915248J628293j604415l901812k396284Q26859K026969R83692J59796
$$ 2355828 4271076 5899369 4294954 393142 -2003142 -1176283 850686 1834378 1994174
2276A994174L86775O75637J174265K645581L501017J175283l280566n526398l622740
$$ 1994174 2380949 3056586 4230851 6876432 10377449 11552732 8272166 2745768 -876972
2267h76972l44138J046404N22955j69301j20190P34458K098064K906866K234180
$$ -876972 -1221110 -174706 348249 178948 58758 793216 2891280 5798146 8032326
2258H032326R80990P17843Q78990m05973k697572l429875k016632o31764l70688
$$ 8032326 9013316 9731159 10610149 10204176 7506604 4076729 2060097 1428333 1057645
2249A057645j110O81914o3017k170745k783070q04192J075415R27002N83307J676897
$$ 1057645 1056535 1738449 1675432 -495313 -3278383 -4082575 -3007160 -2080158 -1496851 180046
$$ [...]
##END NTUPLES=NMR SPECTRUM
##END=
