##TITLE=31Pdec_DE-82k2_d6
 DMSO, 64 sc
 26.6.2025
##JCAMPDX= 6.0         $$ Bruker NMR JCAMP-DX V2.0
##DATA TYPE= NMR SPECTRUM
##DATA CLASS= NTUPLES
##ORIGIN= UXNMR, Bruker Analytische Messtechnik GmbH
##OWNER= root
$$ XWIN-NMR		Version 3.5
$$ Thu Jun 26 16:28:28 2025 Russian Standard Time (UT+4h)  she@DPX200
##.OBSERVE FREQUENCY= 81.013821
##.OBSERVE NUCLEUS= ^31P
##.ACQUISITION MODE= SIMULTANEOUS
##.ACQUISITION SCHEME= undefined
##.AVERAGES= 64
##.DIGITISER RES= 17
##SPECTROMETER/DATA SYSTEM= spect
##.PULSE SEQUENCE= zgpg30
##.SOLVENT NAME= DMSO
##.SHIFT REFERENCE= (INTERNAL, DMSO, 0, 198.062)
##AUDIT TRAIL= $$ (NUMBER, WHEN, WHO, WHERE, WHAT)
$$ ##TITLE= Audit trail, XWIN-NMR		Version 3.5
$$ ##JCAMPDX= 5.01
$$ ##ORIGIN= Bruker BioSpin GmbH
$$ ##OWNER= she
$$ F:/spectra/data/she/nmr/P31/2/pdata/1/auditp.txt
$$ ##AUDIT TRAIL=  $$ (NUMBER, WHEN, WHO, WHERE, WHAT)
(   1,<2025-06-26 16:27:30.62 +0400>,<she>,<DPX200>,
      <created by zg, POWCHK disabled, PULCHK disabled
       configuration hash MD5:
       00 E9 B6 7A A2 85 ED C7 34 08 36 98 17 FE 4E 26
       data hash MD5: 32K
       36 EE D4 E2 31 F9 36 D8 EC EA 5E 28 0A F3 77 32>)
(   2,<2025-06-26 16:27:33.53 +0400>,<she>,<DPX200>,
      <Start of raw data processing
       efp BC_mod = 2 LB = 1.5 FT_mod = 6 PKNL = 1 PHC0 = 1458.064 PHC1 = -58.50484 SI = 64K 
       data hash MD5: 64K
       3A FC FC CC 90 0D 8F 94 B8 3B 27 7D BE A7 53 3A>)
(   3,<2025-06-26 16:27:52.96 +0400>,<she>,<DPX200>,
      <pk PHC0 = 1.075677 PHC1 = 0 
       data hash MD5: 64K
       1B AF 4F DB E5 2D 87 13 5B 24 77 9F 62 BC F3 D7>)
(   4,<2025-06-26 16:27:58.92 +0400>,<she>,<DPX200>,
      <abs ABSG = 5 
       data hash MD5: 64K
       FD B8 48 4C 8F A4 21 AB 63 C7 EE BB CA 9D 1F 75>)
$$ ##END=
$$ 
$$ hash MD5
$$ F9 A3 50 98 3D A1 E4 35 A9 0C CE DC 4D C3 40 A3
##$RELAX= 
##$RELAX= 
##$RELAX= 
##$RELAX= 
##$RELAX= 
##$RELAX= 
##$RELAX= 
##$RELAX= 
$$ Bruker specific parameters
$$ --------------------------
##$DU= <F:/spectra>
##$EXPNO= 2
##$NAME= <P31>
##$PROCNO= 1
##$TYPE= <nmr>
##$USER= <she>
##$AMP= (0..31)
100 100 100 100 100 100 100 100 100 100 100 100 100 100 100 100 100 100 
100 100 100 100 100 100 100 100 100 100 100 100 100 100 
##$AQSEQ= 0
##$AQ_mod= 1
##$AUNM= <au_zg>
##$AUTOPOS= <>
##$BF1= 81.014009
##$BF2= 200.13
##$BF3= 200.13
##$BF4= 200.13
##$BF5= 200.13
##$BF6= 200.13
##$BF7= 200.13
##$BF8= 200.13
##$BYTORDA= 1
##$CFDGTYP= 0
##$CFRGTYP= 5
##$CHEMSTR= <none>
##$CNST= (0..31)
1 1 145 1 1 1 1 1 1 1 1 1 1 1 1 1 1 1 1 1 1 1 1 1 1 1 1 1 1 1 1 1 
##$CPDPRG= <waltz16>
##$CPDPRG1= <>
##$CPDPRG2= <waltz16>
##$CPDPRG3= <>
##$CPDPRG4= <mlev>
##$CPDPRG5= <mlev>
##$CPDPRG6= <mlev>
##$CPDPRG7= <mlev>
##$CPDPRG8= <mlev>
##$CPDPRGB= <>
##$CPDPRGT= <>
##$D= (0..31)
0 1 0 0 0 0 0 0 0 0.06 0 0.03 2e-05 3e-06 0 0 0.0002 0 0 0 0 0 0 0 0 0 
0 0 0 0 0 0 
##$DATE= 1750940850
##$DBL= (0..7)
120 120 120 11 120 120 24 19 
##$DBP= (0..7)
150 150 150 150 150 150 150 150 
##$DBP07= 0
##$DBPNAM0= <>
##$DBPNAM1= <>
$$ [...]
##$SUBNAM3= <"">
##$SUBNAM4= <"">
##$SUBNAM5= <"">
##$SUBNAM6= <"">
##$SUBNAM7= <"">
##$SUBNAM8= <"">
##$SUBNAM9= <"">
##$SW= 400.765351723535
##$SWIBOX= (0..15)
0 1 3 0 0 0 0 0 0 0 0 0 0 0 0 0 
##$SW_h= 32467.5324675325
##$TD= 32768
##$TD0= 1
##$TE= 0
##$TE2= 300
##$TE3= 300
##$TEG= 300
##$TL= (0..7)
0 120 53 12 22 120 120 120 
##$TP= (0..7)
150 150 150 150 150 150 150 150 
##$TP07= 0
##$TPNAME0= <>
##$TPNAME1= <>
##$TPNAME2= <>
##$TPNAME3= <>
##$TPNAME4= <>
##$TPNAME5= <>
##$TPNAME6= <>
##$TPNAME7= <>
##$TPOAL= (0..7)
0.5 0.5 0.5 0.5 0.5 0.5 0.5 0.5 
##$TPOFFS= (0..7)
0 0 0 0 0 0 0 0 
##$TUNHIN= 0
##$TUNHOUT= 0
##$TUNXOUT= 0
##$USERA1= <user>
##$USERA2= <user>
##$USERA3= <user>
##$USERA4= <user>
##$USERA5= <user>
##$V9= 5
##$VALIST= <valist>
##$VCLIST= <CCCCCCCCCCCCCCC>
##$VD= 0
##$VDLIST= <DDDDDDDDDDDDDDD>
##$VPLIST= <PPPPPPPPPPPPPPP>
##$VTLIST= <TTTTTTTTTTTTTTT>
##$WBST= 1024
##$WBSW= 4
##$XGAIN= (0..3)
0 0 0 0 
##$XL= 0
##$YL= 0
##$YMAX_a= 3847
##$YMIN_a= -4516
##$ZGOPTNS= <>
##$ZL1= 120
##$ZL2= 120
##$ZL3= 120
##$ZL4= 120
##$ABSF1= 198.0616
##$ABSF2= -202.7028
##$ABSG= 5
##$ABSL= 3
##$ALPHA= 0
##$AQORDER= 0
##$ASSFAC= 0
##$ASSFACI= 0
##$ASSFACX= 0
##$ASSWID= 0
##$AUNMP= <proc_1d>
##$AZFE= 0.1
##$AZFW= 0.5
##$BCFW= 0
##$BC_mod= 2
##$BYTORDP= 0
##$COROFFS= 0
##$CY= -3
##$DATMOD= 1
##$DC= 0
##$DFILT= <>
##$DTYPP= 0
##$F1P= 0
##$F2P= 0
##$FCOR= 1
##$FTSIZE= 65536
##$FT_mod= 6
##$GAMMA= 0
##$GB= 0
##$INTBC= 1
##$INTSCL= 9.790993e-09
##$ISEN= 30
##$LB= 1.5
##$LEV0= 0
##$LPBIN= 0
##$MAXI= 10000
##$MC2= 0
##$MEAN= 0
##$ME_mod= 0
##$MI= 50
##$NCOEF= 0
##$NC_proc= -9
##$NLEV= 6
##$NOISF1= 182.463
##$NOISF2= 159.3651
##$NSP= 0
##$NTH_PI= 0
##$NZP= 0
##$OFFSET= 198.0616
##$PC= 4
##$PHC0= 1459.14
##$PHC1= -58.50484
##$PH_mod= 1
##$PKNL= yes
##$PPARMOD= 0
##$PSCAL= 0
##$PSIGN= 0
##$REVERSE= no
##$SF= 81.0140089999434
##$SI= 65536
##$SIGF1= 159.3651
##$SIGF2= -187.1042
##$SINO= 113.3802
##$SIOLD= 16384
##$SREGLST= <1H.CDCl3>
##$SSB= 0
##$STSI= 65536
##$STSR= 0
##$SW_p= 32467.5324675325
##$SYMM= 0
##$S_DEV= 0
##$TDeff= 32768
##$TDoff= 0
##$TI= <>
##$TILT= no
##$TM1= 0
##$TM2= 0
##$TOPLEV= 0
##$USERP1= <user>
##$USERP2= <user>
##$USERP3= <user>
##$USERP4= <user>
##$USERP5= <user>
##$WDW= 1
##$XDIM= 65536
##$YMAX_p= 496340112
##$YMIN_p= -183462274
$$ End of Bruker specific parameters
$$ ---------------------------------
##NTUPLES= NMR SPECTRUM
##VAR_NAME=  FREQUENCY,     SPECTRUM/REAL,   SPECTRUM/IMAG
##SYMBOL=    X,             R,               I
##VAR_TYPE=  INDEPENDENT,   DEPENDENT,       DEPENDENT
##VAR_FORM=  AFFN,          ASDF,            ASDF
##VAR_DIM=   65536,         65536,           65536
##UNITS=     HZ,            ARBITRARY UNITS, ARBITRARY UNITS
##FACTOR=    0.49542278885378, 1,            1
##FIRST=     16045.7642231865, 0,            0
##LAST=      -16421.768244346, 0,            0
##MIN=       -16421.768244346, -183462274,   0
##MAX=       16045.7642231865, 496340112,    0
$$ Real data points
##PAGE= N=1
##DATA TABLE= (X++(R..R)), XYDATA
$$ [...]
$$ plain form
7385 4088168 4164673 5360761 9231556 14300692 17918589 18789208 18021899 18075521 20232475
7376 20232475 23031121 23844573 21936063 18962782 16503338 14519352 12588106 10963521
7368 10963521 9542142 7447429 4956912 4175000 5854389 7003891 4367890 -391375
7360 -391375 -1963976 2057997 8725715 14227966 17741645 19688922 19349954 16426435 12596724
7351 12596724 9033293 4233432 -3098717 -10541035 -14059535 -12594666 -8171381 -2730398
7343 -2730398 2491470 5834438 6793091 7807775 11030607 14070749 12799872 7860123
7335 7860123 3957084 2721006 1407157 -382702 1503917 8438496 14645062 14529795
7327 14529795 10771060 10295873 14425057 17732388 15613947 8832212 1056247 -4345773
$$ packed form
7385D088168P6505J196088L870795N069136L617897Q70619p67309N3622K156954
7376B0232475K798646Q13452j908510k973281k459444j983986j931246j624585
7368A0963521j421379k094713k490517p81912J679389J149502k636001m759265
7360c91375j572601M021973O667718N502251L513679J947277l38968k923519l829711
7351A2596724l563431m799861p332149p442318l518500J464869M423285N440983
7343b730398N221868L342968R58653J014684L222832L040142j270877m939749
7335G860123l903039j236078j313849j789859J886619O934579O206566j15267
7327A4529795l758735m75187M129184L307331k118441o781735p775965n402020
$$ plain form
7319 -4345773 -5052389 -663179 6428195 12943952 17529798 20302882 20787335 18615892 15368376
7310 15368376 13086016 11366938 8165692 2912406 -3249485 -9396350 -14701832 -17626875
7302 -17626875 -18030565 -18827561 -22177232 -25092411 -22826084 -16058227 -10256389 -7790153
7294 -7790153 -5540859 -1464212 1367624 -331707 -5112133 -9507201 -12282657 -12951754
7286 -12951754 -9322435 -646501 8600041 12177481 8894547 3043046 -1317084 -3530865
7278 -3530865 -4287267 -3867759 -3229131 -3925549 -5290326 -3653664 3462119 13139889 19230447
7269 19230447 19138023 16845891 18051531 23366279 28089069 28221789 24283902 18768295 12823289
7260 12823289 7360011 4704509 5836096 7606814 6435698 3877028 4423738 7981051
$$ packed form
7319d345773p06616M389210P091374O515757M585846K773084M84453k171443l247516
7310A5368376k282360j719078l201246n253286o161891o146865n305482k925043
7302a7626875m03690p96996l349671k915179K266327O767857N801838K466236
7294g790153K249294M076647K831836j699331m780426m395068k775456o69097
7286a2951754L629319Q675934R246542L577440l282934n851501m360130k213781
7278c530865p56402M19508O38628o96418j364777J636662P115783R677770O090558
7269A9230447r2424k292132J205640N314748M722790J32720l937887n515607n945006
7260A2823289n463278k655502J131587J770718j171116k558670N46710L557313
$$ plain form
7252 7981051 9082294 4535251 -2495616 -7713665 -10837235 -13130466 -13702461 -11600151
7244 -11600151 -8586405 -6360389 -3601702 557522 2685864 -628373 -6087026 -6445074
7236 -6445074 15919 7338756 9966473 8790204 7642662 7522219 6907611 5492575 4896483
7227 4896483 6443608 9686434 12390276 11460334 5689967 -1235797 -2525937 4652399
7219 4652399 14988730 20267332 18257448 13986373 12440207 13194919 13459697 13250967 14408701
7210 14408701 16060773 14945193 10507245 6264033 4885545 4929664 4276633 3806989 4783170
7201 4783170 5103357 2118859 -2287634 -3877248 -2823224 -3581198 -7429429 -9974365 -7955787
7192 -7955787 -4187079 -2829115 -3240472 -2044405 1146599 3740369 4441048 4198372 3652177
$$ packed form
7252G981051J101243m547043p030867n218049l123570k293231n71995K102310
7244a1600151L013746K226016K758687M159224K128342l314237n458653l58048
7236f445074O460993P322837K627717j176269j147542j20443o14608j415036n96092
7227D896483J547125L242826K703842r29942n770367o925764j290140P178336
7219D652399J0336331N278602k009884m271075j546166P54712K64778k08730J157734
7210A4408701J652072j115580m437948m243212j378488M4119o53031m69644R76181
7201D783170L20187k984498m406493j589614J054024p57974l848231k544936K018578
7192g955787L768708J357964m11357J196067L191004K593770P00679k42676n46195
$$ plain form
7183 3652177 2354954 110166 -2850573 -6242750 -8713781 -7917907 -3619577 724757
7175 724757 1646355 -502076 -3443325 -6656925 -10252386 -12084846 -9886539 -5505870 -3364607
7166 -3364607 -4901984 -7713829 -9816247 -11351386 -12196060 -11515937 -10211981 -10529850 -12453334
7157 -12453334 -13384137 -12210762 -11011716 -11831481 -14060278 -15661860 -14993004 -11409607 -6417047
7148 -6417047 -3713540 -4887575 -5595132 -399970 8186380 10585575 2039303 -10896886
7140 -10896886 -18414499 -17902993 -13198452 -7606551 -2455978 77376 -1886499 -6469043
7132 -6469043 -9689246 -10281507 -9638344 -7785031 -3380110 2176784 4503850 1242770 -5442655
7123 -5442655 -12175578 -17348322 -19723082 -17222522 -9731009 -1398845 2687307 1845614
$$ packed form
7183C652177j297223k244788k960739l392177k471031P95874M298330M344334
7175G24757R21598k148431k941249l213600l595461j832460K198307M380669K141263
7166c364607j537377k811845k102418j535139q44674O80123J303956l17869j923484
7157a2453334r30803J173375J199046q19765k228797j601582O68856L583397M992560
7148f417047K703507j174035p07557N195162Q586350K399195q546272j2936189
7140a0896886p517613N11506M704541N591901N150573K533354j963875m582544
7132f469043l220203n92261O43163J853313M404921N556894K327066l261080o685425
7123e442655o732923n172744k374760K500560P491513Q332164M086152q41693
$$ plain form
7115 1845614 -273214 -1038962 -1775280 -4255410 -6380959 -4247365 1604139 5181425 2166504
7106 2166504 -4226731 -7462085 -6282637 -5087856 -5921332 -5027965 527594 7139517 9297468
7097 9297468 7042897 4517648 3015769 350014 -3600758 -5885543 -5712201 -5920728 -7591805
7088 -7591805 -7595441 -4071369 -306547 532670 1218013 6125205 12994427 14700238 9314378
7079 9314378 2880667 389219 -978729 -6019705 -12701232 -14340176 -9285200 -3364345
7071 -3364345 -1978739 -3820269 -4216187 -1635377 1650727 3567031 4258545 4662933 4975785
7062 4975785 4590496 2627918 -1293102 -6386619 -11335380 -15575288 -18686753 -18740720 -13911068
7053 -13911068 -6629136 -2929489 -5305856 -9006303 -8599572 -5574743 -4962327 -6336344
$$ packed form
7115A845614k118828p65748p36318k480130k125549K133594N851504L577286l014921
7106B166504o393235l235354J179448J194781q33476Q93367N555559O611923K157951
7097I297468k254571k525249j501879k665755l950772k284785J73342k08527j671077
7088g591805l636L524072L764822Q39217O85343M907192O869222J705811n385860
7079I314378o433711k491448j367948n040976o681527j638944N054976N920855
7071c364345J385606j841530l95918K580810L286104J916304O91514M04388L12852
7062D975785l85289j962578l921020n093517m948761m239908l111465n3967M829652
7053a3911068P281932L699647k376367l700447M06731L024829O12416j374017
$$ plain form
7045 -6336344 -4176011 2582859 7411397 4947299 -1813525 -6201113 -6141109 -4386109 -3418603
7036 -3418603 -3852740 -5860890 -8427734 -8516601 -4593403 -77833 368256 -2447711 -3131987
7027 -3131987 252655 2906653 -104371 -6800504 -10457048 -7520152 -1042902 3344236
7019 3344236 2935036 -685469 -3909936 -3737325 512112 6206500 8413734 4209358 -3055643
7010 -3055643 -5944246 -1486308 4085555 2216914 -7094955 -15046338 -15037064 -9826265 -5857544
7001 -5857544 -4463297 -2490137 820208 2432314 927845 -737158 607796 3841767
6993 3841767 4992667 2135087 -2490271 -4902453 -3005341 2256293 8511930 13704900
6985 13704900 16188837 14743888 10109743 5652720 4501408 6371419 9042731 11870232
$$ packed form
7045f336344K160333O758870M828538k464098o760824m387588O0004J755000R67506
7036c418603m34137k008150k566844q8867L923198M515570M46089k815967o84276
7027c131987L384642K653998l011024o696133l656544K936896O477250M387138
7019C344236m09200l620505l224467J72611M249437N694388K207234m204376p265001
7010c055643k888603M457938N571863j868641r311869p951383R274N210799L968721
7001e857544J394247J973160L310345J612106j504469j665003J344954L233971
6993C841767J150900k857580m625358k412182J897112N261634O255637N192970
6985A3704900K483937j444949m634145m457023j151312J870011K671312K827501
$$ plain form
6977 11870232 14743964 14706589 8762902 721322 -831276 5610880 10317713 4942158
6969 4942158 -5457473 -9598514 -5882149 -3065184 -5944614 -8977314 -6322806 -908120
6961 -908120 862913 -1506966 -3391806 -2349263 -217201 617178 -567722 -3477867 -6621446
6952 -6621446 -7045325 -3161855 2126232 3734351 494813 -3201928 -3062234 -365248 443478
6943 443478 -1162853 -381988 5849295 13367997 15902920 14075933 14283308 18222109 19310569
6934 19310569 12440434 2079272 -4225590 -6368130 -9318255 -12691480 -10301429 -422717
6926 -422717 10350599 15485090 15356658 13433732 10342359 4603841 -4198541 -15355753
6918 -15355753 -27091669 -35098624 -34800619 -27254442 -19241334 -15316490 -13509578 -11143137
$$ packed form
6977A1870232K873732l7375n943687q041580j552598O442156M706833n375555
6969D942158j0399631m141041L716365K816965k879430l032700K654508N414686
6961i08120J771033k369879j884840J042543K132062Q34379j184900k910145l143579
6952f621446m23879L883470N288087J608119l239538l696741J39694K696986Q08726
6943D43478j606331P80865O231283P518702K534923j826987K07375L938801J088460
6934A9310569o870135j0361162o304862k142540k950125l373225K390051R878712
6926d22717J0773316N134491j28432j922926l091373n738518q802382j1157212
6918a5355753j1735916q006955K98005P546177Q013108L924844J806912K366441
$$ plain form
6910 -11143137 -10212914 -13069477 -16744715 -16606322 -13191051 -10616668 -10046343 -9491740 -8700171
6901 -8700171 -9067005 -9019830 -4672096 3698481 9826150 8119983 -122131 -8500568 -11736453
6892 -11736453 -9103942 -3368398 2067339 5297282 6315586 6203651 6393568 7913013
6884 7913013 9814300 8800677 2732442 -5418917 -9918243 -9102815 -6714131 -5690500
6876 -5690500 -4810154 -3296527 -3878511 -7609428 -9874447 -6365782 222656 4656727 7414521
6867 7414521 12387757 18395757 20067856 16915442 14580556 15781880 16146724 11289068
6859 11289068 3035956 -3790476 -6538079 -4508372 2032856 9680453 12402972 7760991
6851 7760991 428804 -3175075 -1901262 572771 1063567 -659828 -3246369 -5376491
$$ packed form
6910a1143137R30223k856563l675238J38393L415271K574383N70325N54603P91569
6901h700171l66834M7175M347734Q370577O127669j706167q242114q378437l235885
6892a1736453K632511N735544N435737L229943J018304j11935J89917J519445
6884G913013J901287j013623o068235q151359m499326Q15428K388684J023631
6876e690500Q80346J513627n81984l730917k265019L508665O588438M434071K757794
6867G414521M973236O008000J672099l152414k334886J201324L64844m857656
6859A1289068q253112o826432k747603K029707O541228P647597K722519m641981
6851G760991p332187l603879J273813K474033M90796j723395k586541k130122
$$ plain form
6843 -5376491 -6603442 -7495566 -8105411 -6697463 -2463883 651150 -3239962 -13763897
6835 -13763897 -22389272 -21316279 -12016911 -2877339 -595847 -5881700 -15057626 -22903624
6827 -22903624 -25287249 -21779406 -15694248 -10745435 -8439054 -8501784 -9481213 -8764120 -5178178
6818 -5178178 -2088333 -3993706 -9121076 -10396231 -5915935 -2757898 -6401532 -11881552
6810 -11881552 -11322337 -5750932 -2022534 -944622 2992873 10699881 15911492 15227430
6802 15227430 13293942 14905284 18096735 18909151 17824005 16799294 13888810 6313817
6794 6313817 -3045639 -7424978 -4357266 1685603 5234241 5438146 4896120 5215285 5489483
6785 5489483 4642482 3979590 6483745 13144174 20551959 23437078 19925664 13258922 7857575
$$ packed form
6843e376491j226951q92124o09845J407948M233580L115033l891112j0523935
6835a3763897q625375J072993R299368R139572K281492n285853r175926p845998
6827b2903624k383625L507843O085158M948813K306381o2730r79429P17093L585942
6818e178178L089845j905373n127370j275155M480296L158037l643634n480020
6810a1881552N59215N571405L728398J077912L937495P707008N211611o84062
6802A5227430j933488J611342L191451Q12416j085146j024711k910484p574993
6794F313817r359456m379339L067712O042869L548638K03905n42026L19165K74198
6785E489483q47001o62892K504155O660429P407785K885119l511414o666742n401347
$$ plain form
6776 7857575 4746955 1683087 -3005021 -7960377 -10366885 -9219802 -6146254 -2768675
6768 -2768675 1499502 7386765 12314858 12259713 8054482 6339019 11439633 18995055 21368898
6759 21368898 17462588 12769261 10874380 10023372 8220671 6520795 5837536 4986848 3838308
6750 3838308 4492515 7299563 9474781 9855067 11141211 14724306 17202708 15537297 12153391
6741 12153391 10754436 10018930 6327132 849500 -1214755 2059579 7101517 9806635
6733 9806635 9054493 5485147 449538 -3597799 -4932427 -5216854 -7680549 -12581185 -16925356
6724 -16925356 -18330916 -16608428 -12377583 -7290029 -4638642 -5736430 -6266063 -876900
6716 -876900 8493050 13965716 12318302 8899218 8950495 10286746 7990188 2064364 -3658094
$$ packed form
6776G857575l110620l063868m688108m955356k406508J147083L073548L377579
6768b768675M268177N887263M928093n5145m205231j715463N100614P555422K373843
6759B1368898l906310m693327j894881q51008j802701j699876o83259q50688j148540
6750C838308O54207K807048K175218L80286J286144L583095K478402j665411l383906
6741A2153391j398955p35506l691798n477632k064255L274334N041938K705118
6733I806635p52142l569346n035609m047337j334628k84427k463695m900636m344171
6724a6925356j405560J722488M230845N087554K651387j097788n29633N389163
6716h76900R369950N472666j647414l419084N1277J336251k296558n925824n722458
$$ plain form
6707 -3658094 -7034103 -8077233 -6666327 -3865429 -3187988 -6276339 -9231569 -7668104
6699 -7668104 -3727481 -2997180 -5452845 -5302576 -393436 4054698 3369343 139332 -518709
6690 -518709 1305510 1873102 1094035 3133164 9308981 14714445 14245533 9397695 5934736
6681 5934736 5818087 5058788 412092 -5241359 -6962048 -4924224 -3558842 -4342275 -4006445
6672 -4006445 -584791 3526836 6519197 10260975 14810294 14515656 5513512 -5685264
6664 -5685264 -8091194 -173356 8731162 11487126 10727619 11164399 11306779 7759015 2956610
6655 2956610 2546965 7074917 11288395 10850548 5960393 -562063 -4929751 -3127805 5557419
6646 5557419 15490428 19017096 14843680 9352471 9001776 14064857 20263985 23465555
$$ packed form
6707c658094l376009j043130J410906K800898O77441l088351k955230J563465
6699g668104L940623P30301k455665J50269M909140M448134o85355l230011o58041
6690e18709J824219N67592p79067K039129O175817N405464m68912m847838l462959
6681E934736j16649p59299m646696n653451j720689K037824J365382p83433L35830
6672d006445L421654M111627K992361L741778M549319k94638r002144j1198776
6664e685264k405930P917838Q904518K755964p59507M36780J42380l547764m802405
6655B956610m09645M527952M213478m37847m890155o522456m367688J801946Q685224
6646E557419R933009L526668m173416n491209l50695N063081O199128L201570
$$ plain form
6638 23465555 21709638 15632713 8767667 5321593 5869485 6750540 4859618 1019800
6630 1019800 -2783642 -6979242 -12527424 -17123657 -16683786 -10613708 -3020008 1836779
6622 1836779 3389084 3556311 3521957 2865600 998285 -1548194 -3156278 -2390406 235647
6613 235647 1822116 -690894 -7490882 -15490597 -20851065 -21346967 -16881851 -9411958 -2685125
6604 -2685125 -161076 -1761278 -3588182 -2086078 2229830 6237654 8335886 9392424
6596 9392424 10282126 10744027 10837669 11381102 12230838 11988991 10274732 8240669 5420908
6587 5420908 -1655170 -14782821 -28912212 -34985198 -28916648 -15929925 -5220102 -1865790
6579 -1865790 -4651005 -9804751 -14746332 -18561170 -20713228 -20451880 -17523190 -13035214
$$ packed form
6638B3465555j755917o076925o865046l446074N47892Q81055j890922l839818
6630A019800l803442m195600n548182m596233M39871O070078P593700M856787
6622A836779J552305J67227l4354o56357j867315k546479j608084P65872K626053
6613B35647J586469k513010o799988p999715n360468m95902M465116P469893O726833
6604b685125K524049j600202j826904J502104M315908M007824K098232J056538
6596I392424Q89702M61901R3642N43433Q49736k41847j714259k034063k819761
6587E420908p076078j3127651j4129391o072986O068550J2986723J0709823L354312
6579a865790k785215n153746m941581l814838k152058K61348K928690M487976
$$ plain form
6571 -13035214 -8967147 -6462159 -5117088 -4381679 -4656913 -5882023 -6220420 -4444403 -3178685
6562 -3178685 -6699294 -14572672 -20357794 -18702652 -11704971 -5794870 -3841073 -3345826
6554 -3345826 -1784353 -277195 -1024620 -3648064 -5808331 -6152179 -5058139 -3055946 57046
6545 57046 4355728 8832184 11710282 11589558 8200992 2266547 -4917061 -11479099 -15086467
6536 -15086467 -14115521 -9131043 -2714557 2417970 4843980 4491974 2608557 1674101 3506360
6527 3506360 6584540 6935964 3029453 -1698229 -2920341 -688625 1641230 2790600
6519 2790600 4794383 8455368 10452571 6956644 -1015061 -7715524 -8327109 -3610495
6511 -3610495 1634786 4316834 5827071 8019655 8146029 1576097 -9668847 -15549260
$$ packed form
6571a3035214M068067K504988J345071P35409k75234j225110l38397J776017J265718
6562c178685l520609p873378n785122J655142O997681N910101J953797M95247
6554c345826J561473J507158p47425k623444k160267l43848J094040K002193L112992
6545E7046M298682M476456K878098j20724l388566n934445p183608o562038l607368
6536a5086467R70946M984478O416486N132527K426010l52006j883417r34456J832259
6527C506360L078180L51424l906511m727682j222112K231716K329855J149370
6519B790600K003783L660985J997203l495927p971705o700463o11585M716614
6511c610495N245281K682048J510237K192584J26374o569932j1244944n880413
$$ plain form
6503 -15549260 -9042061 3935433 10496398 6015179 -1519649 -2984635 1102117 3773231
6495 3773231 1541152 -2808677 -5376330 -5173767 -3195294 -368502 2811601 6029468
6487 6029468 9069564 11495285 12637227 12382441 11378946 9758378 6307724 -40529
6479 -40529 -8009185 -14108823 -15439544 -12430323 -8554398 -6770178 -6335859 -4292516 -176967
6470 -176967 2951851 3263508 3053616 4376835 4830535 1936082 -874243 1215512 5086089
6461 5086089 2468142 -6985473 -13508011 -11324117 -7018826 -8367651 -12008661 -10021896
6453 -10021896 -3401052 352506 -42377 735526 3211526 1473021 -5518769 -10181563
6445 -10181563 -7338540 -1517953 754716 -452053 -1806760 -2705762 -3128376 -788931
$$ packed form
6503a5549260O507199J2977494O560965m481219p534828j464986M086752K671114
6495C773231k232079m349829k567653K02563J978473K826792L180103L217867
6487F029468L040096K425721J141942k54786j003495j620568l450654o348253
6479d0529p968656o099638j330721L009221L875925J784220M34319K043343M115549
6470a76967L128818L11657k09892J323219M53700k894453k810325K089755L870577
6461E086089k617947r453615o522538K183894M305291j348825l641010J986765
6453a0021896O620844L753558l94883P77903K476000j738505o991790m662794
6445a0181563K843023N820587K272669j206769j354707q99002m22614K339445
$$ plain form
6437 -788931 4234423 6593452 2973575 -2003852 -3393548 -5133796 -13536068 -24322183
6429 -24322183 -25894543 -15999379 -5972965 -5566714 -11418495 -14919997 -14623438 -14529457 -14888268
6420 -14888268 -12428159 -8133238 -7637213 -12864155 -18477182 -18510251 -12927806 -5862229 -463657
6411 -463657 2332414 2388362 416465 -1762016 -3182222 -5130763 -8700866 -11783616 -10723731
6402 -10723731 -4872793 2312731 6691023 6376389 1740205 -4965960 -9452028 -7475509
6394 -7475509 1086436 11423811 18218532 19878015 17958889 14594698 11909490 11663484
6386 11663484 12949672 11674900 4952149 -4868480 -12738289 -16178726 -15582010 -11282165
6378 -11282165 -4350208 1051678 1413163 118242 4273774 13753989 19235886 14463442
$$ packed form
6437g88931N023354K359029l619877m977427j389696j740248q402272j0786115
6429b4322183j572360R895164J0026414M06251n851781l501502K96559R3981l58811
6420a4888268K460109M294921M96025n226942n613027l3069N582445P065577N398572
6411d63657K796071N5948j971897k178481j420206j948541l570103l082750J059885
6402a0723731N850938P185524M378292l14634m636184o706165m486068J976519
6394g475509Q561945J0337375O794721J659483j919126l364191k685208k46006
6386A1663484J286188j274772o722751r820629p869809l440437N96716M299845
6378a1282165O931957N401886L61485j294921M155532R480215N481897m772444
$$ plain form
6370 14463442 5277174 1635776 4723912 7929845 7968148 8024376 10087366 10843879 7336964
6361 7336964 2024957 -479376 1270032 5541827 10101042 12785726 11557615 6341185
6353 6341185 -137984 -4769715 -6578675 -6424205 -5771123 -6304901 -8735171 -10983297 -9651969
6344 -9651969 -4672866 -402291 -226326 -1982664 -1214102 2388593 4757016 3293851 92136
6335 92136 -1279062 72887 2560435 4783897 6388884 7045466 6287607 4589719 3409794
6326 3409794 3502459 3975858 3915831 4228405 6234423 8513052 7398141 1823467 -4246999
6317 -4246999 -6267063 -4647149 -3360769 -3889579 -3614418 -355005 4417764 7752518 8278722
6308 8278722 6319922 3225137 1441382 2881918 6026495 6747749 3156791 -2405353
$$ packed form
6370A4463442r186268l641398L088136L205933L8303N6228K062990P56513l506915
6361G336964n312007k504333J749408M271795M559215K684684j228111n216430
6353F341185o479169m631731j808960J54470O53082n33778k430270k248126J331328
6344i651969M979103M270575J75965j756338P68562L602695K368423j463165l201715
6335I2136j371198J351949K487548K223462J604987O56582p57859j697888j179925
6326C409794R2665M73399o0027L12574K006018K278629j114911n574674o070466
6317d246999k020064J619914J286380n28810K75161L259413M772769L334754N26204
6308H278722j958800l094785j783755J440536L144577P21254l590958n562144
$$ plain form
6300 -2405353 -6988259 -9963032 -11273275 -10103667 -7368885 -6342760 -8021489 -8620732
6292 -8620732 -4740763 1606791 6504426 9960008 14087401 17808101 18403650 17071943
6284 17071943 17743194 20652430 21851948 19200220 14427038 9227854 3889470 22487
6276 22487 -147717 2054385 2800336 1559983 1231139 2177918 1666253 34399 1186562
6267 1186562 5306369 7722271 7459312 9691615 15895418 18949586 13500620 4551868
6259 4551868 -609681 -2676740 -5055896 -4554880 3074672 12668434 15237739 11475816
6251 11475816 9114467 8611698 3412866 -5196017 -6321000 3708166 14121311 15195654
6243 15195654 11436856 12213326 17124950 19011048 16087231 12721601 11187054 9768553
$$ packed form
6300b405353m582906k974773j310243J169608K734782J026125j678729n99243
6292h620732L879969O347554M897635L455582M127393L720700N95549j331707
6284A7071943O71251K909236J199518k651728m773182n199184n338384l866983
6276B2487j70204K202102P45951j240353l28844R46779n11665j631854J152163
6267A186562M119807K415902k62959K232303O203803L054168n448966q948752
6259D551868n161549k067059k379156N01016P629552R593762K569305l761923
6251A1475816k361349n02769n198832q608883j124983J0029166J0413145J074343
6243A5195654l758798P76470M911624J886098k923817l365630j534547j418501
$$ plain form
6235 9768553 7326708 4282796 741100 -2234906 -2116857 350724 -507033 -7458294 -14647834
6226 -14647834 -15363275 -11945593 -11329308 -13680109 -13293612 -9509331 -8692674 -14643908 -23711562
6217 -23711562 -30654216 -33690490 -32671970 -27739706 -21328166 -16869606 -14333198 -11224301
6209 -11224301 -8170757 -8285944 -10536223 -9825374 -5113098 -1187288 -96969 2565969
6201 2565969 9081228 13588369 10246314 2754449 -725143 647626 338797 -4701578
6193 -4701578 -9396820 -8066738 -2084432 2457109 2547414 1409773 3966612 10264966 14652674
6184 14652674 12398814 6038210 2734890 5537451 10303421 11946543 10333900 8378859
6176 8378859 7543499 7626891 8315908 8355815 5633848 886937 -1001330 3365081 10829810
$$ packed form
6235I768553k441845l043912l541696k976006J18049K467581q57757o951261p189540
6226a4647834p15441L417682O16285k350801L86497L784281Q16657n951234r067654
6217b3711562o942654l036274J018520M932264O411540M458560K536408L108897
6209a1224301L053544j15187k250279P10849M712276L925810J090319K662938
6201B565969O515259M507141l342055p491865l479592J372769l08829n040375
6193d701578m695242J330082N982306M541541R0305j137641K556839O298354M387708
6184A4652674k253860o360604l303320K802561M765970J643122j612643j955041
6176H378859q35360Q3392O89017L9907k721967m746911j888267M366411P464729
$$ plain form
6167 10829810 15604606 16659393 17554186 20083242 22200400 22154398 20848658 19328463 17038065
6158 17038065 13756091 10903775 9583192 8845882 7039912 4005798 1299739 804596
6150 804596 3280088 7736681 12184287 15120308 15813349 13378330 7309860 -363638 -5389321
6141 -5389321 -5365195 -2322368 76612 670839 938120 2547691 6178758 11180486 15007918
6132 15007918 14899661 11666207 9459121 9809737 8809993 3271542 -3134065 -4120094 727119
6123 727119 6316332 9664522 12064745 13957262 13052945 8877385 4754141 3260851 2934646
6114 2934646 1300419 -1394877 -2978000 -1819684 2365246 8107423 12152788 12220456 10060261
6105 10060261 9213692 9865021 9225216 6972208 5985871 6791770 6018893 2487981 350991
$$ packed form
6167A0829810M774796J054787Q94793K529056K117158m6002j305740j520195k290398
6158A7038065l281974k852316j320583p37310j805970l034114k706059m95143
6150H04596K475492M456593M447606K936021O93041k435019o068470p673498n025683
6141e389321K4126L042827K398980N94227K67281J609571L631067N001728L827432
6132A5007918j08257l233454k207086L50616r99744n538451o405607r86029M847213
6123G27119N589213L348190K400223J892517r04317m175560m123244j493290l26205
6114B934646j634227k695296j583123J158316M184930N742177M045365O7668k160195
6105A0060261q46569O51329o39805k253008r86337Q05899p72877l530912k136990
$$ plain form
6096 350991 3051956 7983019 10931848 12746666 17162022 23941891 28703603 28835306 25666396
6087 25666396 21000559 15303319 10017362 8345876 11810573 17621283 21215540 21068259
6079 21068259 19901223 20899109 23569379 24640236 23093239 22023694 23666736 24737080
6071 24737080 20321062 11417596 4149891 1279581 -557119 -3752905 -5147793 -1717554
6063 -1717554 3553618 5668486 4310345 2389480 752011 -1042033 -1018859 2799336 7391980
6054 7391980 7313117 2150073 -3047892 -4850343 -4720872 -4972525 -5704500 -6589180 -7882205
6045 -7882205 -8573169 -6905045 -3753348 -2259886 -3071426 -3150439 -509612 3056844 5473358
6036 5473358 7674707 11588647 17117625 22586452 26103679 25557898 19910573 11693887
$$ packed form
6096C50991K700965M931063K948829J814818M415356O779869M761712J31703l168910
6087B5666396m665837n697240n285957j671486L464697N810710L594257j47281
6079B1068259j167036R97886K670270J070857j546997j069545J643042J070344
6071B4737080m416018q903466p267705k870310j836700l195786j394888L430239
6063a717554N271172K114868j358141j920865j637469j794044K3174L818195M592644
6054G391980p8863n163044n197965j802451J29471k51653p31975q84680j293025
6045g882205o90964J668124L151697J493462q11540p9013K640827L566456K416514
6036E473358K201349L913940N528978N468827L517227n45781n647325q216686
$$ plain form
6028 11693887 5477036 2488869 -387737 -4887539 -8102386 -7211532 -4077035 -2001812
6020 -2001812 -831308 970063 1780020 -1060199 -5726791 -7167443 -4034335 -391867
6012 -391867 254954 -876561 -977249 147352 1232944 3036143 7986681 16293664 23851976
6003 23851976 25030012 18067418 7768754 1986419 4612096 12381616 18799043 19938303
5995 19938303 15787270 8236249 268595 -4289562 -3663178 -905894 -969350 -4550373 -7511667
5986 -7511667 -7054398 -5467757 -6167464 -8651609 -9803488 -8484569 -6255550 -4538421 -3635729
5977 -3635729 -4170388 -6915813 -10698692 -12395064 -9832548 -3522826 4803617 13765001
5969 13765001 21600070 25568783 23996843 18424019 12029232 6096174 18551 -4810117
$$ packed form
6028A1693887o216851k988167k876606m499802l214847Q90854L134497K075223
6020b001812J170504J801371Q09957k840219m666592j440652L133108L642468
6012c91867O46821j131515j00688J124601J085592J803199M950538Q306983P558312
6003B3851976J178036o962594j0298664n782335K625677P769520O417427J139260
5995A9938303m151033p551021p967654m558157O26384K757284o3456l581023k961294
5986g511667M57269J586641o99707k484145j151879J318919K229019J717129R02692
5977c635729n34659k745425l782879j696372K562516O309722Q326443Q961384
5969A3765001P835069L968713j571940n572824o394787n933058o077623m828668
$$ plain form
5961 -4810117 -3884109 5022609 16662195 22141731 18677512 12380600 9586798 8567823
5953 8567823 3399568 -5921036 -12230399 -10552549 -4248538 140516 635956 -353497 -1085045
5944 -1085045 -1674511 -1729274 -488698 1056621 1246941 712122 1304495 2337859 1374545
5935 1374545 -817845 103125 5873107 12286347 14204310 11274919 6361689 903911
5927 903911 -5007047 -9861190 -11808004 -11842607 -12613431 -14230977 -14198448 -11402236 -7206453
5918 -7206453 -2608167 2314390 5616804 3940247 -2558786 -8960171 -11518135 -12045267
5910 -12045267 -13627298 -14575522 -10665724 -2400700 4069886 4042678 -426100 -3268283 -773763
5901 -773763 5240764 9081187 5813382 -3976234 -13602058 -15978901 -10380261 -2525407
$$ packed form
5961d810117R26008Q906718J1639586N479536l464219o296912k793802j018975
5953H567823n168255r320604o309363J677850O304011M389054M95440r89453p31548
5944a085045n89466n4763J240576J545319J90320n34819N92373J033364r63314
5935A374545k192390R20970N769982O413240J917963k929391m913230n457778
5927I03911n910958m854143j946814l4603p70824j617546L2529K796212M195783
5918g206453M598286M922557L302414j676557o499033o401385k557964n27132
5910a2045267j582031r48224L909798Q265024O470586k7208m468778k842183K494520
5901g73763O014527L840423l267805r789616r625824k376843N598640P854854
$$ plain form
5893 -2525407 1498492 -516106 -7767367 -17669065 -25236727 -25302831 -18319568 -11430413 -10621865
5884 -10621865 -13702742 -14302663 -10853432 -7188208 -5291845 -2956800 479194 1546855
5876 1546855 -1323466 -3516095 -85881 6913179 11429410 12032848 12661572 15133689 15982565
5867 15982565 12333547 7017499 5123984 7606850 10750519 10776686 6926685 640177
5859 640177 -6423772 -13197391 -18781135 -21785908 -21022603 -17751190 -16133372 -19075133 -23724455
5850 -23724455 -23864948 -17512816 -9383827 -4624863 -3195432 -2716622 -3880889 -9144530
5842 -9144530 -17265631 -23016305 -22673476 -17222530 -9851867 -2622815 3663911 8098348
5834 8098348 9550580 8034720 6087199 7769853 14249855 20574327 20146175 13275393
$$ packed form
5893b525407M023899k014598p251261r901698p567662o6104O983263O889155Q08548
5884a0621865l080877n99921L449231L665224J896363K335045L435994J067661
5876A546855k870321k192629L430214O999060M516231O03438O28724K472117Q48876
5867A5982565l649018n316048j893515K482866L143669K6167l850001o286508
5859F40177p063949o773619n583744l004773P63305L271413J617818k941761m649322
5850b3724455j40493O352132Q128989M758964J429431M78810j164267n263641
5842i144530q121101n750674L42829N450946P370663P229052O286726M434437
5834H098348J452232j515860j947521J682654O480002O324472m28152o870782
$$ plain form
5826 13275393 7062554 4814398 1279679 -6826464 -11479958 -3198292 12882828 21344740
5818 21344740 17215699 11667880 13855252 17568188 12667083 1516330 -4923855 -2404120
5810 -2404120 4109355 10206976 15496616 18469115 16303728 10529124 6017955 3269830
5802 3269830 -2036897 -10340502 -15179737 -11525298 -2265510 6373535 11728468 14241122
5794 14241122 14009295 11439345 8991082 9035860 11004699 12264790 10422271 4229354 -4885736
5785 -4885736 -11065856 -7639597 4702831 16291631 18277659 11851733 4702931 1026721
5777 1026721 -534020 -896174 1639252 6831532 10749639 10865136 9394804 8946721 7717049
5768 7717049 2531852 -4994473 -9477171 -9086530 -8119055 -10655986 -14547257 -14415071 -9025530
$$ packed form
5826A3275393o212839k248156l534719q106143m653494Q281666J6081120Q461912
5818B1344740m129041n547819K187372L712936m901105j1150753o440185K519735
5810b404120O513475O097621N289640K972499k165387n774604m511169k748125
5802C269830n306727q303605m839235L654439R259788Q639045N354933K512654
5794A4241122k31827k569950k448263M4778J968839J260091j842519o192917r115090
5785d885736o180120L426259J2342428J1588800J986028o425926p148802l676210
5777A026721j560741l62154K535426N192280L918107J15497j470332m48083j229672
5768G717049n185197p526325m482698L90641R67475k536931l891271J32186N389541
$$ plain form
5759 -9025530 -2514246 1355772 3056148 4795898 6977142 8692745 9750932 10388165
5751 10388165 10252421 9172306 7750314 5943723 2654774 -1666188 -3821090 -1536121
5743 -1536121 3146495 6677543 8789886 11390432 13764948 12770216 7880739 2336263
5735 2336263 -1539312 -4735006 -7960837 -9010773 -6142825 -1846760 -359632 -2157657
5727 -2157657 -3190601 171373 6662603 11113367 9670351 3651992 -2191641 -4792925
5719 -4792925 -4618160 -2438293 2714925 10309405 15786293 15038772 10297447 7917100 10697889
5710 10697889 15575177 18365209 17414832 13086247 7372438 3870760 4614934 7333445
5702 7333445 9206686 11596618 16066627 17926020 11503788 1411770 -844392 6365864
$$ packed form
5759i025530O511284L870018J700376J739750K181244J715603J058187O37233
5751A0388165j35744j080115j421992j806591l288949m320962k154902K284969
5743a536121M682616L531048K112343K600546K374516r94732m889477n544476
5735B336263l875575l195694l225831j049936K867948M296065J487128j798025
5727b157657j032944L361974O491230M450764j443016o018359n843633k601284
5719d792925J74765K179867N153218P594480N476888p47521m741325k380347K780789
5710A0697889M877288K790032r50377m328585n713809l501678P44174K718511
5702G333445J873241K389932M470009J859393o422232j0092018k256162P210256
$$ plain form
5694 6365864 11081762 5176057 -4114141 -6964548 -6358224 -10857246 -18461372 -19411751 -12170306
5685 -12170306 -5227970 -3525537 -3566734 -2937846 -4527333 -8392353 -8400331 -1530635 6290529
5676 6290529 8334882 5671547 3279007 2468982 1979064 2579230 5228711 7091374 4434954
5667 4434954 -1564844 -5993982 -6700568 -6257741 -7368903 -8982969 -7749800 -2121803 5391394
5658 5391394 9778922 7742422 572406 -7645937 -14246169 -19252382 -23143977 -25411380
5650 -25411380 -25290130 -22098539 -15196739 -5774670 1963116 4444081 3428235 3733575
5642 3733575 6175491 6731329 3538329 239196 99808 640922 -2607133 -9457512 -15291899
5633 -15291899 -16564361 -13910007 -10966924 -11434562 -15676148 -19412005 -18179428 -13755331
$$ packed form
5694F365864M715898n905705r290198k850407O06324m499022p604126r50379P241445
5685a2170306O942336J702433m1197O28888j589487l865020p978O869696P821164
5676F290529K044353k663335k392540q10025m89918O00166K649481J862663k656420
5667D434954n999798m429138p06586M42827j111162j614066J233169N627997P513197
5658E391394M387528k036500p170016q218343o600232n006213l891595k267403
5650b5411380J21250L191591O901800R422069P737786K480965j015846L05340
5642C733575K441916N55838l193000l299133j39388N41114l248055o850379n834387
5633a5291899j272462K654354K943083m67638m241586l735857J232577M424097
$$ plain form
5625 -13755331 -12526368 -16074175 -18122493 -14087178 -8858926 -9552995 -13807021 -12404339
5617 -12404339 -2933566 6191673 7249607 3140409 2287518 7255539 12831731 14265245
5609 14265245 13326077 14871100 19627379 22871707 20370849 13482687 6723455 1776775
5601 1776775 -3137693 -8289901 -10670785 -8683084 -5299687 -4045378 -4315726 -3429945 -1184004
5592 -1184004 719118 1974905 3050545 2717498 -106766 -3042576 -2720233 -245271 -307896
5583 -307896 -4603949 -9770526 -12361543 -12334110 -10852200 -8241309 -5384079 -3762985 -2527923
5574 -2527923 1273455 7670332 12157377 11593252 8865276 8517715 9892090 8349424 2349347
5565 2349347 -4359517 -7840781 -8328869 -8542106 -9571145 -9673207 -6515285 -123189 6303571
$$ packed form
5625a3755331J228963l547807k048318M035315N228252o94069m254026J402682
5617a2404339R470773R125239J057934m109198q52891M968021N576192J433514
5609A4265245r39168J545023M756279L244328k500858o888162o759232m946680
5601A776775m914468n152208k380884J987701L383397J254309k70348Q85781K245941
5592a184004J903122J255787J075640l33047k824264k935810L22343K474962o2625
5583c07896m296053n166577k591017K7433J481910K610891K857230J621094J235062
5574b527923L801378O396877M487045n64125k727976l47561J374375j542666o000077
5565B349347o708864l481264m88088k13237j029039j02062L157922O392096O426760
$$ plain form
5556 6303571 9012522 7473211 4411379 1338108 -3961221 -13154204 -22165748 -24243652
5548 -24243652 -18733508 -12988708 -13479009 -18066452 -20216492 -18449846 -16964906 -17462195
5540 -17462195 -15850081 -9297081 -2048140 64878 -1682096 -875835 4124763 7887545
5532 7887545 6828081 4972205 7253347 11319356 11362018 7791970 6668608 9278881 8752488
5523 8752488 62284 -11555888 -16977730 -15179585 -13286216 -15297425 -16674234 -12315000
5515 -12315000 -5251050 -2992250 -7220823 -11863465 -11609301 -8124420 -5991486 -5880263
5507 -5880263 -5016083 -2591208 -913258 -1437745 -3149372 -5540201 -9905400 -16040662 -20420185
5498 -20420185 -20190498 -17294039 -15974432 -17043403 -17159622 -13701056 -8286099 -4960717
$$ packed form
5556F303571K708951j539311l061832l073271n299329r192983r011544k077904
5548b4243652N510144N744800m90301m587443k150040J766646J484940m97289
5540a7462195J612114O553000P248941K113018j746974Q06261N000598L762782
5532G887545j059464j855876K281142M066009M2662l570048j123362K610273n26393
5523H752488q690204j1618172n421842J798145J893369k011209j376809M359234
5515a2315000P063950K258800m228573m642642K54164L484881K132934J11223
5507e880263Q64180K424875J677950n24487j711627k390829m365199o135262m379523
5498b0420185K29687K896459J319607j068971j16219L458566N414957L325382
$$ plain form
5490 -4960717 -5870566 -8799699 -8708978 -2743053 5664727 9434743 5984585 766893 595535
5481 595535 5619184 11025683 14610173 18026719 21365393 21841673 18721456 14640406 10419093
5472 10419093 3410735 -6357756 -12902552 -11005616 -3153901 3838004 6440389 5214949
5464 5214949 1187562 -3918257 -6105304 -3018416 1525183 1590027 -3058804 -7634941 -9687975
5455 -9687975 -10515230 -10037394 -6568913 -2067843 -924510 -2016379 1072216 9087198 13387846
5446 13387846 7685404 -2811355 -9671517 -12956701 -17492801 -21988315 -20649154 -13638631
5438 -13638631 -7390590 -4854716 -3226235 -1553127 -2563454 -5578621 -5543490 -1681715
5430 -1681715 344185 -1717545 -2078469 3194707 8547449 7393468 2550351 1037353
$$ packed form
5490d960717r09849k929133R0721N965925Q407780L770016l450158n217692j71358
5481E95535N023649N406499L584490L416546L338674M76280l120217m081050m221313
5472A0419093p008358r768491o544796J896936P851715O991905K602385j225440
5464E214949m027387n105819k187047L086888M543599O4844m648831m576137k053034
5455i687975q27255M77836L468481M501070J143333j091869L088595Q014982M300648
5446A3387846n702442j0496759o860162l285184m536100m495514J339161P010523
5438a3638631O248041K535874J628481J673108j010327l015167L5131L861775
5430a681715K025900k061730l60924N273176N352742j153981m843117j512998
$$ plain form
5422 1037353 2705682 1968247 -1733896 -3401734 -1692695 -1000457 -3529942 -5909886 -5415486
5413 -5415486 -4100818 -4619310 -6298087 -7451893 -8149225 -8998059 -10008942 -11588634 -13854004
5404 -13854004 -14739035 -12156543 -8039696 -6228310 -6371111 -4816942 -1851322 -1877561 -4679478
5395 -4679478 -3338141 5167279 13226480 12014790 3347096 -3845347 -5683062 -5553368
5387 -5553368 -6210258 -6694672 -7094970 -9840311 -14526623 -16611815 -13778860 -9665240 -8320618
5378 -8320618 -7917316 -3650044 4297385 9302686 5692972 -4564487 -14254182 -19107510
5370 -19107510 -21353554 -24578463 -27672448 -26575008 -20710383 -14112682 -10161696 -8790295
5362 -8790295 -9369616 -12054023 -14614114 -12532117 -5486858 137380 -704704 -4457867 -4638069
$$ packed form
5422A037353J668329p37435l702143j667838J709039O92238k529485k379944M94400
5413e415486J314668n18492j678777j153806o97332q48834j010883j579692k265370
5404a3854004q85031K582492M116847J811386j42801J554169K965620k6239k801917
5395d679478J341337Q505420Q059201j211690q667694p192443j837715J29694
5387e553368o56890m84414m00298k745341m686312k085192K832955M113620J344622
5378h320618M03302M267272P947429N005301l609714j0257459r689695m853328
5370a9107510k246044l224909l093985J097440N864625O597701L950986J371401
5362h790295n79321k684407k560091K081997P045259N624238q42084l753163j80202
$$ plain form
5353 -4638069 -2127013 -3734651 -11367759 -18807301 -20171589 -16313926 -11000990 -5255898
5345 -5255898 1688560 8865437 14037322 16355679 16632713 15755847 13846176 10310098 4487543
5336 4487543 -2898283 -9370680 -13106646 -14883561 -15758444 -14062883 -7730077 1175531
5328 1175531 8075581 12092966 16514580 22161628 24798590 21539874 15996330 13495053
5320 13495053 13680077 11734826 5685323 -1329410 -5966172 -8455919 -10473519 -11776431
5312 -11776431 -10868552 -7876030 -4768795 -2660613 -607285 1905147 2723547 -423672
5304 -423672 -5434572 -6910919 -3092481 914142 -684334 -6772932 -10848045 -9027436
5296 -9027436 -3501694 1324306 2871779 710956 -3783711 -7438688 -7749040 -6212258
$$ packed form
5353d638069K511056j607638p633108p439542j364288L857663N312936N745092
5345e255898O944458P176877N171885K318357K77034q76866j909671l536078n822555
5336D487543p385826o472397l735966j776915q74883J695561O332806Q905608
5328A175531O900050M017385M421614N647048K636962l258716n543544k501277
5320A3495053J85024j945251o049503p014733m636762k489747k017600j302912
5312a1776431R07879K992522L107235K108182K053328K512432Q18400l147219
5304d23672n010900j476347L818438M006623j598476o088598m075113J820609
5296i027436N525742M826000J547473k160823m494667l654977l10352J536782
$$ plain form
5288 -6212258 -6958811 -11536890 -17295056 -21167834 -22334947 -20640632 -15592648 -8489863
5280 -8489863 -3076706 -2226715 -5337016 -9812852 -13338673 -14068720 -10957763 -5301570 -277930
5271 -277930 2174029 2798192 3150152 4140300 6427475 9683392 11207111 8374133 3216467
5262 3216467 1105975 3412838 5031026 1589206 -4078890 -5965664 -3218563 -771256
5254 -771256 -2451769 -6678224 -9394048 -9224373 -8773982 -11224671 -16035007 -18837856 -16554877
5245 -16554877 -11564341 -8699784 -8971133 -9412939 -8927034 -10161471 -14297370 -17739546 -16339879
5236 -16339879 -10342656 -3134680 2664366 6176733 7600004 8156346 8743691 7922704 3998085
5227 3998085 -511696 -603368 3734773 6424964 3845878 -412623 -2313026 -3626259 -7027861
$$ packed form
5288f212258p46553m578079n758166l872778j167113J694315N047984P102785
5280h489863N413157Q49991l110301m475836l525821p30047L110957N656193N023640
5271b77930K451959O24163L51960R90148K287175L255917J523719k832978n157666
5262C216467k110492K306863J618188l441820n668096j886774K747101K447307
5254g71256j680513m226455k715824J69675M50391k450689m810336k802849K282979
5245a6554877M990536K864557k71349m41806M85905j234437m135899l442176J399667
5236a6339879N997223P207976N799046L512367J423271N56342N87345q20987l924619
5227C998085m509781r1672M338141K690191k579086m258501j900403j313233l401602
$$ plain form
5218 -7027861 -9815172 -8309550 -4910487 -4540485 -6711835 -7469617 -7063547 -8700699 -10808328
5209 -10808328 -8073846 -791239 3873860 1953331 -1927048 -1873655 1618238 4631990
5201 4631990 6384283 8766916 11606568 12267013 9676296 6324764 5656774 8201623 10833092
5192 10833092 10395932 7786773 6654067 7657679 7084244 3139411 150282 2657828
5184 2657828 7975660 9541610 6102870 2294227 967422 742782 1288628 4891735 11164694
5175 11164694 15555906 15389822 12880687 10109478 5800537 -208802 -4059267 -3187033
5167 -3187033 -680928 -285430 -466908 1898007 4683835 2922735 -3050441 -7296825 -6540348
5158 -6540348 -4067266 -3948461 -5253265 -4451222 -1010359 2292484 3648325 4364487 6740889
$$ packed form
5218g027861k787311J505622L399063L70002k171350p57782M06070j637152k107629
5209a0808328K734482P282607M665099j920529l880379N3393L491893L013752
5201D631990J752293K382633K839652O60445k590717l351532o67990K544849K631469
5192A0833092m37160k609159j132706J003612n73435l944833k989129K507546
5184B657828N317832J565950l438740l808643j326805k24640N45846L603107O272959
5175A1164694M391212j66084k509135k771209m308941o009339l850465Q72234
5167c187033K506105L95498j81478K364915K785828j761100n973176m246384P56477
5158f540348K473082J18805j304804Q02043L440863L302843J355841P16162K376402
$$ plain form
5149 6740889 11430444 17085247 21287762 21622914 17499860 11945810 10151413 14350621
5141 14350621 20676421 22913316 19129923 12806579 7826150 4889201 2982335 1378404
5133 1378404 -721824 -3614510 -4960656 -1363351 6246905 12085260 12561765 10450135
5125 10450135 9323590 7701894 2835811 -2998823 -5201754 -3861615 -2946686 -3777227
5117 -3777227 -4214216 -3321892 -1888950 885332 6078838 10839129 10693996 6106321 1789517
5108 1789517 -447495 -2896911 -5809294 -5792486 -1555402 3790432 7367225 8781401 7092921
5099 7092921 1006841 -6599634 -9797217 -7090912 -2985139 -931843 -155778 -482443 -3587994
5090 -3587994 -7311456 -5895941 629949 4105976 -538206 -8210849 -12460949 -14631171
$$ packed form
5149F740889M689555N654803M202515L35152m123054n554050j794397M199208
5141A4350621O325800K236895l783393o323344m980429k936949j906866j603931
5133A378404k100228k892686j346146L597305P610256N838355M76505k111630
5125A0450135j126545j621696m866083n834634k202931J340139R14929q30541
5117c777227m36989Q92324J432942K774282N193506M760291j45133m587675m316804
5108A789517k237012k449416k912383J6808M237084N345834L576793J414176j688480
5099G092921o086080p606475l197583K706305M105773K053296P76065l26665l105551
5090c587994l723462J415515O525890L476027m644182p672643m250100k170222
$$ plain form
5082 -14631171 -18314779 -20962087 -18252390 -11931043 -6009375 261585 7709035 9939635
5074 9939635 479516 -14948049 -23172193 -20353112 -14910481 -13377893 -13134700 -11666190
5066 -11666190 -13305272 -20952294 -27958155 -25438978 -14464867 -4980752 -3888380 -8738636
5058 -8738636 -12794841 -12644758 -10124888 -8899370 -10284984 -12192850 -11943989 -9433856 -6499675
5049 -6499675 -3857004 -792682 1886555 1048883 -4978905 -12978934 -16987029 -14113497
5041 -14113497 -7467677 -2776985 -2315544 -3148245 -1925617 184381 -340068 -3211512 -4092469
5032 -4092469 -1279664 1313540 -17355 -3546315 -5690153 -6413577 -7041845 -5554630 659348
5023 659348 8747380 12633331 11271832 9482833 9814383 8716266 2742658 -5977312 -13347451
$$ packed form
5082a4631171l683608k647308K709697O321347N921668O270960P447450K230600
5074I939635r460119j5427565q224144K819081N442631J532588K43193J468510
5066a1666190j639082p647022p005861K519177J0974111R484115J092372m850256
5058h738636m056205J50083K519870J225518j385614j907866K48861K510133K934181
5049f499675K642671L064322K679237q37672o027788q000029m008095K873532
5041a4113497O645820M690692M61441q32701J222628K109998n24449k871444q80957
5032d092469K812805K593204j330895l528960k143838p23424o28268J487215O213978
5023F59348Q088032L885951j361499j788999L31550j098117n973608q719970p370139
$$ plain form
5014 -13347451 -18767811 -23498868 -26219392 -24371349 -18916524 -13895009 -11005499 -7786939
5006 -7786939 -2209933 3482109 5358186 2771174 -1169935 -3322384 -2803397 -68441
4998 -68441 3850682 6737538 6253746 2930137 196148 28545 588245 -151022 -951157
4989 -951157 -141374 613369 -866423 -2717895 -1996068 -896924 -4455971 -12034684 -16851771
4980 -16851771 -15243108 -11082918 -9121717 -8974685 -8219154 -6772148 -5104435 -2142701
4972 -2142701 1740802 3020295 -497821 -6199318 -10188572 -11513430 -10889592 -8573815
4964 -8573815 -5678004 -4167504 -3507508 -961747 3095347 4722657 3194705 2726854 4573751
4955 4573751 3473893 -3786538 -12002714 -14918478 -13815786 -13014460 -11504326 -5702152
$$ packed form
5014a3347451n420360m731057k720524J848043N454825N021515K889510L218560
5006g786939N577006N692042J876077k587012l941109k152449N18987K734956
4998f8441L919123K886856m83792l323609k733989j67603N59700p39267q00135
4989i51157Q09783P54743j479792j851472P21827J099144l559047p578713m817087
4980a6851771J608663M160190J961201J47032P55531J447006J667713K961734
4972b142701L883503J279493l518116n701497l989254j324858O23838K315777
4964h573815K895811J510500O59996K545761M057094J627310j527952m67851J846897
4955D573751j099858p260431q216176k915764J102692Q01326J510134N802174
$$ plain form
4947 -5702152 2694733 7913210 7111226 1523600 -6565488 -13758298 -16165682 -14653441
4939 -14653441 -15447554 -21043441 -25542877 -24174496 -21386721 -22610615 -23990751 -18985628
4931 -18985628 -10429576 -6603157 -8749258 -11822005 -14703567 -19927119 -25189674 -24958560
4923 -24958560 -19994395 -16780801 -18037714 -21307920 -25376465 -30122128 -31788923 -26947516
4915 -26947516 -19888453 -17888589 -20599802 -22215431 -22113256 -24541178 -29485342 -32801544
4907 -32801544 -34004923 -35539400 -36343991 -34471128 -33198284 -35851537 -38343614 -36174777
4899 -36174777 -34028169 -37870947 -42994042 -41746855 -37206521 -36151412 -35380714 -29940366
4891 -29940366 -27173736 -35015993 -44235533 -42535016 -38255094 -46641730 -60425594 -61277310
$$ packed form
4947e702152Q396885N218477q01984n587626q089088p192810k407384J512241
4939a4653441p94113n595887m499436J368381K787775j223894j380136N005123
4931a8985628Q556052L826419k146101l072747k881562n223552n262555K31114
4923b4958560M964165L213594j256913l270206m068545m745663j666795M841407
4915b6947516P059063J999864k711213j615629J02175k427922m944164l316202
4907c2801544j203379j534477q04591J872863J272844k653253k492077K168837
4899c6174777K146608l842778n123095J247187M540334J055109P70698N440348
4891b9940366K766630p842257r219540J700517M279922q386636j3783864q51716
$$ plain form
4883 -61277310 -53401010 -54483877 -59798199 -52190653 -42609255 -56163395 -79673603 -77395247
4875 -77395247 -62901997 -84736789 -116503197 -43262973 180127064 419802091 496340112
4868 496340112 394736054 258069265 192397080 171365150 137801825 101516166 94851735
4861 94851735 103105713 94673260 77347476 75384266 80350525 68905023 47977664 41987770
4853 41987770 49939111 51209359 43421537 41656494 46812817 44812603 34219440 28458597
4845 28458597 31428633 33359741 30826887 30953905 35025113 35618594 31478935 29863363
4837 29863363 32451506 32399888 27198838 22763185 22868476 24241701 23534973 21185289 17964929
4828 17964929 14615665 14364429 19664396 27701621 34093963 38089412 39477523 35565603
$$ packed form
4883f1277310P876300j082867n314322P607546R581398j3554140k3510208K278356
4875g7395247J4493250k1834792l1766408P3240224K23390037K39675027P6538021
4868D96340112j01604058j36666789o5672185k1031930l3563325l6285659o664431
4861I4851735Q253978q432453j7325784j963210M966259j1445502k0927359n989894
4853D1987770P951341J270248p787822j765043N156323k000214j0593163n760843
4845B8458597K970036J931108k532854J27018M071208N93481m139659j615572
4837B9863363K588143n1618n201050m435653J05291J373225p06728k349684l220360
4828A7964929l349264k51236N299967Q037225O392342L995449J388111l911920
$$ plain form
4820 35565603 27478603 23801481 30286407 40710825 45279359 42949242 38173617 31883595
4812 31883595 24587294 21955723 26719606 30235786 23277874 10951967 5517862 8226700
4804 8226700 10491052 10149531 13139452 19562343 21269867 15285265 8535688 6602041
4796 6602041 7225165 7574438 9303068 13174063 15582448 13334576 7026149 -1004274 -7119302
4787 -7119302 -5914230 4041478 14829799 16884352 11811851 10226843 16972321 26118737
4779 26118737 30941475 31110892 28950612 25786523 23422110 23100182 22416792 19058471 16715856
4770 16715856 20214914 25997079 26063507 20847255 18445031 20578427 20031260 14178458 9922677
4761 9922677 10923444 10500446 3431301 -4355738 -5208711 -1318849 912641 1726142 4787658
$$ packed form
4820C5565603q087000l677122O484926J0424418M568534k330117m775625o290022
4812C1883595p296301k631571M763883L516180o957912j2325907n434105K708838
4804H226700K264352l41521K989921O422891J707524n984602o749577j933647
4796F602041O23124L49273J728630L870995K408385k247872o308427q030423o115028
4787g119302J205072R955708J0788321K054553n072501j585008O745478R146416
4779B6118737M822738J69417k160280l164089k364413l21928o83390l358321k342615
4770A6715856L499058N782165O6428n216252k402224K133396n47167n852802m255781
4761I922677J000767m22998p069145p787039q52973L889862K231490Q13501L061516
$$ plain form
4752 4787658 7884904 5733834 -420817 -4085667 -3359251 -2466083 -3664980 -4056639 -1496947
4743 -1496947 1612243 2490126 2202721 3212267 4818430 3744385 -860369 -4989934 -3907381
4734 -3907381 1768223 6404357 6739689 6229802 9465354 14738714 16333480 12876401 8536403
4725 8536403 6152238 4413782 2859142 4376556 10025969 15269392 14706325 8521352
4717 8521352 1786960 -1242624 -443987 1424621 1994783 1651440 2525754 4723020 5218482
4708 5218482 2132511 -2095382 -4501113 -6182174 -9383268 -12314582 -11623761 -8275794
4700 -8275794 -5743701 -3861059 -307144 3101309 2399001 -747764 -572510 3080724 4132607
4691 4132607 533076 -2591906 -2050752 -997659 -1379876 142589 4800388 7740498 6217571
$$ packed form
4752D787658L097246k151070o154651l664850P26416Q93168j198897l91659K559692
4743a496947L109190Q77883k87405J009546J606163j074045m604754m129565J082553
4734c907381N675604M636134L35332n09887L235552N273360J594766l457079m339998
4725H536403k384165j738456j554640J517414N649413N243423n63067o184973
4717H521352o734392l029584P98637J868608N70162l43343Q74314K197266M95462
4708E218482l085971m227893k405731j681061l201094k931314O90821L347967
4700h275794K532093J882642L553915L408453p02308l146765J75254L653234J051883
4691D132607l599531l124982N41154J053093l82217J522465M657799K940110j522927
$$ plain form
4682 6217571 4776447 6913441 8305546 4652505 150686 884730 4774915 5883935
4674 5883935 4819554 6576477 10470391 10662071 6306646 3840012 8024253 15916259
4666 15916259 20892677 19312222 13090607 8138023 9097077 13500286 13840569 8054991
4658 8054991 3553600 6220254 10323733 6767997 -2026995 -4800042 1669812 7991619
4650 7991619 6693994 2751427 4851937 12247867 16220938 11735689 2724170 -3178843
4642 -3178843 -1863354 4699396 10711276 11356254 6543322 -8518 -4921291 -6993376
4634 -6993376 -5405870 920866 10619043 18378609 18468254 9999582 -1861847 -9904250
4626 -9904250 -10345610 -5262582 -91573 1428184 -67572 -1526862 -1070966 708979 1948447
$$ packed form
4682F217571j441124K136994J392105l653041m501819P34044L890185J109020
4674E883935j064381J756923L893914J91680m355425k466634M184241P892006
4666A5916259M976418j580455o221615m952584R59054M403209L40283n785578
4658H054991m501391K666654M103479l555736q794992k773047O469854O321807
4650G991619j297625l942567K100510P395930L973071m485249r011519n903013
4642c178843J315489O562750O011880O44978m812932o551840m912773k072085
4634f993376J587506O326736R698177P759566Q9645q468672j1861429q042403
4626i904250m41360N083028N171009J519757j495756j459290M55896J779945J239468
$$ plain form
4617 1948447 1329160 -412992 -365595 3931676 11127107 16695133 17639062 15123651 11897264
4608 11897264 9181086 7183427 6332217 6052235 4159689 -280418 -4687456 -5554845 -2461728
4599 -2461728 2010731 5331972 6534211 5714400 3499108 463221 -3387065 -7399868
4591 -7399868 -8751472 -4762061 2649277 7864792 8217626 6749344 6896248 7881400 7468154
4582 7468154 5646710 2716670 -2732875 -10115579 -13972301 -9247398 1927522 12230856
4574 12230856 16774540 16042804 13026812 10439033 9321848 7980638 4033467 -801873
4566 -801873 -1240428 3780127 7953227 6048840 1486675 709618 3710237 5740884 5253048
4557 5253048 4002407 1998909 -1039825 -1581955 3114577 8038883 5869271 -1553078
$$ packed form
4617A948447o19287j742152M7397M297271P195431N568026R43929k515411l226387
4608A1897264k716178j997659q51210k79982j892546m440107m407038q67389L093117
4599b461728M472459L321241J202239q19811k215292l035887l850286m012803
4591g399868j351604L989411P411338N215515L52834j468282J46904R85152m13246
4582G468154j821444k930040n449545p382704l856722M724903J1174920J0303334
4574A2230856M543684p31736l015992k587779j117185j341210l947171m835340
4566h01873m38555N020555M173100j904387m562165p77057L000619K030647m87836
4557E253048j250641k003498l038734n42130M696532M924306k169612p422349
$$ plain form
4549 -1553078 -5340411 -2943616 -698006 -2010532 -2183359 2075750 6560393 7456873 7943004
4540 7943004 11392709 14027989 10664038 3575774 -596996 -113324 1348977 1700995 2563593
4531 2563593 4653029 5480367 2755314 -2291309 -6026725 -6106922 -3739690 -2081725 -2065909
4522 -2065909 -986484 3267739 8073505 8899609 5236046 581139 -2469815 -3512844
4514 -3512844 -1873034 2591144 6825231 7596459 6774078 8357764 10823599 8934226 3332419
4505 3332419 739410 3003831 3945209 196355 -2828477 -609196 2089374 -1193457
4497 -1193457 -8216801 -11862505 -10205846 -6559940 -2946988 568422 3026603 4500668
4489 4500668 7876794 13543761 15850972 10727535 3363820 1591568 4498796 5056831
$$ packed form
4549a553078l787333K396795K245610j312526j72827M259109M484643Q96480M86131
4540G943004L449705K635280l363951p088264m172770M83672J462301L52018Q62598
4531B563593K089436Q27338k725053n046623l735416q0197K367232J657965J5816
4522b065909J079425M254223M805766Q26104l663563m654907l050954j043029
4514c512844J639810M464178M234087P71228q22381J583686K465835j889373n601807
4505C332419k593009K264421R41378l748854l024832K219281K698570l282831
4497a193457p023344l645704J656659L645906L612952L515410K458181J474065
4489D500668L376126N666967K307211n123437p363715j772252K907228N58035
$$ plain form
4481 5056831 2088108 1475647 5673481 9765089 9456320 6864459 6450590 9736018 15315025
4472 15315025 20303927 21308334 17614247 13259096 12223157 12557399 9838999 5207391
4464 5207391 4148691 7671624 10946581 11214085 10775341 11012667 9824914 6953244 5671013
4455 5671013 6507280 5131894 -265146 -5045409 -5493435 -5003102 -8188606 -13092002 -14519493
4446 -14519493 -11954684 -8859859 -6534201 -4069148 -2766836 -5007277 -9137895 -10629845
4438 -10629845 -8792029 -7775567 -9704901 -10757338 -6163493 3418356 12396806 15507398
4430 15507398 11452321 3142311 -4140272 -6128034 -2817440 2041921 5425861 8039753
4422 8039753 11889952 16195593 17863724 15789669 12341500 9731851 6989777 2338126
$$ packed form
4481E056831k968723o12461M197834M091608l08769k591861m13869L285428N579007
4472A5315025M988902J004407l694087m355151j035939L34242k718400m631608
4464E207391j058700L522933L274957K67504m38744K37326j187753k871670j282231
4455E671013Q36267j375386n397040m780263m48026M90333l185504m903396j427491
4446a4519493K564809L094825K325658K465053J302312k240441m130618j491950
4438a0629845J837816J016462j929334j052437M593845R581849Q978450L110592
4430A5507398m055077q310010p282583j987762L310594M859361L383940K613892
4422H039753L850199M305641J668131k074055l448169k609649k742074m651651
$$ plain form
4414 2338126 -2903163 -5466718 -4871987 -4178538 -5302483 -6264766 -4799755 -2558484 -3185822
4405 -3185822 -7197608 -11233865 -12267674 -10550234 -8076336 -5689231 -2480109 2502469
4397 2502469 8398505 12530473 12506797 8052616 311283 -9313504 -17547028 -18076949 -6861611
4388 -6861611 10312754 20620798 17738583 8608959 3001080 731830 -4838144 -13815364
4380 -13815364 -18249042 -13723866 -5568116 -1695119 -4532483 -11779051 -20068605 -25458626
4372 -25458626 -24706160 -18935877 -12797623 -8061859 -1840734 6814926 13150830 13010369
4364 13010369 9088483 6785885 6703403 5467977 1748145 -2881366 -7357885 -10997424
4356 -10997424 -11150173 -5714451 2140655 6168904 4699330 2424238 3610667 7073963
$$ packed form
4414B338126n241289k563555N94731O93449j123945r62283J465011K241271o27338
4405c185822m011786m036257j033809J717440K473898K387105L209122M982578
4397B502469N896036M131968k3676m454181p741333r624787q233524n29921J1215338
4388f861611J7174365J0308044k882215r129624n607879k269250n569974q977220
4380a3815364m433678M525176Q155750L872997k837364p246568q289554n390021
4372b5458626P52466N770283O138254M735764O221125Q655660O335904j40461
4364A3010369l921886k302598q2482j235426l719832m629511m476519l639539
4356a0997424j52749N435722P855106M028249j469574k275092J186429L463296
$$ plain form
4348 7073963 9485682 10365431 11046762 10788068 7270532 697329 -5225865 -7107130 -5072036
4339 -5072036 -1508753 1747172 3589818 2355687 -3077281 -10680679 -16043687 -16841037
4331 -16841037 -14964336 -13382199 -12916873 -13294962 -14606972 -15265113 -11235133 -1171894
4323 -1171894 9400101 13452071 11132321 8500988 8098137 6198635 258769 -6438662
4315 -6438662 -9791710 -9874776 -8302435 -4778924 634002 5280859 7095668 7287627 7465614
4306 7465614 7248046 6995671 8979526 12776006 13561490 8851938 3192466 1840488 3371010
4297 3371010 3324694 1620082 717937 -317359 -3223058 -4297991 1815218 12826846 20309085
4288 20309085 20586601 17613611 15023848 12587744 11447501 14859737 20778835 20871355 11272023
$$ packed form
4348G073963K411719Q79749O81331k58694l517536o573203n923194j881265K035094
4339e072036L563283L255925J842646j234131n432968p603398n363008p97350
4331a6841037J876701J582137M65326l78089j312010o58141M029980J0063239
4323a171894J0571995M051970k319750k631333m02851j899502n939866o697431
4315f438662l353048q3066J572341L523511N412926M646857J814809J91959J77987
4306G465614k17568k52375J983855L796480P85484m709552n659472j351978J530522
4297C371010m6316j704612r02145j035296k905699j074933O113209J1011628P482239
4288B0309085K77516k972990k589763k436104j140243L412236N919098R2520r599332
$$ plain form
4279 11272023 -1251035 -8159652 -9047816 -8098809 -5843887 -769842 4345901 4850714
4271 4850714 1962886 1917151 6997963 12461806 13468506 10959862 8974954 9158826 9882539
4262 9882539 8983530 5757636 1253396 -2322931 -3114775 -1133382 2157872 5771597 9705635
4253 9705635 13157520 13495778 8694715 1072962 -3009989 810218 9147386 13301583
4245 13301583 8705331 214976 -3848935 -1342608 2634302 3128002 341822 -2563415
4237 -2563415 -3045383 214850 6869648 13496358 15372865 11481511 5769064 2226581
4229 2226581 1022939 674704 1095659 2405212 3285195 3018981 3059324 4085186 3649174
4220 3649174 -221476 -4807415 -5552626 -2244558 1035563 1832004 1890335 3395685 5585472
$$ packed form
4279A1272023j2523058o908617q88164R49007K254922N074045N115743N04813
4271D850714k887828m5735N080812N463843J006700k508644j984908J83872P23713
4262I882539q99009l225894m504240l576327p91844J981393L291254L613725L934038
4253I705635L451885L38258m801063p621753m082951L820207Q337168M154197
4245A3301583m596252q490355m063911K506327L976910M93700k786180k905237
4237b563415m81968L260233O654798O626710J876507l891354n712447l542483
4229B226581j203642l48235M20955J309553Q79983k66214M0343J025862m36012
4220C649174l870650m585939p45211L308068L280121P96441N8331J505350K189787
$$ plain form
4211 5585472 6387627 5516617 4440559 4004653 3071304 -403539 -6898641 -13950862 -17943223
4202 -17943223 -17548150 -14425645 -10223626 -4687097 2022023 7079782 7722693 5631687
4194 5631687 5863777 10718533 16694165 18989258 17840178 18124837 22126697 24871220 19413320
4185 19413320 6502336 -4401050 -5322763 1962333 10150602 15415261 18061436 17277123
4177 17277123 11577602 3662593 -1493966 -3625670 -6133332 -7935341 -3826417 5473558
4169 5473558 11630082 10179467 6031982 3835612 1278263 -2782904 -2353116 5974778
4161 5974778 14897658 16403297 13105571 11129153 9423621 6468639 9435617 23395528
4153 23395528 38379197 42481936 41682070 48894234 59240329 58916536 55117383 66929723
$$ packed form
4211E585472Q02155q71010j076058m35906r33349l474843o495102p052221l992361
4202a7943223L95073L122505M202019N536529O709120N057759O42911k091006
4194E631687K32090M854756N975632K295093j149080K84659M001860K744523n457900
4185A9413320j2910984j0903386r21713P285096Q188269N264659K646175p84313
4177A7277123n699521p915009n156559k131704k507662j802009M108924R299975
4169E473558O156524j450615m147485k196370k557349m061167M29788Q327894
4161E974778Q922880J505639l297726j976418j705532k954982K966978J3959911
4153B3395528J4983669M102739p99866P212164J0346095l23793l799153J1812340
$$ plain form
4145 66929723 80873743 49808931 -42827304 -143713319 -183462274 -155043375 -110291442
4138 -110291442 -88824980 -82957776 -71847160 -56355564 -47283071 -42899901 -35544581 -27214771
4130 -27214771 -23970945 -23384240 -19560927 -14464692 -13867818 -16412329 -15701544 -10572112 -6067600
4121 -6067600 -5887965 -9036335 -12222584 -12055503 -7392533 -2197987 -2493952 -7999417 -11479126
4112 -11479126 -9354482 -7300346 -10947619 -16733774 -17934441 -15067250 -13336597 -13028413
4104 -13028413 -9908959 -3744190 502672 33426 -2770232 -5117609 -7015222 -9105753
4096 -9105753 -11006435 -12449787 -13519974 -13892701 -13868526 -14861142 -16411671 -14825627 -8354726
4087 -8354726 -1783891 -1294356 -5800610 -8220874 -5172174 -594387 961167 155123 310805
$$ packed form
4145F6929723J3944020l1064812r2636235j00886015l9748955K8418899M4751933
4138a10291442K1466462N867204J1110616J5491596R072493M383170P355320Q329810
4130b7214771L243826N86705L823313N096235N96874k544511P10785N129432M504512
4121f067600J79635l148370l186249J67081M662970N194546k95965n505465l479709
4112a1479126K124644K054136l647273n786155j200667K867191J730653L08184
4104a3028413L119454O164769M246862m69246k803658k347377j897613k090531
4096i105753j900682j443352j070187l72727K4175r92616j550529J586044O470901
4087h354726O570835M89535m506254k420264L048700M577787J555554q06044J55682
$$ plain form
4078 310805 2494552 5182107 6732988 6747259 6295531 7262123 10052115 12135967 10738398
4069 10738398 6734303 3845490 4214170 6734062 9181836 9764103 7366112 2982289
4061 2982289 139360 817590 1709491 -1787833 -8352807 -11910126 -10286486 -7826212 -7978702
4052 -7978702 -8288434 -5751454 -2973146 -4625559 -10030044 -13643203 -12354195 -8760858
4044 -8760858 -6758786 -6432856 -4559884 776907 7103576 9543931 6053341 -105884
4036 -105884 -4132627 -5082470 -5710250 -7732881 -10133129 -12313660 -15685640 -20856104 -25880353
4027 -25880353 -28746318 -29241615 -27141203 -21469578 -13515718 -7712070 -6847569 -8716487
4019 -8716487 -10173826 -11911825 -15662170 -19002644 -17754321 -12699096 -9113142 -9476295
$$ packed form
4078C10805K183747K687555J550881J4271m51728R66592K789992K083852j397569
4069A0738398m004095k888813L68680K519892K447774N82267k397991m383823
4061B982289k842929O78230Q91901l497324o564974l557319J623640K460274j52490
4052g978702l09732K536980K778308j652413n404485l613159J289008L593337
4044h760858K002072L25930J872972N336791O326669K440355l490590o159225
4036a05884m026743r49843o27780k022631k400248k180531l371980n170464n024249
4027b5880353k865965m95297K100412N671625P953860N803648Q64501j868918
4019h716487j457339j737999l750345l340474J248323N055225L585954l63153
$$ plain form
4011 -9476295 -11284376 -12881531 -16423162 -22634445 -27032938 -25263075 -19423875 -14990439
4003 -14990439 -13224893 -11034247 -7529657 -5793921 -7215858 -8550583 -6974446 -4527248
3995 -4527248 -4148571 -3710825 1755367 12485714 22483265 26134012 23357468 17681491
3987 17681491 12469324 10246531 12236323 15850400 15141731 7247230 -2580838 -5456801
3979 -5456801 1627861 12789426 19414633 17505708 9568564 1610552 -1639704 -383498
3971 -383498 1151371 198800 -1085311 613553 4216207 5657735 4042519 2631290 3410341
3962 3410341 4269305 2670287 -791299 -3663802 -4077405 -1168134 4375638 9538335 11396266
3953 11396266 10690295 9983510 8458817 3164806 -3937763 -6210288 -2305677 171188
$$ packed form
4011i476295j808081j597155l541631o211283m398493J769863N839200M433436
4003a4990439J765546K190646L504590J735736j421937j334725J576137K447198
3995d527248L78677M37746N466192J0730347R997551L650747k776544n675977
3987A7681491n212167k222793J989792L614077p08669p894501r828068k875963
3979e456801P084662J1161565O625207j908925p937144p958012l250256J256206
3971c83498J534869r52571j284111J698864L602654J441528j615216j411229P79051
3962C410341Q58964j599018l461586k872503m13603K909271N543772N162697J857931
3953A1396266p05971p06785j524693n294011p102569k272525L904611K476865
$$ plain form
3945 171188 -4476792 -11119004 -12145866 -10094977 -13300647 -21065294 -23027007 -14777070
3937 -14777070 -5173710 -3828873 -8219753 -9248470 -5071234 -2286777 -4800078 -8191469
3929 -8191469 -6701552 -1283147 2183237 562500 -3431662 -5306118 -3642305 -132502
3921 -132502 3601401 7358123 10822192 12775460 12812243 12331865 12403781 11801767 8946121
3912 8946121 5016597 2998893 3752595 5051834 4903029 4069501 4540000 6698128 8874101
3903 8874101 9218843 7646999 6037353 6120569 6963257 5802429 2364406 619768 3816789
3894 3816789 8728769 8155078 -215235 -10173234 -13660198 -9270435 -2636778 350605
3886 350605 -900766 -2332062 -93242 5392372 9843560 9714678 6370445 5128324 9810053
$$ packed form
3945A71188m647980o642212j026862K050889l205670p764647j961713Q249937
3937a4777070R603360J344837m390880j028717M177236K784457k513301l391391
3929h191469J489917N418405L466384j620737l994162j874456J663813L509803
3921a32502L733903L756722L464069J953268L6783m80378P1916o02014k855646
3912H946121l929524k017704P53702J299239j48805q33528M70499K158128K175973
3903H874101L44742j571844j609646Q3216Q42688j160828l438023j744638L197021
3894C816789M911980n73691q370313r957999l486964M389763O633657K987383
3886C50605j251371j431296K238820N485614M451188j28882l344233j242121M681729
$$ plain form
3877 9810053 18404228 24320362 22294211 13585264 4971484 1545971 1160085 -1694131
3869 -1694131 -6892539 -7867299 -1641284 5024168 3993158 -3086619 -7806526 -7140605 -5653960
3860 -5653960 -5941593 -4619415 -31959 3197129 1571318 -905944 986637 5054733
3852 5054733 4992952 -168158 -5309601 -6491328 -4157292 -97883 4178238 6628255 6621444
3843 6621444 7370163 12115715 18097834 18997486 13798468 8358557 7004095 7639761 7559852
3834 7559852 9050253 14842377 21419580 22280642 16785517 10812101 8244800 6202930
3826 6202930 476791 -7752129 -13610257 -15163651 -15048432 -15671951 -15866688 -13654003 -10193796
3817 -10193796 -8617617 -9534393 -9936634 -7011341 -1411730 3988799 7235351 8095387 6721843
$$ packed form
3877I810053Q594175N916134k026151q708947q613780l425513l85886k854216
3869a694131n198408r74760O226015O665452j031010p079777m719907O65921J486645
3860e653960k87633J322178M587456L229088j625811k477262J892581M068096
3852E054733o1781n161110n141443j181727K334036M059409M276121K450017o811
3843F621444P48719M745552N982119Q99652n199018n439911j354462O35666p9909
3834G559852J490401N792124O577203Q61062n495125n973416k567301k041870
3826F202930n726139q228920n858128j553394J15219o23519j94737K212685L460207
3817a0193796J576179r16776m02241K925293N599611N400529L246552Q60036j373544
$$ plain form
3808 6721843 3059248 -2293761 -7460536 -10120806 -9440290 -7483442 -7951708 -12251340 -17099784
3799 -17099784 -17589490 -12619957 -5643191 -223871 2733612 3313060 1661400 -8049
3791 -8049 1646416 5551479 5410854 -1480256 -7885945 -4944628 4665508 8548508 301452
3782 301452 -12831783 -20265637 -20316095 -18265554 -16811889 -14029507 -8892066 -3546545 8277
3773 8277 1777659 1861424 -351721 -4303387 -7714969 -8704231 -7157595 -3943498 -254082
3764 -254082 2374030 3212750 3766260 6299484 10501851 13329512 12907178 10972970 10286825
3755 10286825 10898236 10576341 8361526 6038055 5837700 7838263 10262381 11681353 12090016
3746 12090016 11977637 11269155 9655620 7394797 5076265 2905563 1025659 284143 1445535
$$ packed form
3808F721843l662595n353009n166775k660270O80516J956848m68266m299632m848444
3799a7099784m89706M969533O976766N419320K957483N79448j651660j669449
3791h049J654465L905063j40625o891110o405689K941317R610136L883000q247056
3782C01452j3133235p433854n0458K050541J453665K782382N137441N345521L554822
3773H277J769382Q3765k213145l951666l411582r89262J546636L214097L689416
3764b54082K628112Q38720N53510K533224M202367K827661m22334j934208o86145
3755A0286825O11411l21895k214815k323471k00355K000563K424118J418972M08663
3746A2090016j12379p08482j613535k260823k318532k170702j879904p41516J161392
$$ plain form
3737 1445535 3372352 3300272 -95308 -4567340 -6178861 -3162776 2470242 6759908 6988658
3728 6988658 3744374 112631 -1923474 -4193185 -9804970 -17540347 -21313968 -17062188
3720 -17062188 -8008233 -363581 4414084 9313008 14645421 16105043 11288661 4201430
3712 4201430 808308 2744348 7695839 13445548 18608356 21211719 19873314 15744164
3704 15744164 10821238 5166938 -1753984 -7999320 -10482440 -9098153 -6686501 -4981676
3696 -4981676 -3416413 -1945494 -1879398 -3265252 -4368129 -4599291 -5077344 -5336165 -2748402
3687 -2748402 3061892 8310713 9831476 9049965 8659737 8117871 5896462 3929757 5339556
3678 5339556 8612230 8680573 4365696 648746 1920434 6236825 8683181 8232539 8246336
$$ packed form
3737A445535J926817p2080l395580m472032j611521L016085N633018M289666K28750
3728F988658l244284l631743k036105k269711n611785p735377l773621M251780
3720a7062188R053955P644652M777665M898924N332413J459622m816382p087231
3712D201430l393122J936040M951491N749709N162808K603363j338405m129150
3704A5744164m922926n654300o920922o245336k483120J384287K411652J704825
3696d981676J565263J470919O6096j385854j102877k31162m78053k58821K587763
3687b748402N810294N248821J520763p81511l90228n41866k221409j966705J409799
3678E339556L272674O8343m314877l716950J271688M316391K446356m50642J3797
$$ plain form
3669 8246336 10737040 12973610 11110008 5969709 3182210 6829981 14419427 20062144
3661 20062144 21853201 23055261 25553624 26105975 21778890 15887198 14100380 15888380
3653 15888380 14348143 4898066 -9312479 -21193530 -25893080 -22773383 -14527562 -5670300
3645 -5670300 363406 3678655 6021213 6894732 4379870 -487184 -4018168 -5238412
3637 -5238412 -6940204 -9990666 -10775012 -6797742 -1198443 1454555 1020691 218189 -319198
3628 -319198 -1905502 -4568516 -7415393 -10818904 -14847524 -16632903 -12898795 -4873763
3620 -4873763 2263064 4807294 3103078 -804358 -5413542 -9600781 -12519231 -14186656
3612 -14186656 -14944716 -14509873 -12571218 -9632542 -6316575 -3032851 -1192359 -2553612
$$ packed form
3669H246336K490704K236570j863602n140299k787499L647771P589446N642717
3661B0062144J791057J202060K498363N52351m327085n891692j786818J788000
3653A5888380j540237r450077j4210545j1881051m699550L119697Q245821Q857262
3645e670300O033706L315249K342558Q73519k514862m867054l530984j220244
3637e238412j701792l050462p84346L977270N599299K652998m33864q02502n37387
3628c19198j586304k663014k846877l403511m028620j785379L734108Q025032
3620d873763P136827K544230j704216l907436m609184m187239k918450j667425
3612a4186656p58060M34843J938655K938676L315967L283724J840492j361253
$$ plain form
3604 -2553612 -5683572 -5694257 -319944 5938008 7081002 3205549 -859196 -2827481 -4386584
3595 -4386584 -6208977 -6469910 -4836457 -3673485 -4225677 -5028790 -4882811 -4049556 -1872243
3586 -1872243 3071719 9328754 12765352 12042844 10558043 11023695 11300523 8120200 2405033
3577 2405033 -2016211 -3528612 -4010092 -5599844 -7917722 -8278216 -4054559 4361458 12600878
3568 12600878 15542101 12035345 5507809 -3743 -2999938 -4007758 -4012496 -3837057 -3736850
3559 -3736850 -3690625 -4997302 -9900947 -17343281 -21231398 -16982768 -8510979 -3890276 -4809134
3550 -4809134 -6096562 -5782024 -8384148 -15580369 -20420259 -15816417 -4327426 5464050
3542 5464050 9062996 8054602 5059763 1753013 120146 1133464 3061942 4282411
$$ packed form
3604b553612l129960j0685N374313O257952J142994l875453m064745j968285j559103
3595d386584j822393k60933J633453J162972n52192q03113J45979Q33255K177313
3586a872243M943962O257035L436598p22508j484801M65652K76828l180323n715167
3577B405033m421244j512401m81480j589752k317878l60494M223657Q416017Q239420
3568A2600878K941223l506756o527536n511552k996195j007820m738J75439J00207
3559c736850M6225j306677m903645p442334l888117M248630Q471789M620703r18858
3550d809134j287428L14538k602124p196221m839890M603842J1488991R791476
3542E464050L598946j008394k994839l306750j632867J013318J928478J220469
$$ plain form
3534 4282411 6038811 9117755 10083643 5203847 -3237590 -8947942 -9456900 -8215886 -9175624
3525 -9175624 -12531162 -15728174 -16143604 -13212493 -9773562 -9808121 -12801949 -12923960 -6891022
3516 -6891022 318424 2008453 -578870 -703550 3489677 7464485 8859777 10784362
3508 10784362 14987562 17640276 14762069 7644780 329488 -4722102 -6113875 -2323605
3500 -2323605 5744641 13280693 15612243 12752554 8355247 5414545 4169335 2906953
3492 2906953 -110255 -4373837 -6631355 -4435637 -145523 1144554 -1891559 -5104732
3484 -5104732 -4606614 -1586145 66756 -1145829 -3306173 -3950036 -2755225 -1861034 -3510181
3475 -3510181 -6653183 -6954665 -1891399 5389673 9643162 9550833 7269747 3855471 -473463
$$ packed form
3534D282411J756400L078944R65888m879796q441437n710352n08958J241014r59738
3525i175624l355538l197012m15430K931111L438931l4559k993828j22011O032938
3516f891022P209446J690029k587323j24680M193227L974808J395292J924585
3508A0784362M203200K652714k878207p117289p315292n051590j391773L790270
3500b323605Q068246P536052K331550k859689m397307k940702j245210j262382
3492B906953l017208m263582k257518K195718M290114J290077l036113l213173
3484e104732M98118L020469J652901j212585k160344o43863J194811Q94191j649147
3475c510181l143002l01482N063266P281072M253489r2329k281086l414276m328934
$$ plain form
3466 -473463 -2859321 -309587 4099369 3119757 -5493732 -16780774 -26180430 -33216667
3458 -33216667 -36423047 -32305991 -23071843 -18105105 -22010781 -27004044 -23796033 -15248329
3450 -15248329 -11544840 -15011566 -18079346 -15360310 -9994684 -7149653 -7455800 -8528648
3442 -8528648 -8453352 -6440689 -3413953 -2224883 -4012438 -5036902 -1305880 4315117 4650643
3433 4650643 -1987571 -9727198 -13627551 -14979028 -16600109 -18089535 -18395421 -18639101 -19119549
3424 -19119549 -17012445 -10491708 -2583915 2272029 3630331 4355250 6258316 8795442
3416 8795442 10475459 9360544 3885438 -4422084 -10550901 -10960141 -8030707 -7250162 -10539808
3407 -10539808 -14411365 -14430465 -9839228 -3868867 -638962 -1708886 -5232999 -8754577
$$ packed form
3466d73463k385858K549734M408956r79612q613489j1287042r399656p036237
3458c3216667l206380M117056R234148M966738l905676m993263L208011Q547704
3450a5248329L703489l466726l067780K719036N365626K845031l06147j072848
3442h528648P5296K012663L026736J189070j787555j024464L731022N620997L35526
3433D650643o638214p739627l900353j351477j621081j489426l05886k43680m80448
3424a9119549K107104O520737P907793M855944J358302P24919J903066K537126
3416H795442J680017j114915n475106q307522o128817m09240K929434P80545l289646
3407a0539808l871557j9100M591237N970361L229905j069924l524113l521578
$$ plain form
3399 -8754577 -12187810 -16365396 -19318945 -17448357 -11331125 -6724600 -7517187 -10793448
3391 -10793448 -11738929 -10445655 -10052763 -10612092 -9673860 -7869661 -8826434 -13154461 -16806980
3382 -16806980 -16302798 -12017783 -5682834 1485817 7094649 8108925 5032294 2027537
3374 2027537 864935 -1450627 -6305901 -8851806 -4260340 4200625 8769554 7757689
3366 7757689 7072258 10897352 16114688 17867063 16285855 14581406 13422827 10976097
3358 10976097 7310247 5267103 6630891 9792708 12022139 12480073 11877570 10174048
3350 10174048 6417630 1283624 -1841118 -189809 4362617 6953499 5996003 5158759
3342 5158759 7481466 10365154 9516789 5598867 2691270 1523239 -577688 -3230239
$$ packed form
3399h754577l433233m177586k953549J870588O117232M606525p92587l276261
3391a0793448r45481J293274L92892n59329R38232J804199r56773m328027l652519
3382a6806980N04182M285015O334949P168651N608832J014276l076631l004757
3374B027537j162602k315562m855274k545905M591466Q460965M568929j011865
3366G757689o85431L825094N217336J752375j581208j704449j158579k446730
3358A0976097l665850k043144J363788L161817K229431M57934o02503j703522
3350A0174048l756418n134006l124742J651309M552426K590882r57496q37244
3342E158759K322707K883688q48365l917922k907597j168031k100927k652551
$$ plain form
3334 -3230239 -2423405 2158194 5019412 2868461 -526308 -1121144 -1090472 -3675697 -6243563
3325 -6243563 -4844807 -2277512 -4341630 -10009682 -12987625 -12424237 -14021763 -19429217
3317 -19429217 -22453998 -18857692 -13246203 -12064347 -14852357 -16759482 -15611846 -12113935
3309 -12113935 -6374430 1210585 7771652 10650541 10882217 11037761 11202711 9807480 6885974
3300 6885974 4039727 2475635 2659004 3964089 3584889 -1066388 -7410680 -9251674 -5628644
3291 -5628644 -3411009 -7407529 -12647859 -11615098 -5142448 -117050 525786 -918234
3283 -918234 -3047614 -5570076 -4941915 2445104 12526523 16035816 9749058 -678748
3275 -678748 -9573431 -16373885 -20917548 -20839994 -16548214 -12860581 -12428960 -12226704 -9092835
$$ packed form
3334c230239Q06834M581599K861218k150951l394769n94836L0672k585225k567866
3325f243563J398756K567295k064118n668052k977943N63388j597526n407454
3317a9429217l024781L596306N611489J181856k788010j907125J147636L497911
3309a2113935N739505P585015O561067K878889K31676J55544J64950j395231k921506
3300F885974k846247j564092J83369J305085l79200m651277o344292j840994L623030
3291e628644K217635l996520n240330J032761O472650N025398O42836j444020
3283i18234k129380k522462O28161P387019J0081419L509293o286758j0427806
3275f78748q894683o800454m543663P7554M291780L687633M31621K02256L133869
$$ plain form
3266 -9092835 -4030827 1100672 5767671 7359500 2034161 -7411151 -11091075 -4676259
3258 -4676259 3328522 3166395 -2498200 -3983404 356034 3345761 1595216 -107210
3250 -107210 2184160 5903185 7583687 7888831 8164594 7088954 4149569 2539548 4857790
3241 4857790 8419554 8375591 4363928 1328632 3859592 11005277 16481863 13969955 3596581
3232 3596581 -6650501 -8141328 -1263393 4315258 827387 -8083718 -11846283 -6032675
3224 -6032675 2660480 5498606 2392830 326147 2924099 6409390 6934057 7015371 10615714
3215 10615714 14945955 13120381 4670177 -2434779 -1962754 3284953 6890068 7018519
3207 7018519 5659139 3600419 875645 -336784 1787317 4698866 4550777 2372559
$$ packed form
3266i092835N062008N131499M666999J591829n325339r445312l679924O414816
3258d676259Q004781j62127n664595j485204M339438K989727j750545j702426
3250a07210K291370L719025J680502L05144K75763j075640k939385j610021K318242
3241D857790L561764m3963m011663l035296K530960P145685N476586k511908j0373374
3232C596581j0247082j490827O877935N578651l487871q911105l762565N813608
3224f032675Q693155K838126l105776k066683K597952L485291N24667Q1314L600343
3215A0615714M330241j825574q450204p104956M72025N247707L605115J28451
3207G018519j359380k058720k724774j212429K124101K911549j48089k178218
$$ plain form
3199 2372559 2563344 5617353 7166593 4885274 1836078 1281843 1722679 -644763 -6637834
3190 -6637834 -13095909 -16134580 -14645986 -11395386 -10473213 -12721847 -14817908 -14400833 -14037682
3181 -14037682 -17082373 -21478272 -21939185 -17319892 -11131403 -5161746 2092055 10146446
3173 10146446 15365532 16758166 17604029 18953546 16811483 9134561 755840 -2910377
3165 -2910377 -2990767 -3332184 -3249413 265699 5501790 7282260 4607417 1789187 1829618
3156 1829618 3151843 3404474 2602348 1732952 1465620 2758006 5687937 7292234 3815613
3147 3815613 -3974064 -10449436 -11082729 -6658454 -1255535 1536976 237695 -3719163
3139 -3719163 -6089822 -3534442 1929776 4854952 3373979 1088417 983823 1355091 26503
$$ packed form
3199B372559J90785L054009J549240k281319l049196n54235M40836k367442n993071
3190f637834o458075l038671J488594L250600R22173k248634k096061M17075L63151
3181a4037682l044691m395899m60913M619293O188489N969657P253801Q054391
3173A0146446N219086J392634Q45863J349517k142063p676922q378721l666217
3165b910377q0390l41417Q2771L515112N236091J780470k674843k818230M0431
3156A829618J322225K52631q02126q69396k67332J292386K929931J604297l476621
3147C815613p789677o475372o33293M424275N402919K792511j299281l956858
3139c719163k370659K555380N464218K925176j480973k285562j04594L71268j328588
$$ plain form
3130 26503 -1111968 615420 3508560 3884414 2294197 2967915 7092078 10665468 10209740
3121 10209740 7526402 6950061 9801475 13420298 14745829 13387212 11450334 11188309
3113 11188309 12842783 14752186 15794966 17008366 19514677 21345147 18680431 11213251
3105 11213251 4338812 4103040 10749795 18835356 23073106 22329147 18356692 13107560
3097 13107560 8259978 5622134 6245976 9405861 13235946 16053430 16737139 14754626
3089 14754626 10687011 6009089 1473160 -3405785 -8081414 -9401220 -4763995 3123418
3081 3123418 7286682 3708137 -4038296 -8861766 -7770024 -3901183 -1889942 -3189176
3073 -3189176 -5823668 -6826670 -4311949 1385564 7531293 10716940 9927620 7846542
$$ packed form
3130B6503j138471J727388K893140L75854j590217O73718M124163L573390m55728
3121A0209740k683338n76341K851414L618823J325531j358617j936878k62025
3113A1188309J654474J909403J042780J213400K506311J830470k664716p467180
3105A1213251o874439k35772O646755Q085561M237750p43959l972455n249132
3097A3107560m847582k637844O23842L159885L830085K817484O83709j982513
3089A4754626m067615m677922m535929m878945m675629j319806M637225P887413
3081C123418M163264l578545p746433m823470J091742L868841K011241j299234
3073c189176k634492j003002K514721N697513O145729L185647p89320k081078
$$ plain form
3065 7846542 8370202 12607982 17687327 19716405 17730945 14453345 13206859 14456845
3057 14456845 15622495 13940092 8977314 2483215 -3481510 -7963806 -11144625 -13318630
3049 -13318630 -13836641 -11407549 -6000628 3180 3702084 4589029 4198717 2951600 -379888
3040 -379888 -5168428 -7513444 -4782835 47377 1629973 -869710 -3344343 -3177407 -2476672
3031 -2476672 -3687021 -5519006 -5943270 -6718203 -11223724 -18607735 -23695846 -23298380 -19836019
3022 -19836019 -17617690 -17781701 -18438235 -17969411 -16086813 -12710448 -8218200 -4657527 -4398975
3013 -4398975 -6883071 -8496225 -6774748 -3371326 -1576465 -2082718 -2856564 -2353026 -849805
3004 -849805 1036972 2970184 3924423 2837053 647390 -675004 -1687286 -4865847 -8845009
$$ packed form
3065G846542N23660M237780N079345K029078j985460l277600j246486J249986
3057A4456845J165650j682403m962778o494099n964725m482296l180819k174005
3049a3318630n18011K429092N406921O003808L698904Q86945l90312j247117l331488
3040c79888m788540k345016K730609M830212J582596k499683k474633J66936P00735
3031b476672j210349j831985m24264p74933m505521p384011n088111L97466L462361
3022a9836019K218329j64011o56534M68824J882598L376365M492248L560673K58552
3013d398975k484096j613154J721477L403422J794861n06253p73846N03538J503221
3004h49805J886777J933212R54239j087370k189663j322394j012282l178561l979162
$$ plain form
2995 -8845009 -7150676 3314499 15080015 16853726 7184933 -3698967 -6458167 -1907890
2987 -1907890 4059661 9100790 13531273 15048315 10773158 3533564 367076 3894941
2979 3894941 9412456 11644062 10589621 9104159 8199624 7239017 6385580 6230599 6306437
2970 6306437 5898731 5156181 3883117 731251 -4656444 -10133865 -13574067 -15516073 -17254607
2961 -17254607 -17800393 -15382194 -10835955 -6476627 -2296471 3353117 9425724 12189304
2953 12189304 10357040 6870206 4361008 2134444 -607912 -1986605 -842580 -307355
2945 -307355 -4232260 -11230570 -15731279 -14641882 -10108710 -5828367 -3400395 -2588698 -2604647
2936 -2604647 -2254915 -533389 2243420 4924143 6958626 8038915 7003628 3152592
$$ packed form
2995h845009J694333J0465175J1765516J773711r668793j0883900k759200M550277
2987a907890N967551N041129M430483J517042m275157p239594l166488L527865
2979C894941N517515K231606j054441j485462r04535r60607q53437j54981P5838
2970F306437m07706p42550j273064l151866n387695n477421l440202j942006j738534
2961a7254607n45786K418199M546239M359328M180156N649588O072607K763580
2953A2189304j832264l486834k509198k226564k742356j378693J144025N35225
2945c07355l924905o998310m500709J089397M533172M280343K427972Q11697j5949
2936b604647L49732J721526K776809K680723K034483J080289j035287l851036
$$ plain form
2928 3152592 -1775385 -5182824 -6727926 -7301263 -5596956 483206 8654295 12769266
2920 12769266 10304120 5729845 4238298 5459393 5935294 4328028 664161 -6436432
2912 -6436432 -17033908 -26065753 -27129715 -19872379 -10004243 -2529529 1470486 2371121
2904 2371121 1151063 1146737 5669238 12362239 14059060 7255556 -3460780 -10990827 -12504006
2895 -12504006 -9256200 -3524099 1845746 4199928 4218001 5540775 8891351 10037728
2887 10037728 6782408 4092715 7316401 13091174 13084062 5687896 -2265039 -5871714 -8132323
2878 -8132323 -13484464 -20576480 -24983756 -25685833 -25078425 -24389869 -22355749 -17773546 -11243152
2869 -11243152 -4810366 -877907 -239864 -393003 2111497 6282282 6281633 -1069205 -10669077
$$ packed form
2928C152592m927977l407439j545102n73337J704307O080162Q171089M114971
2920A2769266k465146m574275j491547J221095M75901j607266l663867p100593
2912f436432j0597476r031845j063962P257336R868136P474714M000015R00635
2904B371121j220058m326M522501O693001J696821o803504j0716336p530047j513179
2895a2504006L247806N732101N369845K354182J8073J322774L350576J146377
2887A0037728l255320k689693L223686N774773p112p396166p952935l606675k260609
2878h132323n352141p092016m407276p02077O07408O88556K034120M582203O530394
2869a1243152O432786L932459O38043j53139K504500M170785o49p350838r599872
$$ plain form
2860 -10669077 -14573983 -11727168 -8232549 -8287562 -9393232 -7948395 -5523634 -6440019 -11313105
2851 -11313105 -16372744 -18576906 -18562335 -18152449 -17148927 -13951540 -8620067 -4072226 -3598830
2842 -3598830 -7147184 -10765545 -10706390 -7808813 -6285641 -7893230 -9300983 -6522056 -208025
2833 -208025 5407509 7516043 6369039 3011718 -1574129 -5296553 -6107051 -4877173 -4270767
2824 -4270767 -4181214 -1641353 3517326 6704862 4724202 522141 -1428460 -1498230 -2631886
2815 -2631886 -4252938 -3528243 -1419739 -2032998 -6003138 -9711653 -11592136 -13896882 -16897926
2806 -16897926 -16792290 -11895502 -6090037 -2976207 -881444 2866801 6871460 8950574
2798 8950574 10541775 12887019 12325410 5555020 -2549065 -3140128 4889051 13545047 16623693
$$ packed form
2860a0669077l904906K846815L494619n5013j105670J444837K424761r16385m873086
2851a1313105n059639k204162J4571M09886J003522L197387N331473M547841M73396
2842c598830l548354l618361N9155K897577J523172j607589j407753K778927O314031
2833b08025N615534K108534j147004l357321m585847l722424q10498J229878O06406
2824d270767Q9553K539861N158679L187536j980660m202061j950601o9770j133656
2815b631886j621052P24695K108504o13259l970140l708515j880483k304746l001044
2806a6897926J05636M896788N805465L113830K094763L748245M004659K079114
2798H950574J591201K345244n61609o770390q104085n91063Q029179Q655996L078646
$$ plain form
2789 16623693 16032870 15612260 14294284 9004445 973696 -4665127 -4673055 -1077564 1027084
2780 1027084 -1267112 -5211296 -5309641 -858749 2004137 -1114553 -5197887 -2357005 5560241
2771 5560241 8230769 1626262 -5785010 -4561054 4235552 12914805 16912736 15981005
2763 15981005 10611471 3189092 -548621 2910181 9670231 13598731 14421255 15508861
2755 15508861 15902000 11199521 2135686 -4165635 -3239776 1073318 2173811 -1364208
2747 -1364208 -5467339 -6094195 -3326678 -609971 -416086 -755597 2536154 9450253 14538700
2738 14538700 14012369 11056650 10939165 13803158 16313503 17416743 17212897 12727303 1509947
2729 1509947 -11687545 -18829889 -19126212 -18611690 -18778240 -13728965 -1251530 10962169
$$ packed form
2789A6623693n90823m20610j317976n289839q030749n638823p928L595491K104648
2780A027084k294196l944184r8345M450892K862886l118690m083334K840882P917246
2771E560241K670528o604507p411272J223956Q796606Q679253L997931r31731
2763A5981005n369534p422379l737713L458802O760050L928500Q22524J087606
2755A5508861L93139m702479r063835o301321R25859M313094J100493l538019
2747a364208m103131o26856K767517K716707J93885l39511L291751O914099N088447
2738A4538700n26331k955719j17485K863993K510345J103240k03846m485594j1217356
2729A509947j3197492p142344k96323N14522j66550N049275J2477435J2213699
$$ plain form
2721 10962169 14715904 11054339 5897682 1121453 -4641971 -10411974 -13857938 -15319629
2713 -15319629 -15863823 -13618860 -6860051 1239939 5860565 7155502 8913458 11651153
2705 11651153 11987023 8870915 5881045 6248768 8841383 10310434 9236010 7432543
2697 7432543 8232687 13139896 19241052 21243075 17463492 12040447 9447092 9110107 8032822
2688 8032822 6310931 6297384 7781063 7964593 5679541 2279676 -1055705 -3681509 -3895408
2679 -3895408 -581932 3732511 4768700 1559119 -2950294 -5831213 -6064011 -3655889
2671 -3655889 -221158 714218 -2110140 -4335900 -1456942 3278939 2315173 -4532857 -8427954
2662 -8427954 -3934362 2806741 2292417 -6288341 -15603790 -19636993 -18020431 -13014719
$$ packed form
2721A0962169L753735l661565n156657m776229n763424n770003l445964j461691
2713a5319629n44194K244963O758809Q099990M620626J294937J757956K737695
2705A1651153L35870l116108k989870L67723K592615J469051j074424j803467
2697G432543Q00144M907209O101156K002023l779583n423045k593355l36985j077285
2688H032822j721891j3547J483679J83530k285052l399865l335381k625804k13899
2679c895408L313476M314443J036189l209581m509413k880919k32798K408122
2671c655889L434731R35376k824358k225760K878958M735881r63766o848030l895097
2662h427954M493592O741103n14324q580758r315449m033203J616562N005712
$$ plain form
2654 -13014719 -7105872 -3453141 -4697108 -9888193 -14379786 -13863006 -8186200 -1226995
2646 -1226995 2812129 3360191 3689438 6677622 11203339 14162157 14907646 15046368 14485581
2637 14485581 11268957 5795868 1525494 49169 -1343824 -5264276 -9958356 -11466952
2629 -11466952 -8257075 -2414470 1907677 621301 -6906361 -15571963 -18693311 -15668574
2621 -15668574 -12214231 -11866587 -11700237 -8856320 -6479870 -8932318 -14694017 -18766492
2613 -18766492 -19526905 -18475585 -15428478 -9293295 -2540717 270426 -1522339 -4214028
2605 -4214028 -5105602 -4669017 -3747511 -2464532 -1775463 -2395226 -2354210 658318 4846282
2596 4846282 6318372 5307441 5614902 7485559 6457946 1085798 -3373089 -2116764
$$ packed form
2654a3014719N908847L652731j243967n191085m491593N16780N676806O959205
2646a226995M039124N48062L29247K988184M525717K958818P45489J38722n60787
2637A4485581l216624n473089m270374j476325j392993l920452m694080j508596
2629a1466952L209877N842605M322147j286376p527662q665602l121348L024737
2621a5668574L454343L47644J66350K843917K376450k452448n761699m072475
2613a8766492p60413J051320L047107O135183O752578K811143j792765k691689
2605d214028q91574M36585R21506J282979O89069o19763M1016L012528M187964
2596D846282J472090j010931L07461J870657j027613n372148m458887J256325
$$ plain form
2588 -2116764 2422177 4681027 3898916 4022092 7504197 12862965 17453699 19529097 18125922
2579 18125922 13882153 10033429 10096893 13917828 17556209 17465730 13560013 8072711 3008214
2570 3008214 -477083 -1426618 571049 4272240 7051006 6861860 3406757 -2967109 -12221875
2561 -12221875 -22938589 -30799360 -31796687 -27328229 -22835965 -20047301 -14340266 -2841186
2553 -2841186 8465060 10998258 5425990 1304867 4294843 9312794 8819885 3374471
2545 3374471 57392 2922122 9060545 13583217 15329643 16810441 19988055 23307988
2537 23307988 23364397 19404058 14805530 12800057 12224762 10171991 7773684 9175585 14092853
2528 14092853 15873153 9753043 -53558 -5059462 -2653954 1979848 3581855 2994903
$$ packed form
2588b116764M538941K258850p82111J23176L482105N358768M590734K075398j403175
2579A8125922m243769l848724O3464L820935L638381r0479l905717n487302n064497
2570C008214l485297r49535J997667L701191K778766j89146l455103o373866r254766
2561a2221875j0716714p860771r97327M468458M492264K788664N707035J1499080
2553b841186J1306246K533198n572268m121123K989976N017951m92909n445414
2545C374471l317079K864730O138423M522672J746426J480798L177614L319933
2537B3307988N6409l960339m598528k005473n75295k052771k398307J401901M917268
2528A4092853J780300o120110r806601n005904K405508M633802J602007n86952
$$ plain form
2520 2994903 4509455 9219108 13179300 12259892 7438417 3814979 4382084 6606712 6332557
2511 6332557 3219104 78481 -1725272 -3114756 -4275598 -4294018 -3829250 -4670467 -6231180
2502 -6231180 -5990307 -4038098 -3473457 -5383251 -7375561 -8226497 -9450156 -10474573 -7495452
2493 -7495452 -480573 3601222 -641866 -8909344 -13030479 -12265198 -13048709 -18789125 -25527493
2484 -25527493 -27857658 -24776947 -19260268 -15283063 -15085946 -16588492 -14613701 -7917655
2476 -7917655 -3268656 -8036520 -19825236 -28548284 -28479877 -22999321 -17220086 -11864235
2468 -11864235 -6241731 -1914051 -196274 421477 1622257 2814376 3292333 3809053 4032649
2459 4032649 1712173 -3142343 -6312769 -4647878 -959087 -520036 -4240539 -8092458
$$ packed form
2520B994903J514552M709653L960192r19408m821475l623438N67105K224628k74155
2511F332557l113453l140623j803753j389484j160842j8420M64768q41217j560713
2502f231180K40873J952209N64641j909794j992310q50936j223659j024417K979121
2493g495452P014879M081795m243088q267478m121135P65281p83511n740416o738368
2484b5527493k330165L080711N516679L977205J97117j502546J974791O696046
2476g917655M648999m767864j1788716q723048O8407N480556N779235N355851
2468a1864235N622504M327680J717777O17751J200780J192119M77957N16720K23596
2459D032649k320476m854516l170426J664891L688791M39051l720503l851919
$$ plain form
2451 -8092458 -8189596 -4133307 1630738 5743247 6212171 4525937 4490652 7572597 10782367
2442 10782367 10609052 7341847 3754481 1323238 -73172 -285581 808608 2240344
2434 2240344 3358850 5129214 7822733 8830619 5635401 107747 -3144483 -2443630
2426 -2443630 -393834 195931 -1006444 -3162021 -5162053 -4698383 330771 7880492 11812680
2417 11812680 8279564 722523 -3720802 -2206953 1426052 2271689 403663 99325
2409 99325 3833259 8756775 9948524 6165988 717421 -3244525 -5959555 -8312151 -8278424
2400 -8278424 -3609504 2361141 1832525 -8096587 -19673796 -21738092 -12418039 -1332161
2392 -1332161 1860164 -1855759 -4038142 -557643 3888560 3320370 -1469811 -4941953
$$ packed form
2451h092458r7138M056289N764045M112509M68924j686234l5285L081945L209770
2442A0782367j73315l267205l587366k431243j396410k12409J094189J431736
2434B240344J118506J770364K693519J007886l195218n527654l252230P00853
2426b443630K049796N89765j202375k155577k000032M63670N029154P549721L932188
2417A1812680l533116p557041m443325J513849L633005Q45637j868026l04338
2409I9325L733934M923516J191749l782536n448567l961946k715030k352596L3727
2400h278424M668920N970645n28616r929112j1577209k064296R320053J1085878
2392a332161L192325l715923k182383L480499M446203n68190m790181l472142
$$ plain form
2384 -4941953 -4386532 -1963827 -23624 1951826 4939928 7674246 7946451 5209651 857693
2375 857693 -2924251 -3959432 -1233973 3722741 7695048 8872955 8311722 8156965 9776805
2366 9776805 13606111 18522310 20765269 16361657 6456323 -2173556 -4316261 -2132333
2358 -2132333 -1143251 -2231484 -1236276 4070053 10326224 12777729 10568059 6688625 4346338
2349 4346338 4502229 6062334 7512132 8189049 7748080 4928107 -1156518 -7860614 -9937476
2340 -9937476 -5938366 -1311955 -1772306 -5412420 -5722328 -1463308 1703873 60699 -2990062
$$ packed form
2384d941953N55421K422705J940203J975450K988102K734318K72205k736800m351958
2375H57693l781944j035181K725459M956714L972307J177907n61233j54757J619840
2366I776805L829306M916199K242959m403612r905334q629879k142705K183928
2358b132333R89082j088233R95208N306329O256171K451505k209670l879434k342287
2349D346338J55891J560105J449798O76917m40969k819973o084625o704096k076862
2340i937476L999110M626411m60351l640114l09908M259020L167181j643174l050761
$$ [...]
##END NTUPLES=NMR SPECTRUM
##END=
