##TITLE=31Pdec_DE-82k2_TFA
 CDCl3, 64 sc
 4.4.2025
##JCAMPDX= 6.0         $$ Bruker NMR JCAMP-DX V2.0
##DATA TYPE= NMR SPECTRUM
##DATA CLASS= NTUPLES
##ORIGIN= UXNMR, Bruker Analytische Messtechnik GmbH
##OWNER= root
$$ XWIN-NMR		Version 3.5
$$ Fri Apr  4 16:14:47 2025 Russian Standard Time (UT+4h)  she@DPX200
##.OBSERVE FREQUENCY= 81.013821
##.OBSERVE NUCLEUS= ^31P
##.ACQUISITION MODE= SIMULTANEOUS
##.ACQUISITION SCHEME= undefined
##.AVERAGES= 64
##.DIGITISER RES= 17
##SPECTROMETER/DATA SYSTEM= spect
##.PULSE SEQUENCE= zgpg30
##.SOLVENT NAME= DMSO
##.SHIFT REFERENCE= (INTERNAL, DMSO, 0, 198.062)
##AUDIT TRAIL= $$ (NUMBER, WHEN, WHO, WHERE, WHAT)
$$ ##TITLE= Audit trail, XWIN-NMR		Version 3.5
$$ ##JCAMPDX= 5.01
$$ ##ORIGIN= Bruker BioSpin GmbH
$$ ##OWNER= she
$$ F:/spectra/data/she/nmr/P31/2/pdata/1/auditp.txt
$$ ##AUDIT TRAIL=  $$ (NUMBER, WHEN, WHO, WHERE, WHAT)
(   1,<2025-04-04 16:13:50.35 +0400>,<she>,<DPX200>,
      <created by zg, POWCHK disabled, PULCHK disabled
       configuration hash MD5:
       00 E9 B6 7A A2 85 ED C7 34 08 36 98 17 FE 4E 26
       data hash MD5: 32K
       BC 1A A8 D2 C7 8A F6 BB 4B 7D 59 8F BE 33 CA B4>)
(   2,<2025-04-04 16:13:53.03 +0400>,<she>,<DPX200>,
      <Start of raw data processing
       efp BC_mod = 2 LB = 1.5 FT_mod = 6 PKNL = 1 PHC0 = 1454.285 PHC1 = -25.50586 SI = 64K 
       data hash MD5: 64K
       9D AB 1A 8A 2E 52 0C B8 8A 4F AF 2F DD 72 F4 DC>)
(   3,<2025-04-04 16:14:14.90 +0400>,<she>,<DPX200>,
      <pk PHC0 = -82.7783 PHC1 = 226.6001 
       data hash MD5: 64K
       15 CC 62 61 76 E5 6D 1C A6 31 D1 9B 37 8A 39 A9>)
$$ ##END=
$$ 
$$ hash MD5
$$ 65 BF 9C 44 03 F1 5D E5 6F E1 49 EC 1F E0 12 0C
##$RELAX= 
##$RELAX= 
##$RELAX= 
##$RELAX= 
##$RELAX= 
##$RELAX= 
##$RELAX= 
##$RELAX= 
$$ Bruker specific parameters
$$ --------------------------
##$DU= <F:/spectra>
##$EXPNO= 2
##$NAME= <P31>
##$PROCNO= 1
##$TYPE= <nmr>
##$USER= <she>
##$AMP= (0..31)
100 100 100 100 100 100 100 100 100 100 100 100 100 100 100 100 100 100 
100 100 100 100 100 100 100 100 100 100 100 100 100 100 
##$AQSEQ= 0
##$AQ_mod= 1
##$AUNM= <au_zg>
##$AUTOPOS= <>
##$BF1= 81.014009
##$BF2= 200.13
##$BF3= 200.13
##$BF4= 200.13
##$BF5= 200.13
##$BF6= 200.13
##$BF7= 200.13
##$BF8= 200.13
##$BYTORDA= 1
##$CFDGTYP= 0
##$CFRGTYP= 5
##$CHEMSTR= <none>
##$CNST= (0..31)
1 1 145 1 1 1 1 1 1 1 1 1 1 1 1 1 1 1 1 1 1 1 1 1 1 1 1 1 1 1 1 1 
##$CPDPRG= <waltz16>
##$CPDPRG1= <>
##$CPDPRG2= <waltz16>
##$CPDPRG3= <>
##$CPDPRG4= <mlev>
##$CPDPRG5= <mlev>
##$CPDPRG6= <mlev>
##$CPDPRG7= <mlev>
##$CPDPRG8= <mlev>
##$CPDPRGB= <>
##$CPDPRGT= <>
##$D= (0..31)
0 1 0 0 0 0 0 0 0 0.06 0 0.03 2e-05 3e-06 0 0 0.0002 0 0 0 0 0 0 0 0 0 
0 0 0 0 0 0 
##$DATE= 1743768829
##$DBL= (0..7)
120 120 120 11 120 120 24 19 
##$DBP= (0..7)
150 150 150 150 150 150 150 150 
##$DBP07= 0
##$DBPNAM0= <>
##$DBPNAM1= <>
##$DBPNAM2= <>
##$DBPNAM3= <>
##$DBPNAM4= <>
##$DBPNAM5= <>
##$DBPNAM6= <>
##$DBPNAM7= <>
##$DBPOAL= (0..7)
0.5 0.5 0.5 0.5 0.5 0.5 0.5 0.5 
##$DBPOFFS= (0..7)
$$ [...]
##$SUBNAM3= <"">
##$SUBNAM4= <"">
##$SUBNAM5= <"">
##$SUBNAM6= <"">
##$SUBNAM7= <"">
##$SUBNAM8= <"">
##$SUBNAM9= <"">
##$SW= 400.765351723535
##$SWIBOX= (0..15)
0 1 3 0 0 0 0 0 0 0 0 0 0 0 0 0 
##$SW_h= 32467.5324675325
##$TD= 32768
##$TD0= 1
##$TE= 0
##$TE2= 300
##$TE3= 300
##$TEG= 300
##$TL= (0..7)
0 120 53 12 22 120 120 120 
##$TP= (0..7)
150 150 150 150 150 150 150 150 
##$TP07= 0
##$TPNAME0= <>
##$TPNAME1= <>
##$TPNAME2= <>
##$TPNAME3= <>
##$TPNAME4= <>
##$TPNAME5= <>
##$TPNAME6= <>
##$TPNAME7= <>
##$TPOAL= (0..7)
0.5 0.5 0.5 0.5 0.5 0.5 0.5 0.5 
##$TPOFFS= (0..7)
0 0 0 0 0 0 0 0 
##$TUNHIN= 0
##$TUNHOUT= 0
##$TUNXOUT= 0
##$USERA1= <user>
##$USERA2= <user>
##$USERA3= <user>
##$USERA4= <user>
##$USERA5= <user>
##$V9= 5
##$VALIST= <valist>
##$VCLIST= <CCCCCCCCCCCCCCC>
##$VD= 0
##$VDLIST= <DDDDDDDDDDDDDDD>
##$VPLIST= <PPPPPPPPPPPPPPP>
##$VTLIST= <TTTTTTTTTTTTTTT>
##$WBST= 1024
##$WBSW= 4
##$XGAIN= (0..3)
0 0 0 0 
##$XL= 0
##$YL= 0
##$YMAX_a= 7832
##$YMIN_a= -28006
##$ZGOPTNS= <>
##$ZL1= 120
##$ZL2= 120
##$ZL3= 120
##$ZL4= 120
##$ABSF1= 0
##$ABSF2= 0
##$ABSG= 0
##$ABSL= 0
##$ALPHA= 0
##$AQORDER= 0
##$ASSFAC= 0
##$ASSFACI= 0
##$ASSFACX= 0
##$ASSWID= 0
##$AUNMP= <proc_1d>
##$AZFE= 0.1
##$AZFW= 0.5
##$BCFW= 0
##$BC_mod= 2
##$BYTORDP= 0
##$COROFFS= 0
##$CY= -3
##$DATMOD= 1
##$DC= 0
##$DFILT= <>
##$DTYPP= 0
##$F1P= 0
##$F2P= 0
##$FCOR= 1
##$FTSIZE= 65536
##$FT_mod= 6
##$GAMMA= 0
##$GB= 0
##$INTBC= 1
##$INTSCL= 9.790993e-09
##$ISEN= 30
##$LB= 1.5
##$LEV0= 0
##$LPBIN= 0
##$MAXI= 10000
##$MC2= 0
##$MEAN= 0
##$ME_mod= 0
##$MI= 50
##$NCOEF= 0
##$NC_proc= -8
##$NLEV= 6
##$NOISF1= 182.463
##$NOISF2= 159.3651
##$NSP= 0
##$NTH_PI= 0
##$NZP= 0
##$OFFSET= 198.0616
##$PC= 4
##$PHC0= 1371.507
##$PHC1= 201.0942
##$PH_mod= 1
##$PKNL= yes
##$PPARMOD= 0
##$PSCAL= 0
##$PSIGN= 0
##$REVERSE= no
##$SF= 81.0140089999434
##$SI= 65536
##$SIGF1= 159.3651
##$SIGF2= -187.1042
##$SINO= 113.3802
##$SIOLD= 16384
##$SREGLST= <1H.CDCl3>
##$SSB= 0
##$STSI= 65536
##$STSR= 0
##$SW_p= 32467.5324675325
##$SYMM= 0
##$S_DEV= 0
##$TDeff= 32768
##$TDoff= 0
##$TI= <>
##$TILT= no
##$TM1= 0
##$TM2= 0
##$TOPLEV= 0
##$USERP1= <user>
##$USERP2= <user>
##$USERP3= <user>
##$USERP4= <user>
##$USERP5= <user>
##$WDW= 1
##$XDIM= 65536
##$YMAX_p= 264191927
##$YMIN_p= -252575511
$$ End of Bruker specific parameters
$$ ---------------------------------
##NTUPLES= NMR SPECTRUM
##VAR_NAME=  FREQUENCY,     SPECTRUM/REAL,   SPECTRUM/IMAG
##SYMBOL=    X,             R,               I
##VAR_TYPE=  INDEPENDENT,   DEPENDENT,       DEPENDENT
##VAR_FORM=  AFFN,          ASDF,            ASDF
##VAR_DIM=   65536,         65536,           65536
##UNITS=     HZ,            ARBITRARY UNITS, ARBITRARY UNITS
##FACTOR=    0.49542278885378, 1,            1
##FIRST=     16045.7642231865, 0,            0
##LAST=      -16421.768244346, 0,            0
##MIN=       -16421.768244346, -252575511,   0
##MAX=       16045.7642231865, 264191927,    0
$$ Real data points
##PAGE= N=1
##DATA TABLE= (X++(R..R)), XYDATA
$$ [...]
##PAGE= N=2
##DATA TABLE= (X++(I..I)), XYDATA
$$ plain form
6725 -3141933 -5410848 -6386321 -6157102 -6609182 -7610241 -7179464 -5255190 -4305258 -5532436
6716 -5532436 -7055931 -7029878 -6350929 -6615323 -7101651 -5874948 -3024746 -788664 -589252
6707 -589252 -1479997 -1665340 -431247 1597849 3176122 3130553 1053672 -2264704 -5298210
6698 -5298210 -6815346 -6516258 -4994580 -3232667 -1766459 -269302 1510180 2555795
6690 2555795 1547644 -739572 -1684265 -433577 447955 -1424280 -4603885 -6094812 -6055407
6681 -6055407 -7160490 -9694836 -10746373 -8907545 -6471329 -5534929 -4915359 -3026325 -1266623
6672 -1266623 -1815375 -3777855 -4357396 -2817448 -715091 869022 1655540 557103 -3090224
6663 -3090224 -6840945 -6964904 -3553293 -755049 -861856 -1210819 1102008 4077363 3294918
$$ packed form
6725c141933k268915r75473K29219m52080j001059M30777J924274R49932j227178
6716e532436j523495K6053O78949k64394m86328J226703K850202K236082J99412
6707e89252q90745j85343J234093K029096J578273m5569k076881l318376l033506
6698e298210j517136K99088J521678J761913J466208J497157J779482J045615
6690B555795j008151k287216r44693J250688Q81532j872235l179605j490927L9405
6681f055407j105083k534346j051537J838828K436216R36400O19570J889034J759702
6672a266623n48752j962480n79541J539948K102357J584113P86518j098437l647327
6663c090224l750721j23959L411611K798244j06807l48963K312827K975355p82445
$$ plain form
6654 3294918 -1847402 -7365841 -9834230 -9634951 -8679238 -7281597 -4740392 -1733267 -378186
6645 -378186 -1874171 -5053645 -7588862 -8099122 -6726346 -4176451 -1108278 1452982 2182046
6636 2182046 840157 -928886 -1239461 -190182 630549 709298 1186727 2496803 3078101
6627 3078101 1634501 -536067 -1189569 -565673 -1222614 -4163308 -6909349 -6544531 -3590433
6618 -3590433 -1427581 -2221920 -4781941 -6597173 -6757307 -6201687 -5966468 -6137780 -6156315
6609 -6156315 -5351710 -3459013 -1370847 -995874 -3296182 -6615411 -8154034 -7142568 -5252735
6600 -5252735 -3748284 -1969998 608699 2598178 2483525 1080308 601238 1917512 4071572
6591 4071572 5800080 6160770 4451924 1242895 -1057599 -554592 1429667 1845114 20854
$$ packed form
6654C294918n142320n518439k468389J99279R55713J397641K541205L007125J355081
6645c78186j495985l179474k535217n10260J372776K549895L068173K561260P29064
6636B182046j341889j769043l10575J049279Q20731P8749M77429J310076N81298
6627C078101j443600k170568o53502O23896o56941k940694k746041L64818K954098
6618c590433K162852p94339k560021j815232j60134N55620K35219j71312j8535
6609f156315Q04605J892697K088166L74973k300308l319229j538623J011466J889833
6600e252735J504451J778286K578697J989479j14653j403217m79070J316274K154060
6591D071572J728508L60690j708846l209029k300494N03007J984259M15447j824260
$$ plain form
6582 20854 -1628198 -1123031 817262 2430992 2893286 1977568 -345282 -2853573 -3176376
6573 -3176376 -369426 3476240 5309186 4239013 1932864 625455 1327456 3233675
6565 3233675 4247607 2655977 -1262117 -5688086 -9203925 -11433313 -12062363 -10799722
6557 -10799722 -8627394 -7610427 -8814993 -11405159 -13949117 -15319258 -14338415 -10460920
6549 -10460920 -5283539 -1516956 129611 1164671 2032717 1191720 -1503383 -3332524
6541 -3332524 -2558381 -1296976 -2113874 -3776655 -3249700 -525478 1525284 1415422 391078
6532 391078 -236573 -705508 -1655694 -3207587 -5277916 -7566013 -9557443 -11440840 -13893577
6523 -13893577 -15804559 -14097959 -7950362 -1348399 1460608 1605108 3225812 6518177
$$ packed form
6582B0854j649052N05167J940293J613730M62294r15718k322850k508291l22803
6573c176376K806950L845666J832946j070173k306149j307409P02001J906219
6565C233675J013932j591630l918094m425969l515839k229388o29050J262641
6557a0799722K172328J016967j204566k590166k543958j370141R80843L877495
6549a0460920N177381L766583J646567J035060Q68046q40997k695103j829141
6541c332524P74143J261405q16898j662781N26955K724222K050762j09862j024344
6532C91078o27651m68935r50186j551893k070329k288097j991430j883397k452737
6523a3893577j910982J706600O147597O601963K809007J44500J620704L292365
$$ plain form
6515 6518177 7291567 3546084 -1598666 -4561153 -5390579 -5860899 -6607608 -7815589 -10001664
6506 -10001664 -12203438 -11704138 -7600588 -2845071 -871289 -1743797 -3317075 -4531538
6498 -4531538 -5540202 -5875310 -4736806 -2609135 -931440 -447981 -931995 -1919877 -2719593
6489 -2719593 -2418977 -891139 855198 2043680 2879448 3186399 1648478 -2316020 -7042709
6480 -7042709 -10402585 -12137892 -12963615 -12422216 -9720548 -6250928 -4960938 -6676179 -8750255
6471 -8750255 -8278249 -5535038 -3203497 -2885467 -3625586 -3890894 -3762695 -4255748 -5149298
6462 -5149298 -5044807 -3830230 -3444519 -5054027 -6775008 -5939242 -2838148 -203195 745454
6453 745454 1639769 4169074 7796842 10626789 10997918 8156369 3135714 -989838 -1807031
$$ packed form
6515F518177P73390l745483n144750k962487q29426m70320p46709j207981k186075
6506a0001664k201774M99300M103550M755517J973782q72508j573278j214463
6498d531538j008664l35108J138504K127671J677695M83459m84014r87882p99716
6489b719593L00616J527838J746337J188482Q35768L06951j537921l964498m726689
6480g042709l359876j735307q25723N41399K701668L469620J289990j715241k074076
6471h750255M72006K743211K331541L18030p40119k65308J28199m93053q93550
6462e149298J04491J214577L85711j609508j720981Q35766L101094K634953R48649
6453G45454Q94315K529305L627768K829947L71129k841549n020655m125552q17193
$$ plain form
6444 -1807031 -659715 -763180 -2204970 -1923591 693211 1935472 -563444 -3701290 -3351621
6435 -3351621 -283051 1710354 1643903 1691063 2853702 3838447 3830862 3293692 2197614 264534
6425 264534 -1201782 -557213 1052962 573401 -2597638 -5658387 -6285355 -5098978 -3748524
6416 -3748524 -2861988 -2510782 -2421757 -1044557 3157516 8482662 10558770 7743333 3833853
6407 3833853 3389574 5989767 7448877 5727521 3116665 2553959 3848484 4345131 2223461
6398 2223461 -1724868 -5300357 -7329672 -8640662 -10533493 -12658298 -13204708 -11394200
6390 -11394200 -8905946 -8008222 -8628416 -8256829 -5064302 -433987 2395150 2071421 498465
6381 498465 13575 451600 490579 947260 4012607 8791464 10545327 6245306 -1245813
$$ packed form
6444a807031J147316j03465j441790K81379K616802J242261k498916l137846L49669
6435c351621L068570J993405o6451M7160J162639R84745p585n37170j096078j933080
6425B64534j466316O44569J610175m79561l171039l060749o26968J186377J350454
6416c748524Q86536L51206Q9025J377200M202073N325146K076108k815437l909480
6407C833853m44279K600193J459110j721356k610856n62706J294525M96647k121670
6398B223461l948329l575489k029315j310990j892831k124805n46410J810508
6390a1394200K488254Q97724o20194L71587L192527M630315K829137l23729j572956
6381D98465m84890M38025L8979M56681L065347M778857J753863m300021p491119
$$ plain form
6372 -1245813 -6800721 -9071701 -10232075 -11274475 -11223551 -10523970 -11219727 -12967587 -12389495
6363 -12389495 -7993122 -2951129 -1123764 -2564060 -4818881 -6503046 -7294485 -6251689
6355 -6251689 -3047417 -23092 -270096 -3732470 -7291178 -8628067 -8029909 -6398809 -3756293
6346 -3756293 -481357 1800420 1843291 349673 -1061692 -1781031 -2312025 -3068707 -3918934
6337 -3918934 -4542747 -4500061 -3314871 -1341423 -241476 -1471061 -4233475 -6159065 -6428074
6328 -6428074 -6854782 -8899525 -10981450 -10579444 -8153801 -6538636 -6473718 -5525997 -2470469
6319 -2470469 -91529 -1532578 -5696724 -8772419 -9218784 -8648638 -8337425 -7554816 -5558795
6310 -5558795 -2999996 -829246 495080 423046 -1386590 -3871133 -5243922 -5155997 -4766271
$$ packed form
6372a245813n554908k270980j160374j042400N0924O99581o95757j747860N78092
6363a2389495M396373N041993J827365j440296k254821j684165p91439J042796
6355f251689L204272L024325k47004l462374l558708j336889N98158J631100K642516
6346c756293L274936K281777M2871j493618j411365p19339n30994p56682q50227
6337c918934o23813M2686J185190J973448J099947j229585k762414j925590k69009
6328f428074m26708k044743k081925M02006K425643J615165O4918R47721L055528
6319b470469K378940j441049m164146l075695m46365N70146L11213P82609J996021
6310e558795K558799K170750J324326p2034j809636k484543j372789Q7925L89726
$$ plain form
6301 -4766271 -4723475 -4833270 -5614977 -7931201 -10778933 -11859808 -11015004 -10663107 -11870941
6292 -11870941 -12536955 -10941572 -8658663 -7897048 -7924659 -6495709 -3504708 -1004184 -532890
6283 -532890 -2301248 -5972380 -10238348 -12519103 -11201488 -7685529 -4544017 -2488596
6275 -2488596 -955646 -512715 -2043492 -4058371 -3635472 -291130 3417527 5446143 6171927
6266 6171927 6396397 5893825 4837474 4431888 4872972 4616270 3096755 2299039 3688886
6257 3688886 5092829 3148462 -1742492 -5441823 -5252496 -2811793 -1037964 -249370 1079030
6248 1079030 3092733 4314718 4336960 4603103 5874758 6617817 5128513 2212847 406919
6239 406919 1059050 3252430 5035117 4607368 1091215 -4206352 -7747304 -6924967 -3307997
$$ packed form
6301d766271M2796j09795p81707k316224k847732j080875Q44804L51897j207834
6292a1870941o66014J595383K282909P61615k7611J428950K991001K500524M71294
6283e32890j768358l671132m265968k280755J317615L515959L141512K055421
6275b488596J532950M42931j530777k014879M22899L344342L708657K028616P25784
6266F171927K24470n02572j056351m05586M41084k56702j519515p97716J389847
6257C688886J403943j944367m890954l699331J89327K440703J773829P88594J328400
6248A079030K013703J221985K2242K66143J271655P43059j489304k915666j805928
6239D06919O52131K193380J782687m27749l516153n297567l540952Q22337L616970
$$ plain form
6230 -3307997 -945222 -1469188 -3011027 -4083605 -5696385 -8507479 -10676813 -10594088 -9538293
6221 -9538293 -9206552 -8445983 -5410882 -1791306 -1492740 -5123415 -8786283 -9045321 -6731071
6212 -6731071 -4838880 -4517100 -4375606 -2644056 989596 5028099 7084756 5766657 2048713
6203 2048713 -1615363 -3539391 -3714404 -2908376 -1805788 -837742 74472 1440011 3060732
6194 3060732 3508148 1937238 -90002 -188565 1614018 2905440 2251431 830205 298490
6185 298490 604434 625400 -250625 -1894930 -3867717 -5586786 -6860683 -8374145 -10562458
6176 -10562458 -11975249 -10316691 -5625650 -947528 965926 430559 -438175 -530618 -323639
6167 -323639 -683917 -2104652 -4365200 -6136327 -5766831 -3302283 -858141 -92449 -232686
$$ packed form
6230c307997K362775n23966j541839j072578j612780k811094k169334Q2725J055795
6221i538293L31741P60569L035101L619576K98566l630675l662868k59038K314250
6212f731071J892191L21780J41494J731550L633652M038503K056657j318099l717944
6203B048713l664076j924028j75013Q06028J102588R68046R12214J365539J620721
6194C060732M47416j570910k027240r8563J802583J291422o54009j421226n31715
6185B98490L05944K0966q76025j644305j972787j719069j273897j513462k188313
6176a0562458j412791J658558M691041M678122J913454n35367q68734r2443K06979
6167c23639l60278j420735k260548j771127L69496K464548K444142P65692j40237
$$ plain form
6158 -232686 303476 1283167 1218403 89413 -242410 1311840 3255428 3090506 210873
6149 210873 -3356863 -5051463 -4375698 -3235182 -3621316 -5309855 -6432474 -6103222 -5403694
6140 -5403694 -5447751 -5640678 -4805921 -3250385 -2432466 -2774773 -2998360 -1933689 -204677
6131 -204677 405242 -981153 -3197930 -4020262 -2412609 164364 1036886 -877539 -3988864
6122 -3988864 -6115094 -6977473 -7721164 -8467152 -7963457 -6072887 -4900890 -5940161 -7102003
6113 -7102003 -4768179 1130818 6268562 7108949 5067947 3932755 4787551 5900991 6587400
6104 6587400 7940587 9526436 8684772 4673416 913353 871630 3399524 4491948 2586632
6095 2586632 -196573 -1470146 -984332 284720 1567911 2549361 3354584 4300976 4929266
$$ packed form
6158b32686N36162R79691o4764j128990l31823J554250J943588j64922k879633
6149B10873l567736j694600O75765J140516l86134j688539j122619L29252O99528
6140e403694m4057j92927Q34757J555536Q17919l42307k23587J064671J729012
6131b04677O09919j386395k216777q22332J607653K576973Q72522j914425l111325
6122c988864k126230q62379p43691p45988N03695J890570J171997j039271j161842
6113g102003K333824N898997N137744Q40387k041002j135192Q54796J113440O86409
6104F587400J353187J585849q41664m011356l760063m1723K527894J092424j905316
6095B586632k783205j273573M85814J269052J283191R81450Q05223R46392O28290
$$ plain form
6086 4929266 3960309 1188396 -1622991 -3087084 -4200311 -6159576 -7440414 -5624391
6078 -5624391 -1482338 1498470 1556318 163722 -803862 -874246 29121 1671882 2312257
6069 2312257 166216 -3437862 -5086710 -4038612 -3094076 -3991490 -5135600 -5197891 -5658454
6060 -5658454 -7626242 -8945112 -7141925 -3330705 -716196 -673238 -2379496 -4819341 -7019797
6051 -7019797 -7597851 -6112417 -3848115 -1778893 718337 3567725 4481948 2104468 -1028074
6042 -1028074 -1398595 680760 1690369 -510397 -5019880 -9930098 -13666589 -15032133
6034 -15032133 -14217963 -13219713 -13317610 -13086311 -10940755 -8275631 -7347148 -7223173 -5135203
6025 -5135203 -1250518 1387439 1682828 1865814 3529546 5392460 5936241 5629790 5457873
$$ packed form
6086D929266r68957k771913k811387j464093j113227j959265j280838J816023
6078e624391M142053K980808N7848j392596r67584p0384R03367J642761O40375
6069B312257k146041l604078j648848J048098R44536q97414j144110o2291m60563
6060e658454j967788j318870J803187L811220K614509M2958j706258k439845k200456
6051g019797n78054J485434K264302K069222K497230K849388R14223k377480l132542
6042a028074l70521K079355J009609k200766m509483m910218l736491j365544
6034a5032133Q14170R98250r7897K31299K145556K665124R28483J23975K087970
6025e135203L884685K637957K95389J82986J663732J862914N43781l06451j71917
$$ plain form
6016 5457873 5376338 5090030 4484860 2823034 -422527 -3634250 -4396076 -3237198 -3278574
6007 -3278574 -5318900 -6307203 -4255737 -1728605 -2035282 -4240222 -4894566 -3362351 -2334758
5998 -2334758 -3369702 -4699580 -4141350 -2282596 -1636715 -3494402 -6617467 -8882968 -9431931
5989 -9431931 -8799344 -7486284 -5514023 -3511342 -2783522 -3333253 -3100492 -653372 2412808
5980 2412808 3537550 2720175 1881343 1538552 693844 -464879 -671353 -283431 -764796
5971 -764796 -1325171 359861 3385669 3585310 -48655 -2858504 -1114949 2401636 2875900
5962 2875900 561568 -793096 -510433 -1186726 -3266571 -4320563 -4021944 -5251179 -8899286
5953 -8899286 -11521892 -10292105 -7176744 -5646791 -5612735 -4539587 -2077360 -449148 -667816
$$ packed form
6016E457873q1535k86308o05170j661826l245561l211723p61826J158878m1376
6007c278574k040326r88303K051466K527132l06677k204940o54344J532215J027593
5998b334758j034944j329878N58230J858754O45881j857687l123065k265501n48963
5989i431931O32587J313060J972261K002681P27820n49731K32761K447120L066180
5980B412808J124742q17375q38832l42791q44708j158723k06474L87922m81365
5971g64796n60375J685032L025808J99641l633965k809849J743555L516585M74264
5962B875900k314332j354664K82663o76293k079845j053992K98619j229235l648107
5953h899286k622606J229787L115361J529953L4056J073148K462227J628212k18668
$$ plain form
5944 -667816 -1228331 -998634 -1033297 -2372539 -3726942 -2992557 -362296 1595291 926297
5935 926297 -1783705 -4645609 -6580663 -7713492 -8511071 -9305035 -10211201 -10854400 -10559303
5926 -10559303 -9418683 -8638190 -8990508 -9462677 -8588528 -6810381 -6160203 -7571910 -9853026
5917 -9853026 -11541819 -12407760 -12667744 -12163073 -11207379 -11059370 -12322788 -13551145 -12638171
5908 -12638171 -9334983 -5432188 -2545256 -606883 1192401 2598700 2173585 -739433
5900 -739433 -4409369 -6119452 -5542584 -5640141 -9141456 -14829030 -18588281 -17699173 -12853391
5891 -12853391 -6568603 -1362624 901500 108260 -1301729 -573857 1725746 2109894 -1107196
5882 -1107196 -5254488 -6455828 -3924532 -156740 2029308 1886236 1095167 2074640 5017463
$$ packed form
5944f67816n60515K29697l4663j339242j354403P34385K630261J957587o68994
5935I26297k710002k861904j935054j132829p97579p93964r06166o43199K95097
5926a0559303J140620P80493l52318m72169Q74149J778147O50178j411707k281116
5917i853026j688793q65941k59984N04671R55694J48009j263418j228357R12974
5908a2638171L303188L902795K886932J938373J799284J406299m25115k913018
5900g39433l669936j710083N76868r7557l501315n687574l759251Q89108M845782
5891a2853391O284788N205979K264124p93240j409989P27872K299603L84148l217090
5882a107196m147292j201340K531296L767792K186048j43072p91069R79473K942823
$$ plain form
5873 5017463 6958058 5338240 1826848 125482 539914 211877 -1220532 -628912 2661884
5864 2661884 4643976 2967839 1129697 2649001 4972370 3879040 864380 585167
5856 585167 2843689 3040871 47422 -2122899 -1051240 816382 831210 -478514 -2237171
5847 -2237171 -5222518 -8949280 -10350585 -7873850 -4263983 -3051661 -4370419 -5991848
5839 -5991848 -6383490 -5103315 -2287571 558790 1209521 -295426 -1234909 -131092 1162589
5830 1162589 845806 105565 536593 1029710 -91273 -1796964 -2210742 -2259140 -4261701
5821 -4261701 -7737609 -9768389 -9198494 -7555724 -5929448 -3963792 -2327629 -3116581 -6514523
5812 -6514523 -9423126 -9081009 -6462538 -4539205 -4460035 -5139734 -5702800 -6367292 -7076656
$$ packed form
5873E017463J940595j619818l511392j701366M14432l28037j432409N91620L290796
5864B661884J982092j676137j838142J519304K323369j093330l014660k79213
5856E85167K258522J97182k993449k170321J071659J867622J4828j309724j758657
5847b237171k985347l726762j401305K476735L609867J212322j318758j621429
5839e991848l91642J280175K815744K846361O50731j504947r39483J103817J293681
5830A162589l16783p40241M31028M93117j120983j705691m13778m8398k002561
5821d261701l475908k030780N69895J642770J626276J965656J636163p88952l397942
5812f514523k908603L42117K618471J923333P9170o79699n63066o64492p09364
$$ plain form
5803 -7076656 -7077307 -6336056 -5960543 -6364890 -6106519 -3741128 -127365 2587241 3941914
5794 3941914 5313900 6886994 6607706 3357879 -632523 -2350295 -1686020 -582050 291647
5785 291647 1472926 2174888 1018862 -635483 618611 5291296 9688324 10862338 10051266
5776 10051266 9426383 8268691 5090252 1398670 35087 836879 1134319 178868 62895
5767 62895 1942500 3985735 3984278 2137897 278201 -406215 -135846 -32794 -1372742
5758 -1372742 -4432147 -7616685 -8545966 -6472768 -3048580 -452425 591045 708374 557437
5749 557437 202856 -454080 -1105336 -1106956 -173478 1167815 2141596 2611403 2910325 3065745
5739 3065745 3140519 4104639 6754714 9474102 9095928 5125411 1158512 281052 772150
$$ packed form
5803g076656o51P41251L75513m04347K58371K365391L613763K714606J354673
5794C941914J371986J573094k79288l249827l990402j717772O64275J103970Q73697
5785B91647J181279P01962j156026j654345J254094M672685M397028J174014q11072
5776A0051266o24883j157692l178439l691582j363583Q01792K97440r55451j15973
5767F2895J879605K043235j457j846381j859696o84416K70369J03052j339948
5758a372742l059405l184538r29281K073198L424188K596155J043470J17329j50937
5749E57437l54581o56936o51256j620R33478J341293R73781M69807K98922J55420
5739C065745P4774R64120K650075K719388l78174l970517l966899q77460M91098
$$ plain form
5730 772150 -1049185 -4844917 -6384636 -3709326 -5275 860466 -757206 -1601550 -145190
5721 -145190 2090495 3173542 2889939 2063512 1021074 -493089 -2237996 -3148755 -2603611
5712 -2603611 -1609815 -1713724 -2663842 -2523567 -732700 561415 -402829 -2180519 -2601755
5703 -2601755 -2802198 -5610334 -10159211 -11705206 -7948165 -2414886 404819 756116 1881619
5694 1881619 4409729 5635348 3895762 848910 -1043827 -1343612 -1347733 -2359656 -4760823
5685 -4760823 -7766856 -9714705 -9428358 -7548420 -5775398 -4763530 -3695022 -2065251
5677 -2065251 -788037 -962083 -2282657 -3352470 -3273689 -2519627 -2357273 -3546790 -5503876
5668 -5503876 -6824315 -6730941 -5619038 -4001291 -1825594 391703 902789 -1053860 -3012325
$$ packed form
5730G72150j821335l795732j539719K675310L704051Q65741j617672q44344J456360
5721a45190K235685J083047k83603q26427j042438j514163j744907r10759N45144
5712b603611R93796j03909r50118J40275J790867J294115r64244j777690m21236
5703b601755k00443k808136m548877j545995L757041N533279K819705L51297J125503
5694A881619K528110J225619j739586l046852j892737k99785m121j011923k401167
5685d760823l006033j947849K86347J879938J773022J011868J068508J629771
5677b065251J277214j74046j320574j069813P8781P54062J62354j189517j957086
5668e503876j320439R3374J111903J617747K175697K217297N11086j956649j958465
$$ plain form
5659 -3012325 -1670284 2232271 4017232 1154351 -3281796 -5180613 -5074825 -6184595
5651 -6184595 -8320751 -7834320 -3851340 -610644 -1851457 -5760576 -7800259 -6541281
5643 -6541281 -4166061 -2518107 -1395938 -373643 94652 -330465 -1403088 -2977202 -4849779
5634 -4849779 -5987399 -5311462 -3330504 -1803266 -1835113 -3366455 -6015489 -8802899 -9472550
5625 -9472550 -6278778 -734658 3343791 3958912 2394779 496254 -1204277 -2226619
5617 -2226619 -1801272 -1023920 -2656104 -6899742 -9804863 -8284523 -4611252 -3070266 -3917496
5608 -3917496 -4138910 -3087055 -3269173 -5383419 -6517459 -4620356 -1642452 -387451 -654322
5599 -654322 -609170 -163191 -602240 -1893181 -2703118 -2796566 -3359002 -4690067 -5286894 -4002240
$$ packed form
5659c012325J342041L902555J784961k862881m436147j898817J05788j109770
5651f184595k136156M86431L982980L240696j240813l909119k039683J258978
5643f541281K375220J647954J122169J022295M68295m25117j072623j574114j872577
5634d849779j137620O75937J980958J527238l1847j531342k649034k787410o69651
5625i472550L193772N544120M078449O15121j564133j898525j700531j022342
5617b226619M25347P77352j632184m243638k905121J520340L673271J540986q47230
5608c917496k21414J051855j82118k114246j134040J897103K977904J255001k66871
5599f54322M5152M45979m39049j290941q09937r3448n62436j331065n96827J284654
$$ plain form
5589 -4002240 -1984355 -1379425 -2528571 -3544191 -2870889 -1344746 -930687 -1971578 -2953812
5580 -2953812 -3057243 -3457836 -5293281 -7576010 -8420798 -7520212 -5993897 -4474511 -3044488
5571 -3044488 -2619946 -4295028 -7102594 -8438330 -7378985 -5781147 -5171954 -4379382 -1827393
5562 -1827393 1172220 1530512 -1557069 -5456411 -7206330 -6382543 -4408716 -2303980 -234104
5553 -234104 1251745 954280 -1457141 -4452570 -6103812 -6271192 -6285397 -6471351 -5461905
5544 -5461905 -2690998 -86410 247905 -933868 -1190858 -76657 550081 -57594 -226966
5535 -226966 1095944 2084743 451903 -3137981 -5781554 -5838347 -4280402 -2888919 -2374885
5526 -2374885 -2240339 -1559211 137619 2164897 3093503 2479731 1825273 2935805 5469866
$$ packed form
5589d002240K017885O04930j149146j015620O73302J526143M14059j040891r82234
5580b953812j03431m00593j835445k282729q44788R00586J526315J519386J430023
5571c044488M24542j675082k807566j335736J059345J597838O09193P92572K551989
5562a827393K999613L58292l087581l899342j749919Q23787J973827K104736K069876
5553b34104J485849k97465k411421k995429j651242j67380j4205j85954J009446
5544e461905K770907K604588L34315j181773k56990J114201O26738o07675j69372
5535b26966J322910R88799j632840l589884k643573n6793J557945J391483N14034
5526b374885J34546O81128J696830K027278R28606o13772o54458J110532K534061
$$ plain form
5517 5469866 7098071 6311637 4214804 2949796 2890338 2354324 258445 -1904411 -1799346
5508 -1799346 287820 1182542 -1302575 -5458323 -7889712 -7707969 -6867630 -6955680 -7773364
5499 -7773364 -9054729 -11153875 -13225968 -12982196 -9792513 -6412455 -5898903 -7935633 -9850210
5490 -9850210 -10225709 -9613030 -8410218 -6231974 -3376167 -1064472 85790 413855 -75021
5481 -75021 -1755099 -3772622 -4122987 -2327278 -725982 -1789667 -4913252 -7239513 -7272766
5472 -7272766 -6213958 -5588645 -5053313 -3538769 -1700760 -1760426 -4732022 -8872286 -11484610
5463 -11484610 -11644338 -10525175 -9569951 -9196547 -9070371 -8729352 -7833727 -6511108 -5631811
5454 -5631811 -6166831 -8064224 -10144854 -11171101 -10705498 -9088380 -7063151 -5303174 -3901443
$$ packed form
5517E469866J628205p86434k096833j265008n9458n36014k095879k162856J05065
5508a799346K087166Q94722k485117m155748k431389J81743Q40339q8050q17684
5499g773364j281365k099146k072093K43772L189683L380058N13552k036730j914577
5490i850210l75499O12679J202812K178244K855807K311695J150262L28065m88876
5481g5021j680078k017523l50365J795709J601296j063685l123585k326261l3253
5472g272766J058808O25313N35332J514544J838009n9666k971596m140264k612324
5463a1484610j59728J119163R55224L73404J26176L41019Q95625J322619Q79297
5454e631811n35020j897393k080630j026247M65603J617118K025229J759977J401731
$$ plain form
5445 -3901443 -2577567 -1620778 -1786357 -2641997 -2291637 -108439 1546665 455333 -1636910
5436 -1636910 -1181553 1667291 3197085 2178135 1863237 4325579 6503370 4729198 386343
5427 386343 -2321763 -2263707 -1498184 -884082 594628 2549715 2847158 924305 -1412070
5418 -1412070 -2900590 -3983146 -4742220 -4346400 -3210664 -3242987 -5026094 -6845836 -7326103
5409 -7326103 -6972139 -6287082 -4546049 -1631759 806487 1315850 221174 -1710106 -4363527
5400 -4363527 -6903418 -7311836 -5015587 -2450283 -2296472 -4421102 -7034102 -9272822 -10737271
5391 -10737271 -10124370 -7017019 -4069101 -4435335 -7142036 -7749729 -4024158 1454297 4944876
5382 4944876 5464151 4067996 1544697 -1373640 -3103027 -2708358 -1715953 -2604945 -5637525
$$ packed form
5445c901443J323876R56789j65579q55640L50360K183198J655104j091332k092243
5436a636910M55357K848844J529794j018950l14898K462342K177791j774172m342855
5427C86343k708106N8056P65523O14102J478710J955087K97443j922853k336375
5418a412070j488520j082556p59074L95820J135736l2323j783107j819742m80267
5409g326103L53964O85057J741033K914290K438246N09363j094676j931280k653421
5400d363527k539891m08418K296249K565304J53811k124630k613000k238720j464449
5391a0737271O12901L107351K947918l66234k706701o07693L725571N478455L490579
5382D944876N19275j396155k523299k918337j729387L94669R92405q88992l032580
$$ plain form
5373 -5637525 -8613381 -9660940 -8852293 -6986275 -4358947 -1449010 386997 50496 -1912789
5364 -1912789 -3915876 -5078010 -5641773 -5780070 -4819351 -2099967 1576535 3774196 2246769
5355 2246769 -2596768 -7397261 -9034255 -8250080 -8837640 -12587650 -16497788 -16431017 -12374224
5346 -12374224 -7991863 -5593438 -4092913 -2105762 -320142 373579 837000 2032223
5338 2032223 3013771 2359031 421725 -1526761 -3325336 -5357070 -7004419 -7644011 -8313271
5329 -8313271 -10157739 -11792370 -10668198 -6966318 -3694055 -2680055 -2942957 -3598225 -5660258
5320 -5660258 -9424133 -12257259 -11263916 -7096555 -3088500 -1065391 182834 2272412
5312 2272412 4631589 5087271 2237146 -3173204 -8720494 -11874442 -11668666 -9444340 -7854740
$$ packed form
5373e637525k975856j047559Q08647J866018K627328K909937J836007l36501j963285
5364a912789k003087j162134n63763j38297R60719K719384L676502K197661j527427
5355B246769m843537m800493j636994P84175n87560l750010l910138O6771M056793
5346a2374224M382361K398425J500525J987151J785620O93721M63421J195223
5338B032223R81548o54740j937306j948486j798575k031734j647349o39592o69260
5329h313271j844468j634631J124172L701880L272263J014000k62902o55268k062033
5320e660258l763875k833126R93343M167361M008055K023109J248225K089578
5312B272412K359177M55682k850125n410350n547290l153948K05776K224326J589600
$$ plain form
5303 -7854740 -8538028 -10462617 -10925786 -8576994 -5071211 -3099796 -3214367 -3724098 -3581251
5294 -3581251 -3805874 -5577308 -8379159 -10800866 -11834863 -10660019 -6876362 -2126302
5286 -2126302 413329 -120937 -756164 867630 2425971 228844 -4830668 -8173833 -7701037
5277 -7701037 -5499411 -3737158 -2685064 -2951195 -5504513 -8505764 -8161890 -4315724 -1386736
5268 -1386736 -1848219 -2692776 -1015307 788980 -821000 -4273048 -5299557 -3686377 -2882579
5259 -2882579 -3702737 -3086626 481849 4317485 5444746 4128326 2220903 454181 -1144059
5250 -1144059 -1932681 -1326085 66204 882674 108824 -2390921 -5595418 -7589182 -7144227
5241 -7144227 -5136225 -3508813 -2991586 -2868796 -2708775 -2939739 -3682146 -4299786 -4304720 -3707605
$$ packed form
5303g854740o83288j924589m63169K348792L505783J971415j14571n09731J42847
5294c581251k24623j771434k801851k421707j033997J174844L783657M750060
5286b126302K539631n34266o35227J623794J558341k197127n059512l343165M72796
5277g701037K201626J762253J052094k66131k553318l001251L43874L846166K928988
5268a386736m61483q44557J677469J804287j609980l452048j026509J613180Q03798
5259b882579q20158O16111L568475L835636J127261j316420j907423j766722j598240
5250a144059p88622O06596J392289Q16470p73850k499745l204497j993764M44955
5241g144227K008002J627412N17227J22790J60021k30964p42407o17640m934N97115
$$ plain form
5231 -3707605 -2531240 -1097389 -635831 -2158840 -4553841 -5239721 -3259737 -591892 233959
5222 233959 -1080289 -2879200 -3939236 -4671560 -5876105 -6820417 -5313583 -331310 5798268
5213 5798268 9118831 8293413 5846182 4617839 4594296 4335154 3742818 3484533 3052685
5204 3052685 1776439 836485 1655373 2833528 1623689 -1493204 -2782168 -620826 1939794
5195 1939794 1432090 -1585085 -4233351 -5620597 -7148756 -9496813 -11494324 -11801863 -10073421
5186 -10073421 -6497576 -1684039 2668257 4253738 2238174 -1467286 -3708076 -3098513
5178 -3098513 -1296934 -950916 -2487978 -3621802 -2416889 -147098 -132979 -3772086 -8497110
5169 -8497110 -10010188 -6415991 -229216 3693769 2703907 -959716 -2665028 -740591
$$ packed form
5231c707605J176365J433851M61558j523009k395001o85880J979984K667845Q25851
5222B33959j314248j798911j060036p32324j204545r44312J506834M982273O129578
5213E798268L320563q25418k447231j228343k3543k59142n92336k58285m31848
5204C052685j276246r39954Q18888J178155j209839l116893j288964K161342K560620
5195A939794n07704l017175k648266j387246j528159k348057j997511l07539J728442
5186a0073421L575845M813537M352296J585481k015564l705460k240790O09563
5178c098513J801579L46018j537062j133824J204913K269791J4119l639107m725024
5169h497110j513078L594197O186775L922985r89862l663623j705312J924437
$$ plain form
5161 -740591 1716684 878092 -3320470 -7733107 -9698335 -8677847 -5418695 -1528585 725456
5152 725456 237700 -1491715 -2356014 -2611021 -4018523 -6618343 -8690340 -9708214 -10756349
5143 -10756349 -11775347 -11015174 -7950853 -4357049 -1555388 1140978 4117300 5823910
5135 5823910 4996470 2737035 853475 -311179 -916778 -142595 2437560 5181969 6046925
5126 6046925 5241165 4541375 4544546 4269605 3183806 2031821 1538162 1471528 1288063 976977
5116 976977 985345 1590611 2475288 3023134 3161533 3420351 3565436 1950924 -2388293 -7493102
5106 -7493102 -10169976 -9801189 -8423524 -7051122 -4676388 -1667200 -1040251 -4310528 -8403283
5097 -8403283 -9190528 -6607472 -4006583 -3763995 -5806869 -9219269 -12639983 -13814666 -11456325
$$ packed form
5161g40591K457275q38592m198562m412637j965228J020488L259152L890110K254041
5152G25456m87756j729415q64299k55007j407502k599820k071997j017874j048135
5143a0756349j018998P60173L064321L593804K801661K696366K976322J706610
5135E823910q27440k259435j883560j164654o05599P74183K580155K744409Q64956
5126F046925q05760o99790L171k74941j085799j151985m93659o6634j83465l11086
5116I76977Q368O05266Q84677N47846J38399K58818J45085j614512m339217n104809
5106g493102k676874L68787J377665J372402K374734L009188O26949l270277m092755
5097h403283p87245K583056K600889K42588k042874l412400l420714j174683K358341
$$ plain form
5088 -11456325 -7415032 -4840646 -4468090 -4777375 -5207046 -6475064 -7829488 -7056721 -4029776
5079 -4029776 -1613093 -1832780 -3359290 -4108732 -4205764 -4625805 -4777169 -3723745 -2595363
5070 -2595363 -3257451 -5079230 -5537153 -4129223 -3130144 -3564124 -2885928 1295145 6787788
5061 6787788 8894237 6587603 3807404 3858856 5158440 4396976 1905521 1034904 2942733
5052 2942733 4973951 4645268 2755698 1490452 1346307 1282270 586553 -704562 -2254857
5043 -2254857 -3164533 -2207991 440688 2452235 1582213 -1670998 -4569082 -4978473 -3039629
5034 -3039629 -448396 1261872 2044511 3243684 5627020 7625123 6926126 4089388 2565133
5025 2565133 3991542 5548466 4051273 1027238 833586 4384136 7863131 8065972 6155427
$$ packed form
5088a1456325M041293K574386L72556l09285m29671j268018j354424P72767L026945
5079d029776K416683k19687j526510p49442r7032m20041j51364J053424J128382
5070b595363o62088j821779m57923J407930R99079m33980O78196M181073N492643
5061F787788K106449k306634k780199N1452J299584p61464k491455q70617J907829
5052B942733K031218l28683j889570j265246j44145o4037o95717j291115j550295
5043b254857r09676R56542K648679K011547q70022l253211k898084m09391J938844
5034c039629K591233J710268P82639J199173K383336J998103o98997k836738j524255
5025B565133J426409J556924j497193l024035j93652L550550L478995K02841j910545
$$ plain form
5016 6155427 4855727 4285400 2664868 -179621 -2359548 -2722851 -2183576 -1968344 -2175990
5007 -2175990 -2801972 -4706009 -8111645 -10950675 -10476932 -6565501 -1981533 803175 1664300
4998 1664300 1567971 1108201 922209 1594008 2099185 372879 -3253065 -5525793 -5017505
4989 -5017505 -4629143 -6511665 -7413590 -3500616 2249229 2980368 -2345016 -7856381 -9669501
4980 -9669501 -9935737 -10650148 -9584106 -5425445 -1722284 -1739383 -3357132 -2908739 -554021
4971 -554021 1960035 5354762 10266500 13644037 12437214 8701498 6532292 5861693 3845476
4962 3845476 677154 -844680 -458836 -435009 -1073450 -672556 431914 154229 -1158414
4953 -1158414 -1046245 399510 171596 -2899241 -6517576 -8414182 -8295930 -6322992 -3053210
$$ packed form
5016F155427j299700n70327j620532k844489k179927l63303N39275K15232k07646
5007b175990o25982j904037l405636k839030M73743L911431M583968K784708Q61125
4998A664300r6329m59770j85992O71799N05177j726306l625944k272728N08288
4989e017505L88362j882522r01925L912974N749845P31139n325384n511365j813120
4980i669501k66236p14411J066042M158661L703161j7099j617749M48393K354718
4971e54021K514056L394727M911738L377537j206823l735716k169206o70599k016217
4962C845476l168322j521834L85844K3827o38441M00894J104470k77685j312643
4953a158414J12169J445755k27914l070837l618335j896606J18252J972938L269782
$$ plain form
4944 -3053210 -970667 -2477751 -5947671 -7205095 -5507404 -4696498 -7517311 -11881600
4936 -11881600 -14028556 -12971544 -10553256 -8756892 -7887278 -6592731 -3734693 -666328
4928 -666328 -226366 -2517727 -4021391 -2614026 -555978 13559 1133699 4898889 8584094
4919 8584094 8558334 6348324 5793247 6660588 6450930 6055697 7576131 8646584 5455724
4910 5455724 -219742 -3556213 -4515729 -6137620 -6900715 -2937102 3192615 4576568 676442
4901 676442 -2380065 -2111027 -1587589 -1055262 2892470 8940992 11272486 9365357 8482961
4892 8482961 9754248 9489951 8506364 11052126 14293544 11509783 6335234 9530090 20325007
4883 20325007 26993280 27797693 32837196 42222434 44504116 41983002 51434765 71185278
$$ packed form
4944c053210K082543j507084l469920j257424J697691Q10906k820813m364289
4936a1881600k146956J057012K418288J796364Q69614J294547K858038L068365
4928f66328M39962k291361j503664J407365K058048N69537J120140L765190L685205
4919H584094k5760k210010n55077Q67341k09658l95233J520434J070453l190860
4910E455724n675466l336471r59516j621891p63095L963613O129717J383953l900126
4901F76442l056507K69038N23438N32327L947732O048522K331494j907129q82396
4892H482961J271287k64297r83587K545762L241418k783761n174549L194856J0794917
4883B0325007O668273Q04413N039503R385238K281682k521114R451763J9750513
$$ plain form
4875 71185278 80106442 85991134 134995607 236663848 312692492 274432702 139368737
4868 139368737 16742880 -23041754 -12315787 -10975259 -24208613 -25120167 -14732752
4861 -14732752 -15203191 -25738024 -26078530 -14496342 -8996991 -14711537 -18251272 -13802564
4853 -13802564 -10757684 -13764996 -15526101 -12409547 -10376798 -12237077 -13245574 -12057400
4845 -12057400 -13373888 -17331519 -17907555 -14143648 -12194752 -14111677 -14844252 -12609239
4837 -12609239 -12333817 -16033720 -18860039 -17782452 -16045278 -15971668 -14894478 -11416598 -8953095
4828 -8953095 -9833476 -11584377 -11659810 -10714661 -9414428 -7271169 -6006018 -8463635 -12812118
4819 -12812118 -13609251 -10158263 -7921414 -9915425 -12762805 -13475890 -14054785 -16339681 -17840336
$$ packed form
4875G1185278Q921164N884692M9004473J01668241P6028644l8259790j35063965
4868A39368737j22625857l9784634J0725967J340528j3233354r11554J0387415
4861a4732752m70439j0534833l40506J1582188N499351n714546l539735M448708
4853a3802564L044880l007312j761105L116554K032749j860279j008497J188174
4845a2057400j316488l957631n76036L763907J948896j916925p32575K235013
4837a2609239K75422l699903k826319J077587J737174P3610J077190L477880K463503
4828h953095q80381j750901p5433R45149J300233K143259J265151k457617m348483
4819a2812118p97133L450988K236849j994011k847380p13085n78895k284896j500655
$$ plain form
4810 -17840336 -16267450 -13651898 -12472213 -11597359 -9396129 -7482078 -8148298 -10686704
4802 -10686704 -12811910 -13532758 -12960649 -11724673 -11662722 -14142871 -16800106 -15387210 -9891539
4793 -9891539 -5081358 -3825865 -3925451 -3000793 -2122265 -2475862 -2697782 -2204407 -3324631
4784 -3324631 -7114865 -10373677 -9915943 -7065252 -5090690 -4770829 -5177198 -6319677 -8202252
4775 -8202252 -9360756 -8876112 -7993756 -7781174 -7392850 -6519408 -6909449 -9244365 -11204409
4766 -11204409 -11174293 -11234542 -13574755 -16320220 -16183411 -13472695 -11245775 -10751624 -10633105
4757 -10633105 -9706010 -8000698 -5876995 -4204438 -4414499 -6460921 -7906616 -6865795
4749 -6865795 -4526596 -3025625 -2512855 -2314388 -3089364 -5279553 -7057101 -6688802 -5726659
$$ packed form
4810a7840336J572886K615552J179685Q74854K201230J914051o66220k538406
4802a0686704k125206p20848N72109J235976O1951k480149k657235J412896N495671
4793i891539M810181J255493r9586R24658Q78528l53597k21920M93375j120224
4784c324631l790234l258812M57734K850691J974562L19861m06369j142479j882575
4775h202252j158504M84644Q82356K12582L88324Q73442l90041k334916j960044
4766a1204409L0116o0249k340213k745465J36809K710716K226920M94151J18519
4757a0633105R27095J705312K123703J672557k10061k046422j445695J040821
4749f865795K339199J500971N12770J98467p74976k190189j777548L68299R62143
$$ plain form
4740 -5726659 -6856205 -9327679 -9510726 -5827885 -572603 3256552 4736571 4446684 3059649
4731 3059649 1085974 -1043173 -2867076 -3425591 -1588739 2295491 5886570 7039024
4723 7039024 5904440 4107000 2678991 1530425 -10348 -2739678 -6545262 -9528396
4715 -9528396 -9822972 -8600521 -8976244 -11315777 -12507147 -11092357 -9760510 -10554788 -10969732
4706 -10969732 -8134536 -4226259 -3771456 -7234487 -11169082 -13553046 -15016106 -15460742
4698 -15460742 -13608974 -10206144 -8140143 -8610228 -9900279 -10467489 -10661717 -10833464 -10245237
4689 -10245237 -8719686 -7335998 -6659648 -5934671 -4734952 -4050606 -5108583 -7965422 -11364747
4680 -11364747 -13324400 -12479531 -9912063 -8815690 -10923542 -14022049 -14460133 -11320455
$$ packed form
4740e726659j129546k471474j83047L682841N255282L829155J480019k89887j387035
4731C059649j973675k129147j823903n58515J836852L884230L591079J152454
4723G039024j134584j797440j428009j148566j540773k729330l805584k983134
4715i528396k94576J222451l75723k339533j191370J414790J331847p94278m14944
4706a0969732K835196L908277M54803l463031l934595k383964j463060m44636
4698a5460742J851768L402830K066001m70085j290051n67210j94228j71747N88227
4689a0245237J525551J383688O76350P24977J199719O84346j057977k856839l399325
4680a1364747j959653Q44869K567468J096373k107852l098507m38084L139678
$$ plain form
4672 -11320455 -6762550 -3431036 -3073820 -6156351 -10772804 -13450774 -13238965 -13201184 -15358910
4663 -15358910 -16617554 -13483575 -8575844 -7385020 -9775970 -10416245 -7574047 -5507603
4655 -5507603 -6950323 -9041005 -9015866 -8657482 -9930776 -10798118 -9210427 -7553066 -8939645
4646 -8939645 -11849024 -12593023 -11075974 -10141790 -10696255 -11157871 -10567992 -8855122 -5271445
4637 -5271445 -211947 2460787 -943121 -8117631 -12565565 -11789473 -9979727 -11336000
4629 -11336000 -14160601 -13849495 -9433132 -4463348 -2293237 -2687458 -3174135 -2307639 -944858
4620 -944858 -699582 -1751774 -2715681 -2677237 -2446501 -3061327 -3858235 -3329853 -1557175 -300898
4610 -300898 -541690 -1400068 -2083811 -3530084 -6830080 -10699689 -12117993 -9872168 -6403309
$$ packed form
4672a1320455M557905L331514L57216l082531m616453k677970K11809L7781k157726
4663a5358910j258644L133979M907731J190824k390950o40275K842198K066444
4655e507603j442720k090682K5139L58384j273294q67342J587691J657361j386579
4646h939645k909379p43999J517049R34184n54465m61616N89879J712870L583677
4637e271445N059498K672734l403908p174510m447934P76092J809746j356273
4629a1336000k824601L11106M416363M969784K170111l94221m86677Q66496J362781
4620i44858K45276j052192r63907L8444K30736o14826p96908N28382J772678J256277
4610c00898k40792q58378o83743j446273l299996l869609j418304K245825L468859
$$ plain form
4601 -6403309 -5241936 -7048982 -9163557 -8967970 -6540530 -3637278 -1373092 38346
4593 38346 282331 -760790 -2160241 -2843419 -3105104 -3848854 -4777153 -5073714 -5468531 -7329559
4583 -7329559 -9708559 -10017599 -8291668 -7832619 -10127348 -11975486 -10104639 -6408769 -5488364
4574 -5488364 -8226141 -11033362 -11155607 -9746097 -9225392 -10025756 -10927048 -11018451 -10351322
4565 -10351322 -9522647 -9170165 -9336491 -9249733 -8248972 -6639566 -5015914 -3376710 -1864966
4556 -1864966 -1585469 -3204446 -5204156 -5168983 -2707657 347970 2515117 3879326 4747802
4547 4747802 4717177 3427857 981401 -2537118 -6656951 -9666744 -9828506 -7779645 -6132014
4538 -6132014 -6223276 -6862919 -6838468 -6827460 -7749914 -8829638 -8737972 -7526077 -5998245 -4137689
$$ packed form
4601f403309J161373j807046k114575J95587K427440K903252K264186J411438
4593C8346K43985j043121j399451o83178k61685p43750r28299k96561l94817j861028
4583g329559k379000l09040J725931M59049k294729j848138J870847L695870R20405
4574e488364k737777k807221j22245J409510N20705q00364r01292r1403O67129
4565a0351322Q28675L52482j66326Q6758J000761J609406J623652J639204J511744
4556a864966K79497j618977j999710L5173K461326L055627K167147J364209Q68476
4547D747802l0625j289320k446456l518519m119833l009793j61762K048861J647631
4538f132014r1262o39643K4451J1008r22454j079724R1666J211895J527832J860556
$$ plain form
4528 -4137689 -1751196 -20621 -644723 -3488693 -6550566 -8458722 -9724371 -11078863
4520 -11078863 -11756098 -10466740 -7639829 -5584831 -6052220 -8244689 -9916153 -10177761 -10243851
4511 -10243851 -11187751 -12167107 -11856442 -10692953 -10154276 -10275210 -9751511 -8563628 -8392990
4502 -8392990 -9634003 -9954932 -7342988 -3208213 -709855 -877180 -2183934 -3385473 -4742544
4493 -4742544 -6365840 -7239567 -6602360 -5063587 -3625325 -2463126 -1331583 -553053 -993537
4484 -993537 -3304653 -7286636 -11507313 -13644474 -12235076 -8543102 -5845086 -6146974 -8111570
4475 -8111570 -8857182 -7344794 -5237605 -4625250 -5655897 -6602379 -5918679 -4008996 -2857281
4466 -2857281 -3728006 -5382119 -5146823 -1953453 2228167 4366944 3426570 1131407 -19370
$$ packed form
4528d137689K386493J730575o24102k843970l061873j908156j265649j354492
4520a1078863o77235J289358K826911K054998m67389k192469j671464k61608o6090
4511a0243851r43900r79356L10665J163489N38677j20934N23699J187883J70638
4502h392990j241013l20929K611944M134775K498358j67325j306754j201539j357071
4493d742544j623296q73727O37207J538773J438262J162199J131543P78530m40484
4484i93537k311116l981983m220677k137161J409398L691974K698016l01888j964596
4475h111570p45612J512388K107189O12355j030647r46482O83700J909683J151715
4466b857281q70725j654113K35296L193370M181620K138777r40374k295163j150777
$$ plain form
4457 -19370 707716 1435494 -568754 -5701023 -10800081 -12314911 -10731687 -10040261 -12092371
4448 -12092371 -13767131 -11692746 -7814617 -7088142 -10407965 -13385954 -12603211 -9783704
4440 -9783704 -8457571 -9278809 -10490212 -10829788 -9980932 -7923999 -5790434 -5654112 -7424234
4431 -7424234 -7756036 -4578141 -1024880 -1697247 -6139056 -9595298 -9765794 -8912997 -8888405
4422 -8888405 -8117859 -5217496 -2326097 -2328866 -4715321 -6426568 -5574103 -2623702 907206
4413 907206 3297651 3195744 946714 -1268683 -1736783 -935754 -155202 473333 1477422
4404 1477422 2644755 3364292 3590490 3489402 2942350 2159276 1692803 1091716 -1025159
4395 -1025159 -4519356 -6909829 -6353144 -4004223 -1975836 -519342 1008493 1929452 1195744
$$ packed form
4457a9370P27086P27778k004248n132269n099058j514830J583224O91426k052110
4448a2092371j674760K074385L878129P26475l319823k977989P82743K819507
4440i783704J326133q21238j211403l39576Q48856K056933K133565J36322j770122
4431g424234l31802L177895L553261o72367m441809l456242j70496Q52797K4592
4422h888405P70546K900363K891399k769k386455j711247Q52465K950401L530908
4413I07206K390445j01907k249030k215397m68100Q01029P80552O28535J004089
4404A477422J167333P19537K26198j01088n47052p83074m66473o01087k116875
4395a025159l494197k390473N56685K348921K028387J456494J527835R20959p33708
$$ plain form
4386 1195744 -582555 -2242180 -4204486 -7325671 -10579810 -12193203 -12204429 -11571663 -9848719
4377 -9848719 -6597332 -4112619 -5203171 -8523924 -9776764 -7845049 -6022933 -6333951
4369 -6333951 -6485092 -4215074 -1265716 -600385 -2274027 -4581950 -7124322 -9952162 -11292395
4360 -11292395 -9169083 -4737496 -1614132 -2050631 -5396343 -9770216 -13420472 -14787127
4352 -14787127 -13161148 -9663665 -6513860 -5181864 -5781327 -7660238 -9581262 -9875125
4344 -9875125 -7747434 -4425084 -2075058 -1535721 -1717216 -1160227 281875 1233129 123076
4335 123076 -2979058 -5994132 -6975695 -6356561 -5940615 -6022346 -5388400 -4221352 -4467494
4326 -4467494 -6380790 -7329360 -5858209 -4623891 -6769718 -11075950 -13543591 -12705378 -10500715
$$ packed form
4386A195744j778299j659625j962306l121185l254139j613393j1226O32766J722944
4377i848719L251387K484713j090552l320753j252840J931715J822116l11018
4369f333951j51141K270018K949358O65331j673642k307923k542372k827840j340233
4360a1292395K123312M431587L123364m36499l345712m373873l650256j366655
4352a4787127J625979L497483L149805J331996n99463j878911j921024k93863
4344i875125K127691L322350K350026N39337j81495N56989J442102R51254j110053
4335A23076l102134l015074r81563O19134M15946q1731O33946J167048k46142
4326d467494j913296r48570J471151J234318k145827m306232k467641Q38213K204663
$$ plain form
4317 -10500715 -8636624 -7172671 -6516803 -7633091 -9670930 -10118466 -8252957 -6150537
4309 -6150537 -5297833 -4451486 -2258106 -92771 -436391 -3436457 -6625384 -7582754 -5950173
4300 -5950173 -3376372 -2194642 -3537317 -6117787 -7425696 -6518061 -4937315 -4625200 -5874113
4291 -5874113 -7619678 -8596562 -7797610 -5146658 -2379482 -1834293 -3462442 -4512672 -3381220
4282 -3381220 -2234037 -4048759 -8260507 -11449534 -11577665 -9320539 -5792540 -1716902
4274 -1716902 967683 -319428 -5215905 -9590545 -10058920 -7803432 -6254456 -6539992 -7419163
4265 -7419163 -8467561 -10381672 -12329755 -12023087 -9241912 -6744535 -6348401 -6374343 -4857826
4256 -4857826 -3309537 -4551733 -7848168 -9274582 -7108194 -4174904 -3943469 -6394413
$$ packed form
4317a0500715J864091J463953O55868j116288k037839m47536J865509K102420
4309f150537Q52704Q46347K193380K165335l43620l000066l188927r57370J632581
4300e950173K573801J181730j342675k580470j307909R07635J580746L12115j248913
4291e874113j745565r76884P98952K650952K767176N45189j628149j050230J131452
4282c381220J147183j814722m211748l189027j28131K257126L527999M075638
4274a716902K684585j287111m896477m374640m68375K255488J548976k85536q79171
4265g419163j048398j914111j948083L06668K781175K497377L96134k5942J516517
4256d857826J548289j242196l296435j426414K166388K933290K31435k450944
$$ plain form
4248 -6394413 -9027169 -10344744 -10764525 -11002952 -11082558 -10708785 -9709181 -8244458 -6995582
4239 -6995582 -6670842 -7014939 -7031265 -6517173 -6408445 -7154786 -8002697 -8643661 -10089830 -12537125
4229 -12537125 -13686689 -11236529 -6443028 -3077039 -2820076 -3645996 -3223057 -2124952 -2563954
4220 -2563954 -5019655 -7452248 -7753043 -6190635 -5073420 -6082218 -8363563 -9817047
4212 -9817047 -9995007 -10456078 -11873134 -12444632 -10548349 -7690535 -6842387 -8497254 -10463532
4203 -10463532 -11276281 -11537491 -11701683 -10956047 -9194964 -7999554 -8272747 -8538499 -7238568
4194 -7238568 -5562728 -6169361 -9597965 -13580886 -15851101 -16291347 -16073633 -15772659 -15021459
4185 -15021459 -13671221 -12666585 -13394459 -16095805 -19317766 -21419248 -22314135 -22950556 -23320697
$$ packed form
4248f394413k632756j317575m19781k38427p9606L73773R99604J464723J248876
4239f995582L24740l44097j6326N14092J08728p46341q47911o40964j446169k447295
4229a2537125j149564K450160M793501L365989K56963q25920M22939J098105m39002
4220b563954k455701k432593l00795J562408J117215j008798k281345j453484
4212i817047j77960m61071j417056n71498J896283K857814Q48148j654867j966278
4203a0463532q12749k61210j64192P45636J761083J195410k73193k65752J299931
4194g238568J675840o06633l428604l982921k270215m40246K17714L00974P51200
4185a5021459J350238J004636p27874k701346l221961k101482q94887o36421l70141
$$ plain form
4176 -23320697 -22308871 -19866611 -17911658 -17976023 -18967882 -18806707 -17872124 -18997660 -23464418
4167 -23464418 -28465990 -29943457 -27413867 -24495706 -24451168 -26618018 -28092447 -27728493 -26921943
4158 -26921943 -27047937 -28045373 -29667215 -32288399 -35836081 -39438888 -42850996 -46909074
4150 -46909074 -52170063 -58706460 -67356281 -78757278 -91202878 -103578679 -120965213 -149689870
4142 -149689870 -180747545 -184792051 -136271731 -44828486 46235787 97564828 105024373
4135 105024373 91873087 78916709 70148392 61846899 53609655 47573655 43628834 39903886
4127 39903886 35778316 32077681 29407106 27358957 24693189 20315667 14892514 10801050
4119 10801050 9334835 9059460 8464091 8777671 11862590 16493885 19429970 19455438 17726872
$$ packed form
4176b3320697J011826K442260J954953o4365r91859J61175R34583j125536m466758
4167b3464418n001572j477467K529590K918161M4538k166850j474429L63954Q06550
4158b6921943j25994r97436j621842k621184l547682l602807l412108m058078
4150d6909074n260989o536397q649821j1400997j2445600j2375801j7386534k8724657
4142a49689870l1057675m044506M8520320R1443245R1064273N1329041P459545
4135A05024373j3151286j2956378q768317q301493q237244o036000l944821l724948
4127C9903886m125570l700635k670575k048149k665768m377522n423153m091464
4119A0801050j466215k75375n95369L13580L084919M631295K936085K5468j728566
$$ plain form
4110 17726872 14884381 10907769 7491269 7219080 9937090 12664109 13397013 12415902 9956051
4101 9956051 5965169 2601688 3239623 7632526 11385632 11885619 11511112 12837823 13888059
4092 13888059 11276145 5803865 1509193 444271 1533958 3747185 7191861 11138173
4084 11138173 13789556 14578055 14613208 14323685 12512768 8583206 4289859 2210792 3104185
4075 3104185 5455343 7233730 7585514 7008080 6393658 6258355 6837176 8217591 9673769
4066 9673769 9428295 6432990 2408339 587203 1910652 3929390 4309154 3940049 5196392
4057 5196392 8233583 10757278 11028775 9512459 7552272 5760895 4118015 2819394
4049 2819394 2421218 3162482 4228705 3998109 1628255 -1654555 -3699573 -3969384 -3879089
$$ packed form
4110A7726872k842491l976612l416500k72189K718010K727019P32904r81111k459851
4101I956051l990882l363481O37935M392903L753106M99987l74507J326711J050236
4092A3888059k611914n472280m294672j064922J089687K213227L444676L946312
4084A1138173K651383P88499L5153k89523j810917l929562m293347k079067Q93393
4075C104185K351158J778387L51784n77434o14422j35303N78821J380415J456178
4066I673769k45474k995305m024651j821136J323449K018738L79764l69105J256343
4057E196392L037191K523695K71497j516316j960187j791377j642880j298621
4049B819394l98176P41264J066223k30596k369854l282810k045018k69811R0295
$$ plain form
4040 -3879089 -4333737 -4279700 -2513260 190844 1783804 1037340 -1788095 -5430372 -7961009
4031 -7961009 -7645687 -4524513 -463586 2966409 5561240 6918730 5778968 2493534
4023 2493534 346533 1987342 5552939 6900899 5256287 4048660 5983358 9651746
4015 9651746 11711994 10607762 7367712 4187072 3016162 4480986 7488200 10425894
4007 10425894 12731891 14517267 15187967 14043935 12116183 11450465 12012845 11053438 6574167
3998 6574167 216386 -4371647 -5283146 -3665414 -2005362 -1994550 -3724712 -6145303 -8026468
3989 -8026468 -8544812 -7255973 -4307360 -1058536 517884 54122 -426677 779421 2390230
3980 2390230 1959647 -132905 -700871 1981901 5812610 7395306 5641011 2418986 656812
$$ packed form
4040c879089m54648N4037J766440K704104J592960p46464k825435l642277k530637
4031g961009L15322L121174M060927L429995K594831J357490j139762l285434
4023B493534k147001J640809L565597J347960j644612j207627J934698L668388
4015I651746K060248j104232l240050l180640j170910J464824L007214K937694
4007A0425894K305997J785376O70700j144032j927752o65718N62380r59407m479271
3998F574167o357781m588033r11499J617732J660052J0812j730162k420591j881165
3989h026468n18344J288839K948613L248824J576420m63762m80799J206098J610809
3980B390230m30583k092552n67966K682772L830709J582696j754295l222025j762174
$$ plain form
3971 656812 1802925 4107951 3895587 2300 -3907207 -3725395 -793238 -148032 -2974122
3962 -2974122 -4747286 -2048196 2641207 5121007 5094526 4744434 4411379 3112637 1667996
3953 1667996 1993572 4148586 6654538 8762627 10078864 9295195 6024301 2693501 1658918
3944 1658918 1475159 -740909 -4048516 -4453375 -876615 3158953 4253269 2378600 -1099941
3935 -1099941 -5332805 -8781180 -9086132 -5856187 -1608875 1278310 2785412 3701237 4039366
3926 4039366 3967572 4200703 4408018 3223227 781480 -894375 -996740 -1016994 -1531486
3917 -1531486 -605172 2709919 5738758 5495894 2882988 1226279 2023615 4289650 6728797
3908 6728797 8307726 7908764 5733982 4067974 4493819 5377365 4273026 1673840 -56496
$$ packed form
3971F56812J146113K305026k12364l893287l909507J81812K932157O45206k826090
3962b974122j773164K699090M689403K479800k6481l50092l33055j298742j444641
3953A667996L25576K155014K505952K108089J316237p83669l270894l330800j034583
3944A658918j83759k216068l307607m04859L576760M035568J094316j874669l478541
3935a099941m232864l448375l04952L229945M247312K887185J507102R15825L38129
3926D039366p1794K33131K07315j184791k441747j675855j02365k0254n14492
3917a531486R26314L315091L028839k42864k612906j656709P97336K266035K439147
3908F728797J578929l98962k174782j666008M25845Q83546j104339k599186j730336
$$ plain form
3899 -56496 -366828 -333708 328923 2801858 5800884 5913886 2085261 -2602450 -4399783
3890 -4399783 -2383784 1741018 5363759 6268900 4300212 2150223 2659351 5147081 6389936
3881 6389936 5227813 3719362 3417477 3317466 2458315 1879988 2539462 3522612 3823522
3872 3823522 3807766 3380254 961010 -3620162 -7161787 -6650545 -3656016 -2629567 -5314522
3863 -5314522 -9055542 -10546478 -9392165 -7735688 -7676164 -9358106 -10948244 -10537696 -8307947
3854 -8307947 -6192215 -5231391 -4546246 -3427314 -2690991 -2796969 -2370734 -337593 1915821
3845 1915821 2517232 2054449 2333052 3125441 2592521 431825 -1767956 -2977090 -3146911
3836 -3146911 -1513641 2650065 7232250 8127626 4100948 -1367487 -4346651 -4653296 -4446543
$$ packed form
3899e6496l10332L3120O62631K472935K999026J13002l828625m687711j797333
3890d399783K015999M124802L622741R05141j968688k149989N09128K487730J242855
3881F389936j162123j508451l01885j00011q59151n78327O59474R83150L00910
3872C823522j5756m27512k419244m581172l541625N11242K994529J026449k684955
3863e314522l741020j490936J154313J656477N9524j681942j590138M10548K229749
3854h307947K115732R60824O85145J118932P36323j05978M26235K033141K253414
3845A915821O01411m62783K78603P92389n32920k160696k199781j209134j69821
3836c146911J633270M163706M582185Q95376m026678n468435k979164l06645K06753
$$ plain form
3827 -4446543 -4512567 -3925641 -2336171 -622493 411541 519252 -624936 -3199159 -6172697
3818 -6172697 -7473837 -5775156 -1854402 2024096 3962430 3624861 1813871 -660906
3810 -660906 -3193252 -4696672 -3879108 -965836 1636329 1580532 -684135 -2346792 -1360725
3801 -1360725 1568528 3980289 4012779 1980227 129471 463171 2472541 3868939 3942852
3792 3942852 4611285 7033671 9117475 8530887 6626709 6519771 8222102 8865772 7317948
3783 7317948 5184600 3229803 475881 -2477532 -2981183 -565738 1734940 1905575 1438331
3774 1438331 1371738 -531576 -5689911 -10852334 -11936169 -9507963 -6893736 -4851158 -2205414
3765 -2205414 -378024 -2591040 -8482307 -13522413 -14567376 -12837211 -10665108 -8336537
$$ packed form
3827d446543o6024N86926J589470J713678J034034J07711j144188k574223k973538
3818f172697j301140J698681L920754L878498J938334l37569j810990k474777
3810f60906k532346j503420Q17564K913272K602165n5797k264667j662657R86067
3801a360725K929253K411761L2490k032552j850756L33700K009370J396398P3913
3792C942852O68433K422386K083804n86588j904178j06938J702331O43670j547824
3783G317948k133348j954797k753922k953413n03651K415445K300678J70635m67244
3774A438331o6593j903314n158335n162423j083835K428206K614227K042578K645744
3765b205414J827390k213016n891267n040106j044963J730165K172103K328571
$$ plain form
3757 -8336537 -5368066 -2463528 -708369 -306012 -986815 -2374495 -3493439 -3267844 -1810243
3748 -1810243 13552 2129951 4806609 7034087 7438068 6668090 6562023 6867212 5399182
3739 5399182 1975010 -477471 216288 2789870 4803832 5421018 4773049 2848977 566583
3730 566583 -111394 1058962 1434138 -1130514 -5316990 -8581125 -10635255 -12365994 -12711883
3721 -12711883 -9658031 -4111303 -120709 -633949 -4673521 -9033551 -11292682 -10860052
3713 -10860052 -8577453 -6088389 -4765528 -4665608 -4964784 -5446923 -6685478 -8402326 -8551227
3704 -8551227 -5056309 1532895 7909548 11122289 11503639 11622638 12334785 11370906 6897701
3695 6897701 1074112 -2055141 -1646933 -610747 -1035138 -1786248 -1462367 -876060 -782101
$$ packed form
3757h336537K968471K904538J755159M02357o80803j387680j118944K25595J457601
3748a810243J823795K116399K676658K227478M03981p69978j06067L05189j468030
3739E399182l424172k452481O93759K573582K013962O17186o47969j924072k282394
3730E66583o77977J170356L75176k564652m186476l264135k054130j730739l45889
3721a2711883L053852N546728L990594n13240m039572m360030k259131M32630
3713a0860052K282599K489064J322861R9920k99176m82139j238555j716848j48901
3704h551227L494918O589204O376653L212741L81350J18999P12147r63879m473205
3695F897701n823589l129253M08208J036186m24391p51110L23881N86307R3959
$$ plain form
3686 -782101 388118 3836200 7054398 6267053 1690109 -2417995 -3003006 -1109195 740837
3677 740837 1707966 2356004 3101556 4033056 4961166 4795798 2234921 -1844228 -3979121
3668 -3979121 -1754750 2750176 4888457 2945548 196538 738578 4443954 7417403
3660 7417403 6977726 4400883 2199752 431999 -2566643 -6582408 -8852424 -7411563
3652 -7411563 -3528772 -103248 1174625 417587 -1421834 -3071772 -3380098 -2283619 -855855
3643 -855855 199720 1339058 2875932 3914631 3488467 1908797 113667 -1396518 -2077981
3634 -2077981 -1013021 1545447 3308298 2364354 -100723 -1213694 -258083 573173 -705970
3625 -705970 -3524154 -5803575 -6146910 -4575888 -1972539 734825 3111209 4988674 5768211
$$ packed form
3686g82101J170219L448082L218198p87345m576944m108104n85011J893811J850032
3677G40837R67129O48038P45552R31500R28110j65368k560877m079149k134893
3668c979121K224371M504926K138281j942909k749010N42040L705376K973449
3660G417403m39677k576843k201131j767753k998642m015765k270016J440861
3652g411563L882791L425524J277873p57038j839421j649938l08326J096479J427764
3643h55855J055575J139338J536874J038699m26164j579670j795130j510185o81463
3634b077981J064960K558468J762851r43944k465077j112971R55611Q31256j279143
3625g05970k818184k279421l43335J571022K603349K707364K376384J877465P79537
$$ plain form
3616 5768211 4702248 2171417 -375247 -2300353 -4245778 -5927223 -5395757 -2280656
3608 -2280656 31361 -1788722 -5950000 -7259309 -3682957 1637301 5046976 6119879
3600 6119879 6020074 4968206 2921899 883736 -14943 416955 2094401 4956873 7862094
3591 7862094 8880543 7753320 6473362 6253974 5540976 2558449 -1585590 -4205700 -4526914
3582 -4526914 -3946820 -3326993 -2053995 -1723 1326458 567720 -1459997 -2565405 -1983524
3573 -1983524 -1522632 -3300858 -6707217 -8683230 -7355822 -4309772 -2413921 -2350505 -2516986
3564 -2516986 -1583051 407324 3022734 5873928 8145371 9066906 8736901 7463296 5065717
3555 5065717 2176396 859017 1674935 1583476 -1928436 -5684060 -4149861 2117038 6328658
$$ packed form
3616E768211j065963k530831k546664j925106j945425j681445N31466L115101
3608b280656K312017j820083m161278j309309L576352N320258L409675J072903
3600F119879r9805j051868k046307k038163q98679M31898J677446K862472K905221
3591G862094J018449j127223j279958k19388p12998k982527m144039k620110l21214
3582d526914N80094O19827J272998K052272J328181p58738k027717j105408N81881
3573a983524M60892j778226l406359j976013J327408L046050J895851O3416j66481
3564b516986R33935J990375K615410K851194K271443R21535l30005j273605k397579
3555E065717k889321j317379Q15918r1459l511912l755624J534199O266899M211620
$$ plain form
3546 6328658 5011845 2634160 4180022 7880171 9149379 7870982 7077654 7075061 5787064
3537 5787064 3301753 1406609 -286768 -3229675 -5815906 -5141918 -2602839 -2809641 -6428088
3528 -6428088 -8913807 -7597984 -5415854 -5598083 -6863526 -6625184 -5457718 -5098763 -4621360
3519 -4621360 -2069479 1761152 4384593 5363430 6055243 6395113 4839530 1370225 -1969335
3510 -1969335 -3782404 -4577335 -5093157 -5173957 -4681987 -3978019 -3071917 -1643681 -268734
3501 -268734 -217295 -1452633 -2119351 -825438 1627300 3642769 4907696 5884318 6074595
3492 6074595 4470979 1647312 -197140 220426 1874695 3175744 3921374 4570400 4646193
3483 4646193 3320460 1072731 -692971 -1485356 -1857823 -2023213 -2023154 -3135566 -6866661
$$ packed form
3546F328658j316813k377685J545862L700149J269208j278397p93328k593j287997
3537E787064k485311j895144j693377k942907k586231O73988K539079k06802l618447
3528f428088k485719J315823K182130j82229j265443K38342J167466L58955M77403
3519d621360K551881L830631K623441R78837O91813L39870j555583l469305l339560
3510a969335j813069p94931n15822q0800M91970P03968R06102J428236J374947
3501b68734N1439j235338o66718J293913K452738K015469J264927R76622J90277
3492F074595j603616k823667j844452M17566J654269J301049P45630O49026P5793
3483D646193j325733k247729j765702p92385l72467j65390N9j112412l731095
$$ plain form
3474 -6866661 -11860421 -13980585 -10887420 -4992599 -470385 1229913 1397503 1180125 877384
3465 877384 1161199 2653474 4492335 5158965 4558848 3703446 2770022 1342950 229346
3456 229346 789871 2224139 1638407 -2404514 -7915131 -11774265 -12839869 -12212014 -11398029
3447 -11398029 -10734590 -9094548 -5241759 -68482 3248574 2610972 -132346 -1302091
3439 -1302091 190649 2415574 3801311 4473740 4382977 2895706 795096 113438 1135619
3430 1135619 1911387 1562085 1542934 2513862 2638584 698486 -1485334 -1785166 -941862
3421 -941862 -895239 -1701452 -2355668 -3151563 -4802861 -6350168 -6273294 -4810015 -3081993
3412 -3081993 -946270 2022894 4456119 4739407 3977789 4657021 6687074 7625055 6827651
$$ packed form
3474f866661m993760k120164L093165N894821M522214J700298J67590k17378l02741
3465H77384K83815J492275J838861O66630o00117q55402r33424j427072j113604
3456B29346N60525J434268n85732m042921n510617l859134j065604O27855Q13985
3447a1398029O63439J640042L852789N173277L317056o37602k743318j169745
3439a302091J492740K224925J385737O72429r0763j487271k100610o81658J022181
3430A135619P75768l49302j9151R70928J24722j940098k183820k99832Q43304
3421i41862M6623q06213o54216p95895j651298j547307P6874J463279J728022
3412c081993K135723K969164K433225K83288p61618O79232K030053R37981p97404
$$ plain form
3403 6827651 6337177 6993726 6588087 3244080 -1671923 -5580176 -7748897 -8704088 -8296277
3394 -8296277 -6437058 -4689474 -4897908 -6529927 -7251082 -6145999 -4639592 -3911765 -3109808
3385 -3109808 -1007000 1938928 4467295 6432650 8131614 8268515 4890859 -1091593
3377 -1091593 -5498329 -5535895 -3375587 -3178244 -5626065 -7721382 -7438603 -5845274 -4376195
3368 -4376195 -2795527 -978200 -333066 -1722179 -3586455 -3866880 -2654255 -1471023 -1020888
3359 -1020888 -1103776 -1698575 -2547548 -2537144 -1091507 499512 660625 -150397 -162554 1197730
3349 1197730 2979656 4528744 6233830 8481532 10725977 11499101 9225925 4053453
3341 4053453 -958248 -2369837 -858543 -796518 -3924665 -6398967 -4829335 -2342235 -4338102
$$ packed form
3403F827651m90474O56549m05639l344007m916003l908253k168721r55191M07811
3394h296277J859219J747584k08434j632019p21155J105083J506407P27827Q01957
3385c109808K102808K945928K528367J965355J698964J36901l377656n982452
3377a091593m406736l7566K160308J97343k447821k095317K82779J593329J469079
3368d376195J580668J817327O45134j389113j864276k80425J212625J183232M50135
3359a020888q2888n94799q48973J0404J445637J591019J61113q11022j2157J360284
3349A197730J781926J549088J705086K247702K244445P73124k273176n172472
3341D053453n011701j411589J511294O2025l128147k474302J569632K487100j995867
$$ plain form
3332 -4338102 -9951114 -12844859 -10266781 -6168905 -4333449 -3346431 -727287 2101786
3324 2101786 2307497 293264 -1600466 -3202826 -5881765 -8772153 -8978939 -5694758 -1569811
3315 -1569811 657754 1112618 1598801 2748891 3427701 2563634 622214 -1149719 -2490163
3306 -2490163 -4162114 -6008254 -6287192 -4131698 -1593758 -1370839 -3052865 -3808924 -2648236
3297 -2648236 -1486537 -1534879 -1289356 622405 2837905 3207851 1675495 -484500 -2833508
3288 -2833508 -5305795 -6796327 -6416386 -5618207 -6892268 -10091770 -11689747 -8503797 -1506983
3279 -1506983 4695927 6187105 3310274 -327880 -2235449 -3300230 -5084377 -6564275
3271 -6564275 -5707066 -3257332 -1955786 -2093343 -1165821 1345396 2419997 472211 -1463213
$$ packed form
3332d338102n613012k893745K578078M097876J835456R87018K619144K829073
3324B101786K05711k014233j893730j602360k678939k890388k06786L284181M124947
3315a569811K227565M54864M86183J150090O78810q64067j941420j771933j340444
3306b490163j671951j846140k78938K155494K537940K22919j682026p56059J160688
3297b648236J161699m8342K45523J911761K215500L69946j532356k159995k349008
3288b833508k472287j490532L79941P98179j274061l199502j597977L185950O996814
3279a506983O202910J491178k876831l638154j907569j064781j784147j479898
3271f564275Q57209K449734J301546j37557R27522K511217J074601j947786j935424
$$ plain form
3262 -1463213 -245732 2351248 2513222 415205 -426319 976510 1690449 -282943 -2949085
3253 -2949085 -3325391 -1393802 339633 210967 -662959 393867 4516182 9281309 10498175
3244 10498175 6584725 297391 -4570212 -6974203 -8138270 -8932786 -9555556 -10588264
3236 -10588264 -12160345 -12691650 -10521018 -6455618 -3014524 -1668688 -2466481 -5432179
3228 -5432179 -9957216 -13277664 -12267273 -7268712 -2264140 -720453 -2480806 -4651127
3220 -4651127 -4204245 -103485 5481059 8324057 6120802 1033649 -3097296 -5214394
3212 -5214394 -6901873 -8930381 -10529605 -11413539 -11740285 -10478508 -6736397 -2475201 -802538
3203 -802538 -1582204 -1948724 -1262049 -1957158 -4940602 -7900168 -9241956 -10040882 -10746091
$$ packed form
3262a463213J217481K596980J61974k098017q41524J402829P13939j973392k666142
3253b949085l76306J931589J733435j28666q73926J056826M122315M765127J216866
3244A0498175l913450o287334m867603k403991j164067p94516o22770j032708
3236a0588264j572081n31305K170632M065400L441094J345836p97793k965698
3228e432179m525037l320448J010391M998561N004572J543687j760353k170321
3220d651127M46882M100760N584544K842998k203255n087153m130945k117098
3212e214394j687479k028508j599224q83934l26746J261777L742111M261196J672663
3203h02538p79666l66520O86675o95109k983444k959566j341788p98926p05209
$$ plain form
3194 -10746091 -9744037 -7096094 -6046460 -8347177 -11246849 -11660591 -10319520 -9140845
3186 -9140845 -7623959 -5088732 -3650612 -5237453 -7842843 -8436893 -7635529 -7705175 -7888105
3177 -7888105 -6059995 -3571835 -3625630 -5440910 -4914004 -1297848 1488633 1211369 647780
3168 647780 2821767 6500872 8608912 8430809 7286517 6027980 4786234 3808963 3118805
3159 3118805 2421469 2074377 2743929 3631102 2868436 355879 -1706028 -1915012 -1362390
3150 -1362390 -1302025 -1095862 300705 2496531 4500897 5913427 6325574 5150453 2965987
3141 2965987 1314131 364067 -1153037 -2848464 -2315498 475905 1425297 -2279831 -7437231
3132 -7437231 -8980369 -7079879 -6119101 -7574122 -8448566 -7146129 -6394869 -8415531 -10714483
$$ packed form
3194a0746091J002054K647943J049634k300717k899672m13742J341071J178675
3186i140845J516886K535227J438120j586841k605390n94050Q01364o9646j82930
3177g888105J828110K488160n3795j815280N26906L616156K786481k77264n63589
3168F47780K173987L679105K108040j78103j144292j258537j241746r77271o90158
3159C118805o97336l47092O69552Q87173p62666k512557k061907k08984N52622
3150a362390O0365K06163J396567K195826K004366J412530M12147j175121k184466
3141B965987j651856r50064j517104j695427N32966K791403R49392l705128n157400
3132g437231j543138J900490R60778j455021q74444J302437P51260k020662k298952
$$ plain form
3123 -10714483 -9582716 -5651339 -2882014 -2966135 -3649269 -2725743 -1160844 -1103949 -2441984
3114 -2441984 -3085813 -2195411 -1307111 -1664513 -1887860 174633 3916944 6274506 5836838
3105 5836838 4681236 5019356 5760107 4228454 157138 -4197320 -7353914 -9712765 -11388215
3096 -11388215 -11350828 -9499722 -7625461 -7170034 -7503655 -7577053 -7931189 -9599824 -11926450
3087 -11926450 -13014919 -11962558 -9447701 -6455782 -3566886 -1230117 427873 1986012
3079 1986012 3841346 4934352 3475220 -736802 -5539128 -8312218 -8147810 -6077460
3071 -6077460 -3914059 -3079681 -3771747 -4791396 -4701894 -3549453 -2977844 -4289811 -6892462
3062 -6892462 -9111311 -10146382 -10752007 -12222521 -14977355 -17791334 -18265990 -14793533 -8576725
$$ packed form
3123a0714483J131767L931377K769325q4121o83134R23526J564899N6895j338035
3114b441984o43829Q90402Q88300l57402k23347K062493L742311K357562m37668
3105E836838j155602L38120P40751j531653m071316m354458l156594k358851j675450
3096a1388215L7387J851106J874261M55427l33621p3398l54136j668635k326626
3087a1926450j088469J052361K514857K991919K888896K336769J657990J558139
3079A986012J855334J093006j459132m212022m802326k773090J64408K070350
3071f077460K163401Q34378o92066j019649Q9502J152441N71609j311967k602651
3062f892462k218849j035071o05625j470514k754834k813979m74656L472457O216808
$$ plain form
3053 -8576725 -3000418 -279112 577242 1591059 2586808 1849943 -374029 -1246366 1102533
3044 1102533 5064898 7610877 7527287 5636669 3291285 2119782 3864010 8276412 11873104
3035 11873104 11138918 6887412 3159434 1645593 -82698 -3751246 -6605534 -4999899
3027 -4999899 -262396 2076564 -978540 -6286210 -8577738 -6467931 -3174203 -2041399
3019 -2041399 -2910025 -3392045 -2840367 -3659249 -8040067 -14327169 -18222230 -17724525 -15234053
3010 -15234053 -13904598 -13448754 -11198597 -6399904 -1429299 1139744 904661 -1080855
3002 -1080855 -3594509 -5212388 -4662530 -2433298 -1004101 -2150519 -4488488 -4885644 -2263288
2993 -2263288 966266 1618907 -533206 -2251763 -333225 4514680 8091629 7627580 5458638
$$ packed form
3053h576725N576307K721306Q56354J013817R95749p36865k223972q72337K348899
3044A102533L962365K545979q3590j890618k345384j171503J744228M412402L596692
3035A1873104p34186m251506l727978j513841j728291l668548k854288J605635
3027d999899M737503K338960l055104n307670k291528K109807L293728J132804
3019b041399q68626m82020N51678q18882m380818o287102l895061M97705K490472
3010a5234053J329455M55844K250157M798693M970605K569043k35083j985516
3002a080855k513654j617879N49858K229232J429197j146418k337969l97156K622356
2993b263288L229554O52641k152113j718557J918538M847905L576949m64049k168942
$$ plain form
2984 5458638 6250633 10719863 14129999 11915212 5098155 -1386396 -4468009 -5001826 -4732948
2975 -4732948 -3765139 -1745301 361983 1126096 401246 -1005383 -2867632 -5383880 -7520009
2966 -7520009 -6991363 -2901979 2220274 4294850 1877699 -2377458 -4969628 -5468502 -6209785
2957 -6209785 -8634250 -11491417 -12976676 -13189985 -13506711 -14441243 -15244827 -15077032 -13557559
2948 -13557559 -10630107 -7023510 -4556953 -4688153 -6633288 -8025481 -7713534 -6944501 -7407068
2939 -7407068 -9047995 -10493818 -10986086 -11036446 -11271224 -11306083 -10158992 -7697976 -5206527
2930 -5206527 -3941485 -3281076 -1346118 2103318 4598539 3919327 1165060 -708412 -742768
2921 -742768 -344118 -67437 1389342 4212550 5883235 4245982 663698 -1608259 -1194742
$$ packed form
2984E458638P91995M469230L410136k214787o817057o484551l081613n33817K68878
2975d732948R67809K019838K107284P64113p24850j406629j862249k516248k136129
2966g520009N28646M089384N122253K074576k417151m255157k592170m98874p41283
2957f209785k424465k857167j485259k13309l16726r34532q03584J67795J519473
2948a3557559K927452L606597K466557j31200j945135j392193L11947P69033m62567
2939g407068j640927j445823m92268n0360k34778l4859J147091K461016K491449
2930e206527J265042O60409J934958L449436K495221o79212k754267j873472l4356
2921g42768L98650K76681J456779K823208J670685j637253l582284k271957M13517
$$ plain form
2912 -1194742 754560 2674415 3592875 2775288 297212 -2248558 -3282931 -3334552 -4002717
2903 -4002717 -5008756 -4248892 -1177876 1731333 1869967 -477211 -2988224 -4174703 -4312027
2894 -4312027 -4192741 -4144107 -4220477 -4581786 -5382175 -6359399 -6611691 -5177131 -2286902 366201
2884 366201 1424434 1617203 2632610 4480736 5503718 5150911 4889839 5526078 5408579
2875 5408579 2876177 -709230 -2248552 -749099 1741626 2879435 2328300 1405419 1650769
2866 1650769 3656806 6137509 6359205 2921647 -1933970 -4379243 -3502324 -1964806 -1758567
2857 -1758567 -1561828 320549 2478596 2304065 339859 12951 3006799 7235500 9882683
2848 9882683 10246059 8656745 4851876 -621605 -4845934 -4896060 -1598803 1030333 345083
$$ packed form
2912a194742J949302J919855R18460q17587k478076k545770j034373n1621o68165
2903d002717j006039P59864L071016K909209J38634k347178k511013j186479j37324
2894d312027J19286M8634p6370l61309q00389r77224k52292J434560K890229K653103
2884C66201J058233J92769J015407J848126J022982l52807k61072O36239j17499
2875E408579k532402l585407j539322J499453K490725J137809n51135r22881K45350
2866A650769K006037K480703K21696l437558m855617k445273Q76919J537518K06239
2857a758567J96739J882377K158047j74531j964206l26908K993848M228701K647183
2848I882683L63376j589314l804869n473481m224329n0126L297257K629136o85250
$$ plain form
2839 345083 -2489757 -4847133 -5725085 -5745410 -5566165 -5547498 -6127361 -7281948 -8018626 -7357322
2829 -7357322 -5479406 -3133985 -419996 2839223 5858953 7156320 6093710 3452522
2821 3452522 662460 -893394 -439177 1081163 893295 -2894450 -8315776 -10938831 -8732035
2812 -8732035 -4021415 -37879 2593944 4628004 5306851 3147886 -929500 -3684166
2804 -3684166 -3306029 -1452849 -776142 -1648112 -2379912 -1950236 -1252367 -1521780 -2410718
2795 -2410718 -2366085 -886540 339629 -678683 -3393629 -4897172 -3498860 -1109989 -893336
2786 -893336 -3144910 -5114266 -4969671 -4154202 -4785040 -6036382 -4952535 -754669 3374330
2777 3374330 3753910 619274 -2154831 -1690487 688837 1523801 -304933 -2381085 -2066552
$$ packed form
2839C45083k834840k357376q77952k0325J79245J8667n79863j154587p36678O61304
2829g357322J877916K345421K713989L259219L019730J297367j062610k641188
2821C452522k790062j555854M54217J520340j87868l787745n421326k623055K206796
2812h732035M710620L983536K631823K034060O78847k158965m077386k754666
2804c684166L78137J853180O76707q71970p31800M29676O97869k69413q88938
2795b410718M4633J479545J226169j018312k714946j503543J398312K388871K16653
2786h93336k251574j969356J44595Q15469o30838j251342J083847M197866M128999
2777C374330L79580l134636k774105M64344K379324Q34964j828734k076152L14533
$$ plain form
2768 -2066552 152087 1385181 -204603 -3633852 -6659376 -8099472 -8192229 -7483252 -6387347
2759 -6387347 -5686543 -6212387 -7356243 -6882625 -3623929 -14181 -114182 -4569784 -9266827
2750 -9266827 -10203913 -8180285 -6886497 -7661597 -8658518 -8533113 -7926942 -7063809 -5038998
2741 -5038998 -2616816 -2690052 -5888182 -8203949 -5745943 -293731 2714965 863883 -3190585
2732 -3190585 -5745784 -5503682 -3236268 -621304 311813 -1205798 -3229239 -3116529 -1076032
2723 -1076032 411992 786876 2349682 6194358 9775816 10085297 7325857 3811935 849228
2714 849228 -1494032 -2816312 -2664196 -1849427 -1762355 -2500029 -2923716 -2493885 -2027226 -2549514
2704 -2549514 -4028986 -5342377 -5328136 -4040374 -2826244 -2634314 -2586550 -1293515 677765
$$ packed form
2768b066552K218639J233094j589784l429249l025524j440096r2757P08977J095905
2759f387347P00804n25844j143856M73618L258696L609748j00001m455602m697043
2750i266827r37086K023628J293788p75100r96921J25405O06171Q63133K024811
2741e038998K422182p3236l198130k315767K458006N452212L008696j851082m054468
2732c190585k555199K42102K267414K614964R33117j517611k023441J12710K040497
2723a076032J488024L74884J562806L844676L581458L09481k759440l513922k962707
2714H49228k343260j322280J52116Q14769Q7072p37674m23687M29831M66659n22288
2704b549514j479472j313391J4241J287762J214130J91930M7764J293035J971280
$$ plain form
2695 677765 1270003 62465 -877007 89365 2160484 3912031 5323193 6679413 7064320
2686 7064320 5608799 3128425 1033718 -417996 -1583010 -2429901 -3393696 -5654831 -8826276
2677 -8826276 -9983310 -7244246 -2922105 -532378 89932 1586737 3853097 3772303 443226
2668 443226 -2895150 -3341973 -1887784 -1101769 -1692694 -2912684 -4303595 -5346616 -5011429
2659 -5011429 -3263095 -1692945 -1305787 -1058350 92712 1237368 1225566 904482 1719780
2650 1719780 3187315 3835852 3894834 4812589 6366268 6441612 4067132 1036156 -43418
2641 -43418 1728738 5180524 8185109 8959117 7240069 4481890 2287805 790884 -681928
2632 -681928 -1884459 -2052592 -1914881 -3511283 -7359678 -11222377 -12599796 -11342937 -8853313
$$ packed form
2695F77765N92238j207538r39472R66372K071119J751547J411162J356220L84907
2686G064320j455521k480374k094707j451714j165014q46891r63795k261135l171445
2677h826276j157034K739064M322141K389727O22310J496805K266360q0794l329077
2668D43226l338376m46823J454189P86015n90925j219990j390911j043021L35187
2659e011429J748334J570150L87158K47437J151062J144656j1802l21084Q15298
2650A719780J467535O48537N8982R17755J553679P5344k374480l030976j079574
2641d3418J772156L451786L004585P74008j719048k758179k194085j496921j472812
2632f81928j202531j68133J37711j596402l848395l862699j377419J256859K489624
$$ plain form
2623 -8853313 -5853063 -2419660 440480 1042998 -940045 -3984647 -6655754 -8960142
2615 -8960142 -11147924 -12156007 -10432814 -6116078 -1369573 1750508 3163682 4134749
2607 4134749 5247483 5695701 4695560 3060499 2717599 4445054 6496486 6109234 2540642
2598 2540642 -1895279 -4246248 -4057961 -3498895 -4462695 -6319251 -6921036 -5319272 -2812376
2589 -2812376 -1307533 -1194487 -1305635 -938007 -1277250 -4019281 -8566844 -11657822 -10651999
2580 -10651999 -6638190 -3217203 -2416871 -2916850 -2308739 72301 2862847 4208578 3265881
2571 3265881 1053868 -58491 1194261 2921922 1869589 -2451868 -7003699 -8994211
2563 -8994211 -8526452 -6864370 -4525217 -2547700 -3090031 -6288643 -8464207 -6344791 -1687395
$$ packed form
2623h853313L000250L433403K860140O02518j983043l044602k671107k304388
2615h960142k187782j008083J723193M316736M746505L120081J413174R71067
2607D134749J112734M48218j000141j635061l42900J727455K051432l87252l568592
2598B540642m435921k350969J88287N59066r63800j856556o01785J601764K506896
2589b812376J504843J13046j11148L67628l39243k742031m547563l090978J005823
2580a0651999M013809L420987Q00332m99979O08111K381040K790546J345731r42697
2571C265881k212013j112359J252752J727661j052333m321457m551831j990512
2563h994211M67759J662082K339153J977517n42331l198612k175564K119416M657396
$$ plain form
2554 -1687395 1280852 1788719 2482478 4319444 5408822 4935399 4328066 3826462 1570411
2545 1570411 -2663587 -6097587 -6716786 -5415715 -3181441 439580 4338773 4984484 1313946
2536 1313946 -2549634 -2600185 -428081 -40552 -1456924 -1418019 902969 2994679 3442181
2527 3442181 3633116 4715859 5736363 5385886 3592330 1122826 -922781 -1599844 -1496636
2518 -1496636 -2658406 -5550802 -7610390 -6863498 -5013437 -4132586 -2624259 1374804 4477105
2509 4477105 1457101 -6236072 -11200899 -10209902 -7986646 -9058000 -11433623 -11527567 -10413942
2500 -10413942 -10890935 -11991584 -11091277 -8989523 -8323015 -8566679 -6975785 -3526670 -861578
2491 -861578 163799 1040880 1826271 493460 -3330423 -6993798 -8078470 -6818076 -4663916
$$ packed form
2554a687395K968247N07867O93759J836966J089378m73423o07333n01604k256051
2545A570411m233998l434000o19199J301071K234274L621021L899193O45711l670538
2536A313946l863580n0551K172104L87529j416372L8905K320988K091710M47502
2527C442181J90935J082743J020504l50477j793556k469504k045607o77063J03208
2518a496636j161770k892396k059588P46892J850061Q80851J508327L999063L102301
2509D477105l020004p693173m964827R90997K223256j071354k375623r3944J113625
2500a0413942m76993j100649R00307K101754O66508k43664J590894L449115K665092
2491h61578J025377Q77081P85391j332811l823883l663375j084672J260394K154160
$$ plain form
2482 -4663916 -2380940 -125613 2072235 4125596 5095050 3268297 -1310222 -5370915
2474 -5370915 -5799342 -3666622 -2209383 -1701040 31006 2243816 975477 -4487944 -8935094
2465 -8935094 -7661140 -2626333 720468 517745 -832579 -1627048 -2995113 -6074013 -9644844
2456 -9644844 -11222578 -9196652 -3888065 2333827 6193858 6038067 3279683 617550
2448 617550 -730416 -1222824 -1323901 -1153579 -1443821 -3250684 -6453462 -9557310 -11228230
2439 -11228230 -11429978 -11128382 -11414413 -12644556 -13936075 -13971207 -12745361 -11659938 -11228534
2430 -11228534 -9978860 -6940112 -3947177 -3454847 -4839960 -5261623 -4029328 -3609539 -5742186
2421 -5742186 -8766711 -9856646 -8288275 -5467755 -3054462 -2031341 -2466356 -3221956 -2777261
$$ packed form
2482d663916K282976K255327K197848K053361R69454j826753m578519m060693
2474e370915m28427K132720J457239N08343J732046K212810j268339n463421m447150
2465h935094J273954N034807L346801k02723j350324p94469j368065l078900l570831
2456i644844j577734K025926N308587O221892L860031j55791k758384k662133
2448F17550j347966m92408j01077J70322k90242j806863l202778l103848j670920
2439a1228230k01748L01596k86031j230143j291519l5132J225846J085423M31404
2430a1228534J249674L038748K992935M92330j385113m21663J232295M19789k132647
2421e742186l024525j089935J568371K820520K413293J023121m35015p55600M44695
$$ plain form
2412 -2777261 -979930 941160 2378252 3901498 5383942 5478522 3939750 2503310 2028444
2403 2028444 742308 -2671253 -6020634 -6282968 -4154963 -3026680 -4018264 -5096562 -5110922
2394 -5110922 -5495705 -7064443 -7935860 -6311719 -3413153 -1928306 -2694539 -4306714 -5228105
2385 -5228105 -5265233 -5524122 -7399167 -10843591 -13552766 -13181695 -10536970 -8815158 -9255728
2376 -9255728 -9689899 -8304153 -6464425 -6159504 -6783896 -6626497 -5818749 -5397948 -4910379
2367 -4910379 -3613780 -2844018 -4150509 -5867974 -4903000 -1768388 -355539 -2157944 -4101763
2358 -4101763 -3330046 -1043240 230848 507873 1092759 1399957 -250172 -3559329 -6319240
2349 -6319240 -7255949 -7044817 -6668889 -6269647 -5710036 -5217158 -5229345 -5905650 -6531849 -5539914
$$ packed form
2412b777261J797331J921090J437092J523246J482444R4580j538772j436440m74866
2403B028444j286136l413561l349381k62334K128005J128283r91584j078298j4360
2394e110922l84783j568738q71417J624141K898566J484847p66233j612175r21391
2385e228105l7128k58889j875045l444424k709175L71071K644725J721812m40570
2376i255728m34171J385746J839728L04921o24392J57399Q07748M20801M87569
2367d910379J296599P69762j306491j717465R64974L134612J412849j802405j943819
2358d101763P71717K286806J274088K77025N84886L07198j650129l309157k759911
2349f319240r36709K11132L75928L99242N59611M92878j2187o76305o26199R91935
$$ plain form
2339 -5539914 -2264406 1158289 1446450 -1380578 -3175714 -950156 2731354 2907885 -1462443
2330 -1462443 -6932969 -10472480 -11918905 -11683761 -9358788 -5706123 -3311195 -3461178 -4168176
2321 -4168176 -3044419 -746725 308075 -332291 -818574 -159059 248639 -1116405 -3309838
2312 -3309838 -3621450 -664918 3871761 6872860 7018105 5811761 5125942 4503094 2034432
2303 2034432 -2350177 -6042552 -6770875 -5188147 -3564980 -2993758 -3157998 -4105018 -6527816
2294 -6527816 -10146030 -13130828 -13783020 -12242324 -10197467 -9219930 -9411851 -9327288 -7383511
2285 -7383511 -3899627 -1480867 -2443485 -5838761 -8172601 -7507463 -5688309 -5605931 -7287151
2276 -7287151 -8189914 -6904534 -4756637 -3459143 -2951814 -2632821 -3337584 -6285012 -10438557
$$ packed form
2339e539914L275508L422695K88161k827028j795136K225558L681510J76531m370328
2330a462443n470526l539511j446425K35144K324973L652665K394928j49983p06998
2321d168176J123757K297694J054800o40366m86283O59515M07698j365044k193433
2312c309838l11612K956532M536679L001099J45245j206344o85819o22848k468662
2303B034432m384609l692375p28323J582728J623167N71222j64240r47020k422798
2294f527816l618214k984798o52192J540696K044857R77537j91921Q4563J943777
2285g383511L483884K418760r62618l395276k333840O65138J819154Q2378j681220
2276g287151r02763J285380K147897J297494N07329L18993p04763k947428m153545
$$ plain form
2267 -10438557 -12664277 -10983097 -6639080 -2507092 -217129 808776 2207236 4922260
2259 4922260 7943498 8600703 5038040 -1226017 -6217967 -7551045 -6501249 -5416758
2251 -5416758 -4551857 -2930941 -1082851 -623885 -1414301 -1397548 293903 1958491 1797044
2242 1797044 189664 -1421196 -2582412 -3671301 -4740002 -5685007 -6843170 -8416325
2234 -8416325 -9943044 -11162194 -12514842 -13760033 -13144483 -9559795 -4874727 -2249519
2226 -2249519 -2302724 -2853116 -2592463 -2801908 -4450847 -5621745 -3805144 189458 2706887
2217 2706887 1596438 -1607535 -4188663 -5324483 -5698217 -5288085 -3295461 -239241 1431633
2208 1431633 -189687 -3871137 -6027947 -4278523 158678 3730275 3946991 1417986
$$ packed form
2267a0438557k225720J681180M344017M131988K289963J025905J398460K715024
2259D922260L021238O57205l562663o264057m991950j333078J049796J084491
2251e416758Q64901J620916J848090M58966p90416J6753J691451J664588j61447
2242A797044j607380j610860j161216j088889j068701r45005j158163j573155
2234h416325j526719j219150j352648j245191O15550L584688M685068K625208
2226b249519n3205n50392K60653k09445j648939j170898J816601L994602K517429
2217B706887j110449l203973k581128j135820l73734M10132J992624L056220J670874
2208A431633j621320l681450k156810J749424M437201L571597K16716k529005
$$ plain form
2200 1417986 -1241322 -2187180 -1843893 -1656582 -1758114 -581737 2915962 7300339 9774213
2191 9774213 9123410 6730558 4595959 3326504 2555103 2366978 3170522 4449792 4802646
2182 4802646 3518232 1398293 -324829 -1277854 -1677545 -1296757 424481 3115466 5011864
2173 5011864 4372586 1313901 -2171039 -4127576 -4291823 -3747888 -3413464 -3350878 -3335524
2164 -3335524 -3396573 -3581740 -3637468 -3216206 -2206471 -813556 373696 496315 -710518
2155 -710518 -2044714 -1779126 -84969 401135 -2400296 -6880216 -9032228 -6962794 -2809509
2146 -2809509 238286 1477193 2264728 3124357 2917871 862592 -1980385 -3781295 -3793333
2137 -3793333 -2701824 -1703772 -1694813 -2864385 -4493358 -5427363 -5322612 -5258684 -6576301
$$ packed form
2200A417986k659308r45858L43287J87311j01532J176377L497699M384377K473874
2191I774213o50803k392852k134599j269455p71401j88125Q03544J279270L52854
2182D802646j284414k119939j723122r53025l99691L80788J721238K690985J896398
2173E011864o39278l058685l484940j956537j64247N43935L34424O2586J5354
2164c335524o1049j85167n5728M21262J009735J392915J187252J22619j206833
2155g10518j334196K65588J694157M86104k801431m479920k152012K069434M153285
2146b809509L047795J238907P87535Q59629k06486k055279k842977j800910j2038
2137c793333J091509R98052Q959j169572j628973r34005J04751O3928j317617
$$ plain form
2128 -6576301 -9256852 -12053193 -14036768 -15096789 -14868585 -12514232 -8459058 -5288410
2120 -5288410 -5324503 -7528577 -8418595 -6441541 -3945191 -3904710 -5959593 -7178278 -6022434
2111 -6022434 -3705848 -1637760 504309 3246456 5417549 5382046 3504253 1767266 1041743
2102 1041743 270254 -1293169 -2498345 -1873775 200927 2017523 2665983 2517153 1923469
2093 1923469 701473 -970624 -2223161 -2510173 -2306258 -2458854 -3280600 -4319699 -4472330
2084 -4472330 -2507305 1515607 5296265 5990390 3286181 -323259 -2771700 -4566483
2076 -4566483 -6994988 -9779318 -11854951 -13136790 -13853890 -13312355 -11295398 -9607622 -9700284
2067 -9700284 -9481762 -5635752 802841 4652396 3512052 1198771 2100706 4860013 4826173
$$ packed form
2128f576301k680551k796341j983575j060021K28204K354353M055174L170648
2120e288410l6093k204074q90018J977054K496350M0481k054883j218685J155844
2111f022434K316586K068088K142069K742147K171093l5503j877793j736987p25523
2102A041743p71489j563423j205176O24570K074702J816596O48460j48830n93684
2093A923469j221996j672097j252537k87012K03915j52596q21746j039099j52631
2084d472330J965025M022912L780658O94125k704209l609440k448441j794783
2076d566483k428505k784330k075633j281839p17100N41535K016957J687776r2662
2067i700284K18522L846010O438593L849555j140344k313281R01935K759307l3840
$$ plain form
2058 4826173 1128237 -2363897 -2932766 -2539627 -4414323 -8399098 -11294290 -10836065 -8000721
2049 -8000721 -5485796 -4597387 -4024794 -1965080 787485 1051955 -2740219 -7911211 -10303214
2040 -10303214 -8958881 -6389069 -4633184 -3165584 -1056744 823184 947806 -761326
2032 -761326 -3263001 -6159889 -9862783 -14024192 -16764059 -16082703 -12097776 -7556149 -5572427
2023 -5572427 -6723699 -8981474 -10614855 -11876388 -13030553 -12440434 -8790539 -4267851
2015 -4267851 -2665863 -4209389 -5171870 -3537184 -2116619 -4133650 -8201436 -10526670
2007 -10526670 -10543360 -10974408 -12646834 -12691631 -8989362 -3874542 -1598453 -3406587 -6711424
1998 -6711424 -8367018 -7336290 -4623519 -2144484 -1788568 -4212034 -7825036 -9764319
$$ packed form
2058D826173l697936l492134n68869L93139j874696l984775k895192M58225K835344
2049h000721K514925Q88409N72593K059714K752565K64470l792174n170992k392003
2040a0303214J344333K569812J755885J467600K108840J879928J24622j709132
2032g61326k501675k896888l702894m161409k739867O81356L984927M541627J983722
2023e572427j151272k257775j633381j261533j154165N90119L649895M522688
2015d267851J601988j543526r62481J634686J420565k017031m067786k325234
2007a0526670j6690m31048j672426m4797L702269N114820K276089j808134l304837
1998f711424j655594J030728K712771K479035L55916k423466l613002j939283
$$ plain form
1990 -9764319 -8707061 -6326783 -5201132 -5658221 -5805565 -4624087 -3513976 -4006562 -5292122
1981 -5292122 -5462950 -4351836 -3350909 -2842417 -1923733 -829135 -1294884 -3568902 -5178181
1972 -5178181 -4263049 -2454691 -2464688 -4118068 -5158490 -5195774 -6037523 -7962127 -8450800
1963 -8450800 -5811230 -1989745 -81119 -281336 -103584 1903104 4335334 5033661 3792621
1954 3792621 2294357 1848535 2022367 1792892 1493520 2601765 5319161 7465846 6867004
1945 6867004 4203132 2125361 1851508 2218575 2096016 1865745 1952443 1743789 1048086
1936 1048086 979396 1960977 2293792 501496 -2067553 -3078038 -2785768 -3336875 -4891627
1927 -4891627 -5213623 -3475995 -1767804 -1827644 -2775463 -3532073 -5053607 -7942744 -9805694
$$ packed form
1990i764319J057258K380278J125651m57089j47344J181478J110111m92586j285560
1981e292122j70828J111114J000927N08492R18684J094598m65749k274018j609279
1972e178181R15132J808358r997j653380j040422l7284q41749j924604m88673
1963h450800K639570L821485J908626k00217J77752K006688K432230O98327j241040
1954C792621j498264m45822J73832k29475k99372J108245K717396K146685n98842
1945F867004k663872k077771k73853L67067j22559k30271Q6698k08654o95703
1936A048086o8690R81581L32815j792296k569049j010485K92270n51107j554752
1927d891627l21996J737628J708191n9840r47819p56610j521534k889137j862950
$$ plain form
1918 -9805694 -7909403 -3457278 -252007 481143 879779 1956576 1739023 -825792 -3186974
1909 -3186974 -2818788 -1454864 -2760181 -6744435 -9492912 -8535766 -5823657 -4490231 -4805959
1900 -4805959 -4888769 -4060728 -3539582 -4064430 -4518267 -3452617 -980682 1575592 3310137
1891 3310137 4143233 4013854 2918757 1892750 2413343 3852726 2956870 -2235640 -8753175
1882 -8753175 -11427845 -9307035 -6726971 -7305434 -9663204 -10667319 -10140977 -9712533 -9177103
1873 -9177103 -7470503 -6061265 -7622584 -11535527 -14200430 -14085884 -13129531 -12609885 -11203110
1864 -11203110 -8352063 -6127314 -5908886 -6246986 -6027274 -6701279 -8841633 -9488689 -6327879
1855 -6327879 -2196273 -1596783 -4252924 -5980828 -4896728 -2783184 -938666 1074993
$$ packed form
1918i805694J896291M452125L205271P33150L98636J076797k17553k564815k361182
1909c186974L68186J363924j305317l984254k748477R57146K712109J333426l15728
1900d805959q2810Q28041N21146n24848m53837J065650K471935K556274J734545
1891C310137Q33096j29379j095097j026007N20593J439383q95856n192510o517535
1882h753175k674670K120810K580064n78463k357770j004115N26342M28444N35430
1873i177103J706600J409238j561319l912943k664903J14546R56353N19646J406775
1864a1203110K851047K224749K18428l38100K19712o74005k140354o47056L160810
1855f327879M131606N99490k656141j727904J084100K113544J844518K013659
$$ plain form
1847 1074993 2484767 1384722 -1372639 -2233259 -174201 1626297 765209 -1274360 -2772247
1838 -2772247 -4824253 -8050272 -9595463 -7078756 -3230248 -2638809 -5246522 -7018771
1830 -7018771 -6419551 -6171182 -8206801 -10554097 -10581653 -8625732 -6778445 -6013588 -6137906
1821 -6137906 -7259426 -9726974 -13221061 -16891624 -19917494 -21424981 -20665295 -17919705
1813 -17919705 -14486701 -11141853 -7389485 -2991888 573594 1402043 -272614 -1858965
1805 -1858965 -1037462 1981762 5058526 6431743 5975300 4553152 3024241 2173439 2746385
1796 2746385 4472045 5282531 2853929 -2538981 -7717576 -9943841 -9798354 -9806929 -10905732
1787 -10905732 -11554487 -10125032 -6875379 -3312821 -558071 1222643 2329815 2953188
$$ packed form
1847A074993J409774j100045k757361q60620K059058J800498q61088k039569j497887
1838b772247k052006l226019j545191K516707L848508N91439k607713j772249
1830g018771N99220K48369k035619k347296k7556J955921J847287P64857j24318
1821f137906j121520k467548l494087l670563l025870j507487P59686K745590
1813a7919705L433004L344848L752368M397597L565482Q28449j674657j586351
1805a858965Q21503L019224L076764J373217m56443j422148j528911q50802N72946
1796B746385J725660Q10486k428602n392910n178595k226265J45487q575j098803
1787a0905732o48755J429455L249653L562558K754750J780714J107172O23373
$$ plain form
1779 2953188 3066263 2847802 2934600 3637833 4061993 3237652 2355060 4005940 8081009
1770 8081009 10411854 7592889 1546420 -3396691 -6517593 -10109084 -13573652 -12936581
1762 -12936581 -7460466 -2305122 -2025148 -4859509 -6423471 -6014837 -5718262 -5835337 -5416563
1753 -5416563 -5519405 -7335377 -8199227 -4523224 1487877 3418754 -116529 -3158555 -1411412
1744 -1411412 1624093 1009851 -1673609 -1675609 659632 720731 -2410370 -4370574 -2300134
1735 -2300134 1550483 4284408 6328739 8858396 10444716 8919189 4737938 332237
1727 332237 -2619405 -3713647 -3048720 -1511271 -496493 160150 2440268 6558708 8853296
1718 8853296 5913996 -236235 -4145509 -3875079 -2811185 -4003378 -5824356 -4969931 -1447540
$$ packed form
1779B953188J13075k18461Q6798P03233M24160q24341q82592J650880M075069
1770H081009K330845k818965o046469m943111l120902l591491l464568O37071
1762a2936581N476115N155344K79974k834361j563962M08634K96575j17075M18774
1753e416563j02842j815972q63850L676003O011101J930877l535283l042026J747143
1744a411412L035505o14242k683460k000K335241O1099l131101j960204K070440
1735b300134L850617K733925K044331K529657J586320j525527m181251m405701
1727C32237k951642j094242O64927J537449J014778O56643K280118M118440K294588
1718H853296k939300o150231l909274K70430J063894j192193j820978Q54425L522391
$$ plain form
1709 -1447540 1772992 2819893 2286241 1037771 -1095559 -4118276 -7108711 -9439201
1701 -9439201 -11591414 -13866409 -15144231 -14130074 -11566112 -9907208 -10294061 -10755559 -8426913
1692 -8426913 -3247652 1712466 3828483 3595398 2944423 2095959 -205703 -3778245 -6483268
1683 -6483268 -7226374 -7589890 -9202418 -11012879 -11018017 -9640429 -9013418 -9213270 -7898384
1674 -7898384 -4402202 -1615199 -2055243 -3973845 -3750009 -1067996 962900 538343 -818506
1665 -818506 -1520320 -2460390 -4746339 -7017100 -7208209 -5749968 -4806381 -5115666 -5866514
1656 -5866514 -7264206 -10592287 -15327794 -18577840 -18383752 -15776309 -12623038 -9338594
1648 -9338594 -6026509 -3980845 -4016980 -4519596 -3316646 -878477 299526 -931772 -3529670
$$ packed form
1709a447540L220532J046901n33652j248470k133330l022717k990435k330490
1701i439201k152213k274995j277822J014157K563962J658904l86853m61498K328646
1692h426913N179261M960118K116017k33085o50975q48464k301662l572542k705023
1683f483268p43106l63516j612528j810461n138J377588O27011j99852J314886
1674g898384L496182K787003m40044j918602K23836K682013K030896m24557j356849
1665h18506p01814r40070k285949k270761j91109J458241R43587l09285p50848
1656e866514j397692l328081m735507l250046J94088K607443L153271L284444
1648i338594L312085K045664l6135n02616J202950K438169J178003j231298k597898
$$ plain form
1639 -3529670 -6455144 -9617133 -12513242 -13894908 -13247460 -11079420 -7591193 -2840703
1631 -2840703 1555911 3061558 1326927 -1294984 -3133971 -4857720 -6599832 -6189399
1623 -6189399 -2693638 417087 -1001676 -5810139 -8729281 -7351376 -4753004 -4476374
1615 -4476374 -5998908 -6728434 -6046993 -5229583 -4831808 -4287161 -3363807 -2279989 -863624
1606 -863624 880106 1812950 908589 -677635 -418896 2385770 5557614 6674296 5624823
1597 5624823 3879159 2220620 245630 -2342426 -4981718 -6879210 -7779217 -7950457 -7769981
1588 -7769981 -7459008 -7024107 -6365694 -5517267 -4693986 -3930590 -2781497 -716258 2098404
1579 2098404 4680631 6083720 6201368 5568807 4641570 3727127 3524256 4907662 7555816
$$ packed form
1639c529670k925474l161989k896109j381666O47448K168040L488227M750490
1631b840703M396614J505647j734631k621911j838987j723749j742112M10433
1623f189399L495761L110725j418763m808463k919142J377905K598372K76630
1615d476374j522534p29526O81441Q17410L97775N44647R23354J083818J416365
1606h63624J743730R32844r04361j586224K58739K804666L171844J116682j049473
1597E624823j745664j658539j974990k588056k639292j897492r00007j71240J80476
1588g769981L10973M34901O58413Q48427Q23281P63396J149093K065239K814662
1579B098404K582227J403089J17648o32561r27237r14443k02871J383406K648154
$$ plain form
1570 7555816 9291940 7922351 3995975 702154 194194 762916 -1007878 -5484914 -9027264
1561 -9027264 -8413798 -4830943 -2217718 -2605423 -4710637 -6630153 -7890471 -8496274 -7945102
$$ packed form
1570G555816J736124j369589l926376l293821n07960N68722j770794m477036l542350
1561i027264O13466L582855K613225l87705k105214j919516j260318o05803N51172
$$ [...]
##END NTUPLES=NMR SPECTRUM
##END=
