##TITLE=31Pdec_DE-82k2
 CDCl3, 64 sc
 4.4.2025
##JCAMPDX= 6.0         $$ Bruker NMR JCAMP-DX V2.0
##DATA TYPE= NMR SPECTRUM
##DATA CLASS= NTUPLES
##ORIGIN= UXNMR, Bruker Analytische Messtechnik GmbH
##OWNER= root
$$ XWIN-NMR		Version 3.5
$$ Fri Apr  4 14:15:38 2025 Russian Standard Time (UT+4h)  she@DPX200
##.OBSERVE FREQUENCY= 81.013821
##.OBSERVE NUCLEUS= ^31P
##.ACQUISITION MODE= SIMULTANEOUS
##.ACQUISITION SCHEME= undefined
##.AVERAGES= 64
##.DIGITISER RES= 17
##SPECTROMETER/DATA SYSTEM= spect
##.PULSE SEQUENCE= zgpg30
##.SOLVENT NAME= CDCl3
##.SHIFT REFERENCE= (INTERNAL, CDCl3, 0, 198.062)
##AUDIT TRAIL= $$ (NUMBER, WHEN, WHO, WHERE, WHAT)
$$ ##TITLE= Audit trail, XWIN-NMR		Version 3.5
$$ ##JCAMPDX= 5.01
$$ ##ORIGIN= Bruker BioSpin GmbH
$$ ##OWNER= she
$$ F:/spectra/data/she/nmr/P31/2/pdata/1/auditp.txt
$$ ##AUDIT TRAIL=  $$ (NUMBER, WHEN, WHO, WHERE, WHAT)
(   1,<2025-04-04 14:14:37.50 +0400>,<she>,<DPX200>,
      <created by zg, POWCHK disabled, PULCHK disabled
       configuration hash MD5:
       00 E9 B6 7A A2 85 ED C7 34 08 36 98 17 FE 4E 26
       data hash MD5: 32K
       0D D3 73 A9 B7 9B 52 94 3D 19 34 BA FB 03 56 D6>)
(   2,<2025-04-04 14:14:39.96 +0400>,<she>,<DPX200>,
      <Start of raw data processing
       efp BC_mod = 2 LB = 1.5 FT_mod = 6 PKNL = 1 PHC0 = 1436.326 PHC1 = -25.50586 SI = 64K 
       data hash MD5: 64K
       DE 8D AC A9 B5 57 4C D2 08 AE 3D 9E C8 13 F6 AA>)
(   3,<2025-04-04 14:15:07.81 +0400>,<she>,<DPX200>,
      <pk PHC0 = 17.95941 PHC1 = 0 
       data hash MD5: 64K
       B3 EC 94 05 4D 27 98 23 52 BB 66 8F 7C 5C A5 6E>)
(   4,<2025-04-04 14:15:14.26 +0400>,<she>,<DPX200>,
      <abs ABSG = 5 
       data hash MD5: 64K
       33 C6 4F 2F 25 1C BE 53 24 A8 41 42 7C 8A 22 37>)
$$ ##END=
$$ 
$$ hash MD5
$$ 41 BA DF D7 AF 54 6C 97 AC 5D 9B DA 64 15 0A 0C
##$RELAX= 
##$RELAX= 
##$RELAX= 
##$RELAX= 
##$RELAX= 
##$RELAX= 
##$RELAX= 
##$RELAX= 
$$ Bruker specific parameters
$$ --------------------------
##$DU= <F:/spectra>
##$EXPNO= 2
##$NAME= <P31>
##$PROCNO= 1
##$TYPE= <nmr>
##$USER= <she>
##$AMP= (0..31)
100 100 100 100 100 100 100 100 100 100 100 100 100 100 100 100 100 100 
100 100 100 100 100 100 100 100 100 100 100 100 100 100 
##$AQSEQ= 0
##$AQ_mod= 1
##$AUNM= <au_zg>
##$AUTOPOS= <>
##$BF1= 81.014009
##$BF2= 200.13
##$BF3= 200.13
##$BF4= 200.13
##$BF5= 200.13
##$BF6= 200.13
##$BF7= 200.13
##$BF8= 200.13
##$BYTORDA= 1
##$CFDGTYP= 0
##$CFRGTYP= 5
##$CHEMSTR= <none>
##$CNST= (0..31)
1 1 145 1 1 1 1 1 1 1 1 1 1 1 1 1 1 1 1 1 1 1 1 1 1 1 1 1 1 1 1 1 
##$CPDPRG= <waltz16>
##$CPDPRG1= <>
##$CPDPRG2= <waltz16>
##$CPDPRG3= <>
##$CPDPRG4= <mlev>
##$CPDPRG5= <mlev>
##$CPDPRG6= <mlev>
##$CPDPRG7= <mlev>
##$CPDPRG8= <mlev>
##$CPDPRGB= <>
##$CPDPRGT= <>
##$D= (0..31)
0 1 0 0 0 0 0 0 0 0.06 0 0.03 2e-05 3e-06 0 0 0.0002 0 0 0 0 0 0 0 0 0 
0 0 0 0 0 0 
##$DATE= 1743761676
##$DBL= (0..7)
120 120 120 11 120 120 24 19 
##$DBP= (0..7)
150 150 150 150 150 150 150 150 
##$DBP07= 0
##$DBPNAM0= <>
##$DBPNAM1= <>
##$DBPNAM2= <>
$$ [...]
##$SUBNAM3= <"">
##$SUBNAM4= <"">
##$SUBNAM5= <"">
##$SUBNAM6= <"">
##$SUBNAM7= <"">
##$SUBNAM8= <"">
##$SUBNAM9= <"">
##$SW= 400.765351723535
##$SWIBOX= (0..15)
0 1 3 0 0 0 0 0 0 0 0 0 0 0 0 0 
##$SW_h= 32467.5324675325
##$TD= 32768
##$TD0= 1
##$TE= 0
##$TE2= 300
##$TE3= 300
##$TEG= 300
##$TL= (0..7)
0 120 53 12 22 120 120 120 
##$TP= (0..7)
150 150 150 150 150 150 150 150 
##$TP07= 0
##$TPNAME0= <>
##$TPNAME1= <>
##$TPNAME2= <>
##$TPNAME3= <>
##$TPNAME4= <>
##$TPNAME5= <>
##$TPNAME6= <>
##$TPNAME7= <>
##$TPOAL= (0..7)
0.5 0.5 0.5 0.5 0.5 0.5 0.5 0.5 
##$TPOFFS= (0..7)
0 0 0 0 0 0 0 0 
##$TUNHIN= 0
##$TUNHOUT= 0
##$TUNXOUT= 0
##$USERA1= <user>
##$USERA2= <user>
##$USERA3= <user>
##$USERA4= <user>
##$USERA5= <user>
##$V9= 5
##$VALIST= <valist>
##$VCLIST= <CCCCCCCCCCCCCCC>
##$VD= 0
##$VDLIST= <DDDDDDDDDDDDDDD>
##$VPLIST= <PPPPPPPPPPPPPPP>
##$VTLIST= <TTTTTTTTTTTTTTT>
##$WBST= 1024
##$WBSW= 4
##$XGAIN= (0..3)
0 0 0 0 
##$XL= 0
##$YL= 0
##$YMAX_a= 8726
##$YMIN_a= -10548
##$ZGOPTNS= <>
##$ZL1= 120
##$ZL2= 120
##$ZL3= 120
##$ZL4= 120
##$ABSF1= 198.0616
##$ABSF2= -202.7028
##$ABSG= 5
##$ABSL= 3
##$ALPHA= 0
##$AQORDER= 0
##$ASSFAC= 0
##$ASSFACI= 0
##$ASSFACX= 0
##$ASSWID= 0
##$AUNMP= <proc_1d>
##$AZFE= 0.1
##$AZFW= 0.5
##$BCFW= 0
##$BC_mod= 2
##$BYTORDP= 0
##$COROFFS= 0
##$CY= -3
##$DATMOD= 1
##$DC= 0
##$DFILT= <>
##$DTYPP= 0
##$F1P= 0
##$F2P= 0
##$FCOR= 1
##$FTSIZE= 65536
##$FT_mod= 6
##$GAMMA= 0
##$GB= 0
##$INTBC= 1
##$INTSCL= 9.790993e-09
##$ISEN= 30
##$LB= 1.5
##$LEV0= 0
##$LPBIN= 0
##$MAXI= 10000
##$MC2= 0
##$MEAN= 0
##$ME_mod= 0
##$MI= 50
##$NCOEF= 0
##$NC_proc= -8
##$NLEV= 6
##$NOISF1= 182.463
##$NOISF2= 159.3651
##$NSP= 0
##$NTH_PI= 0
##$NZP= 0
##$OFFSET= 198.0616
##$PC= 4
##$PHC0= 1454.285
##$PHC1= -25.50586
##$PH_mod= 1
##$PKNL= yes
##$PPARMOD= 0
##$PSCAL= 0
##$PSIGN= 0
##$REVERSE= no
##$SF= 81.0140089999434
##$SI= 65536
##$SIGF1= 159.3651
##$SIGF2= -187.1042
##$SINO= 113.3802
##$SIOLD= 16384
##$SREGLST= <1H.CDCl3>
##$SSB= 0
##$STSI= 65536
##$STSR= 0
##$SW_p= 32467.5324675325
##$SYMM= 0
##$S_DEV= 0
##$TDeff= 32768
##$TDoff= 0
##$TI= <>
##$TILT= no
##$TM1= 0
##$TM2= 0
##$TOPLEV= 0
##$USERP1= <user>
##$USERP2= <user>
##$USERP3= <user>
##$USERP4= <user>
##$USERP5= <user>
##$WDW= 1
##$XDIM= 65536
##$YMAX_p= 529760067
##$YMIN_p= -79872205
$$ End of Bruker specific parameters
$$ ---------------------------------
##NTUPLES= NMR SPECTRUM
##VAR_NAME=  FREQUENCY,     SPECTRUM/REAL,   SPECTRUM/IMAG
##SYMBOL=    X,             R,               I
##VAR_TYPE=  INDEPENDENT,   DEPENDENT,       DEPENDENT
##VAR_FORM=  AFFN,          ASDF,            ASDF
##VAR_DIM=   65536,         65536,           65536
##UNITS=     HZ,            ARBITRARY UNITS, ARBITRARY UNITS
##FACTOR=    0.49542278885378, 1,            1
##FIRST=     16045.7642231865, 0,            0
##LAST=      -16421.768244346, 0,            0
##MIN=       -16421.768244346, -79872205,    0
##MAX=       16045.7642231865, 529760067,    0
$$ Real data points
##PAGE= N=1
##DATA TABLE= (X++(R..R)), XYDATA
$$ [...]
$$ plain form
44048 3691095 3375478 2218233 -86567 -2899534 -4641525 -3470142 1024291 6330392
44040 6330392 8167258 4260992 -3082840 -8852298 -9755199 -6418159 -1804029 1286426
44032 1286426 1166028 -2478083 -7835112 -11189589 -9628778 -4022052 1629669 4277843
44024 4277843 4406712 3949838 2865123 -358936 -4981710 -7201921 -4517546 650606
44016 650606 3756912 3705960 3184203 3710323 3458398 999395 -1792508 -2699329 -2644114
44007 -2644114 -3462162 -4107381 -2613760 -730489 -2437113 -7692385 -11740427 -11690406 -9883173
43998 -9883173 -8923434 -7287055 -2927923 1943695 3725204 3100104 3587947 5446844 5483330
43989 5483330 2975318 1382356 2945654 5316833 5386348 3347499 835842 -2065612
$$ packed form
44048C691095l15617j157245k304800k812967j741991J171383M494433N306101
44040F330392J836866l906266p343832n769458r02901L337040M614130L090455
44032A286426j20398l644111n357029l354477J560811N606726N651721K648174
44024D277843J28869m56874j084715l224059m622774k220211K684375N168152
44016F50606L106306n0952n21757N26120k51925k459003k791903r06821N5215
44007b644114q18048o45219J493621J883271j706624n255272m048042N0021J807233
43998i883173R59739J636379M359132M871618J781509o25100M87843J858897L6486
43989E483330k508012j592962J563298K371179O9515k038849k511657k901454
$$ plain form
43981 -2065612 -5160607 -5890533 -2382806 2462388 3661265 732192 -1860707 -1196585
43973 -1196585 756962 1559291 2438888 5216799 7683424 5903845 240740 -4660312
43965 -4660312 -6064492 -5811102 -5851539 -4709501 -729490 3884548 5531979 4257484 3078069
43956 3078069 3086165 2707936 1785973 2639841 5867737 8345498 7446822 4817112 3615010
43947 3615010 3864440 3139757 638390 -2108686 -4012456 -5435648 -6539518 -6757016 -6030011
43938 -6030011 -4788379 -2690602 784617 4386786 5638731 3724182 149719 -3716161
43930 -3716161 -7701622 -10805715 -10559208 -6231990 -1058199 1026513 222538 281391 3126867
43921 3126867 6246186 6379507 4129543 3059947 4726765 6639560 5805960 2616006
$$ packed form
43981b065612l094995p29926L507727M845194J198877k929073k592899O64122
43973a196585J953547Q02329Q79597K777911K466625j779579n663105m901052
43965d660312j404180K53390m0437J142038L980011M614038J647431j274495j179415
43956C078069Q096l78229r21963Q53868L227896K477761q98676k629710j202102
43947C615010K49430p24683k501367k747076j903770j423192j103870k17498P27005
43938f030011J241632K097777L475219L602169J251945j914549l574463l865880
43930c716161l985461l104093K46507M327218N173791K084712q03975N8853K845476
43921C126867L119319J33321k249964j069596J666818J912795q33600l189954
$$ plain form
43913 2616006 -331164 -2162092 -4239926 -6952657 -8590023 -8299682 -7800306 -8528620 -9068450
43904 -9068450 -7572651 -5173730 -4434301 -5500764 -6506009 -6887146 -7164022 -6046953 -1712857
43895 -1712857 3591582 4426049 -554112 -5782193 -5859967 -2494648 -1136488 -2991218 -4378356
43886 -4378356 -3046153 -998941 -589464 -1219299 -1267524 -830977 -805388 -752470 560128
43877 560128 3115762 5477136 6492017 6283326 5545684 4520711 2906803 465331 -2592386
43868 -2592386 -5775641 -8559106 -10326693 -10470428 -9006045 -6868636 -5096800 -3929665
43860 -3929665 -3142582 -2661294 -1939061 498738 5208200 9845952 11087151 8723965 5751459
43851 5751459 4035382 2536531 830164 1265296 5214805 9593416 10253853 7401575
$$ packed form
43913B616006k947170j830928k077834k712731j637366K90341M99376p28314n39830
43904i068450J495799K398921P39429j066463j005245l81137k76876J117069M334096
43895a712857N304439Q34467m980161n228081p7774L365319J358160j854730j387138
43886d378356J332203K047212M09477o29835m8225M36547K5589N2918J312598
43877E60128K555634K361374J014881k08691p37642j024973j613908k441472l057717
43868b592386l183255k783465j767587j43735J464383K137409J771836J167135
43860c929665P87083M81288P22233K437799M709462M637752J241199k363186k972506
43851E751459j716077j498851j706367M35132L949509M378611O60437k852278
$$ plain form
43843 7401575 4495600 2862763 928341 -1626891 -2776197 -1884862 -1159181 -1981050 -2505419
43834 -2505419 -596837 2937710 5759425 6942234 6803242 5219851 2018498 -1719143
43826 -1719143 -4306767 -5053499 -4337000 -2817500 -1430800 -1188627 -1857017 -1639762 685311
43817 685311 4037966 6507503 7688120 8275668 8279029 7459757 7098589 9200534 13527480
43808 13527480 17102711 17459299 15185335 12429630 10009585 7338195 4730641 4144076
43800 4144076 6876656 11260990 13716237 12336404 8846063 6532226 6607990 7281250 6251994
43791 6251994 3240735 -187235 -2420386 -2814158 -1621983 135139 1019185 412400 -440745
43782 -440745 552972 3849117 7300618 8161406 5771458 1830832 -1675136 -4133459 -5968997
$$ packed form
43843G401575k905975j632837j934422k555232j149306Q91335P25681q21869n24369
43834b505419J908582L534547K821715J182809j38992j583391l201353l737641
43826a719143k587624p46732P16499J519500J386700K42173o68390K17255K325073
43817F85311L352655K469537J180617N87548L361q19272l61168K101945M326946
43808A3527480L575231L56588k273964k755705k420045k671390k607554n86565
43800D144076K732580M384334K455247j379833l490341k313837P5764O73260j029256
43791F251994l011259l427970k233151l93772J192175J757122Q84046o06785q53145
43782d40745R93717L296145L451501Q60788k389948l940626l505968k458323j835538
$$ plain form
43773 -5968997 -7602977 -9274166 -11182898 -12907266 -13034569 -10457070 -6053784 -2080025
43765 -2080025 196914 1141813 1023221 -577681 -2900195 -3547682 -1605765 345845 -401392
43756 -401392 -2443441 -2160189 732644 2814314 2404665 1769080 2444988 1869447 -2464666
43747 -2464666 -7985807 -9896065 -7938234 -6487444 -7818398 -9011167 -6958900 -3388352
43739 -3388352 -2301921 -4068713 -5014865 -2736691 754963 2170260 1416620 1198224 2880467
43730 2880467 4755685 4782395 3269413 1629660 -170000 -2921787 -5499646 -5317469 -2090092
43721 -2090092 918165 704298 -1853557 -3592938 -3055121 -1191217 965485 3244740
43713 3244740 5211802 6088969 6107321 6369438 6982327 6737628 5112265 3220442 2118587
$$ packed form
43773e968997j633980j671189j908732j724368j27303K577499M403286L973759
43765b080025K276939R44899j18592j600902k322514o47487J941917J951610p47237
43756d01392k042049K83252K892833K081670m09649o35585O75908n75541m334113
43747b464666n521141j910258J957831J450790j330954j192769K052267L570548
43739c388352J086431j766792r46152K278174L491654J415297p53640k18396J682243
43730B880467J875218K6710j512982j639753j799660k751787k577859J82177L227377
43721b090092L008257k13867k557855j739381N37817J863904K156702K279255
43713C244740J967062Q77167J8352K62117O12889k44699j625363j891823j101855
$$ plain form
43704 2118587 1396845 267971 -1023180 -1795777 -1966044 -1418311 790936 5219340 10437279
43695 10437279 13965080 14703508 13320030 10473608 6226986 1510821 -1518050 -1712314
43687 -1712314 -525783 -176963 -904779 -1281764 -657031 336790 1585955 3993218 7646738
43678 7646738 11055345 13040462 13952245 13935132 11575438 6165897 278854 -2311931 -1175832
43669 -1175832 411827 -143524 -2054182 -3328844 -3500201 -3053698 -1974008 -451363 244715
43660 244715 -724952 -2224835 -2668920 -2424905 -3086914 -4755636 -5720826 -4911921 -3252169
43651 -3252169 -2224525 -2093935 -1958680 -974216 724317 2066679 2143903 1403955 1167760
43642 1167760 1675976 1659763 582487 2101 1241913 2781726 2043539 -673114 -2284040
$$ packed form
43704B118587p21742j128874j291151p72597j70267N47733K209247M428404N217939
43695A0437279L527801P38428j383478k846422m246622m716165l028871j94264
43687a712314J186531L48820p27816l76985O24733R93821J249165K407263L653520
43678G646738L408607J985117R11783j7113k359694n409541n887043k590785J136099
43669a175832J587659n55351j910658j274662j71357M46503J079690J522645O96078
43660B44715r69667j499883m44085K44015o62009j668722r65190Q08905J659752
43651c252169J027644J30590J35255R84464J698533J342362P7224p39948k36195
43642A167760N08216j6213j077276n80386J239812J539813p38187k716653j610926
$$ plain form
43633 -2284040 -1072288 1435723 3309431 4774537 6719497 8361355 8108521 5896158
43625 5896158 3227013 1402496 870560 1784415 3868093 5903389 6612143 6200623 6010603
43616 6010603 6427099 6229782 4633854 2978753 3164014 4810060 5511647 4236558 2822667
43607 2822667 2886638 2730156 -339446 -5180366 -7356104 -5331877 -3203937 -5201634 -9760216
43598 -9760216 -11900615 -9977583 -6688879 -4059736 -1238945 2153334 4110815 3428991
43590 3428991 2108617 2389699 3271633 2247146 -805606 -3726504 -5242824 -5794604 -5523799
43581 -5523799 -3651949 -280890 2848759 4212928 4217185 4419260 5625314 7358914 8954749
43572 8954749 10539965 12559840 14465279 14549720 11746627 7345299 4064772 3257934 3670123
$$ packed form
43633b284040J211752K508011J873708J465106J944960J641858k52834k212363
43625E896158k669145j824517n31936R13855K083678K035296P08754m11520j90020
43616F010603M16496j97317j595928j655101J85261J646046P01587j275089j413891
43607B822667O3971j56482l069602m840920k175738K024227K127940j997697m558582
43598i760216k140399J923032L288704K629143K820791L392279J957481o81824
43590C428991j320374K81082Q81934j024487l052752k920898j516320n51780K70805
43581e523799J871850L371059L129649J364169M257K02075J206054J733600J595835
43572H954749J585216K019875J905439Q4441k803093m401328l280527q06838M12189
$$ plain form
43563 3670123 3100237 689847 -2468328 -4286099 -3228103 259217 3777323 5210133
43555 5210133 4819144 4150808 3253427 730770 -3237550 -5909251 -4979880 -1155252 3141387
43546 3141387 6205003 7219750 5575955 1654297 -2497245 -4672588 -4449093 -3073122
43538 -3073122 -2096938 -2459840 -3819383 -4445392 -3154467 -1584914 -2578084 -5830358 -7721373
43529 -7721373 -6487634 -4574646 -4087242 -3217082 -64321 3117225 3482172 2977515 5367047
43520 5367047 9291145 9536772 4993238 211522 -1600763 -2245352 -3885913 -5400925
43512 -5400925 -5475100 -5260480 -5437299 -4145188 -581873 2437584 2428673 1032469 880356
43503 880356 1184338 -224167 -2510652 -3023232 -1473402 317909 1685222 3029627 3607487
$$ packed form
43563C670123n69886k410390l158175j817771J057996L487320L518106J432810
43555E210133l90989o68336q97381k522657l968320k671701R29371L824628M296639
43546C141387L063616J014747j643795l921658m151542k175343K23495J375971
43538c073122R76184l62902j359543o26009J290925J569553r93170l252274j891015
43529g721373J233739J912988M87404Q70160L152761L181546L64947n04657K389532
43520E367047L924098K45627m543534m781716j812285o44589j640561j515012
43512e400925p4175K14620j76819J292111L563315L019457q911j396204j52113
43503H80356L03982j408505k286485n12580J549830J791311J367313J344405N77860
$$ plain form
43494 3607487 2658147 1834362 3160511 5212893 4786694 2047076 503582 1791129 3935653
43485 3935653 5176201 6057753 6968832 6913475 5810174 4956673 4140245 1517644 -2299374
43476 -2299374 -3626594 -1344013 284767 -2490765 -7017201 -8040155 -5514674 -4410753
43468 -4410753 -7348795 -11368436 -12434242 -9977871 -6145928 -3051576 -1724583 -1868468
43460 -1868468 -1849565 -392301 1438741 1596871 371618 106724 1312889 1749278 350348
43451 350348 -750180 67647 747956 -1193587 -4103511 -4179848 -1312117 327794 -2232433
43442 -2232433 -7464666 -12156179 -14965576 -15995338 -15036484 -12070277 -8253059 -4749316
43434 -4749316 -1371421 2282733 5127605 5509255 3401876 408844 -2052045 -3365873
$$ packed form
43494C607487r49340q23785J326149K052382m26199k739618j543494J287547K144524
43485C935653J240548Q81552R11079n5357j103301q53501q16428k622601l817018
43476b299374j327220K282581J628780k775532m526436j022954K525481J103921
43468d410753k938042m019641j065806K456371L831943L094352J326993j43885
43460a868468J8903J457264J831042J58130j225253k64894J206165M36389j398930
43451C50348j100528Q17827O80309j941543k909924p6337K867731J639911k560227
43442b232433n232233m691513k809397j029762R58854K966207L817218L503743
43434d749316L377895L654154K844872L81650k107379k993032k460889j313828
$$ plain form
43426 -3365873 -3074137 -1267927 465034 188140 -1961789 -3985794 -4989292 -6164657
43418 -6164657 -8006832 -8517533 -5983201 -2196268 -538184 -1288802 -1233427 1802880 6266293
43409 6266293 9428989 10413736 9362921 5816415 311396 -3823337 -3323397 546010
43401 546010 3145749 2404705 870407 1039701 1631041 349895 -2222008 -4178587 -5871017
43392 -5871017 -8797101 -11996267 -12919339 -11607695 -10743199 -11308549 -11392376 -9963203 -8615172
43383 -8615172 -8368171 -7832674 -6222431 -5185067 -5397148 -4149674 686280 6384216 8311437
43374 8311437 5810049 2176178 84143 129012 2543246 6511675 8464760 5279003
43366 5279003 -538841 -2818800 326408 4236351 4454035 1925722 -230135 -1345996
$$ packed form
43426c365873K91736J806210J732961k76894k149929k024005j003498j175365
43418f164657j842175n10701K534332L786933J658084p50618N5375L036307M463413
43409F266293L162696R84747j050815l546506n505019m134733M99940L869407
43401E46010K599739p41044j534298J69294N91340j281146k571903j956579j692430
43392e871017k926084l199166r23072J311644Q64496n65350q3827J429173J348031
43383h615172K47001N35497J610243J037364k12081J247474M835954N697936J927221
43374H311437k501388l633871k092035M4869K414234L968429J953085l185757
43366E279003n817844k279959L145208L909943K17684k528313k155857j115861
$$ plain form
43358 -1345996 -1967297 -1183101 1496945 3758042 3230772 1126132 155922 234072 -547304
43349 -547304 -1752393 -1060340 1327111 2319686 641344 -1243406 -1207318 -836704 -2735784
43340 -2735784 -6096996 -7248727 -4319775 263587 2307116 101936 -4257810 -7431077
43332 -7431077 -8017574 -6869028 -4957560 -2358098 364920 1358572 -528858 -3648397
43324 -3648397 -4846133 -2806460 709760 2730068 1545315 -2099260 -5379312 -5464467
43316 -5464467 -2264738 1143336 1621786 -864289 -3778028 -4864157 -3519718 -332924
43308 -332924 3180770 4940194 4044521 2007322 929043 772026 -71409 -1823577 -2756494
43299 -2756494 -1788903 -72041 498536 -744314 -2985430 -4619340 -4153202 -1567342 1130039
$$ packed form
43358a345996o21301P84196K680046K261097n27270k104640r70210P8150p81376
43349e47304j205089O92053K387451R92575j678342j884750L6088L70614j899080
43340b735784l361212j151731K928952M583362K043529k205180m359746l173267
43332g431077n86497J148546J911468K599462K723018R93652j887430l119539
43324c648397j197736K039673L516220K020308j184753l644575l280052q5155
43316e464467L199729L408074M78450k486075k913739j086129J344439L186794
43308c32924L513694J759424q95673k037199j078279j57017q43435j752168r32917
43299b756494R67591J716862N70577j242850k241116j633910M66138K585860K697381
$$ plain form
43290 1130039 1804883 684128 -167129 248326 858348 560336 -169988 -251937 380582
43281 380582 635994 -683466 -3586362 -6236561 -6286157 -3649538 -980060 -312867 -612294
43272 -612294 -285308 -340646 -2278053 -4305822 -3446862 -822918 -565599 -3156563 -4388180
43263 -4388180 -2214908 -27897 -747009 -1953061 -335792 2541194 3068191 1629992
43255 1629992 1384339 2622263 2801113 1400029 440661 296884 -934256 -3384536 -4460434
43246 -4460434 -2970976 -1047074 -666944 -976281 -484071 407437 611476 209621 -370212
43237 -370212 -1434032 -2906714 -3558385 -2707621 -1487920 -1125964 -1044737 50870 2180764
43228 2180764 4453753 6509460 8201165 8598058 6958782 4472497 3458392 4507749
$$ packed form
43290A130039O74844j120755q51257M15455O10022k98012p30324q1949O32519
43281C80582K55412j319460k902896k650199m9596K636619K669478O67193k99427
43272f12294L26986n5338j937407k027769Q58960K623944K57319k590964j231617
43263d388180K173272K187011p19112j206052J617269K876986N26997j438199
43255A629992k45653J237924J78850j401084r59368j43777j231140k450280j075898
43246d460434J489458J923902L80130l09337M92210Q91508K04039m01855n79833
43237c70212j063820j472682o51671Q50764J219701L61956Q1227J095607K129894
43228B180764K272989K055707J691705L96893j639276k486285j014105J049357
$$ plain form
43220 4507749 5546227 4281747 896958 -2260545 -3284684 -2388933 -1008635 126340
43212 126340 1450168 3262524 4773157 4921716 3743672 2360979 1724847 1684022 1136316
43203 1136316 -1003688 -4491129 -7229695 -6939674 -3939215 -1351628 -1616677 -3643276
43195 -3643276 -4612091 -3740564 -2542726 -1822306 -536325 1942372 4166209 4070085 1091655
43186 1091655 -3619857 -8083341 -10175957 -8625975 -4180963 653191 3368677 2744472
43178 2744472 -929745 -5635833 -8072962 -6258290 -1999925 939411 1470686 1993005
43170 1993005 4081345 5941333 5665364 4544725 4591107 4498941 1315073 -4424453 -8452144
43161 -8452144 -8202045 -5892459 -5133585 -6493474 -7820700 -7513491 -5903516 -4183668 -3311730
$$ packed form
43220D507749J038478j264480l384789l157503j024139Q95751J380298J134975
43212A26340J323828J812356J510633J48559j178044j382693o36132m0825n47706
43203A136316k140004l487441k738566K90021L000459K587587k65049k026599
43195c643276r68815Q71527J197838P20420J285981K478697K223837r6124k978430
43186A091655m711512m463484k092616J549982M445012M834154K715486o24205
43178B744472l674217m706088k437129J814672M258365K939336N31275N22319
43170A993005K088340J859988k75969j120639M6382r2166l183868n739526m027691
43161h452144K50099K309586P58874j359889j327226L07209J609975J719848Q71938
$$ plain form
43152 -3311730 -3539074 -3945519 -2860333 128471 2904959 2928098 694290 -390916 1652566
43143 1652566 4461615 4199782 701955 -2133417 -1379103 1332176 2435773 1262566
43135 1262566 307437 1158234 2334145 1785272 -125615 -1329256 -839717 300574 441183
43126 441183 -1182144 -4047692 -6639574 -7325887 -5661021 -2798198 -174882 2033905
43118 2033905 4708772 8242840 11673508 13253698 11701446 7374524 2621766 296681
43110 296681 1072563 2690597 2853798 2397041 4098772 8357488 11903674 11724835 8766725
43101 8766725 6243496 5321753 4457922 2608268 747877 -356661 -1664924 -3736995
43093 -3736995 -4855623 -3354066 -730769 18357 -1205560 -1497233 500351 2660997
$$ packed form
43152c311730k27344m06445J085186K988804K776488K3139k233808j085206K043482
43143A652566K809049k61833l497827k835372P54314K711279J103597j173207
43135A262566r55129Q50797J175911n48873j910887j203641M89539J140291J40609
43126D41183j623327k865548k591882o86313J664866K862823K623316K208787
43118B033905K674867L534068L430668J580190j552252m326922m752758k325085
43110B96681P75882J618034J63201m56757J701731M258716L546186j78839k958110
43101H766725k523229r21743q63831j849654j860391j104538j308263k072071
43093c736995j118628J501557K623297P49126j223917k91673J997584K160646
$$ plain form
43085 2660997 3015916 2692446 3350741 3881979 2238954 -839893 -2765687 -3123828 -4024675
43076 -4024675 -6503005 -9077008 -10214849 -10074384 -9406739 -8713682 -8774127 -9870401 -10135042
43067 -10135042 -7106745 -1726331 1690010 739282 -2023730 -2786738 -1068681 1168775
43059 1168775 2943569 4482138 5508684 5701582 5900406 6728093 6884459 4882591 1634412
43050 1634412 -806612 -2187528 -3384146 -3663803 -1567187 1693660 2833236 1076060
43042 1076060 -596363 240726 2329137 3220741 2778749 2526972 3083079 3989627 4994603
43033 4994603 5785803 5193388 2412537 -1129686 -2582036 -703303 2654601 4370783
43025 4370783 3040963 125392 -1631553 -894525 1143529 2380165 2166727 1486003 1047056
$$ packed form
43085B660997L54919l23470O58295N31238j643025l078847j925794l58141r00847
43076d024675k478330k574003j137841J40465O67645O93057o0445j096274k64641
43067a0135042L028297N380414L416341r50728k763012p63008J718057K237456
43059A168775J774794J538569J026546J92898J98824Q27687J56366k001868l248179
43050A634412k441024j380916j196618k79657K096616L260847J139576j757176
43042A076060j672423Q37089K088411Q91604m41992k51777N56107R06548J004976
43033D994603P91200n92415k780851l542223j452350J878733L357904J716182
43025D370783j329820k915571j756945P37028K038054J236636k13438o80724m38947
$$ plain form
43016 1047056 261435 -1483772 -3323065 -3487746 -1366511 1378883 2068896 -287673 -3572091
43007 -3572091 -4517660 -2357604 457859 1840030 3012367 6273039 10768251 12873760
42999 12873760 10863991 6979473 4168391 2666461 837023 -2144238 -5705426 -8917430
42991 -8917430 -10996230 -11558600 -11264484 -11475209 -12592536 -13558826 -13526835 -12880708 -11903189
42982 -11903189 -9789150 -6100422 -2041093 926825 2649861 3244496 1853939 -1721283
42974 -1721283 -5180877 -5762077 -3766584 -2037624 -2185799 -3475927 -5285310 -7900590
42966 -7900590 -10128163 -8984856 -3839116 1065414 952721 -3288449 -5894324 -3474014
42958 -3474014 979601 2567544 1011784 326845 2565570 4704780 3020918 -1355448
$$ packed form
43016A047056p85621j745207j839293j64681K121235K745394O90013k356569l284418
43007c572091r45569K160056K815463J382171J172337L260672M495212K105509
42999A2873760k009769l884518k811082j501930j829438k981261l561188l212004
42991h917430k078800n62370K94116k10725j117327r66290L1991O46127R77519
42982a1903189K114039L688728M059329K967918J723036N94635j390557l575222
42974a721283l459594n81200J995493J728960j48175j290128j809383k615280
42966g900590k227573J143307N145740M904530j12693m241170k605875K420310
42958c474014M453615J587943j555760o84939K238725K139210j683862m376366
$$ plain form
42950 -1355448 -3617840 -1555920 1772995 2372348 339681 -988606 270736 2698617
42942 2698617 4177731 4462927 4498850 4364411 2926158 -692786 -5832964 -10552592 -13174557
42933 -13174557 -13719248 -13639591 -13892910 -13602585 -11152816 -6405225 -1230343 2059528 2272859
42924 2272859 -342972 -4324179 -7347966 -7327740 -3882937 1392789 6186257 8724580
42916 8724580 8207018 5140622 1569830 -107654 629086 1977808 2251830 2039018 2967440
42907 2967440 4934556 5970357 4858130 2610491 1005074 726727 1358046 2062587 1649293
42898 1649293 -754260 -3942336 -4721128 -1552673 2552110 3034159 -175601 -1919665
42890 -1919665 1927924 9405880 15085981 16137353 13976546 11179563 9115587 8179030
$$ packed form
42950a355448k262392K061920L328915N99353k032667j328287J259342K427881
42942B698617J479114K85196L5923j34439j438253l618944n140178m719628k621965
42933a3174557n44691P9657k53319K90325K449769M747591N174882L289871K13331
42924B272859k615831l981207l023787K0226L444803N275726M793468K538323
42916H724580n17562l066396l570792j677484P36740J348722K74022k12812R28422
42907B967440J967116J035801j112227k247639j605417k78347O31319P04541m13294
42898A649293k403553l188076p78792L168455M104783M82049l209760j744064
42890a919665L847589P477956N680101J051372k160807k796983k063976r36557
$$ plain form
42882 8179030 8036716 7382770 5193480 2434483 945444 640189 -262441 -2054318 -2898524
42873 -2898524 -2134288 -1862538 -3746922 -6178383 -6547429 -4961579 -3672382 -3686551 -3866596
42864 -3866596 -2850171 -190271 3857250 7974356 9694543 7546670 3189590 -172670
42856 -172670 -1318679 -1356647 -925342 709182 3370726 4942702 3803406 995566 -1120822
42847 -1120822 -1563275 -1262911 -1538547 -2685172 -3737359 -3465148 -2048510 -1488087 -3367593
42838 -3367593 -6396104 -7540542 -5751242 -3131822 -2035707 -2481310 -3078219 -3051686 -2385771
42829 -2385771 -1160995 174744 792430 671420 923083 2094459 3157548 3109709 2474564
42820 2474564 2113526 1737493 1018776 1007097 2526775 3959857 2848328 -511357 -3243271
$$ packed form
42882H179030j42314o53946k189290k758997j489039l05255r02630j791877q44206
42873b898524P64236K71750j884384k431461l69046J585850J289197j4169j80045
42864c866596J016425K659900M047521M117106J720187k147873m357080l362260
42856a72670j146009l7968M31305J634524K661544J571976j139296k807840k116388
42847a120822m42453L00364k75636j146625j052187K72211J416638N60423j879506
42838c367593l028511j144438J789300K619420J096115m45603n96909K6533O65915
42829b385771J224776J335739O17686j21010K51663J171376J063089m7839o35145
42820B474564l61038l76033p18717j1679J519678J433082j111529l359685k731914
$$ plain form
42811 -3243271 -3814208 -3652661 -4348958 -5432638 -6109733 -7314773 -10113540 -12988459 -12680076
42802 -12680076 -7825752 -631409 5174907 7328319 6143864 3609567 1638596 721911
42794 721911 58804 -982025 -1939665 -2158637 -2080046 -2839950 -4766897 -7064824 -8931400
42785 -8931400 -10173089 -10648566 -10027820 -8506217 -7047050 -6404626 -6368662 -6298863 -5815683
42776 -5815683 -4626363 -2521046 -254439 411223 -1294056 -3599460 -4004324 -2512448
42768 -2512448 -1629836 -2891366 -4789674 -4807854 -2379139 945521 3254215 3266143 529793
42759 529793 -4027828 -8097086 -9620669 -8364730 -5367539 -1578954 1981401 3627609
42751 3627609 2364341 -292235 -1600592 -1038732 -898429 -2847163 -5442889 -6197147 -4970144
$$ packed form
42811c243271n70937J61547o96297j083680o77095j205040k798767k874919L08383
42802a2680076M854324P194343N806316K153412j184455k534297j970971r16685
42794G21911o63107j040829r57640k18972P8591p59904j926947k297927j866576
42785h931400j241689m75477O20746J521603J459167O42424L5964O9799M83180
42776e815683J189320K105317K266607O65662j705279k305404m04864J491876
42768b512448Q82612j261530j898308j8180K428715L324660K308694J1928k736350
42759E29793m557621m069258j523583J255939K997191L788585L560355J646208
42751C627609j263268k656576j308357N61860J40303j948734k595726p54258J227003
$$ plain form
42742 -4970144 -3813582 -3881866 -3976715 -2467478 272533 2014889 1124603 -1533330 -3413551
42733 -3413551 -2993576 -1176183 381840 1715196 4222349 7964227 10652654 10095318
42725 10095318 6876069 3765244 2846853 3895897 5301603 5868250 5637326 5367071 5489070
42716 5489070 5736444 5826615 6027104 6501300 6556000 5543576 4285890 4256237 5214639 5256308
42706 5256308 3872430 3302757 5471804 8800538 9852013 7603052 4380184 2707450
42698 2707450 2829813 3580535 4289573 5178926 6615273 8400849 9443534 8342086 5116580
42689 5116580 2157664 2222809 5166479 7650449 6519927 1690559 -4453496 -9260824
42681 -9260824 -10815242 -8243106 -2695585 2455593 4111777 2527043 824374 1067351
$$ packed form
42742d970144J156562o8284r4849J509237K740011J742356q90286k657933j880221
42733c413551M19975J817393J558023J333356K507153L741878K688427n57336
42725A0095318l219249l110825r18391J049044J405706N66647k30924k70255J21999
42716E489070K47374R0171K00489M74196N4700j012424j257686k9653R58402M1669
42706E256308j383878n69673K169047L328734J051475k248961l222868j672734
42698B707450J22363P50722P09038Q89353J436347J785576J042685j101448l225506
42689E116580k958916O5145K943670K483970j130522m829368o144055m807328
42681i260824j554418K572136N547521N151178J656184j584734j702669K42977
$$ plain form
42673 1067351 1953570 1245158 -548297 -589744 2229460 5429170 6136848 4903609 4681570
42664 4681570 6473178 7945037 6813620 3904453 1764707 1481905 2280871 3427090
42656 3427090 4830747 6021395 6197741 5521752 4907573 4104586 1539182 -2895114 -6135322
42647 -6135322 -4796198 420138 4677895 3962434 -829579 -5506212 -7596070 -8471854
42639 -8471854 -10384880 -12832235 -13153240 -10209711 -5899499 -2674703 -931866 222515
42631 222515 726026 -319395 -2462824 -3370931 -1188452 3217694 6986187 8031814 6754709
42622 6754709 5091411 4195603 3369173 1393942 -1553960 -4090290 -5608230 -6890042
42614 -6890042 -8216555 -8124461 -5366091 -1444122 407327 -1125355 -3980033 -5179817
$$ packed form
42673A067351Q86219p08412j793455m1447K819204L199710P07678j233239k22039
42664D681570J791608J471859j131417k909167k139746k82802P98966J146219
42656C427090J403657J190648J76346o75989o14179q02987k565404m434296l240208
42647f135322J339124N216336M257757p15461m792013m676633k089858q75784
42639h471854j913026k447355l21005K943529M310212L224796J742837J154381
42631B22515N03511j045421k143429r08107K182479M406146L768493J045627j277105
42622F754709j663298q95808q26430j975231k947902k536330j517940j281812
42614f890042j326513R2094K758370L921969J851449j532682k854678j199784
$$ plain form
42606 -5179817 -3862859 -1614226 -540533 -1309595 -2608265 -2445601 -349353 2001799
42598 2001799 2852676 2497087 2350900 2477900 1577156 -626374 -2575082 -2810788 -1392340
42589 -1392340 882174 3205054 4329814 3087482 123499 -2379057 -3561950 -4888250
42581 -4888250 -7256589 -8998877 -8494213 -7171958 -7591916 -9518526 -10386173 -9202844 -7501080
42572 -7501080 -6498311 -5866399 -5663943 -6875107 -9065357 -9856276 -8110577 -5581758 -3809670
42563 -3809670 -1511561 2586777 6095680 5426848 1340430 -1420841 -620278 494641
42555 494641 -1829478 -6599928 -10111767 -11217840 -11510333 -11210430 -8456657 -3350205 364443
42546 364443 -400188 -3859781 -5530746 -3676733 -544958 1413537 2297325 3119940 3254800
$$ packed form
42606e179817J316958K248633J073693p69062j298670J62664K096248K351152
42598B001799Q50877l55589j46187J27000r00744k203530j948708k35706J418448
42589a392340K274514K322880J124760j242332k963983k502556j182893j326300
42581d888250k368339j742288N04664J322255m19958j926610q67647J183329J701764
42572g501080J002769O31912K02456j211164k190250p90919J745699K528819J772088
42563c809670K298109M098338L508903o68832m086418k761271Q00563J114919
42555D94641k324119m770450l511839j106073k92493K99903K753773N106452L714648
42546C64443p64631l459593j670965J854013L131775J958495Q83788Q22615J34860
$$ plain form
42537 3254800 1125426 -2989438 -6215114 -5722670 -1732127 2633754 4540756 4033885
42529 4033885 3102547 2729276 1959276 -60709 -2482817 -3955837 -4290430 -3807294 -2037484
42520 -2037484 1263613 4310943 4411811 1096249 -3367357 -6732503 -8464824 -8511343 -6509731
42511 -6509731 -3271248 -1221101 -1717960 -3081248 -2869863 -1203155 -142530 -490181 -1098591
42502 -1098591 -1094220 -916861 -1005338 -1089176 -1086180 -1224976 -1016882 205986 1251340 -363459
42492 -363459 -4478003 -6805961 -3651915 2874453 6968567 6348019 4626197 5604036 7840532
42483 7840532 7121573 2691513 -1966860 -4365972 -6072175 -9357387 -12928830 -13032889
42475 -13032889 -8087664 -594637 5411819 7730495 7005236 5447866 4714650 4551513
$$ packed form
42537C254800k129374m114864l225676M92444L990543M365881J907002n06871
42529D033885r31338l73271p70000k019985k422108j473020l34593M83136J769810
42520b037484L301097L047330J00868l315562m463606l365146j732321m6519K001612
42511f509731L238483K050147m96859j363288K11385J666708J060625l47651o08410
42502a098591M371J77359q8477q3838K996j38796K08094J222868J045354j614799
42492c63459m114544k327958L154046O526368M094114o20548j721822R77839K236496
42483G840532p18959m430060m658373k399112j706203l285212l571443j04059
42475a3032889M945225P493027O006456K318676p25259j557370p33216j63137
$$ plain form
42467 4551513 3648186 1921101 938995 1396186 1561604 -104402 -1858728 -602153 3380493
42458 3380493 6256549 5785897 4147593 4441384 6554721 8285813 8928777 9578310 10727209
42449 10727209 11600680 11609269 10857987 9365179 7187274 5283860 4996681 6513072 8709959
42440 8709959 10447483 11187540 10570550 8441366 5339711 2128755 -859633 -3574467
42432 -3574467 -5325992 -5139054 -3223476 -1280509 -910804 -2013364 -2912940 -1941831 986499
42423 986499 4237120 6081495 6392941 6178268 5640863 3981843 1442040 -42486 742209
42414 742209 2565168 3796000 4921160 7222608 9887375 10648184 9048263 6991608
42406 6991608 5934300 5455533 4976761 5008723 5836547 6409930 5651567 4126017 3591789
$$ packed form
42467D551513r03327j727085r82106M57191J65418j666006j754326J256575L982646
42458C380493K876056m70652j638304K93791K113337J731092O42964O49533J148899
42449A0727209Q73471Q589p51282j492808k177905j903414k87179J516391K196887
42440H709959J737524P40057o16990k129184l101655l210956k988388k714834
42432c574467j751525J86938J915578J942967L69705j102560q99576R71109K928330
42423I86499L250621J844375L11446k14673n37405j659020k539803j484526P84695
42414G42209J822959J230832J125160K301448K664767P60809j599921k056655
42406F991608j057308m78767m78772L1962Q27824N73383p58363j525550n34228
$$ plain form
42397 3591789 5217013 8464187 11249398 11191623 7448373 1561324 -3894227 -7392437
42389 -7392437 -8893770 -8869560 -7751740 -5890939 -3230611 416771 4026213 5400747
42381 5400747 3870579 1794383 1582709 2328255 1611845 -438836 -1804889 -2510143 -4198994
42372 -4198994 -5684599 -3137174 3687806 9045697 7624935 977119 -4878351 -6277018
42364 -6277018 -3921776 117170 4458987 8120717 10553826 12010077 12727085 12349792
42356 12349792 11022327 9861121 9289004 8354649 6930483 6822094 9001670 11444410
42348 11444410 11726838 10229648 8623781 6814463 4015179 1509567 1363361 3164372
42340 3164372 4807620 5743935 6559504 6160557 2862565 -1936117 -4756053 -5014429 -5518484
$$ packed form
42397C591789J625224L247174K785211n7775l743250n887049n455551l498210
42389g392437j501333K4210J117820J860801K660328L647382L609442J374534
42381E400747j530168k076196k11674P45546p16410k050681j366053p05254j688851
42372d198994j485605K547425O824980N357891j420762o647816n855470j398667
42364f277018K355242M038946M341817L661730K433109J456251P17008l77293
42356A2349792j327465j161206n72117r34355j424166j08389K179576K442740
42348A1444410K82428j497190j605867j809318k799284k505612j46206J801011
42340C164372J643248R36315Q15569l98947l297992m798682k819936k58376n04055
$$ plain form
42331 -5518484 -7443582 -8555088 -7615961 -6750209 -7351522 -7122942 -4073182 -602232 -32616
42322 -32616 -1009785 611614 5029280 7651925 5520405 1145524 -1478176 -1951184 -2357058
42313 -2357058 -2859108 -1313646 2855454 6936429 8197333 7287743 6810908 7447674 7531120
42304 7531120 6320009 5334066 5485984 4982302 1974046 -1984571 -3284058 -483585 4716528
42295 4716528 10101187 14231718 15395164 12141039 5829194 481084 -1238818 -507046
42287 -507046 54970 -368295 -1086120 -1835137 -2627921 -2511152 -265490 3648122 6917542
42278 6917542 7347350 4669662 674645 -2128374 -2311807 -337761 2369429 4671936
42270 4671936 5679882 4627125 2264721 1425362 3848238 6770863 5539425 32587
$$ packed form
42331e518484j925098j111506R39127Q65752o01313K28580L049760L470950N69616
42322c2616r77169J621399M417666K622645k131520m374881k623700m73008m05874
42313b357058n02050J545462M169100M080975J260904r09590m76835O36766Q3446
42304G531120j211111r85943J51918n03682l008256l958617j299487K800473N200113
42295D716528N384659M130531J163446l254125o311845n348110j719902P31772
42287e07046N62016m23265p17825p49017p92784J16769K245662L913612L269420
42278F917542M29808k677688l995017k803019j83433J974046K707190K302507
42270D671936J007946j052757k362404q39359K422876K922625j231438n506838
$$ plain form
42262 32587 -4598064 -4781498 -2978748 -3200588 -4950065 -4722773 -1642389 1807819 3738097
42253 3738097 4382858 4139652 3027953 1996814 2039022 1940539 -405769 -4187792 -5911986
42244 -5911986 -4078257 -975868 1122879 2903523 5614538 8082635 8299106 6530491
42236 6530491 4741319 3775652 2903773 1513995 -379666 -2755388 -5117019 -5942034 -4391074
42227 -4391074 -2310870 -2550001 -5039833 -6501440 -4786799 -1725974 -450259 -1421357
42219 -1421357 -2821102 -3723372 -4621138 -5261282 -4562053 -3168685 -3546199 -6147817 -7653442
42210 -7653442 -5113505 -265137 2786075 3060383 2864623 2961391 1219650 -3042456 -6702315
42201 -6702315 -6762892 -4230640 -1961031 -679924 365025 412079 -2053204 -5933783 -7601736
$$ packed form
42262C2587m630651j83434J802750k21840j749477K27292L080384L450208J930278
42253C738097O44761k43206j111699j031139M2208r8483k346308l782023j724194
42244e911986J833729L102389K098747J780644K711015K468097K16471j768615
42236F530491j789172r65667q71879j389778j893661k375722k361631q25015J550960
42227d391074K080204k39131k489832j461607J714641L060825J275715r71098
42219a421357j399745r02270q97766o40144O99229J393368l77514k601618j505625
42210g653442K539937M848368L051212K74308j95760R6768j741741m262106l659859
42201f702315o0577K532252K269609J281107J044949M7054k465283l880579j667953
$$ plain form
42192 -7601736 -4842369 781988 5623255 6930309 4581819 1133357 -271389 863449
42184 863449 1938279 996972 -623362 -1078314 -1514227 -3804052 -6147330 -4828796 -199626
42175 -199626 3050508 2329865 145525 -638243 -897876 -2356289 -3577088 -1836514 2620286
42166 2620286 6683793 7788020 5643010 1907024 -487699 530397 3076692 2380602
42158 2380602 -3014667 -8314585 -8428102 -4804029 -2849771 -4046791 -4841585 -2943701
42150 -2943701 -316899 877739 1361813 2181679 2396706 1409961 929199 2200031 3318295
42141 3318295 1848427 -1318519 -3253830 -3094573 -2195306 -716181 2985875 8930452
42133 8930452 13842555 14377745 10939503 7176205 6284170 8575666 12117050 14782351
$$ packed form
42192g601736K759367N624357M841267J307054k348490l448462j404746J134838
42184H63449J074830r41307j620334m54952m35913k289825k343278J318534M629170
42175a99626L250134p20643k184340p83768k59633j458413j220799J740574M456800
42166B620286M063507J104227k145010l735986k394723J018096K546295o96090
42158B380602n395269n299918j13517L624073J954258j197020p94794J897884
42150b943701K626802J194638M84074Q19866K15027r86745m80762J270832J118264
42141C318295j469868l166946j935311J59257Q99267J479125L702056N944577
42133H930452M912103N35190l438242l763298q92035K291496L541384K665301
$$ plain form
42125 14782351 15663087 15095558 13714648 11670527 8934651 6148229 4510697 4505198 5139166
42116 5139166 4890923 3276766 1226729 109182 627811 2377007 4086184 4567797 3923710
42107 3923710 3574556 4487601 5672283 5395070 3799410 3006085 4178722 5844764 6090848
42098 6090848 5248066 4976136 5492638 5460236 4359987 3202044 2629195 1837379 -50806
42089 -50806 -2626077 -4730654 -5660335 -5753633 -6513226 -9671025 -14746178 -18017835 -16059606
42080 -16059606 -10363739 -6037690 -5391353 -5553725 -3611110 -1069275 -826336 -2122165
42072 -2122165 -1671017 1456862 5091260 7375948 8158858 7452560 5272891 2976148 2327380
42063 2327380 3156631 3999031 4741123 6261190 7806248 7563692 5866157 4877741 4839183
$$ packed form
42125A4782351Q80736n67529j380910k044121k735876k786422j637532n499O33968
42116E139166k48243j614157k050037j117547N18629J749196J709177M81613o44087
42107C923710l49154R13045J184682k77213j595660p93325J172637J666042K46084
42098F090848q42782k71930N16502l2402j100249j157943n72849p91816j888185
42089e0806k575271k104577r29681r3298p59593l157799n075153l271657J958229
42080a6059606N695867M326049O46337j62372J942615K541835K42939j295829
42072b122165M51148L127879L634398K284688P82910p06298k179669k296743o48768
42063B327380Q29251Q42400P42092J520067J545058k42556j697535r88416l8558
$$ plain form
42054 4839183 3795753 1634513 917440 2485298 3703055 2877926 2063518 3098662 4059406
42045 4059406 2722051 781585 938506 1941704 712356 -1943017 -2215561 498462
42037 498462 2684586 2499955 2308124 4073298 5911233 5399106 3515380 2754703 3239868
42028 3239868 3297354 2805011 3519343 6265739 9517326 10902966 9228329 5206072 918086
42019 918086 -1722158 -2504264 -2586854 -2532759 -1696891 21078 1243601 1043793 615266
42010 615266 1516866 3089425 3323009 1817585 93049 -859068 -1406894 -1486446 -111517
42001 -111517 2384902 3477349 1426294 -2043345 -3809873 -3379720 -2897836 -3375496 -3099557
41992 -3099557 -452995 3498807 6417095 7393865 6977385 5635641 3841743 2959087 4150353
$$ packed form
42054D839183j043430k161240p17073J567858J217757q25129q14408J035144R60744
42045D059406j337355j940466J56921J003198j229348k655373k72544K714023
42037D98462K186124j84631j91831J765174J837935n12127j883726p60677M85165
42028C239868N7486m92343P14332K746396L251587J385640j674637m022257m287986
42019I18086k640244p82106q2590N4095Q35868J717969J222523j99808m28527
42010F15266R01600J572559K33584j505424j724536r52117n47826p9552J374929
42001a11517K496419J092447k051055l469639j766528M30153M81884m77660K75939
41992c099557K646562L951802K918288R76770m16480j341744j793898q82656J191266
$$ plain form
41983 4150353 6587025 8500472 9964491 12676094 16679979 19488908 19393151 17672805
41975 17672805 16270050 15233602 14217257 14537542 17060940 19318683 18006050 14197301
41967 14197301 12896281 16692146 22598905 26312530 27064328 26598363 25625722 23796025
41959 23796025 21933227 21646507 22819819 23373832 21686510 18003872 13605847 9878603
41951 9878603 8064157 8466661 9698872 9892272 8797032 7526668 6214939 3570998
41943 3570998 -586246 -3883022 -3791560 -721166 2437844 3403733 2201728 320333 -633772
41934 -633772 309730 2791523 5037254 5499379 4725413 4526210 5169199 4871119 2711054
41925 2711054 465904 226775 1449283 2127565 1958492 2137159 2516408 1685008 186677
$$ packed form
41983D150353K436672J913447J464019K711603M003885K808929r5757j720346
41975A7672805j402755j036448j016345L20285K523398K257743j312633l808749
41967A4197301j301020L795865N906759L713625P51798m65965r72641j829697
41959B3796025j862798k86720J173312N54013j687322l682638m398025l727244
41951I878603j814446M02504J232211J93400j095240j270364j311729k643941
41943C570998m157244l296776R1462L070394L159010R65889j202005j881395r54105
41934f33772R43502K481793K245731M62125p73966j99203O42989k98080k160065
41925B711054k245150k39129J222508O78282j69073J78667L79249q31400j498331
$$ plain form
41916 186677 780211 4220353 7354521 7379526 5812738 5709496 6710180 6077455 3758486
41907 3758486 2918481 5329610 9357825 13007993 15863702 17064589 14588838 8516626
41899 8516626 2579509 233357 894141 1925666 2413435 2659878 1802051 -950012 -3628669
41890 -3628669 -3221873 8659 2569976 2220729 26032 -2188021 -3896855 -4917234
41882 -4917234 -4934232 -4965531 -7013808 -10921387 -13499663 -12345623 -8975801 -6565768 -5914168
41873 -5914168 -5406889 -3938020 -1947140 -132415 1068161 977773 -714755 -2907388 -4023576
41864 -4023576 -3938276 -3672695 -3355880 -2095934 7412 1480241 1700789 1939562 3311794
41855 3311794 5125036 6371509 7455629 8848846 9202063 6991067 3577111 2266702
$$ packed form
41916A86677N93534L440142L134168K5005j566788j03242J000684o32725k318969
41907C758486q40005K411129M028215L650168K855709J200887k475751o072212
41899H516626n937117k346152O60784J031525M87769K46443q57827k752063k678657
41890c628669M06796L230532K561317l49247k194697k214053j708834j020379
41882d917234j6998l1299k048277l907579k578276J154040L369822K410033O51600
41873e914168N07279J468869J990880J814725J200576r0388j692528k192633j116188
41864d023576Q5300K65581L16815J259946K103346J472829K20548K38773J372232
41855C311794J813242J246473J084120J393217L53217k210996l413956j310409
$$ plain form
41847 2266702 4128425 7034722 9414873 12331653 16340903 18884360 17596219 14614583
41839 14614583 14256930 16947379 18888529 18003914 16643663 17214548 18563332 18866127 19174514
41830 19174514 21147315 23474717 23998807 23924657 26139448 29981584 31616673 29881186
41822 29881186 27989148 28440387 29734118 29768040 29295155 29625941 29424706 26655238 22137531
41813 22137531 18458335 16401106 14973952 14106419 14604682 15772714 15773955 14618265 14413054
41804 14413054 15999185 17362614 16323572 13211963 9870716 7317825 5510193 4411153
41796 4411153 4044867 4016811 4033523 4614649 6387961 8792911 10305709 10095274 8865085
41787 8865085 7800957 7130968 6156376 4515756 2889588 2307513 3132559 4905186 6727456
$$ packed form
41847B266702J861723K906297K380151K916780M009250K543457j288141k981636
41839A4614583l57653K690449J941150q84615j360251N70885J348784L02795L08387
41830A9174514J972801K327402N24090p4150K214791L842136J635089j735487
41822B9881186j892038M51239J293731L3922m72885L30786k01235k769468m517707
41813B2137531l679196k057229j427154q67533M98263J168032J241j155690k05211
41804A4413054J586131J363429j039042l111609l341247k552891j807632j099040
41796D411153l66286k8056J6712N81126J773312K404950J512798k10435j230189
41787H865085j064128o69989r74592j640620j626168n82075Q25046J772627J822270
$$ plain form
41778 6727456 7532294 6739682 5425790 6055044 9618670 13430201 13645020 10173286 7030255
41769 7030255 7010547 8143304 6974367 3514077 703193 110140 547090 447271 -559042
41760 -559042 -2155558 -3402245 -2607976 652676 3614177 2989516 -202355 -1271346 1816945
41751 1816945 5543725 5878488 3700882 2728230 3726393 3790109 1020315 -2757221 -4607535
41742 -4607535 -4007974 -2606237 -1335308 846554 4912456 9248526 10630921 8342048
41734 8342048 5899275 6911395 10077743 10885137 8210702 6069388 7641222 10661936
41726 10661936 11084662 8909072 7343130 7749575 8767470 9659825 11020940 12041772
41718 12041772 10421483 6048488 2151351 1368386 2581111 3056622 2219706 1789059 3129149
$$ packed form
41778F727456Q04838p92612j313892O29254L563626L811531K14819l471734l143031
41769G030255j9708J132757j168937l460290k810884n93053M36950r9819j006313
41760e59042j596516j246687P94269L260652K961501o24661l191871j068991L088291
41751A816945L726780L34763k177606r72652R98163O3716k769794l777536j850314
41742d607535N99561J401737J270929K181862M065902M336070J382395k288873
41734H342048k442773J012120L166348Q07394k674435k141314J571834L020714
41726A0661936M22726k175590j565942M06445J017895Q92355J361115J020832
41718A2041772j620289m372995l897137p82965J212725M75511q36916m30647J340090
$$ plain form
41709 3129149 5846700 8591157 10266338 10529205 9534631 7328127 3983598 760813
41701 760813 75980 2854620 6586276 7924092 6882026 6266919 7102101 7369401 5834171
41692 5834171 4202676 4171428 4963323 5454019 6199119 7260128 6522571 2986187 -296997
41683 -296997 113168 2782558 3309536 792855 -1156129 214669 3824671 7538935 10628727
41674 10628727 12559947 12338904 10472653 9224107 9579627 9962514 9003394 7462441 6356006
41665 6356006 5470699 4907381 5549011 6476628 4719773 -212414 -4206030 -3741367 -829949
41656 -829949 595866 1076788 4081470 9205043 11805817 9853222 6753399 6023427 6892404
41647 6892404 7023885 6341979 5788431 4882910 3222328 2572074 4713823 8313900 10425569
$$ packed form
41709C129149K717551K744457J675181K62867r94574k206504l344529l222785
41701G60813o84833K778640L731656J337816j042066o15107Q35182K67300j535230
41692E834171j631495l1248P91895M90696P45100J061009p37557l536384l283184
41683b96997M10165K669390N26978k516681j948984J370798L610002L714264L089792
41674A0628727J931220k21043j866251j248546L55520L82887r59120j540953j106435
41665F356006q85307n63318O41630R27617j756855m932187l993616M64663K911418
41656h29949J425815M80922L004682N123573K600774j952595l099823p29972Q68977
41647F892404J31481o81906n53548r05521j660582o50254K141749L600077K111669
$$ plain form
41638 10425569 10444226 10328640 11283738 12388195 12625132 12480238 12986502 14238021 15313902
41629 15313902 15292884 14395696 14197760 15950021 18434066 18814677 16438161 14310462 15475584
41620 15475584 19340584 23308552 26613352 30107756 33245652 34298101 33545259 33447784
41612 33447784 35173980 37505094 39830850 43535043 49143477 54537984 57753317 59531895
41604 59531895 61112989 61275012 58112741 52697673 48272146 46023840 44052445 40788349
41596 40788349 37262113 35162593 34378096 33787181 33513757 34885334 38145064 41277350
41588 41277350 41797870 39502510 36775858 35898281 36715912 37809725 39456147 43864005
41580 43864005 52126942 62404624 71944436 79660788 85748517 90133105 92877187 95084318
$$ packed form
41638A0425569J8657j15586R55098J104457K36937j44894N06264J251519J075881
41629A5313902k1018q97188j97936J752261K484045L80611k376516k127699J165122
41620A5475584L865000L967968L304800L494404L137896J052449p52842r7475
41612C3447784J726196K331114K325756L704193N608434N394507L215333J778578
41604E9531895J581094J62023l162271n415068m425527k248306j971395l264096
41596D0788349l526236k099520p84497n90915k73424J371577L259730L132286
41588D1277350N20520k295360k726652q77577Q17631J093813J646422M407858
41580D3864005Q262937J0277682R539812P716352O087729M384588K744082K207131
$$ plain form
41572 95084318 97455178 98469178 96009226 90679385 85526644 82218882 79345477 74966803
41564 74966803 69033730 62562934 56240445 51026693 48550328 49192734 50656416 50097865
41556 50097865 47389091 45046781 45198134 47680331 50828383 53009283 53605800 53777255
41548 53777255 56368418 63827516 75657909 88688904 100347863 111095196 123289692
41541 123289692 138419210 156242429 176282596 199178194 226276397 258461053 295745650
41534 295745650 337422672 381505063 423521671 456497640 473305341 469989763 447538613
41527 447538613 411208384 368371763 325890826 287747122 254328362 224303135 197335631
41520 197335631 174615788 157037594 143930792 133790019 125219627 116896635 107980090
$$ packed form
41572I5084318K370860J014000k459952n329841n152741l307762k873405m378674
41564G4966803n933073o470796o322489n213752k476365O42406J463682n58551
41556E0097865k708774k342310J51353K482197L148052K180900N96517J71455
41548E3777255K591163P459098J1830393J3030995J1658959J0747333J2194496
41541A23289692J5129518J7823219K0040167K2895598K7098203L2184656L7284597
41534B95745650M1677022M4082391M2016608L2975969J6807701l315578k2451150
41527D47538613l6330229m2836621m2480937l8143704l3418760l0025227k6967504
41520A97335631k2719843j7578194j3106802j0140773q570392q322992q916545
$$ plain form
41513 107980090 99348134 93106544 89680470 86596439 81711140 76551480 74302252 75103627
41505 75103627 75946539 75345706 75344510 77937156 82161187 86540239 92157520 100665794 110658114
41496 110658114 119214473 126948918 138626295 157928947 183729462 212573578 243093782
41489 243093782 276727811 315504612 360441011 410595876 461369153 503942951 528574224
41482 528574224 529760067 508405047 469879307 421314447 370237200 323156777 283333685
41475 283333685 249952046 220348653 193210136 169474642 150602847 136568902 125457847
41468 125457847 114700070 102897411 90867075 80867869 74481400 71145694 68740359
41461 68740359 65377929 60556288 55021389 49979208 46286390 43951626 42354959 41109489
$$ packed form
41513A07980090q631956o241590l426074l084031m885299n159660k249228Q01375
41505G5103627Q42912o00833j196K592646M224031M379052N617281Q508274R992320
41496A10658114Q556359P734445J1677377J9302652K5800515K8844116L0520204
41489B43093782L3634029L8776801M4936399N0154865N0773277M2573798K4631273
41482E28574224J185843k1355020l8525740m8564860n1077247m7080423l9823092
41475B83333685l3381639k9603393k7138517k3735494j8871795j4033945j1111055
41468A25457847j0757777j1802659j2030336r999206o386469l335706k405335
41461F8740359l362430m821641n534899n042181l692818k334764j596667j245470
$$ plain form
41453 41109489 40514986 40843238 41390341 40809406 38527610 35516628 33581469 34112407 37320902
41444 37320902 41932338 45332006 44850207 40003807 33551714 29479606 29391514 31244206
41436 31244206 32048469 31326901 31050287 32367920 33789921 33407326 31874739 31674139 33655966
41427 33655966 35978152 36977328 37568054 39626718 43071136 46140016 48106365 49988825
41419 49988825 52451597 54690700 56162812 58082519 61946320 67205826 71628600 73830895
41411 73830895 74472504 74853097 75198838 74838366 73712170 73169911 75027870 79771313 85760168
41402 85760168 90395453 92088404 90978028 88052585 84300315 80779772 78494283 77358101
41394 77358101 75736035 71854617 65584124 58294257 51241993 44846500 39370768 35350285
$$ packed form
41453D1109489n94503L28252N47103n80935k281796l010982j935159N30938L208495
41444C7320902M611436L399668m81799m846400o452093m072108q8092J852692
41436C1244206Q04263p21568k76614J317633J422001l82595j532587k00600J981827
41427C3655966K322186R99176N90726K058664L444418L068880J966349J882460
41419D9988825K462772K239103J472112J919707L863801N259506M422774K202295
41411G3830895O41609L80593L45741l60472j126196n42259J857959M743443N988855
41402H5760168M635285J692951j110376k925443l752270l520543k285489j136182
41394G7358101j622066l881418o270493p289867p052264o395493n475732m020483
$$ plain form
41386 35350285 33040974 32007206 31480632 30724486 29048519 26103057 22389513 19013571
41378 19013571 16714972 15407768 14552228 13455663 11410428 8424459 5883889 5524334
41370 5524334 7409748 9706321 10675400 10037171 8353376 6489155 6061509 8568007 12912661
41361 12912661 15500382 14482763 12450112 12805369 14783355 14860307 12343015 10194527
41353 10194527 10141302 10447999 9634732 9047186 9704746 9433601 5946175 924436 -1827179
41344 -1827179 -1158008 1017371 2953764 4038470 3550186 1645999 1203790 5329923 12615311
41335 12615311 17833358 18056562 15384201 12937587 11218168 9752309 9261446 9913855
41327 9913855 9657761 6753595 2440260 -1023663 -3420738 -5453162 -6147652 -4186908
$$ packed form
41386C5350285k309311j033768n26574p56146j675967k945462l713544l375942
41378A9013571k298599j307204q55540j096565k045235k985969k540570l59555
41370E524334J885414K296573R69079o38229j683795j864221m27646K506498M344654
41361A2912661K587721j017619k032651L55257J977986P6952k517292k148488
41353A0194527n3225L06697q13267n87546O57560k71145l487426n021739k751615
41344a827179O69171K175379J936393J084706m88284j904187m42209M126133P285388
41335A2615311N218047K23204k672361k446614j719419j465859m90863O52409
41327I913855k56094k904166m313335l463923k397075k032424o94490J960744
$$ plain form
41319 -4186908 -901615 944155 1007598 1354444 2722619 3510742 2834808 1991361 2000292
41310 2000292 1894296 649250 -920786 -1539992 -1497716 -1977427 -3084781 -3562793 -2076777
41301 -2076777 1687889 6590505 10366414 11242677 9719999 8029436 7459686 7072068 5465799
41292 5465799 2798952 309181 -1385690 -2596518 -3563559 -3928990 -3175168 -1256703 1118724
41283 1118724 2787916 3001625 2095358 1172655 1308244 3091736 6114822 8348842 7216842
41274 7216842 2713930 -1396315 -1406444 1753884 3895394 3312727 2469961 3395793 4299074
41265 4299074 2532726 -1170376 -3644358 -3351931 -1589197 -302940 -272948 -1041978 -1485483
41256 -1485483 -820876 316290 607344 256536 883845 2381400 2019621 -1448051 -4699980
$$ packed form
41319d186908L285293J845770O3443L46846J368175P88123o75934q43447Q931
41310B000292j05996j245046j570036o19206M2276m79711j107354m78012J486016
41301b076777L764666M902616L775909Q76263j522678j690563n69750l87618j606269
41292E465799k666847k489771j694871j210828r67041l65431P53822J918465K375427
41283A118724J669192K13709r06267r22703J35589J783492L023086K234020j132000
41274G216842m502912m110245j0129L160328K141510n82667q42766R25832R03281
41265D299074j766348l703102k473982K92427J762734J286257K9992p69030m43505
41256a485483O64607J137166K91054l50808O27309J497555l61779l467672l251929
$$ plain form
41247 -4699980 -3617047 891666 3783338 2367279 -905622 -2537992 -2362357 -2746296
41239 -2746296 -5084467 -8236373 -9715284 -7990251 -4221538 -1567005 -1862151 -3343165
41231 -3343165 -2810666 471804 4524272 7648581 9568198 9832240 7669074 4039631
41223 4039631 1523512 1077755 780849 -1039020 -3123284 -3081077 -517645 2932922 5538461
41214 5538461 6252883 4821612 2510789 1676877 3112845 4680538 4079973 2145367 1619478
41205 1619478 3185752 4715766 4512023 3424386 3146460 3893007 4732887 5264916 5780686
41196 5780686 5999707 4661971 909956 -4092762 -7432208 -6852265 -2980603 1282050
41188 1282050 3786583 4994583 6406785 7921157 8006833 6463663 5492026 6932618 9262278
$$ packed form
41247d699980J082933M508713K891672j416059l272901j632370J75635l83939
41239b746296k338171l151906j478911J725033L768713K654533k95146j481014
41231c343165N32499L282470M052468L124309J919617K64042k163166l629443
41223D039631k516119m45757k96906j819869k084264M2207K563432L450567K605539
41214E538461P14422j431271k310823q33912J435968J567693o00565j934606n25889
41205A619478J566274J530014k03743j087637k77926P46547Q39880N32029N15770
41196E780686K19021j337736l752015n002718l339446N79943L871662M262653
41188A282050K504533J208000J412202J514372Q5676j543170r71637J440592K329660
$$ plain form
41179 9262278 9037594 5608052 2734234 4125109 8303420 9938993 6344624 572130
41171 572130 -2751320 -2607987 -997156 976671 3672943 6280435 6677038 4531104 2182161
41162 2182161 1472082 1684690 1778890 2734685 5886801 10174138 13009481 13399894 12618751
41153 12618751 12041073 11779389 11556704 11741277 13094994 16054699 20393007 25155119 28926204
41144 28926204 30598183 30056940 28136352 26061337 24793016 24329001 23479141 20865128
41136 20865128 16377898 11289779 7033590 4507029 4268402 6100781 8160831 8006899
41128 8006899 5262527 2213343 994890 1185574 1034868 87344 -543838 62641 1548059
41119 1548059 2585846 1798700 -928841 -3587528 -3513933 -467528 2776118 3769546 3282479
$$ packed form
41179I262278k24684l429542k873818J390875M178311J635573l594369n772494
41171E72130l323450J43333J610831J973827K696272K607492L96603k145934k348943
41162B182161p10079K12608R4200R55795L152116M287337K835343L90413p81143
41153A2618751n77678k61684k22685J84573J353717K959705M338308M762112L771085
41144B8926204J671979n41243j920588k075015j268321m64015q49860k614013
41136B0865128m487230n088119m256189k526561k38627J832379K060050j53932
41128H006899k744372l049184j218453J90684j50706r47524o31182O06479J485418
41119A548059J037787p87146k727541k658687P3595L046405L243646R93428m87067
$$ plain form
41110 3282479 3827108 6337412 9570122 11988078 12956578 12698420 12240745 12917571 15030506
41101 15030506 17545932 19523976 20621936 19837893 16079840 11316438 10424168 15214060
41093 15214060 20791272 21272327 17499830 15069328 15796674 16110493 14250489 13861515 18239481
41084 18239481 25051684 29793379 31785390 33772101 37357183 41428835 43866188 42852693
41076 42852693 37913559 31486084 27893362 28829214 31423942 32562374 32862435 33774363
41068 33774363 33272654 28655680 22353538 20073856 22844802 25405658 23764575 20117975
41060 20117975 18033576 16666792 13410789 9662917 9427858 12877850 15488581 14303614
41052 14303614 11659225 11069230 12037425 11452860 8775166 6955006 7948495 9609562 8506466
$$ packed form
41110C282479N44629K510304L232710K417956R68500k58158m57675O76826K112935
41101A5030506K515426J978044J097960p84043l758053m763402q92270M789892
41093A5214060N577212M81055l772497k430502P27346L13819j860004l88974M377966
41084A8239481O812203M741695J992011J986711L585082M071652K437353j013495
41076D2852693m939134o427475l592722R35852K594728J138432L00061R11928
41068C3774363n01709m616974o302142k279682K770946K560856j641083l646600
41060B0117975k084399j366784l256003l747872k35059L449992K610731j184967
41052A4303614k644389n89995R68195n84565k677694j820160R93489J661067j103096
$$ plain form
41043 8506466 4795525 2460353 4387852 8566093 10361535 8052903 4566026 3320921
41035 3320921 3868176 3101979 65774 -2506577 -1978586 505462 1503957 -250109 -2272648
41026 -2272648 -1270527 3291573 8806331 12138804 12465827 11849416 12946984 15913104
41018 15913104 17984232 16660140 12743086 9305625 8129985 8472324 9060056 9489763
41010 9489763 9253280 7333027 4100613 2314069 4484772 9608258 13785392 14004730
41002 14004730 10513952 5819792 2367156 1132957 1563045 2468685 3084162 3245862 2900415
40993 2900415 2281465 2451416 4261330 6373083 5970929 2451987 -1148618 -1821896 -227709
40984 -227709 1064611 1517402 2330652 3105886 1832384 -1519535 -3971067 -3033779 488073
$$ packed form
41043H506466l710941k335172J927499M178241J795442k308632l486877j245105
41035C320921N47255p66197l036205k572351N27991K484048R98495j754066k022539
41026b272648J002121M562100N514758L332473L27023o16411J097568K966120
41018A5913104K071128j324092l917054l437461j175640L42339N87732M29707
41010I489763k36483j920253l232414j786544K170703N123486M177134K19338
41002A4004730l490778m694160l452636j234199M30088R05640O15477J61700l45447
40993B900415o18950J69951J809914K111753m02154l518942l600605o73278J594187
40984b27709J292320M52791Q13250P75234j273502l351919k451532R37288L521852
$$ plain form
40975 488073 3911791 5401929 4693952 2621629 811112 794254 2625898 4893120 6240562
40966 6240562 6318133 5636066 5479294 7280907 10536826 12011044 9071768 3426814 -734338
40957 -734338 -1948979 -2046950 -1688287 969311 6078365 10168815 10533788 8776573 7722766
40948 7722766 7339994 6369451 5737942 7059238 9126829 9233348 7415941 6410079 7458210
40939 7458210 8757867 8364922 6527483 4621291 3250652 1863434 -515030 -4021609
40931 -4021609 -6980617 -7213467 -5109658 -3789180 -4849129 -5968380 -4975254 -4124619 -6710556
40922 -6710556 -10687532 -10171078 -3635467 3558739 6123769 4663633 2686473 1303105
40914 1303105 -140096 -719191 1016802 3668173 4160303 2364857 1571013 3585780 5928944
$$ packed form
40975D88073L423718J490138p07977k072323j810517j6858J831644K267222J347442
40966F240562P7571o82067j56772J801613L255919J474218k939276n644954m161152
40957g34338j214641r7971L58663K657598N109054M090450L64973j757215j053807
40948G722766l82772r70543o31509J321296K067591J06519j817407j005862J048131
40939G458210J299657l92945j837439j906192j370639j387218k378464l506579
40931d021609k959008k32850K103809J320478j059949j119251R93126Q50635k585937
40922f710556l976976N16454O535611P194206K565030j460136j977160j383368
40914A303105j443201n79095J735993K651371M92130j795446p93844K014767K343164
$$ plain form
40905 5928944 5466947 2980257 1845728 2911464 3250764 699761 -2448353 -2098112 2240225
40896 2240225 6764015 8075865 6650429 5076510 4652704 4913387 5225327 5388463 5317779
40887 5317779 5252709 5696844 6319307 5854548 4141318 3152962 4477941 6595000 6396996
40878 6396996 3081997 -939701 -2711501 -1008434 3553479 9144797 13595887 15824891
40870 15824891 16240005 15196180 12325722 8563035 6967499 9122079 12038547 11582273
40862 11582273 8141875 5609745 5176491 4057864 982341 -1048875 700559 4590239
40854 4590239 7339529 8462808 9520693 10773751 11168128 10578949 9753797 8601043 6438689
40845 6438689 3582587 1103263 -754130 -2594586 -4518977 -5882232 -6315881 -6061338
$$ packed form
40905E928944m61997k486690j134529J065736L39300k551003l148114L50241M338337
40896B240225M523790J311850j425436j573919m23806K60683L11940J63136p0684
40887E317779o5070M44135O22463m64759j713230r88356J324979K117059j98004
40878F396996l314999m021698j771800J703067M561913N591318M451090K229004
40870A5824891M15114j043825k870458l762687j595536K154580K916468m56274
40862A1582273l440398k532130m33254j118627l075523k031216J749434L889680
40854D590239K749290J123279J057885J253058L94377n89179q25152j152754k162354
40845F438689k856102k479324j857393j840456j924391j363255m33649K54543
$$ plain form
40837 -6061338 -5239439 -3472273 -523735 2764207 4403860 2829674 -970728 -3745087
40829 -3745087 -3431847 -1453197 -125874 1073350 4237204 8720681 11280468 10773471
40821 10773471 9512763 9122043 8355880 6540762 5846023 7628822 9127921 6769684
40813 6769684 1121753 -4113921 -6750810 -7333931 -6938828 -6258913 -6050723 -6296908 -5688803
40804 -5688803 -3758605 -2314909 -2687939 -2967421 -609473 3324378 5479430 5121244 4773885
40795 4773885 6186504 8532144 10689674 12495824 13217613 11318342 6690835 1356999
40787 1356999 -2706254 -5051550 -5996182 -6063483 -6290322 -7331836 -8059471 -6672066 -3268045
40778 -3268045 303992 2997325 5083582 6284104 5627376 3426189 1326723 96100
$$ packed form
40837f061338Q21899J767166K948538L287942J639653j574186l800402k774359
40829c745087L13240J978650J327323J199224L163854M483477K559787n06997
40821A0773471j260708l90720p66163j815118o94739J782799J499099k358237
40813F769684n647931n235674k636889n83121L95103O79915K08190k46185O08105
40804e688803J930198J443696l73030k79482K357948L933851K155052l58186l47359
40795D773885J412619K345640K157530J806150P21789j899271m627507n333836
40787A356999m063253k345296r44632o7301k26839j041514p27635J387405L404021
40778c268045L572037K693333K086257J200522o56728k201187k099466j230623
$$ plain form
40770 96100 -642379 -378116 2121848 6057727 8425574 7587084 5098028 3301158 3137673
40761 3137673 4881409 8441516 11752733 11412031 6772578 1592375 -89627 1759379
40753 1759379 4276725 5287349 4295259 1815380 -374795 91514 3243490 5844429
40745 5844429 5308374 3233489 3001550 5119668 7223539 7693446 6828498 5101624 2712104
40736 2712104 581809 -446279 -1236182 -3139907 -5460945 -6392017 -6282498 -7340802 -9653992
40727 -9653992 -10036161 -5942471 1254768 7839070 11123858 10682979 8019150 5891062
40719 5891062 6258188 7861713 7484742 4645612 3015932 5434749 9414950 10221788 7315988
40710 7315988 4704387 5017710 6338740 5904318 4326781 4140842 5665137 6569885 5206935
$$ packed form
40770I6100p38479K64263K499964L935879K367847q38490k489056j796870j63485
40761C137673J743736L560107L311217l40702m639453n180203j682002J849006
40753A759379K517346J010624r92090k479879k190175M66309L151976K600939
40745E844429n36055k074885k31939K118118K103871M69907q64948j726874k389520
40736B712104k130295j028088p89903j903725k321038r31072J09519j058304k313190
40727i653992l82169M093690P197239O584302L284788m40879k663829k128088
40719E891062L67126J603525l76971k839130j629680K418817L980201Q06838k905800
40710G315988k611601L13323J321030m34422j577537j85939J524295R04748j362950
$$ plain form
40701 5206935 2594079 898109 1156529 2740073 4078215 3617231 967583 -2402128
40693 -2402128 -4266102 -3937980 -2980532 -3201056 -4477131 -5147120 -4121322 -1907822 201642
40684 201642 1233848 908925 -351376 -1636936 -2290694 -2567313 -3088745 -3564934 -2703753
40675 -2703753 150176 3653325 5360780 4161799 1614906 618130 2597037 6006351
40667 6006351 7774367 6299690 2872974 137631 -508753 156081 378397 -861948 -3081267
40658 -3081267 -4818821 -5040676 -4187309 -3513527 -3291534 -2377549 16109 3004514 5372510
40649 5372510 7439054 10217956 13107474 14016053 11945641 8023889 3654146 -801906
40641 -801906 -4724735 -6185040 -3879616 352208 2488992 222899 -4693206 -8184782
$$ packed form
40701E206935k612856j695970K58420J583544J338142m60984k649648l369711
40693b402128j863974L28122R57448k20524j276075o69989J025798K213500K109464
40684B01642J032206l24923j260301j285560o53758k76619n21432m76189Q61181
40675b703753K853929L503149J707455j198981k546893r96776J978907L409314
40667F006351J768016j474677l426716k735343o46384O64834K22316j240345k219319
40658c081267j737554k21855Q53367O73782K21993R13985K393658K988405K367996
40649E372510K066544K778902K889518R08579k070412l921752m369743m456052
40641h01906l922829j460305K305424M231824K136784k266093m916105l491576
$$ plain form
40633 -8184782 -7674690 -4251698 -1356296 -1332610 -3245562 -4282095 -3127542 -1218318 -418627
40624 -418627 -398579 706745 3386684 5653517 5234728 2202015 -1180321 -2964128 -3195934
40615 -3195934 -2947041 -2380629 -640879 2361454 4978630 5279178 3130755 338606 -1082858
40606 -1082858 -476048 1188085 2119280 1174836 -956849 -2393674 -2285398 -1736324 -1884016
40597 -1884016 -2017928 -855231 1067934 2016110 1825638 2187546 3887127 5517057 5612933
40588 5612933 4585491 3682157 3301536 3305260 3916428 5208965 6463788 6984963 6879201
40579 6879201 6195139 4144105 352851 -3674498 -5661027 -5038284 -3309619 -1941680
40571 -1941680 -863600 671389 2536039 3702108 3589865 2898562 2787085 3433438 3931938
$$ packed form
40633h184782N10092L422992K895402K3686j912952j036533J154553J909224P99691
40624d18627K0048J105324K679939K266833m18789l032713l382336j783807k31806
40615c195934K48893N66412J739750L002333K617176L00548k148423k792149j421464
40606a082858O06810J664133R31195r44444k131685j436825J08276N49074j47692
40597a884016j33912J162697J923165R48176j90472L61908J699581J629930R5876
40588E612933j027442r03334l80621L724O11168J292537J254823N21175j05762
40579F879201o84062k051034l791254m027349j986529O22743J728665J367939
40571a941680J078080J534989J864650J166069j12243o91303j11477O46353M98500
$$ plain form
40562 3931938 3724652 3473110 4057627 5348554 6631332 7564262 7780170 6272360 2582195
40553 2582195 -1805459 -4772960 -6048534 -6788067 -6955753 -5223739 -1750906 1134252
40545 1134252 1862235 1369730 1003143 550606 -400120 -881191 32393 1408496 1632001
40536 1632001 581236 -656772 -1559733 -2595289 -4422331 -7256101 -10241706 -11286977
40528 -11286977 -8982214 -4965943 -2383733 -1484667 621801 4734129 7302585 5689209
40520 5689209 2659985 2299652 3839080 3607238 1507574 867479 2276267 2340038 -623238
40511 -623238 -3855311 -4636570 -3861609 -3117479 -1342723 2848573 7601666 9526224 8121941
40502 8121941 6199909 6160346 7503458 7979783 6071202 2326800 -1077172 -2183843 -1001185
$$ packed form
40562C931938k07286k51542N84517J290927J282778R32930K15908j507810l690165
40553B582195m387654k967501j275574p39533j67686J732014L472833K885158
40545A134252P27983m92505l66587m52537r50726m81071R13584J376103K23505
40536A632001j050765j238008r02961j035556j827042k833770k985605j045271
40528a1286977K304763M016271K582210Q99066K106468M112328K568456j613376
40520E689209l029224l60333J539428k31842k099664o40095J408788O3771k963276
40511f23238l232073p81259P74961P44130J774756M191296M753093J924558j404283
40502H121941j922032l9563J343112M76325j908581l744402l403972j106671J182658
$$ plain form
40493 -1001185 796511 1825368 1946760 1375067 122951 -1140418 -882821 1541704 4413310
40484 4413310 4823924 1366940 -4570210 -9904118 -12066070 -10611420 -7177478 -3925289
40476 -3925289 -1883633 -586747 1034019 3442500 5769071 6341962 4606936 2361261
40468 2361261 1913577 2987351 3050272 1020631 -1447463 -3171579 -5363532 -8627943 -10581524
40459 -10581524 -9083082 -5783190 -3459386 -1718788 1012013 2837953 354023 -5179063
40451 -5179063 -8327164 -6737142 -3632299 -2151125 -1506728 -330805 386014 82413 734966
40442 734966 3343680 5227196 3770630 520525 -1332635 -1552043 -2067345 -3225467 -3645120
40433 -3645120 -2690051 -786710 1531684 2900279 1088780 -3894251 -8175632 -8146317 -4985192
$$ packed form
40493a001185J797696J028857J21392n71693j252116j263369K57597K424525K871606
40484D413310M10614l456984n937150n333908k161952J454650L433942L252189
40476c925289K041656J296886J620766K408481K326571N72891j735026k245675
40468B361261m47684J073774O2921k029641k468094j724116k191953l264411j953581
40459a0581524J498442L299892K323804J740598K730801J825940k483930n533086
40451e179063l148101J590022L104843J481174O44397J175923P16819l03601O52553
40442G34966K608714J883516j456566l250105j853160k19408n15302j158122m19653
40433c645120R55069J903341K318394J368595j811499m983031m281381K9315L161125
$$ plain form
40424 -4985192 -2448370 -1470637 -89164 2136182 3158933 2046084 511116 169986
40416 169986 597698 834827 915550 1127360 1183504 779405 27426 -835187 -1288488 -283502
40406 -283502 2719349 6581926 9383051 10343148 10070089 9368390 8729735 8482056 8545558
40397 8545558 8584493 8926748 10117611 10847341 8268601 2005960 -4019303 -6035570 -5150353
40388 -5150353 -5053865 -6421952 -6835625 -5488694 -4412319 -4879370 -5786829 -6162746 -6462191
40379 -6462191 -6717172 -6077643 -5009449 -5389442 -7388215 -8601635 -7392623 -4897620 -2579003
40370 -2579003 -71058 3026496 5283320 5250221 3661534 2128939 919884 -348834
40362 -348834 -1089840 -719237 -354231 -1537214 -3622273 -4231380 -2372238 331206 1750899
$$ packed form
40424d985192K536822R77733J381473K225346J022751j112849j534968l41130
40416A69986M27712K37129Q0723K11810N6144m04099p51979q62613m53301J004986
40406b83502L002851L862577K801125R60097k73059p01699o38655k47679O3502
40397H545558L8935L42255J190863P29730k578740o262641o025263k016267Q85217
40388e150353R6488j368087m13673J346931J076375m67051r07459l75917k99445
40379f462191k54981O39529J068194l79993j998773j213420J209012K495003K318617
40370b579003K507945L097554K256824l3099j588687j532595j209055j268718
40362c48834p41006L70603L65006j182983k085059o09107J859142K703444J419693
$$ plain form
40353 1750899 1438395 327922 -784447 -1785132 -2725678 -3502513 -4130491 -4783212 -5116426
40344 -5116426 -3912756 -276459 4669781 8196343 8607456 6777797 4613143 2931899
40336 2931899 1553715 350696 -896955 -2674700 -4493452 -4540269 -2130938 531346
40328 531346 960350 -169576 -440195 209002 -421332 -2732015 -4308792 -3574373 -1908259
40319 -1908259 -1227316 -1628949 -2323008 -2844199 -2433868 -252356 2819684 4609617 4880096
40310 4880096 5966082 8970283 11653490 11872692 10935262 11171212 11820139 10129158 5830982
40301 5830982 1914779 855655 2055440 3418565 4020029 4556767 5828149 7319059
40293 7319059 7497490 5788304 3835539 3688081 4780804 4270060 807679 -3666730 -6688409
$$ packed form
40353A750899l12504j110473j112369j000685r40546p76835o27978o52721l33214
40344e116426J203670L636297M946240L526562M11113j829659k164654j681244
40336B931899j378184j203019j247651j777745j818752m6817K409331K662284
40328E31346M29004j129926k70619O49197o30334k310683j576777P34419J666114
40319a908259O80943m01633o94059n21191M10331K181512L072040J789933K70479
40310D880096J085986L004201K683207K19202r37430K35950O48927j690981m298176
40301E830982l916203j059124J199785J363125O01464N36738J271382J490910
40293G319059J78431j709186j952765j47458J092723n10744l462381m474409l021679
$$ plain form
40284 -6688409 -8143486 -9219249 -10055683 -10033332 -9288713 -8337362 -6956788 -4885645 -3032458
40275 -3032458 -2708085 -4079413 -6237585 -8110360 -8650419 -7320554 -5354703 -5097769 -6660626
40266 -6660626 -6628684 -2086688 4918189 9024548 7469430 2754433 -469944 136313 3161672
40257 3161672 5410780 5324289 4780089 6784869 11223514 14562516 14467755 12508406 10870791
40248 10870791 8992759 5961982 3765888 4410269 5383433 2417625 -3657825 -7353505
40240 -7353505 -6336175 -4344357 -4805556 -5753808 -3707778 720123 4250613 5601030
40232 5601030 5517260 3954626 676197 -2363319 -2689690 -1150775 -1013372 -3072747 -4624919
40223 -4624919 -3913760 -2663738 -2835181 -3419014 -2514112 -747984 -168890 -759473 -639407
$$ packed form
40284f688409j455077j075763q36434K2351P44619R51351J380574K071143J853187
40275c032458L24373j371328k158172j872775n40059J329865J965851K56934j562857
40266f660626L1942M541996P004877M106359j555118m714997l224377O06257L025359
40257C161672K249108q6491n44200K004780M438645L339002r4761j959349j637615
40248A0870791j878032l030777k196094O44381R73164k965808o075450l695680
40240g353505J017330J991818m61199r48252K046030M427901L530490J350417
40232E601030q3770j562634l278429l039516l26371J538915J37403k059375j552172
40223d624919P11159J250022j71443n83833R04902J766128N79094n90583J20066
$$ plain form
40214 -639407 474534 497970 -1721147 -4305591 -4674390 -2738883 -738624 -715623 -2915721
40205 -2915721 -5831968 -7086474 -5230124 -1569984 714330 192753 -1187916 -1221850 -729760
40196 -729760 -1786891 -3834721 -4270563 -2706495 -1919063 -3917872 -7209547 -8830154 -7497713
40187 -7497713 -4169551 -1020520 -254552 -2222849 -4327558 -3537326 -202146 2639541
40179 2639541 3700160 4362108 4857512 3195866 -644501 -3115247 -2103065 -350652
40171 -350652 -1028377 -2875149 -3167280 -2751574 -3829405 -4745552 -1940421 3641150 6891676
40162 6891676 5541788 2635419 1392492 1460951 1276351 581012 -838922 -3868894 -7858912
40153 -7858912 -10140640 -9300890 -6967746 -5168499 -3917210 -2562177 -1509138 -1262055
$$ packed form
40214f39407J113941K3436k219117k584444l68799J935507K000259K3001k200098
40205b915721k916247j254506J856350L660140K284314n21577j380669l3934M92090
40196g29760j057131k047830m35842J564068P87432j998809l291675j620607J332441
40187g497713L328162L149031P65968j968297k104709P90232L335180K841687
40179B639541J060619O61948M95404j661646l840367k470746J012182J752413
40171c50652o77725j846772k92131M15706j077831r16147K805131N581571L250526
40162F891676j349888k906369j242927O8459j84600o95339j419934l029972l990018
40153g858912k281728Q39750K333144J799247J251289J355033J053039K47083
$$ plain form
40145 -1262055 -1380258 -1510820 -1983954 -2591896 -2442315 -1749007 -1881002 -2780713 -2381338
40136 -2381338 240330 3093564 4075442 3816157 4186865 5466718 6633910 7268146 7500430
40127 7500430 6934686 5194008 3073014 1893179 1902976 2077074 1341649 -245505 -1156411
40118 -1156411 561386 4978740 9226154 10024316 7279054 3906260 2257530 2206973 2472212
40109 2472212 1902079 -389316 -3939547 -5955887 -3900205 623804 3136450 1929624
40101 1929624 -218358 -539155 528383 1572314 2408392 2583861 858362 -1942366 -2596452
40092 -2596452 -182201 1845073 706761 -1556587 -1909702 -1346228 -2389885 -3938375
40084 -3938375 -2915659 204580 1714585 89322 -2527215 -4124441 -4871999 -5267024
$$ packed form
40145a262055j18203j30562m73134o07942J49581O93308j31995q99711L99375
40136b381338K621668K853234R81878k59285L70708J279853J167192O34236K32284
40127G500430n65744j740678k120994j179835R797J74098p35425j587154r10906
40118a156411J717797M417354M247414P98162k745262l372794j648730n0557K65239
40109B472212n70133k291395l550231k016340K055682M524009K512646j206826
40101A929624k147982l20797J067538J043931Q36078J75469j725499k800728o54086
40092b596452K414251K027274j138312k263348l53115N63474j043657j548490
40084c938375J022716L120239J510005j625263k616537j597226p47558l95025
$$ plain form
40076 -5267024 -5115298 -4668553 -4492805 -4162388 -3090108 -2288760 -3171188 -5090534 -6276022
40067 -6276022 -6541430 -6633190 -5685829 -2278535 2365469 5305312 5998363 6556727 7812114
40058 7812114 8206426 7068929 5974604 5939637 5926703 5184862 4727623 5416069 6642075
40049 6642075 7821309 9088100 9526488 6895380 615497 -6466464 -10615368 -10539197 -7572621
40040 -7572621 -3892163 -1309683 -582743 -1020510 -1451845 -1798126 -2785781 -4187396 -4593853
40031 -4593853 -2996261 393104 4474942 7258727 6528281 2498406 -999519 -429048
40023 -429048 2843708 4426559 2898604 916104 559964 1085547 1723889 3087159 4640011
40014 4640011 4086766 867109 -2455131 -3677113 -3253138 -2048926 155479 2528095
$$ packed form
40076e267024J51726M46745J75748L30417J072280Q01348q82428j919346j185488
40067f276022k65408r1760R47361L407294M644004K939843O93051N58364J255387
40058G812114L94312j137497j094325l4967j2934p41841m57239O88446J226006
40049F642075J179234J266791M38388k631108o279883p081961m148904P6171K966576
40040g572621L680458K582480P26940m37767m31335l46281r87655j401615m06457
40031d593853J597592L389365M081838K783785p30446m029875l497925N70471
40023d29048L272756J582851j527955j982500l56140N25583O38342J363270J552852
40014D640011n53245l219657l322240j221982M23975J204212K204405K372616
$$ plain form
40006 2528095 2781694 806091 -317557 1005935 2220943 958970 -1037590 -1145523
39998 -1145523 -112900 239230 1063120 4459968 9141119 11769941 11423572 9459635 6269388
39989 6269388 1685203 -2345423 -3089373 -681545 2458326 5131456 7307220 7617596
39981 7617596 4645277 400975 -1174081 579272 2536909 2621847 1822374 1105070 -183144
39972 -183144 -1978325 -2738420 -2121230 -1646924 -1638045 -160813 3843748 8793570 12805989
39963 12805989 15375658 15907947 13412919 8894688 5253290 3318153 736389 -3513220
39955 -3513220 -6481781 -5517341 -2538684 -1118707 -1306852 -475354 2133713 4907163 6997106
39946 6997106 8852041 10053984 9540930 7883767 6638629 5405017 2337497 -1956576
$$ packed form
40006B528095K53599j975603j123648J323492J215008j261973j996560j07933
39998a145523J032623L52130Q23890L396848M681151K628822l46369j963937l190247
39989F269388m584185m030626p43950K407828L139871K673130K175764L10376
39981G617596k972319m244302j575056J753353J957637Q4938p99473p17304j288214
39972a83144j795181p60095O17190M74306Q879J477232M004561M949822M012419
39963A2805989K569669N32289k495028m518231l641398j935137k581764m249609
39955c513220k968561R64440K978657J419977j88145Q31498K609067K773450K089943
39946F997106J854935J201943n13054j657163j245138j233612l067520m294073
$$ plain form
39938 -1956576 -3884087 -1474717 2729079 4957324 4685023 4104853 4423953 4756432 4283165
39929 4283165 3555520 3164264 2362352 -112185 -4244547 -8407524 -10790995 -10808267 -9075069
39920 -9075069 -6469304 -3635253 -1196516 216162 414797 -258131 -1511350 -3347406
39912 -3347406 -5416199 -6582093 -5684877 -2620502 1593888 5573671 8185753 8927621
39904 8927621 8191007 6833543 5119271 2598143 -447421 -2183658 -983902 2234584
39896 2234584 4611717 4461037 2889708 2141655 3215074 5337701 6821602 6047323 2665462
39887 2665462 -1450615 -3389319 -2344579 -873873 -1865382 -4827747 -6703975 -6211595
39879 -6211595 -5584567 -7349553 -10805922 -12877170 -11671149 -8041320 -4037580 -949892
$$ packed form
39938a956576j927511K409370M203796K228245k72301n80170L19100L32479m73267
39929D283165p27645l91256q01912k474537m132362m162977k383471j7272J733198
39920i075069K605765K834051K438737J412678J98635o72928j253219j836056
39912c347406k068793j165894Q97216L064375M214390L979783K612082P41868
39904H927621p36614j357464j714272k521128l045564j736237J199756L218486
39896B234584K377133j50680j571329p48053J073419K122627J483901p74279l381861
39887B665462m116077j938704J044740J470706r91509k962365j876228M92380
39879f211595O27028j764986l456369k071248J206021L629829M003740L087688
$$ plain form
39871 -949892 1101306 2496920 3370469 3360340 2266008 940172 675116 1214933 505568
39862 505568 -2424155 -5370996 -5548258 -3626997 -2843882 -4061766 -4461799 -2192963 294697
39853 294697 -364778 -3602900 -6020987 -6255611 -5945856 -6166678 -5790502 -4055024 -2308237
39844 -2308237 -1845945 -1724522 -313468 2025683 3415442 3194868 2828694 4030739 6796308
39835 6796308 9359837 9621732 6810340 2358892 -924689 -1175164 890586 2969223
39827 2969223 3715927 3779798 4347238 5530732 6762291 8058394 9724956 10903310 9817336
39818 9817336 6215885 2549449 1566127 3307091 5634661 7155153 8100880 8754606 9069843
39809 9069843 9966589 12606192 15548753 15142094 10486636 5900784 6019122 9844717 12289257
$$ packed form
39871i49892K051198J395614Q73549j0129j094332j325836k65056N39817p09365
39862E05568k929723k946841j77262J921261P83115j217884m00033K268836K487660
39853B94697o59475l238122k418087k34624L09755k20822L76176J735478J746787
39844b308237M62292J21423J411054K339151J389759k20574l66174J202045K765569
39835F796308K563529K61895k811392m451448l283581k50475K065750K078637
39827B969223P46704O3871N67440J183494J231559J296103J666562J178354j085974
39818I817336l601451l666436r83322J740964K327570J520492R45727O53726L15237
39809I069843Q96746K639603K942561m06659m655458m585852J18338L825595K444540
$$ plain form
39800 12289257 10698479 7091661 4441541 3710514 4670360 6668197 7794297 5939593
39792 5939593 1905293 -713241 -60286 1487067 787832 -1879508 -3864320 -4051853 -3807540
39783 -3807540 -4663035 -6644860 -8680599 -9644105 -9188498 -8040369 -7043588 -5889473 -3862216
39774 -3862216 -1816584 -1613495 -3164901 -4247278 -4194192 -5196252 -8166152 -9995604 -7833736
39765 -7833736 -4022504 -3071819 -4901617 -5273105 -2791764 -1003406 -2256681 -3581490
39757 -3581490 -1325954 3034900 5058198 3720230 2235425 2811487 3650433 2032963
39749 2032963 -1727028 -4845022 -5575564 -4777894 -4148612 -4007118 -3394644 -1873130 -310615
39740 -310615 369697 436327 645368 884896 579544 89178 267581 518516 -1064817 -4859132
$$ packed form
39800A2289257j590778l606818k650120p31027R59846J997837J126100j854704
39792E939593m034300k618534O52955J547353o99235k667340j984812j87533K44313
39783c807540q55495j981825k035739r63506M55607J148129R96781J154115K027257
39774c862216K045632K03089j551406j082377N3086j002060k969900j829452K161868
39765g833736L811232R50685j829798l71488K481341J788358j253275j324809
39757c581490K255536M360854K023298j337968j484805N76062Q38946j617470
39749B032963l759991l117994p30542P97670O29282J41494O12474J521514J562515
39740c10615O80312O6630K09041K39528l05352m90366J78403K50935j583333l794315
$$ plain form
39730 -4859132 -8474226 -9611849 -9023356 -8974484 -9495638 -8232058 -4143259 577889 3097759
39721 3097759 3088886 2332534 2287466 3200265 4737101 6032902 5584013 2752055 -526662
39712 -526662 -1104218 1702514 5001790 5614410 3408603 545316 -1394093 -2137302 -1492395
39703 -1492395 613801 2828444 2910242 352127 -2596288 -3284488 -1435985 885713 1554240
39694 1554240 349367 -847590 177062 3294208 5339464 3370182 -1286678 -3846724
39686 -3846724 -1559943 3162317 6061068 5856664 4278102 2746597 1304053 295166
39678 295166 795913 3006317 5806976 8231637 9996315 10364366 8199585 4021818 697574
39669 697574 779355 3625383 6116038 6054115 4161109 2716742 2777607 3113916 1945911
$$ packed form
39730d859132l615094j137623N88493M8872n21154J263580M088799M721148K519870
39721C097759q873p56352m5068R12799J536836J295801m48889k831958l278717
39712e26662n77556K806732L299276O12620k205807k863287j939409p43209O44907
39703a492395K106196K214643Q1798k558115k948415o88200J848503K321698O68527
39694A554240j204873j196957J024652L117146K045256j969282m656860k560046
39686c846724K286781M722260K898751k04404j578562j531505j442544j008887
39678B95166N00747K210404K800659K424661J764678L68051k164781m177767l324244
39669F97574Q1781K846028K490655o1923j893006j444367O0865L36309j168005
$$ plain form
39660 1945911 -546873 -2046545 -702416 2681796 5699110 7069548 7348076 7163613
39652 7163613 6061481 3539705 257448 -2566191 -4478805 -5820523 -6707063 -6817020
39644 -6817020 -6381046 -6627048 -8392757 -10427085 -10192854 -7008411 -3420610 -2190382 -2632079
39635 -2632079 -1907363 158152 142535 -3940179 -8931858 -9938241 -6111567 -939148 2249147
39626 2249147 2794303 1352712 -1417358 -4503894 -6746621 -7868152 -8206261 -7728922 -6717294
39617 -6717294 -6753660 -8899079 -11181156 -10341048 -6298395 -2487395 -1274389 -1463071 -1135048
39608 -1135048 -475310 -386742 -345908 681722 2525436 4250869 5100887 4204162 1016590
39599 1016590 -2934984 -4553750 -2771917 -121478 545869 -628339 -1650289 -1398834
$$ packed form
39660A945911k492784j499672J344129L384212L017314J370438K78528j84463
39652G163613j102132k521776l282257k823639j912614j341718q86540j09957
39644f817020M35974k46002j765709k034328K34231L184443L587801J230228m41697
39635b632079P24716K065515j5617m082714m991679j006383L826674N172419L188295
39626B249147N45156j441591k770070l086536k242727j121531l38109M77339J011628
39617f717294l6366k145419k282077Q40108M042653L811000J213006j88682L28023
39608a135048O59738Q8568M0834J027630J843714J725433Q50018q96725l187572
39599A016590l951574j618766J781833K650439O67347j174208j021950K51455
$$ plain form
39591 -1398834 69394 2061720 2714169 110646 -4277415 -5667979 -1915421 2857465
39583 2857465 3499831 641808 -1231444 -712819 -129661 -158342 1348447 4596761 6286735
39574 6286735 4291215 451568 -2813853 -5512149 -7941431 -8606336 -6654514 -4090382
39566 -4090382 -3055811 -2613485 -705072 1967042 2572014 122029 -3335167 -5362930
39558 -5362930 -5307071 -3845126 -1825974 76962 1401557 2010836 2051619 1843888 1694761
39549 1694761 1471417 701265 -242223 222110 2593692 4222188 1828557 -3695551 -7454786
39540 -7454786 -6336116 -2295446 1216105 3503683 5439252 6448448 5504411 3803167
39532 3803167 3726537 5697308 8058904 9251416 8216384 3970414 -2569976 -7319582
$$ packed form
39591a398834J468228J992326O52449k603523m388061j390564L752558M772886
39583B857465O42366k858023j873252N18625N83158k8681J506789L248314J689974
39574F286735j995520l839647l265421k698296k429282o64905J951822K564132
39566d090382J034571M42326J908413K672114O04972k449985l457196k027763
39558e362930N5859J461945K019152J902936J324595O09279M0783k07731j49127
39549A694761k23344p70152r43488M64333K371582J628496k393631n524108l759235
39540g454786J118670M040670L511551K287578J935569J009196r44037j701244
39532C803167p6630J970771K361596J192512j035032m245970o540390m749606
$$ plain form
39524 -7319582 -6715070 -2415321 640369 685965 296912 867101 -85943 -4376041 -9286923
39515 -9286923 -10902625 -9019084 -6057931 -2913186 1044861 4864186 6213777 4858888
39507 4858888 3321820 3426179 4190430 3963274 2968710 2592369 3193204 3716758 2981566
39498 2981566 673071 -2482620 -5016892 -5667205 -4572579 -3226516 -2904653 -3487333 -4006365
39489 -4006365 -3695352 -2142378 721028 3962299 5717403 5142016 3958125 4695548 7399593
39480 7399593 9570969 9712962 9207418 9580419 9499269 6531936 1269607 -2576241 -2646157
39471 -2646157 -809914 -695332 -3431429 -6773850 -7842837 -5973147 -3118948 -1781386
39463 -1781386 -2326813 -2550428 -514936 2684052 4357802 4135204 4327660 5925653 6654089
$$ packed form
39524g319582O04512M299749L055690M5596l89053N70189r53044m290098m910882
39515i286923j615702J883541K961153L144745L958047L819325J349591j354889
39507D858888j537068J04359P64251k27156r94564l76341O00835N23554p35192
39498B981566k308495l155691k534272o50313J094626J346063L21863n82680n19032
39489d006365L11013J552974K863406L241271J755104n75387j183891P37423K704045
39480G399593K171376J41993n05544L73001q1150k967333n262329l845848o9916
39471b646157J836243J14582k736097l342421j068987J869690K854199J337562
39463a781386n45427k23615K035492L198988J673750k22598J92456J597993P28436
$$ plain form
39454 6654089 4475172 886476 -1474212 -2912011 -5640085 -9457322 -11273546 -9041163
39446 -9041163 -4008008 1032541 3885756 3638997 1454850 563614 2995679 6286066
39438 6286066 6189541 2852813 858447 2205841 3178595 497120 -3009765 -2472301 1760987
39429 1760987 5063108 5362719 4767219 4746886 4032997 2181025 1465562 3381900 5935340
39420 5935340 6481417 5441493 5153062 6143303 6430733 4165533 -280280 -4730287 -7094223
39411 -7094223 -7106027 -6414189 -6518697 -6827557 -5743969 -3397590 -1611515 -962957 81356
39402 81356 2233314 3616909 2495983 176728 -770108 -155541 -19744 -1453012 -3587396
39393 -3587396 -5483363 -6991856 -7635877 -6659042 -4839742 -4562002 -7036933 -10590390 -12674925
$$ packed form
39454F654089k178917l588696k360688j437799k728074l817237j816224K232383
39446i041163N033155N040549K853215k46759k184147q91236K432065L290387
39438F286066r6525l336728j994366J347394R72754k681475l506885N37464M233288
39429A760987L302121K99611n95500k0333p13889j851972p15463J916338K553440
39420E935340N46077j039924k88431R90241K87430k265200m445813m450007k363936
39411g094223j1804O91838j04508l08860J083588K346379J786075O48558J044313
39402H1356K151958J383595j120926k319255r46836O14567J35797j433268k134384
39393c587396j895967j508493o44021R76835J819300K77740k474931l553457k084535
$$ plain form
39384 -12674925 -12569559 -10978498 -7973531 -3243046 1603613 2994345 -899128 -7155636
39376 -7155636 -10407079 -8387879 -4048603 -1726137 -2481212 -4225698 -5218384 -5504265 -5339975
39367 -5339975 -4515750 -3819537 -5151609 -8897365 -12478784 -12812167 -9429833 -4381357 -144448
39358 -144448 1556003 393094 -1656381 -1359805 2123521 5708097 6174225 4256671 2876675
39349 2876675 2582097 1574855 -429532 -1598668 -1306379 -925382 -741296 868862 4124539
39340 4124539 6555640 6482450 5289529 4673390 4045969 2505833 1077185 777007 451152
39331 451152 -1043125 -2213585 -1113305 1202932 2083091 1120296 -26364 -768088 -1830522
39322 -1830522 -3006981 -3373894 -3238785 -3145695 -1538978 3283460 8950409 10386081 6301985
$$ packed form
39384a2674925J05366J591061L004967M730485M846659J390732l893473o256508
39376g155636l251443K019200M339276K322466p55075j744486r92686k85881J64290
39367e339975Q24225O96213j332072l745756l581419l33383L382334N048476M236909
39358a44448J700451j162909k049475K96576L483326L584576M66128j917554j379996
39349B876675k94578j007242k004387j169136K92289L80997J84086J610158L255677
39340D124539K431101p3190j192921o16139o27421j540136j428648l00178l25855
39331D51152j494277j170460J100280K316237Q80159r62795j146660p41724j062434
39322a830522j176459l66913J35109R3090J606717M822438N666949J435672m084096
$$ plain form
39313 6301985 1149295 -685435 253814 1008070 832210 1011754 1909500 2532436 2094552
39304 2094552 388537 -2484561 -5523621 -7095800 -6985191 -6934824 -7959423 -8574040 -7208451
39295 -7208451 -5023894 -4517289 -6255894 -8603528 -9798527 -8848374 -5507965 -1118081
39287 -1118081 1620667 1680484 1558536 3972912 7616565 8723591 6320571 3166089 1572672
39278 1572672 1191970 1347237 2533865 4373550 4720940 2656331 428612 436520 1763453
39269 1763453 1857807 608040 327771 1957134 3637695 3687478 3188393 4357680 7245666
39260 7245666 9415410 8861860 6215938 3587466 1919127 430796 -1423045 -2637692
39252 -2637692 -2042617 -260459 829431 420952 -425074 -417003 415216 1106724 1047704 526465
$$ packed form
39313F301985n152690j834730R39249P54256j75860J79544Q97746O22936m37884
39304B094552j706015k873098l039060j572179J10609N0367j024599o14617J365589
39295g208451K184557N06605j738605k347634j194999R50153L340409M389884
39287a118081K738748N9817j21948K414376L643653J107026k403020l154482j593417
39278A572672l80702J55267J186628J839685L47390k064609k227719P908J326933
39269A763453R4354j249767k80269J629363J680561M9783m99085J169287K887986
39260G245666K169744n53550k645922k628472j668339j488331j853841j214647
39252b637692N95075J782158J089890m08479q46026Q071Q32219O91508n9020n21239
$$ plain form
39242 526465 342869 1021569 2098527 2254062 589660 -2303361 -4932943 -6291023 -6191451
39233 -6191451 -4805814 -2784002 -1381642 -1299241 -1703993 -1670386 -2128563 -4497157 -7487316
39224 -7487316 -7753417 -4592065 -1620983 -2094752 -4441257 -4693242 -2089129 372907 570270
39215 570270 -136019 579010 2854093 4891605 5039750 2826479 -1035164 -4806092 -6574110
39206 -6574110 -5768561 -3586846 -1604154 -384021 346039 862031 1331372 2025147 2969521
39197 2969521 3533583 2841147 603842 -2625185 -5859964 -8174361 -9053199 -8588258 -7280024
39188 -7280024 -5506315 -3331717 -964046 887344 1464233 687000 -856261 -2547738
39180 -2547738 -4002979 -4805730 -4672881 -4229969 -4965976 -7563269 -10465930 -11045404 -8363126
$$ packed form
39242E26465j83596O78700J076958J55535j664402k893021k629582j358080R9572
39233f191451J385637K021812J402360Q2401m04752L3607m58177k368594k990159
39224g487316k66101L161352K971082m73769k346505k51985K604113K462036J97363
39215E70270p06289P15029K275083K037512J48145k213271l861643l770928j768018
39206f574110Q05549K181715J982692J220133P30060N15992M69341O93775R44374
39197B969521N64062o92436k237305l229027l234779k314397q78838M64941J308234
39188g280024J773709K174598K367671J851390N76889p77233j543261j691477
39180b547738j455241q02751J32849M42912p36007k597293k902661n79474K682278
$$ plain form
39171 -8363126 -4004156 -79654 2468959 3219494 1592170 -1707864 -3728000 -1852554
39163 -1852554 2900028 7017189 8775358 9306473 9372081 7834587 4460306 1667996 1439472
39154 1439472 2327154 1830295 322635 10890 947816 1021411 -304298 -1126519 -375602
39145 -375602 673745 928898 1094583 1694790 1799453 1228247 1906993 4958251 7985629
39136 7985629 7617032 3925890 133234 -1566577 -1697111 -1302825 -526400 103493 -849612
39127 -849612 -3763278 -6893688 -8479804 -8854471 -9262370 -9471689 -8077648 -4893614 -1617097
39118 -1617097 152373 624560 1251998 3153280 6317789 9611012 11168261 9575241
39110 9575241 5488324 1676080 467308 1136576 763603 -1952501 -4646554 -3951322 233528
$$ packed form
39171h363126M358970L924502K548613P50535j627324l300034k020136J875446
39163a852554M752582M117161J758169N31115O5608j537494l374281k792310k28524
39154A439472Q87682m96859j507660l11745R36926P3595j325709q22221P50917
39145c75602J049347K55153J65685O00207J04663n71206O78746L051258L027378
39136G985629l68597l691142l792656j699811j30534L94286P76425O29893r53105
39127h49612k913666l130410j586116l74667m07899k09319J394041L184034L276517
39118a617097J769470M72187O27438J901282L164509L293223J557249j593020
39110I575241m086917l812244j208772O69268l72973k716104k694053O95232M184850
$$ plain form
39101 233528 4303926 4982536 2749555 583857 150605 551731 702577 1336721 3683129
39092 3683129 7081300 9321749 9244875 7768697 6101488 4142335 1342917 -1827116
39084 -1827116 -4334091 -5966003 -7228516 -8211120 -8649852 -8900585 -9566420 -10020723 -8604452
39075 -8604452 -4877901 -718060 1511025 1237360 -343852 -1815222 -2451197 -2308395 -2206527
39066 -2206527 -3182447 -5225727 -6795616 -6167604 -3178013 568259 2986408 3101311 1970532
39057 1970532 1880597 3698705 5316113 4322389 2120508 2831588 7126695 9963204 6783120
39048 6783120 -213319 -5022142 -5528884 -4624356 -4376981 -3332627 -401262 2371670 2812787
39039 2812787 1686042 763890 -1593 -1344074 -2568453 -2836994 -3225853 -5153574 -7546551
$$ packed form
39101B33528M070398O78610k232981k165698m33252M01126J50846O34144K346408
39092C683129L398171K240449p6874j476178j667209j959153k799418l170033
39084a827116k506975j631912j262513r82604m38732k50733o65835m54303J416271
39075h604452L726551M159841K229085k73665j581212j471370o35975J42802J01868
39066b206527r75920k043280j569889O28012K989591L746272K418149J14903j130779
39057A970532q9935J818108J617408r93724k201881P11080M295107K836509l180084
39048F783120o996439m808823n06742R04528K47375J044354K931365K772932M41117
39039B812787j126745r22152p65483j342481j224379k68541l88859j927721k392977
$$ plain form
39030 -7546551 -7807595 -5370791 -2474033 -1409326 -2399431 -4096863 -4879832 -3682632 -760588
39021 -760588 2163881 3311989 2483171 820205 -684910 -1788925 -2560756 -3213162 -4105355
39012 -4105355 -5158767 -5530075 -4564253 -2822684 -1532036 -1235687 -1480692 -1577812 -1358259
39003 -1358259 -1524720 -3220678 -6421547 -8848572 -7963681 -4370831 -1446109 -879467 -705887
38994 -705887 944042 2538939 1904050 311466 744957 3192824 4868787 4605306 3818317
38985 3818317 3196421 1775529 -147960 -393998 1669346 3819719 4416255 4600537 5575737
38976 5575737 6184991 5148214 3528338 2664809 1466645 -1528401 -4607245 -4408605 -814599
38967 -814599 2271256 1485927 -2537844 -6687639 -8559959 -7442385 -3842676 418990
$$ packed form
39030g546551k61044K436804K896758J064707r90105j697432p82969J197200K922044
39021g60588K924469J148108q28818j662966j505115j104015p71831o52406q92193
39012d105355j053412l71308R65822J741569J290648K96349k45005r7120K19553
39003a358259j66461j695958l200869k427025Q84891L592850K924722N66642J73580
38994g05887J649929J594897o34889j592584M33491K447867J675963k63481p86989
38985C818317o21896j420892j923489k46038K063344K150373N96536J84282R75200
38976E575737O09254j036777j619876q63529j198164k995046l078844J98640L594006
38967h14599L085855p85329m023771m149795j872320J117574L599709M261666
$$ plain form
38959 418990 2371382 -136590 -6062823 -11557175 -13519464 -12584141 -11789000 -12325722 -11931438
38950 -11931438 -8361426 -3251379 -734633 -2533534 -6220396 -8475266 -8268392 -6323561
38942 -6323561 -3286182 387148 3891900 6568077 8299028 8943668 8345373 7239960
38934 7239960 6755952 6470179 4614722 1043408 -1891948 -2721239 -3157617 -5068767 -6798103
38925 -6798103 -5101624 33537 5041689 7086869 6562330 5262309 4140892 3429101
38917 3429101 3454136 4564274 6755210 9291797 10315288 7880811 2635159 -1578591
38909 -1578591 -1617834 1123184 2680859 1673456 206932 47072 582011 826768 806229
38900 806229 249356 -1590825 -3739208 -3419773 327959 4703497 6269651 4608528 1674046
$$ packed form
38959D18990J952392k507972n926233n494352j962289R35323P95141n36722L94284
38950a1931438L570012N110047K516746j798901l686862k254870K06874J944831
38942f323561L037379L673330L504752K676177J730951O44640n98295j105413
38934G239960m84008k85773j855457l571314k935356q29291m36378j911150j729336
38925f798103J696479N135161N008152K045180n24539j300021j121417p11791
38917C429101K5035J110138K190936K536587J023491k434477n245652m213750
38909a578591l9243K741018J557675j007403j466524j59860N34939K44757k0539
38900H06229n56873j840181k148383L19435L747732M375538J566154j661123k934482
$$ plain form
38891 1674046 -900425 -2380305 -2274233 -890207 285295 162598 -741570 -1682856 -3107688
$$ packed form
38891A674046k574471j479880J06072J384026J175502j22697r04168r41286j424832
$$ [...]
##END NTUPLES=NMR SPECTRUM
##END=
