##TITLE=31Pdec_DE-82K_TFA
 CDCl3, 64 sc
 27.3.2025
##JCAMPDX= 6.0         $$ Bruker NMR JCAMP-DX V2.0
##DATA TYPE= NMR SPECTRUM
##DATA CLASS= NTUPLES
##ORIGIN= UXNMR, Bruker Analytische Messtechnik GmbH
##OWNER= root
$$ XWIN-NMR		Version 3.5
$$ Thu Mar 27 16:23:48 2025 Russian Standard Time (UT+4h)  she@DPX200
##.OBSERVE FREQUENCY= 81.013821
##.OBSERVE NUCLEUS= ^31P
##.ACQUISITION MODE= SIMULTANEOUS
##.ACQUISITION SCHEME= undefined
##.AVERAGES= 64
##.DIGITISER RES= 17
##SPECTROMETER/DATA SYSTEM= spect
##.PULSE SEQUENCE= zgpg30
##.SOLVENT NAME= D2O
##.SHIFT REFERENCE= (INTERNAL, D2O, 0, 198.062)
##AUDIT TRAIL= $$ (NUMBER, WHEN, WHO, WHERE, WHAT)
$$ ##TITLE= Audit trail, XWIN-NMR		Version 3.5
$$ ##JCAMPDX= 5.01
$$ ##ORIGIN= Bruker BioSpin GmbH
$$ ##OWNER= she
$$ F:/spectra/data/she/nmr/P31/2/pdata/1/auditp.txt
$$ ##AUDIT TRAIL=  $$ (NUMBER, WHEN, WHO, WHERE, WHAT)
(   1,<2025-03-27 16:22:37.92 +0400>,<she>,<DPX200>,
      <created by zg, POWCHK disabled, PULCHK disabled
       configuration hash MD5:
       00 E9 B6 7A A2 85 ED C7 34 08 36 98 17 FE 4E 26
       data hash MD5: 32K
       5B 4E A3 30 A5 8E C4 AD 8A 64 2C 97 B7 93 85 64>)
(   2,<2025-03-27 16:22:40.48 +0400>,<she>,<DPX200>,
      <Start of raw data processing
       efp BC_mod = 2 LB = 1.5 FT_mod = 6 PKNL = 1 PHC0 = 1423.515 PHC1 = 9.094223 SI = 64K 
       data hash MD5: 64K
       E3 A9 AE 9C 83 F8 09 F5 FE 66 E7 A7 91 D6 CB F1>)
(   3,<2025-03-27 16:23:01.34 +0400>,<she>,<DPX200>,
      <pk PHC0 = 1.896168 PHC1 = 32.2 
       data hash MD5: 64K
       23 DF F3 15 08 3F CE 1F DC 3E 60 52 C1 19 AA F3>)
(   4,<2025-03-27 16:23:07.10 +0400>,<she>,<DPX200>,
      <abs ABSG = 5 
       data hash MD5: 64K
       81 A8 C2 1F F0 DA 3C CC A5 7D F5 DE 0B 95 F3 DF>)
$$ ##END=
$$ 
$$ hash MD5
$$ 1E 85 D9 CE 04 2B 5D 6C 2B BB 17 C7 FC 82 6C 56
##$RELAX= 
##$RELAX= 
##$RELAX= 
##$RELAX= 
##$RELAX= 
##$RELAX= 
##$RELAX= 
##$RELAX= 
$$ Bruker specific parameters
$$ --------------------------
##$DU= <F:/spectra>
##$EXPNO= 2
##$NAME= <P31>
##$PROCNO= 1
##$TYPE= <nmr>
##$USER= <she>
##$AMP= (0..31)
100 100 100 100 100 100 100 100 100 100 100 100 100 100 100 100 100 100 
100 100 100 100 100 100 100 100 100 100 100 100 100 100 
##$AQSEQ= 0
##$AQ_mod= 1
##$AUNM= <au_zg>
##$AUTOPOS= <>
##$BF1= 81.014009
##$BF2= 200.13
##$BF3= 200.13
##$BF4= 200.13
##$BF5= 200.13
##$BF6= 200.13
##$BF7= 200.13
##$BF8= 200.13
##$BYTORDA= 1
##$CFDGTYP= 0
##$CFRGTYP= 5
##$CHEMSTR= <none>
##$CNST= (0..31)
1 1 145 1 1 1 1 1 1 1 1 1 1 1 1 1 1 1 1 1 1 1 1 1 1 1 1 1 1 1 1 1 
##$CPDPRG= <waltz16>
##$CPDPRG1= <>
##$CPDPRG2= <waltz16>
##$CPDPRG3= <>
##$CPDPRG4= <mlev>
##$CPDPRG5= <mlev>
##$CPDPRG6= <mlev>
##$CPDPRG7= <mlev>
##$CPDPRG8= <mlev>
##$CPDPRGB= <>
##$CPDPRGT= <>
##$D= (0..31)
0 1 0 0 0 0 0 0 0 0.06 0 0.03 2e-05 3e-06 0 0 0.0002 0 0 0 0 0 0 0 0 0 
0 0 0 0 0 0 
##$DATE= 1743078157
##$DBL= (0..7)
120 120 120 11 120 120 24 19 
##$DBP= (0..7)
150 150 150 150 150 150 150 150 
##$DBP07= 0
##$DBPNAM0= <>
##$DBPNAM1= <>
$$ [...]
##$SUBNAM3= <"">
##$SUBNAM4= <"">
##$SUBNAM5= <"">
##$SUBNAM6= <"">
##$SUBNAM7= <"">
##$SUBNAM8= <"">
##$SUBNAM9= <"">
##$SW= 400.765351723535
##$SWIBOX= (0..15)
0 1 3 0 0 0 0 0 0 0 0 0 0 0 0 0 
##$SW_h= 32467.5324675325
##$TD= 32768
##$TD0= 1
##$TE= 0
##$TE2= 300
##$TE3= 300
##$TEG= 300
##$TL= (0..7)
0 120 53 12 22 120 120 120 
##$TP= (0..7)
150 150 150 150 150 150 150 150 
##$TP07= 0
##$TPNAME0= <>
##$TPNAME1= <>
##$TPNAME2= <>
##$TPNAME3= <>
##$TPNAME4= <>
##$TPNAME5= <>
##$TPNAME6= <>
##$TPNAME7= <>
##$TPOAL= (0..7)
0.5 0.5 0.5 0.5 0.5 0.5 0.5 0.5 
##$TPOFFS= (0..7)
0 0 0 0 0 0 0 0 
##$TUNHIN= 0
##$TUNHOUT= 0
##$TUNXOUT= 0
##$USERA1= <user>
##$USERA2= <user>
##$USERA3= <user>
##$USERA4= <user>
##$USERA5= <user>
##$V9= 5
##$VALIST= <valist>
##$VCLIST= <CCCCCCCCCCCCCCC>
##$VD= 0
##$VDLIST= <DDDDDDDDDDDDDDD>
##$VPLIST= <PPPPPPPPPPPPPPP>
##$VTLIST= <TTTTTTTTTTTTTTT>
##$WBST= 1024
##$WBSW= 4
##$XGAIN= (0..3)
0 0 0 0 
##$XL= 0
##$YL= 0
##$YMAX_a= 10756
##$YMIN_a= -11926
##$ZGOPTNS= <>
##$ZL1= 120
##$ZL2= 120
##$ZL3= 120
##$ZL4= 120
##$ABSF1= 198.0616
##$ABSF2= -202.7028
##$ABSG= 5
##$ABSL= 3
##$ALPHA= 0
##$AQORDER= 0
##$ASSFAC= 0
##$ASSFACI= 0
##$ASSFACX= 0
##$ASSWID= 0
##$AUNMP= <proc_1d>
##$AZFE= 0.1
##$AZFW= 0.5
##$BCFW= 0
##$BC_mod= 2
##$BYTORDP= 0
##$COROFFS= 0
##$CY= -3
##$DATMOD= 1
##$DC= 0
##$DFILT= <>
##$DTYPP= 0
##$F1P= 0
##$F2P= 0
##$FCOR= 1
##$FTSIZE= 65536
##$FT_mod= 6
##$GAMMA= 0
##$GB= 0
##$INTBC= 1
##$INTSCL= 9.790993e-09
##$ISEN= 30
##$LB= 1.5
##$LEV0= 0
##$LPBIN= 0
##$MAXI= 10000
##$MC2= 0
##$MEAN= 0
##$ME_mod= 0
##$MI= 50
##$NCOEF= 0
##$NC_proc= -8
##$NLEV= 6
##$NOISF1= 182.463
##$NOISF2= 159.3651
##$NSP= 0
##$NTH_PI= 0
##$NZP= 0
##$OFFSET= 198.0616
##$PC= 4
##$PHC0= 1425.411
##$PHC1= 41.29422
##$PH_mod= 1
##$PKNL= yes
##$PPARMOD= 0
##$PSCAL= 0
##$PSIGN= 0
##$REVERSE= no
##$SF= 81.0140089999434
##$SI= 65536
##$SIGF1= 159.3651
##$SIGF2= -187.1042
##$SINO= 113.3802
##$SIOLD= 16384
##$SREGLST= <1H.CDCl3>
##$SSB= 0
##$STSI= 65536
##$STSR= 0
##$SW_p= 32467.5324675325
##$SYMM= 0
##$S_DEV= 0
##$TDeff= 32768
##$TDoff= 0
##$TI= <>
##$TILT= no
##$TM1= 0
##$TM2= 0
##$TOPLEV= 0
##$USERP1= <user>
##$USERP2= <user>
##$USERP3= <user>
##$USERP4= <user>
##$USERP5= <user>
##$WDW= 1
##$XDIM= 65536
##$YMAX_p= 440993458
##$YMIN_p= -107909071
$$ End of Bruker specific parameters
$$ ---------------------------------
##NTUPLES= NMR SPECTRUM
##VAR_NAME=  FREQUENCY,     SPECTRUM/REAL,   SPECTRUM/IMAG
##SYMBOL=    X,             R,               I
##VAR_TYPE=  INDEPENDENT,   DEPENDENT,       DEPENDENT
##VAR_FORM=  AFFN,          ASDF,            ASDF
##VAR_DIM=   65536,         65536,           65536
##UNITS=     HZ,            ARBITRARY UNITS, ARBITRARY UNITS
##FACTOR=    0.49542278885378, 1,            1
##FIRST=     16045.7642231865, 0,            0
##LAST=      -16421.768244346, 0,            0
##MIN=       -16421.768244346, -107909071,   0
##MAX=       16045.7642231865, 440993458,    0
$$ Real data points
##PAGE= N=1
##DATA TABLE= (X++(R..R)), XYDATA
$$ [...]
$$ plain form
44935 -2649925 -2920516 -2161355 -207082 2624716 5619039 6612396 3591010 -1256001 -2207442
44926 -2207442 2781111 8224415 7632257 1859834 -2570563 -2032053 1185442 3704916
44918 3704916 4784052 4738428 3335555 1222523 342400 1315824 2183953 1138025 -843483
44909 -843483 -1291010 801674 4266627 7193681 8241313 7128133 4622655 1957214
44901 1957214 34698 -731557 -160750 1527025 3445852 4489758 4048319 2300061 444288
44892 444288 650155 4412628 10287480 14612430 15386862 14004248 12197886 9367623 4767497
44883 4767497 203411 -2262011 -3732977 -6315868 -8582215 -7011028 -1822175 2479323
44875 2479323 3116020 2207813 2872571 5285557 7989062 10235357 11330592 10146428 7099295
$$ packed form
44935b649925k70591P59161J954273K831798K994323R93357l021386m847011r51441
44926b207442M988553N443304n92158n772423m430397N38510L217495K519474
44918C704916J079136m5624j402873k113032q80123R73424Q68129j045928j981508
44909h43483m47527K092684L464953K927054J047632j113180k505478k665441
44901A957214j922516p66255N70807J687775J918827J043906m41439j748258j855773
44892D44288K05867L762473N874852M324950P74432j382614j806362k830263m600126
44883D767497m564086k465422j470966k582891k266347J571187N188853M301498
44875B479323O36697r08207O64758K412986K703505K246295J095235j184164l047133
$$ plain form
44866 7099295 4511304 3389472 1974587 -922701 -3523007 -3989963 -3367686 -3143523 -2052016
44857 -2052016 1586411 5802312 6600777 3131142 -1548390 -4465879 -4864213 -2766012
44849 -2766012 1499079 5823222 6985795 3914843 -1207878 -5592941 -8158685 -9046990
44841 -9046990 -8639623 -7652806 -6780514 -5750880 -3961649 -2163210 -1905540 -3073534 -3831203
44832 -3831203 -3587999 -4081100 -6497194 -9281078 -10155276 -8885702 -6597818 -3654475 30062
44823 30062 3500683 5555248 6689249 8469270 10930209 12133116 10615482 7038931
44815 7038931 2985001 -828955 -4471670 -7543432 -8705467 -6627578 -1596431 3713165
44807 3713165 5750288 3218967 -1542643 -5083085 -6433634 -7234837 -8620243 -9499623
$$ packed form
44866G099295k587991j121832j414885k897288k600306m66956O22277K24163J091507
44857b052016L638427M215901P98465l469635m679532k917489l98334K098201
44849b766012M265091M324143J162573l070952n122721m385063k565744q88305
44841i046990M07367R86817Q72292J029634J789231J798439K57670j167994p57669
44832c831203K43204m93101k416094k783884q74198J269574K287884K943343L684537
44823C0062L470621K054565J134001J780021K460939J202907j517634l576551
44815G038931m053930l813956l642715l071762j162035K077889N031147N309596
44807C713165K037123k531321m761610l540442j350549q01203j385406q79380
$$ plain form
44799 -9499623 -8379408 -5662111 -3290155 -2688759 -3601587 -4522935 -4033659 -2264011 -1118516
44790 -1118516 -2262433 -4818238 -6122688 -4955959 -2680337 -724850 1441015 4767459
44782 4767459 8451369 10717516 10849314 9254841 6572761 4004731 3257626 4383899
44774 4383899 4792504 2494007 -594257 -947640 1692121 4429034 5710086 6522755 6962958
44765 6962958 5155532 851848 -2940741 -3778230 -2935709 -2972466 -4206667 -5447332 -6299456
44756 -6299456 -6676507 -5638390 -2864249 -25222 1280452 1757408 2657832 3084024 1299262
44747 1299262 -2135906 -4748166 -5234410 -4443999 -3822011 -4294713 -5893807 -7220403 -6528231
44738 -6528231 -4629265 -4745837 -7482736 -8303673 -3187744 5007312 9645084 8678738 5914202
$$ packed form
44799i499623J120215K717297K371956O01396r12828r21348M89276J769648J145495
44790a118516j143917k555805j304450J166729K275622J955487K165865L326444
44782D767459L683910K266147J31798j594473k682080k568030p47105J126273
44774D383899M08605k298497l088264l53383K639761K736913J281052Q12669M40203
44765F962958j807426m303684l792589q37489Q42521l6757j234201j240665q52124
44756f299456l77051J038117K774141K839027J305674M76956R00424M26192j784762
44747A299262l435168k612260m86244P90411O21988m72702j599094j326596O92172
44738f528231J898966j16572k736899q20937N115929Q195056M637772r66346k764536
$$ plain form
44729 5914202 4595280 4215542 3908639 4386302 5244742 4433620 2177755 1798182 4528065
44720 4528065 6795783 5159294 1124627 -1749082 -3245561 -5866381 -10227289 -14066211
44712 -14066211 -15330355 -14023298 -11297685 -8437222 -6524421 -5869213 -5931495 -6334666 -7201816
44703 -7201816 -8111995 -8012549 -6778268 -5445099 -4286808 -2369365 200115 1547803 695698
44694 695698 -962921 -2075253 -3116008 -4254683 -3748811 -663143 2737322 3825262
44686 3825262 3342116 3733400 5063527 5420702 4567326 4289307 5330656 6518900 6938640
44677 6938640 6698181 5465387 2522757 -1218844 -3184854 -1979706 866711 2574214
44669 2574214 1824173 -404841 -2138865 -2470175 -2451640 -3480931 -4929761 -4751943 -2743752
$$ packed form
44729E914202j318922l79738l06903M77663Q58440q11122k255865l79573K729883
44720D528065K267718j636489m034667k873709j496479k620820m360908l838922
44712a4066211j264144J307057K725613K860463J912801O55208o2282m03171q67150
44703g201816r10179R9446J234281J333169J158291J917443K569480J347688q52105
44694F95698j658619j112332j040755j138675N05872L085668L400465J087940
44686C825262m83146L91284J330127L57175q53376k78019J041349J188244M19740
44677F938640k40459j232794k942630l741601j966010J205148K846417J707503
44669B574214p50041k229014j734024l31310J8535j029291j448830J77818K008191
$$ plain form
44660 -2743752 -1271619 -1795573 -2745280 -2396436 -1800152 -2731651 -4496691 -5226980 -4890227
44651 -4890227 -4445376 -3379923 -973761 1091608 528616 -1818078 -3074910 -2611937 -2046453
44642 -2046453 -1477344 618238 3508443 3890425 515063 -3744730 -5504778 -4197423
44634 -4197423 -1203584 1760130 2756038 873320 -1713982 -1504963 1580883 3767782
44626 3767782 2659657 176551 -926521 -680022 -459684 -508590 -733204 -1722351 -3100297
44617 -3100297 -2868252 -204469 2885546 4263971 4031786 2800813 146845 -3176325
44609 -3176325 -4059556 -850679 3608586 5537450 5012680 4293083 3238243 158575 -3839434
44600 -3839434 -5454335 -4148972 -2855706 -3242684 -3712122 -3105475 -3111268 -5133163 -7286640
$$ packed form
44660b743752J472133n23954r49707L48844N96284r31499j765040p30289L36753
44651d890227M44851J065453K406162K065369n62992k346694j256832M62973N65484
44642b046453N69109K095582K890205L81982l375362m259793j760048J307355
44634d197423K993839K963714R95908j882718k587302K09019L085846K186899
44626C767782j108125k483106j103072K46499K20338m8906k24614r89147j377946
44617c100297K32045K663783L090015J378425k32185j230973k653968l323170
44609c176325q83231L208877M459265J928864n24770p19597j054840l079668l998009
44600c839434j614901J305363J293266l86978m69438O06647n793k021895k153477
$$ plain form
44591 -7286640 -6837870 -4098468 -1644881 -522907 573328 2451194 3730422 2815534
44583 2815534 467072 -720224 732478 3537948 5150771 4373026 2128668 234199
44575 234199 8858 1531714 3362376 3508817 1856602 1068487 3336272 6649331 6782397
44566 6782397 3293221 604128 1807693 4309449 3973363 1166658 -525518 -61170
44558 -61170 234821 -844818 -1631334 -869785 105892 -512729 -2847467 -6105039 -9536595
44549 -9536595 -11776731 -11151806 -7825452 -4195786 -2159982 -1289875 -486144 234113 798848
44540 798848 2242138 4904445 6495972 4197370 -1256706 -5332032 -4230030 1148825
44532 1148825 6301796 7740790 6048346 4415575 4621509 5171144 3779189 880104
$$ packed form
44591g286640M48770K739402K453587J121974J096235J877866J279228r14888
44583B815534k348462j187296J452702K805470J612823p77745k244358j894469
44575B34199k25341J522856J830662J46441j652215p88115K267785L313059J33066
44566F782397l489176k689093J203565K501756l36086k806705j692176M64348
44558f1170K95991j079639p86516P61549R75677o18621k334738l257572l431556
44549i536595k240136O24925L326354L629666K035804Q70107Q03731P20257N64735
44540G98848J443290K662307J591527k298602n454076m075326J102002N378855
44532A148825N152971J438994j692444j632771K05934N49635j391955k899085
$$ plain form
44524 880104 -717476 315594 1938823 1590454 -337985 -1320073 -311058 1156413 1519359
44515 1519359 1208444 1444621 2229641 2633895 2403815 2042779 1541105 390473 -872718
44506 -872718 -558169 1740652 3638322 2488930 -887558 -2832375 -1697084 -370493
44498 -370493 -2639641 -8107291 -12525030 -12949411 -10766801 -9059906 -8532644 -7447556 -4928014
44489 -4928014 -2571889 -2256830 -3547386 -4478546 -4459610 -4927949 -6777735 -8555162 -8323436
44480 -8323436 -6379148 -4622455 -3746150 -2814834 -1515487 -699735 -100648 2228068 6604111
44471 6604111 9612126 7684226 2072623 -2148059 -2102892 59212 967051 492257 766285
44462 766285 2031134 1794324 -1591712 -6208678 -8568576 -7591527 -5369023 -4182879 -4177853
$$ packed form
44524H80104j597580J033070J623229l48369j928439r82088J009015J467471L62946
44515A519359l10915K36177P85020M04254k30080l61036n01674j150632j263191
44506h72718L14549K298821J897670j149392l376488j944817J135291J326591
44498c70493k269148n467650m417739m24381K182610J706895N27262J085088K519542
44489d928014K356125L15059j290556r31160J8936m68339j849786j777427K31726
44480h323436J944288J756693Q76305R31316J299347Q15752N99087K328716M376043
44471F604111L008015j927900n611603m220682M5167K162104R07839m74794K74028
44462G66285J264849k36810l386036m616966k359898R77049K222504J186144N026
$$ plain form
44453 -4177853 -4449254 -5024842 -6450808 -8180026 -8947294 -8559503 -7888466 -7156748 -5792157
44444 -5792157 -4161395 -3752685 -5020202 -6524347 -6972371 -6809599 -7060061 -7906127 -9135571
44435 -9135571 -10559966 -11241165 -10019467 -7819603 -7457398 -9614890 -10956224 -8335900
44427 -8335900 -3253858 244472 710023 -276864 -1508306 -2747460 -2586556 658342 5449076
44418 5449076 7568741 5236065 1305206 -608509 -94391 870621 694357 -902642 -3019939
44409 -3019939 -3780022 -2024916 606011 1222613 -111494 -152114 2459839 4610392 3163711
44400 3163711 -401088 -2563418 -3268593 -5490387 -9772899 -12539388 -10739388 -5929623
44392 -5929623 -2415344 -2562475 -5081329 -7250829 -7736386 -7177040 -6645934 -6109742 -4652022
$$ packed form
44453d177853k71401n75588j425966j729218p67268L87791O71037P31718J364591
44444e792157J630762M08710j267517j504145m48024J62772k50462q46066j229444
44435i135571j424395o81199J221698K199864L62205k157492j341334K620324
44427h335900N082042L498330M65551r86887j231442j239154J60904L244898M790734
44418E449076K119665k332676l930859j913715N14118R65012j76264j596999k117297
44409c019939p60083J755106K630927O16602j334107m0620K611953K150553j446681
44400C163711l564799k162330p05175k221794m282512k766489J800000M809765
44392e929623L514279j47131k518854k169500m85557N59346N31106N36192J457720
$$ plain form
44383 -4652022 -1910475 1314847 3832295 4711291 3232109 -542143 -4560620 -5479039
44375 -5479039 -2012793 2859421 4444482 1262124 -3487393 -5610253 -4299046 -2349726
44367 -2349726 -2486182 -4279839 -5074542 -3548032 -1454899 -1405618 -3589368 -5601634 -5328963
44358 -5328963 -3126289 -1087810 -901538 -2508243 -4219231 -4104019 -1880418 579368
44350 579368 1187689 -124552 -1770444 -2631417 -2738833 -2212253 -964895 465335 1050941
44341 1050941 351995 -1538759 -4659641 -8190315 -9367610 -5955153 -110838 2909445
44333 2909445 977759 -2383624 -3021480 -1165880 545286 1614703 3220224 4600647
44325 4600647 3354491 -623739 -4251861 -4972629 -3477019 -2118239 -2192607 -3546895 -5612146
$$ packed form
44383d652022K741547L225322K517448Q78996j479182l774252m018477r18419
44375e479039L466246M872214J585061l182358m749517k122860J311207J949320
44367b349726j36456j793657p94703J526510K093133M9281k183750k012266K72671
44358e328963K202674K038479J86272j606705j710988J15212K223601K459786
44350E79368O08321j312241j645892q60973j07416N26580J247358J430230N85606
44341A050941o98946j890754l120882l530674j177295L412457N844315L020283
44333B909445j931686l361383o37856J855600J711166J069417J605521J380423
44325D600647j246156l978230l628122p20768J495610J358780p4368j354288k065251
$$ plain form
44316 -5612146 -7747167 -9048840 -8699763 -6695235 -4018670 -1842978 -444412 704003
44308 704003 1408674 200494 -3391219 -6676391 -6110945 -1932139 1864587 2801521 2490710
44299 2490710 2666972 1723482 -2146548 -6711673 -8037756 -5790957 -2868881 -582177
44291 -582177 2224815 5459741 6946559 6116153 5364824 6455772 8111000 8463194 7560667
44282 7560667 6022145 3477125 204421 -1549325 -96482 3016916 4909925 5065765
44274 5065765 5054935 5160504 3747062 450736 -2056184 -871085 3411685 7022425 6963663
44265 6963663 3850468 781121 153299 1996955 4773217 6853367 7264218 5947835
44257 5947835 3776961 1902630 895074 863165 2036367 4106557 5172982 3156304
$$ packed form
44316e612146k135021j301673L49077K004528K676565K175692J398566J148415
44308G04003P04671j208180l591713l285172N65446M178806L796726R36934l10811
44299B490710J76262r43490l870030m565125j326083K246799K922076K286704
44291e82177K806992L234926J486818q30406p51329J090948J655228L52194r02527
44282G560667j538522k545020l272704j753746J452843L113398J893009J55840
44274E065765j0830J05569j413442l296326k506920J185099M282770L610740n8762
44265F963663l113195l069347o27822J843656K776262K080150M10851j316383
44257E947835k170874j874331j007556l1909J173202K070190J066425k016678
$$ plain form
44249 3156304 -1118149 -4053215 -3605763 -1749118 -1151986 -1266436 28636 2403736 3641435
44240 3641435 3493252 3812595 4784547 4152531 1080816 -1870298 -2004527 246110 2668225
44231 2668225 4222066 5182327 5555607 4889170 3180099 1117889 -229979 123987 2006074
44222 2006074 3450394 2571571 287126 -540386 828122 1794132 335063 -1818685 -1611556
44213 -1611556 1203659 4337481 6364622 7619658 7999806 6164753 1735603 -3058103
44205 -3058103 -5070217 -3339582 58676 2286226 2571684 2526760 3781945 6015831 7829602
44196 7829602 8867081 9936889 11257868 11876118 11115419 9636367 8675781 8858590 9833566
44187 9833566 10433441 9364480 6588280 3800714 2630229 2796721 3176214 3937257 5835987
$$ packed form
44249C156304m274453k935066M47452J856645N97132j14450J295072K375100J237699
44240C641435j48183L19343R71952o32016l071715k951114j34229K250637K422115
44231B668225J553841R60261L73280o66437j709071k062210j347868L53966J882087
44222B006074J444320q78823k284445q27512J368508R66010j459069k153748K07129
44213a611556K815215L133822K027141J255036L80148j835053m429150m793706
44205c058103k012114J730635L398258K227550K85458m4924J255185K233886J813771
44196G829602J037479J069808J320979O18250p60699j479052r60586J82809R74976
44187I833566N99875j068961k776200k787566j170485J66492L79493P61043J898730
$$ plain form
44178 5835987 7927961 8211557 6401239 3744921 279885 -4721774 -9226800 -8999193
44170 -8999193 -3360827 2678517 4282706 2276919 504673 314081 711920 1831758
44162 1831758 4365522 6475530 5120263 655210 -2998727 -3362812 -2026631 -1555853
44154 -1555853 -2047461 -1872885 -221277 2276024 4519806 5703860 5688096 5131158 4945518
44145 4945518 5522518 6687072 7998766 8658027 7775736 5504687 3349010 2596113 3049141
44136 3049141 3991415 5470767 7617997 9578377 10276120 9486118 7203601 3164072 -1644682
44127 -1644682 -4359089 -3197035 -256104 747887 -873747 -2368350 -1533758 752866
44119 752866 1988616 519729 -3256510 -6833107 -7250392 -4247074 -996182 -119430 -189217
$$ packed form
44178E835987K091974K83596j810318k656318l465036n001659m505026K27607
44170h999193N638366O039344J604189k005787j772246j90592L97839J119838
44162A831758K533764K110008j355267m465053l653937l64085J336181M70778
44154a555853m91608J74576J651608K497301K243782J184054j5764n56938j85640
44145D945518N77000J164554J311694O59261q82291k271049k155677p52897M53028
44136C049141R42274J479352K147230J960380O97743p90002k282517m039529m808754
44127a644682k714407J162054K940931J003991j621634j494603Q34592K286624
44119G52866J235750j468887l776239l576597m17285L003318L250892Q76752o9787
$$ plain form
44110 -189217 1528885 4172435 4464096 2290561 1247283 2941154 4322557 2207240
44102 2207240 -2497502 -6975102 -10474093 -13857509 -16837120 -17910251 -16309283 -12507285
44094 -12507285 -7458962 -2456064 989852 2104989 1213967 -1165095 -4565486 -7621825
44086 -7621825 -8337531 -6095203 -2358972 1059683 3212406 3311904 707491 -3609223 -7140006
44077 -7140006 -8547969 -8874874 -9420395 -10034130 -10299241 -10551250 -10598284 -9229687 -6297894
44068 -6297894 -3550041 -2002745 -331900 2453298 4620698 4202427 2384727 1934694
44060 1934694 3197893 4138403 3842768 3558812 4202927 4827467 3966652 1283027 -2194449
44051 -2194449 -4595527 -4395715 -2104962 -269727 -823306 -3090153 -5242736 -6545716
$$ packed form
44110a89217J718102K643550K91661k173535j043278J693871J381403k115317
44102B207240m704742m477600l498991l383416k979611j073131J600968L801998
44094a2507285N048323N002898L445916J115137q91022k379062l400391l056339
44086g621825p15706K242328L736231L418655K152723R9498k604413m316714l530783
44077g140006j407963l26905n45521o13735k65111k52009m7034J368597K931793
44068f297894K747853J547296J670845K785198K167400m18271j817700m50033
44060A934694J263199R40510k95635k83956O44115O24540q60815k683625l477476
44051b194449k401078J99812K290753J835235n53579k266847k152583j302980
$$ plain form
44043 -6545716 -6959398 -6003830 -3845521 -2242436 -2308740 -2501277 -1187141 -19857 -1756186
44034 -1756186 -5451495 -7291404 -6165283 -4793074 -4679370 -3690141 -245549 3416244
44026 3416244 4496253 3536742 2529383 1416697 -490619 -1406076 893839 4546421
44018 4546421 4887353 823163 -3294021 -3391830 -523242 1814151 2811724 4091823 5724856
44009 5724856 5802208 4077496 3098335 4550844 6638637 6691112 4795931 3018555 2240446
44000 2240446 1969293 2565961 5071865 8611014 10280445 8471780 4649047 1123960
43992 1123960 -1323463 -2851445 -3293703 -2650852 -1594215 -518817 765727 1827774
43984 1827774 1731539 1046020 1610289 3154151 2647150 -1037621 -4234231 -2994620 1433487
$$ packed form
44043f545716m13682R55568K158309J603085o6304j92537J314136J167284j736329
44034a756186l695309j839909J126121J372209J13704R89229L444592L661793
44026C416244J080009r59511j007359j112686j907316r15457K299915L652582
44018D546421L40932m064190m117184r7809K868588K337393R97573J280099J633033
44009E724856P7352j724712r79161J452509K087793N2475j895181j777376p78109
44000B240446k71153N96668K505904L539149J669431j808665l822733l525087
43992A123960k447423j527982m42258O42851J056637J075398J284544J062047
43984A827774r6235o85519N64269J543862n07001l684771l196610J239611M428107
$$ plain form
43975 1433487 4749089 5603441 5830971 5823432 4015330 1059797 276808 2749466 5414461
43966 5414461 5551155 4281828 3952309 4552402 4619955 3768128 2529975 1098334 -444441
43957 -444441 -1878531 -3567686 -5801601 -6934947 -4536209 619142 4253043 3770738
43949 3770738 1294845 -178606 -947491 -2474354 -3600583 -2262648 472733 1500819
43941 1500819 144922 -1516516 -2411974 -3564930 -5287475 -6014517 -4572817 -1562566
43933 -1562566 2009667 5591800 8064180 7718435 4312152 139009 -1808443 -561583
43925 -561583 1833344 1849020 -2071379 -6886483 -7155939 -1301028 5696217 7820171 4968339
43916 4968339 1891492 1421277 2208004 2868071 4419091 7521608 10628842 12548401 14193666
$$ packed form
43975A433487L315602Q54352K27530p539j808102k955533p82989K472658K664995
43966E414461J36694j269327l29519O00093O7553q51827j238153j431641j542775
43957d44441j434090j689155k233915j133346K398738N155351L633901m82305
43949C770738k475893j473451p68885j526863j126229J337935K735381J028086
43941A500819j355897j661438q95458j152956j722545p27042J441700L010251
43933a562566L572233L582133K472380l45745l406283m173143j947452J246860
43925e61583K394927J5676l920399m815104k69456N854911O997245K123954k851832
43916D968339l076847m70215P86727O60067J551020L102517L107234J919559J645265
$$ plain form
43907 14193666 16047104 16277624 13373882 8678996 4376695 876390 -1717918 -1584069
43899 -1584069 2457852 7749579 9954668 8033743 4593931 1717065 -840701 -3298329
43891 -3298329 -4599269 -4375954 -3867702 -3782546 -3161698 -1554581 -463080 -968470 -1405728
43882 -1405728 501668 3995123 6001378 5364059 4120912 3966223 3550572 828056 -3379354
43873 -3379354 -6363084 -7553887 -9081811 -11769170 -13003360 -10385438 -5825891 -3473599
43865 -3473599 -4202061 -4876082 -3327638 -1289820 -1207040 -2593938 -3593079 -4309587 -5909823
43856 -5909823 -7291388 -5602900 -451679 4643916 5846846 2656640 -2448244 -6517372
43848 -6517372 -7742979 -6148738 -3628789 -2220282 -1682486 -49752 2798564 3943791
$$ packed form
43907A4193666J853438K30520k903742m694886m302301l500305k594308J33849
43899a584069M041921N291727K205089j920925l439812k876866k557766k457628
43891c298329j300940K23315N08252Q5156O20848J607117J091501n05390m37258
43882a405728J907396L493455K006255o37319j243147j54689m15651k722516m207410
43873c379354k983730j190803j527924k687359j234190K617922M559547K352292
43865c473599p28462o74021J548444K037818Q2780j386898r99141p16508j600236
43856e909823j381565J688488N151221N095595J202930l190206n104884m069128
43848f517372j225607J594241K519949J408507N37796J632734K848316J145227
$$ plain form
43840 3943791 1240517 -3252493 -5674959 -5112871 -3648563 -2473965 -902504 674927
43832 674927 182284 -2328636 -3061459 780618 6330109 8046760 4712404 604567 -353311
43823 -353311 1227753 2742700 3618713 4765413 5688505 4754454 2028897 -325641 -955794
43814 -955794 -1063731 -2419941 -4605721 -5266964 -2900161 1312662 4636709 5520708 4917905
43805 4917905 4716011 5225367 5113549 3987963 3664243 5574517 7798584 6724807 1862861
43796 1862861 -2904099 -3767752 -1188844 1582739 2868322 3610615 4729157 5614440 5620132
43787 5620132 5235838 4791637 3323173 162560 -2994027 -3257664 -30789 3915509 5542445
43778 5542445 4927106 4637525 6212011 8538262 9945353 10604759 11770257 13287229 13348509
$$ packed form
43840C943791k703274m493010k422466N62088J464308J174598J571461J577431
43832F74927m92643k510920p32823L842077N549491J716651l334356m107837r57878
43823c53311J581064J514947Q76013J146700R23092r34051k725557k354538o30153
43814i55794j07937j356210k185780o61243K366803M212823L324047Q83999o02803
43805D917905k01894N09356j11818j125586l23720J910274K224067j073777m861946
43796A862861m766960q63653K578908K771583J285583P42293J118542Q85283N692
43787E620132l84294m44201j468464l160613l156587k63637L226875L946298J626936
43778E542445o15339k89581J574486K326251J407091O59406J165498J516972O1280
$$ plain form
43769 13348509 11018979 7879806 6390611 7178273 8724374 9479429 9467640 9610644 10031906
43760 10031906 9615477 7392120 4053711 1494445 560051 -130944 -2243169 -4889934
43752 -4889934 -5101394 -1628521 2893988 4624330 2703817 -241739 -1294188 175224
43744 175224 2765994 4543288 4152470 1644691 -1328605 -2869865 -2624255 -1540227 39587
43735 39587 2708042 5962637 7346601 4997755 407138 -2733500 -2410182 -130365 1041782
43726 1041782 -494231 -3758693 -6269565 -6092117 -3462008 -597267 441755 -359262
43718 -359262 -1575502 -2403820 -3179484 -3972030 -3937483 -2596505 -820082 161005 39041
43709 39041 -954956 -2948308 -5861368 -8320544 -8333599 -5249079 -365852 4399609 7761283
$$ packed form
43769A3348509k329530l139173j489195P87662J546101P55055j1789J43004M21262
43760A0031906m16429k223357l338409k559266r34394o90995k112225k646765
43752d889934k11460L472873M522509J730342j920513k945556j052449J469412
43744A75224K590770J777294l90818k507779k973296j541260K45610J084028J579814
43735C9587K668455L254595J383964k348846m590617l140638L23318K279817J172147
43726A041782j536013l264462k510872J77448K630109K864741J039022q01017
43718c59262j216240q28318p75664p92546L4547J340978J776423R81087j21964
43709C9041r93997j993352k913060k459176j3055L084520M883227M765461L361674
$$ plain form
43700 7761283 9132080 8550310 6964591 5845182 5991217 7074248 8444490 9727571
43692 9727571 10518050 10438028 9920572 9967484 10488478 9857190 7035965 3279191 620907
43683 620907 -528833 -953412 -637783 857228 2364018 1784463 -670068 -2068503 -775035
43674 -775035 898316 -249584 -3792519 -6203441 -5408081 -2859779 -943052 -125267 435566
43665 435566 703474 -352675 -2823905 -5002836 -5134316 -3530870 -2067052 -1621653 -1125608
43656 -1125608 380815 2023139 2611363 2717765 3303534 3060367 -151979 -5076679 -7226359
43647 -7226359 -4360541 840778 4949927 7744452 9856238 9553389 5512985 825972
43639 825972 -39040 2445632 3657611 1795366 -97476 330812 1333472 768896 -333894
$$ packed form
43700G761283J370797n81770j585719j119409J46035J083031J370242J283081
43692I727571P90479q0022n17456M6912N20994o31288k821225l756774k658284
43683F20907j149740m24579L15629J495011J506790n79555k454531j398435J293468
43674g75035J673351j147900l542935k410922P95360K548302J916727Q17785N60833
43665D35566K67908j056149k471230k178931j31480J603446J463818M45399M96045
43656a125608J506423J642324N88224J06402N85769k43167l212346m924700k149680
43647g226359K865818N201319M109149K794525K111786l02849m040404m687013
43639H25972q65012K484672J211979j862245j892842M28288J002660n64576j102790
$$ plain form
43630 -333894 -9150 1635977 3664333 6014879 7947311 7394958 4347249 2521540 4705026
43621 4705026 8201806 8065803 3734689 -598500 -1579384 150575 2081598 2611746 1712280
43612 1712280 739367 1326805 2934425 2508600 -1404560 -5554063 -5843485 -3264344 -2458920
43603 -2458920 -4712195 -6287280 -4348957 -732941 1636511 2663240 3293829 2693882
43595 2693882 -639 -2904148 -3139365 -592576 2209182 3446177 3472821 3304988 3223204
43586 3223204 2953084 2290616 1442739 974503 1018356 608058 -1153916 -3185545 -3195968
43577 -3195968 -876173 1306762 1389305 427040 581628 2127215 3753787 4693046 5111716
43568 5111716 5285655 5605946 6489412 7251764 6341934 3946103 2811691 4661907 7185833
$$ packed form
43630c33894L24744J645127K028356K350546J932432n52353l047709j825709K183486
43621D705026L496780j36003m331114m333189r80884J729959J931023N30148q99466
43612A712280r72913N87438J607620m25825l913160m149503k89422K579141Q05424
43603b458920k253275j575085J938323L616016K369452J026729O30589n99947
43595B693882k694521k903509k35217K546789K801758J236995K6644j67833q1784
43586C223204k70120o62468q47877m68236M3853m10298j761974k031629j0423
43577c195968K319795K182935Q2543r62265J54588J545587J626572R39259M18670
43568E111716J73939L20291Q83466P62352r09830k395831j134412J850216K523926
$$ plain form
43559 7185833 6920451 4159670 2331800 2834053 3256686 1242031 -2196616 -4224902 -3536128
43550 -3536128 -1213360 778155 1297019 854095 986647 2303258 3434630 2751982 648860
43541 648860 -1087818 -1767309 -2210906 -2959690 -3694844 -4375479 -5253932 -5658376 -4527358
43532 -4527358 -2447670 -1361140 -1748121 -1884464 -555248 1305352 2540958 3462770 4391825
43523 4391825 4305102 2599373 753241 300975 213905 -1622527 -4996263 -7556914 -8054950
43514 -8054950 -7166352 -5082492 -789070 5293381 9992888 10326413 6729279 2204555
43506 2204555 -611882 -287430 3934011 10922758 16388833 15855719 9947560 4369088
43498 4369088 3082728 3643673 1606390 -2296996 -2933710 1710410 7613754 10303193
$$ packed form
43559G185833k65382k760781j827870N02253M22633k014655l438647k028286O88774
43550c536128K322768J991515N18864m42924J32552J316611J131372o82648k103122
43541F48860j736678o79491m43597p48784p35154o80635q78453m04444J131018
43532d527358K079688J086530l86981j36343J329216J860600J235606R21812R29055
43523D391825q6723j705729j846132m52266q7070j836432l373736k560651m98036
43514h054950Q88598K083860M293422O082451M699507L33525l597134m524724
43506B204555k816437L24452M221441O988747N466075n33114n908159n578472
43498D369088j286360N60945k037283l903386o36714M644120N903344K689439
$$ plain form
43490 10303193 9914735 8716254 6667748 2736515 -1116802 -1099349 3238741 7888624
43482 7888624 9031981 6722634 3463796 1138175 231192 538646 1460988 2232739 2483062
43473 2483062 2312908 1991152 2114564 3468238 5744992 7139638 6599564 5728492 6673918
43464 6673918 8787428 9577233 8549793 7561694 7450761 7155524 6530225 6986158 8388657
43455 8388657 8325998 5984040 4011939 4636987 6351189 6598403 5585288 5054547 5152270
43446 5152270 5073684 5292415 6512928 7592236 7072169 5782771 5372285 5113098 2842526
43437 2842526 -1404130 -5172528 -6676854 -5939284 -3385004 370920 3741036 5433206
43429 5433206 6121473 6838674 6654052 4491283 2116548 1971516 2829449 1552989 -1151034
$$ packed form
43490A0303193l88458j198481k048506l931233l853317J7453M338090M649883
43482G888624J143357k309347l258838k325621r06983L07454R22342P71751K50323
43473B483062j70154l21756J23412J353674K276754J394646n40074q71072R45426
43464F673918K113510P89805j027440r88099j10933k95237o25299M55933J402499
43455H388657o2659k341958j972101O25048J714202K47214j013115n30741R7723
43446E152270p8586K18731J220513J079308n20067j289398m10486k59187k270572
43437B842526m246656l768398j504326P37570K554280L755924L370116J692170
43429E433206O88267P17201j84622k162769k374735j45032Q57933j276460k704023
$$ plain form
43420 -1151034 -1324927 1378344 2461259 -45097 -1934644 423415 4044612 4092972 1282655
43411 1282655 -170817 389663 165427 -1159296 -800186 1727186 3276775 2047316 -98672
43402 -98672 -1444736 -2744411 -4066510 -2947186 1745778 6877651 8828404 8159191 7677157
43393 7677157 7700602 6651243 5193395 5863421 8519153 9883284 8606096 7386217 8241724
43384 8241724 8726637 5768599 1224716 181 3253967 6952724 7581591 6138076
43376 6138076 5265445 5249276 4945316 4615613 5182263 5722310 4428996 1900293 1038895
43367 1038895 3185830 6239275 7337779 5934567 3453309 1229063 -181006 -573760
43359 -573760 -134624 434322 576760 565958 1199125 2964587 5525248 7705323 8211371
$$ packed form
43420a151034j73893K703271J082915k506356j889547K358059L621197M8360k810317
43411A282655j453472N60480k24236j324723L59110K527372J549589j229459k145988
43402i8672j346064j299675j322099J119324M692964N131873J950753o69213m82034
43393G677157K3445j049359j457848O70026K655732J364131j277188j219879Q55507
43384H241724M84913k958038m543883j224535L253786L698757O28867j443515
43376F138076q72631j6169l03960l29703N66650N40047j293314k528703q61398
43367A038895K146935L053445J098504j403212k481258k224246j410069l92754
43359e73760M39136N68946J42438j0802O33167J765462K560661K180075N06048
$$ plain form
43350 8211371 6982684 5545458 5185187 5154840 3903764 1661338 20332 -874876 -2292100
43341 -2292100 -3549475 -1608351 4160608 9290501 9082587 4654782 1186363 1117766 2374937
43332 2374937 2962083 3509816 4367480 3736495 805515 -1847895 -1487613 987794 3078225
43323 3078225 4956306 8435165 12297297 12408668 7476786 1666155 -367729 1138514
43315 1138514 2829076 3638418 5404608 8554279 10357812 8536237 4403237 924321
43307 924321 -807305 -1458535 -996131 1415710 5203770 8136341 8970846 8982642 10027409
43298 10027409 12063990 13517524 13440148 12335665 11126615 10181969 9441385 8954718 9085545
43289 9085545 10257436 12365897 14384181 14956175 13730226 11879142 10998766 11671276 13280253
$$ packed form
43350H211371j228687j437226l60271l0347j251076k242426j641006q95208j417224
43341b292100j257375J941124N768959N129893k07914m427805l468419o8597J257171
43332B374937N87146N47733Q57664o30985k930980k653410L60282K475407K090431
43323C078225J878081L478859L862132J11371m931882n810631k033884J506243
43315A138514J690562Q09342J766190L149671J803533j821575m133000l478916
43307I24321j731626o51230M62404K411841L788060K932571Q34505J1796J044767
43298A0027409K036581J453534p7376j104483j209050r44646p40584m86667J30827
43289I085545J171891K108461K018284N71994j225949j851084q80376O72510J608977
$$ plain form
43280 13280253 14829647 15524392 14872958 12880074 10275086 8232803 7666841 8688900
43272 8688900 10516554 11840917 11625675 9814360 7134949 4242213 1493342 -395195
43264 -395195 -278659 2219589 5887640 8884130 10173145 9566772 7099491 3485412 845508
43255 845508 1495208 5548926 10703728 14829615 17766988 19959379 20579119 18555012 15000084
43246 15000084 12839359 13530023 15417781 16147549 15736721 16144996 18384327 21462167 24246205
43237 24246205 27002725 30306044 33266267 34050109 32273702 30072457 30141228 32746767
43229 32746767 35228138 34934023 32382960 30635815 31384049 32872412 32585996 30842044
43221 30842044 30072239 31204498 32806169 33666021 33947662 33493189 31551986 29133464 28980368
$$ packed form
43280A3280253J549394O94745o51434j992884k604988k042283n65962J022059
43272H688900J827654J324363k15242j811315k679411k892736k748871j888537
43264c95195J16536K498248L668051K996490J289015o06373k467281l614079k639904
43255H45508O49700M053718N154802M125887K937373K192391O19740k024107l554928
43246A5000084k160725O90664J887758P29768m10828M08275K239331L077840K784038
43237B4246205K756520L303319K960223P83842j776407k201245O8771K605539
43229C2746767K481371k94115k551063j747145P48234J488363k86416j743952
43221C0842044p69805J132259J601671Q59852K81641m54473j941203k418522j53096
$$ plain form
43212 28980368 31561738 33568753 32577965 30897420 32014630 35280450 37499605 38142096
43204 38142096 38960702 39464892 37392260 33736373 32727301 35866052 40082785 42913679
43196 42913679 45212020 47142203 46123660 41482958 36993188 35404006 34137228 30271732
43188 30271732 26311619 26179319 28128498 27160883 23106683 20740017 22129280 24087688
43180 24087688 23753768 21958693 20005398 17450667 14597937 13347953 13810219 13457156
43172 13457156 11430870 10412003 12119298 14033949 13185758 10720197 9933300 11596150
43164 11596150 13899126 15673394 17088123 17967060 17672434 16369452 14951748 14155739
43156 14155739 14622650 16802994 19877058 22107174 23256184 25002695 27773644 29240064
$$ packed form
43212B8980368K581370K007015r90788j680545J117210L265820K219155O42491
43204C8142096Q18606N04190k072632l655887j009072L138751M216733K830894
43196D2913679K298341J930183j018543m640702m489770j589182j266778l865496
43188C0271732l960113j32300J949179r67615m054200k366666J389263J958408
43180B4087688l33920j795075j953295k554731k852730j249984M62266l53063
43172A3457156k026286j018867J707295J914651q48191k465561p86897J662850
43164A1596150K302976J774268J414729Q78937k94626j302982j417704p96009
43156A4155739M66911K180344L074064K230116J149010J746511K770949J466420
$$ plain form
43148 29240064 27798411 25548322 25445760 27235749 28933566 30743222 34109796 37878841
43140 37878841 39324878 39040198 40922698 46331106 51765666 54053702 54777174 57125879
43132 57125879 60677008 62302888 61068459 59220554 58454572 57739407 55396568 51416142
43124 51416142 46816926 42068990 37216537 32755981 29358916 27046695 25333983 23906533
43116 23906533 22607478 21186572 19819146 19506321 20970173 23284070 24650283 24474778
43108 24474778 23394994 21262138 17067131 11734211 8926610 11178068 16555647 21183071
43100 21183071 23832292 25499018 25564632 22033420 15812106 11122685 10319310 11255562 11351915
43091 11351915 11279578 12324906 12832485 10518489 6701284 4899028 5931220 7336478
$$ packed form
43148B9240064j441653k250089j02562J789989J697817J809656L366574L769045
43140C7878841J446037k84680J882500N408408N434560K288036P23472K348705
43132E7125879L551129J625880j234429j847905p65982p15165k342839l980426
43124E1416142m599216m747936m852453m460556l397065k312221j712712j427450
43116B3906533j299055j420906j367426l12825J463852K313897J366213j75505
43108B4474778j079784k132856m195007n332920k807601K251458N377579M627424
43100B1183071K649221J666726O5614l531212o221314m689421q03375R36252R6353
43091A1351915p2337J045328N07579k313996l817205j802256J032192J405258
$$ plain form
43083 7336478 7253797 6127311 4745575 3386286 3165107 5542399 9651401 12248303 11323198
43074 11323198 8236538 5603451 4521804 4454768 4389085 3515479 2081192 1932468 4675050
43065 4675050 8917474 11187256 10323919 9062306 10119939 12526707 13434302 12113513
43057 12113513 10261677 9308231 9378165 10387493 12163263 13459462 12595608 9492139 5823606
43048 5823606 2840590 295845 -2019140 -3098995 -2240506 -816893 -958522 -2576050
43040 -2576050 -3248979 -1649056 303179 20044 -1813571 -1700745 2182726 7703764 11633358
43031 11633358 13202322 13661303 13709878 13095901 11967528 10794359 9293830 7109246 5279826
43022 5279826 5266678 6640733 7606783 7788429 8312376 8864930 7283057 3197607 -361087
$$ packed form
43083G336478q2681j126486j381736j359289k21179K377292M109002K596902r25105
43074A1323198l086660k633087j081647o7036o5683q73606j434287j48724K742582
43065D675050M242424K269782q63337j261613J057633K406768R07595j320789
43057A2113513j851836r53446O9934J009328J775770J296199q63854l103469l668533
43048E823606k983016k544745k314985j079855Q58489J423613j41629j617528
43040b576050o72929J599923J952235k83135j833615J12826L883471N521038L929594
43031A1633358J568964M58981M8575o13977j128373j173169j500529k184584j829420
43022E279826j3148J374055R66050J81646N23947N52554j581873m085450l558694
$$ plain form
43013 -361087 -837400 308112 173802 -943459 -203707 3106035 6338141 7231840 6606578
43004 6606578 6483085 7230194 7674210 6953157 5227775 3205948 1805569 1853312 3368024
42995 3368024 5308741 6545660 7020395 7640023 9074394 10828270 11460884 9745329 5884769
42986 5884769 1735431 -403783 423836 3076234 5363947 5996896 5572370 5562009 6383490
42977 6383490 6941765 6375829 5614427 6277513 8352165 10234892 11193009 12277260 14072588
42968 14072588 15008222 13326234 9847293 7183513 6618035 7296577 8250512 9433822 10486228
42959 10486228 10215457 8186160 5605524 3695336 2160749 285562 -1299950 -1260399
42951 -1260399 365027 1957177 2298485 1861362 1870435 2718035 3629448 3562104 2252715
$$ packed form
43013c61087m76313J145512j34310j117261P39752L309742L232106Q93699o25262
43004F606578j23493P47109M44016p21053j725382k021827j400379M7743J514712
42995C368024J940717J236919M74735O19628J434371J753876O32614j715555l860560
42986E884769m149338k139214Q27619K652398K287713O32949m24526j0361Q21481
42977F383490N58275n65936p61402O63086K074652J882727R58117J084251J795328
42968A4072588R35634j681988l478941k663780n65478O78542R53935J183310J052406
42959A0486228k70771k029297k580636j910188j534587j875187j585512L9551
42951a260399J625426J592150L41308m37123R073Q47600R11413o7344j309389
$$ plain form
42942 2252715 587528 -28597 1096781 3297784 5227228 6034375 5760864 4948307 4255167
42933 4255167 4180279 4664961 5141473 5413408 6187756 8125398 10646954 12423746 12781982
42924 12781982 11732458 8990143 4400541 -587753 -3481732 -3342198 -1458312 1022400
42916 1022400 4265284 7561613 8217251 4821738 118143 -1957988 -1135998 -21231
42908 -21231 666440 2582440 5479214 6309458 3929294 1387648 1544632 3140261 3489433
42899 3489433 2650759 2216348 1959828 790648 -309085 463870 2216927 2128717 -440804
42890 -440804 -3203571 -4202530 -3522686 -2082164 -1096909 -2223161 -5427857 -7127562 -3732816
42881 -3732816 2952910 7465185 8227148 9321655 13422116 17167601 16204119 11435756
$$ packed form
42942B252715j665187o16125J125378K201003J929444Q07147k73511q12557o93140
42933D255167p4888M84682M76512K71935P74348J937642K521556J776792L58236
42924A2781982j049524k742315m589602m988294k893979J39534J883886K480712
42916A022400L242884L296329O55638l395513m703595k076131Q21990J114767
42908b1231O87671J916000K896774Q30244k380164k541646J56984J595629L49172
42899C489433q38674m34411k56520j169180j099733P72955J753057q8210k569521
42890d40804k762767r98959O79844J440522R85255j126252l204696j699705L394746
42881c732816O685726M512275P61963J094507M100461L745485r63482m768363
$$ plain form
42873 11435756 7065983 5017118 4621692 5642100 7801087 8770257 6630250 3772973
42865 3772973 4583549 9213468 13205920 13778074 12945206 13169505 13180803 10457692 5812108
42856 5812108 2906779 3913611 7521308 10911564 12167580 10779085 7256473 3001113
42848 3001113 -133137 -1202708 -1395063 -3179567 -7355230 -11219237 -11018929 -6619598
42840 -6619598 -2292460 -1827424 -4117814 -5093739 -3006040 230653 2447304 3614018
42832 3614018 4506205 5118643 5373327 5822530 6483453 6141603 4077353 1682839 1028168
42823 1028168 2224963 3538784 4076055 4914226 6847315 8187434 6522957 2690914
42815 2690914 1087570 4623943 10591512 13706060 12803483 11757183 13214887 14626045
$$ packed form
42873A1435756m369773k048865l95426J020408K158987R69170k140007k857277
42865C772973Q10576M629919L992452N72154q32868K24299J1298k723111m645584
42856E812108k905329J006832L607697L390256J256016j388495l522612m255360
42848C001113l134250j069571j92355j784504m175663l864007K00308M399331
42840f619598M327138M65036k290390r75925K087699L236693K216651J166714
42832C614018Q92187O12438K54684M49203O60923l41850k064250k394514o54671
42823A028168J196795J313821N37271Q38171J933089J340119j664477l832043
42815B690914j603344L536373N967569L114548r02577j046300J457704J411158
$$ plain form
42807 14626045 12630080 8787876 7538301 9681687 11596059 10900569 9359146 9199193
42799 9199193 9645706 8938392 7588719 7488941 9047666 11111938 12996878 14977270 17147790
42790 17147790 19050383 20195109 20080047 18152099 14709616 11465089 10159401 10655916
42782 10655916 11174841 10410047 8807230 7756819 8084919 9467263 10915762 11553294 11024419
42773 11024419 9500979 7632178 6417537 6556794 7619975 8302303 7800758 6423031
42765 6423031 4633904 2475232 490006 -9508 1332999 3093374 4282353 6019142
42757 6019142 9121860 11483457 10663274 8227377 8139420 10947826 13151361 12833738 12100779
42748 12100779 12651119 12869841 11588035 11059664 12956227 14368566 11729143 6725766
$$ packed form
42807A4626045j995965l842204j249575K143386J914372o95490j541423j59953
42799I199193M46513p07314j349673r9778J558725K064272J884940J980392K170520
42790A7147790J902593J144726j15062j927948l442483l244527j305688M96515
42782A0655916N18925p64794j602817j050411L28100J382344J448499O37532n28875
42773A1024419j523440j868801j214641J39257J063181O82328n01545j377727
42765F423031j789127k158672j985226m99514J342507J760375J188979J736789
42757F019142L102718K361597q20183k435897q7957K808406K203535l17623p32959
42748A2100779N50340K18722j281806n28371J896563J412339k639423n003377
$$ plain form
42740 6725766 4176170 5145265 6259734 5403994 4046986 3558837 2864631 762809 -2209347
42731 -2209347 -5021189 -6786304 -5796957 -937682 5129613 7418071 4814459 1955382
42723 1955382 2979732 6130375 7164856 5836656 5529289 7478499 8890134 7173542
42715 7173542 3425771 773590 914426 3155403 5678117 6856042 6031736 3878325
42707 3878325 1949454 1504300 2615725 4281744 5326609 5325879 4655398 3547426 1608480
42698 1608480 -995901 -2407823 -643435 3590269 7325498 9137612 10682723 13385029
42690 13385029 15635215 15314362 13563067 13361967 15093611 16370856 16245371 16669612 18974647
42681 18974647 21442009 21771094 20087497 18138471 17181545 18109487 21942277 28181824
$$ packed form
42740F725766k549596R69095J114469q55740j357008m88149o94206k101822k972156
42731b209347k811842j765115R89347M859275O067295K288458k603612k859077
42723A955382J024350L150643J034481j328200l07367J949210J411635j716592
42715G173542l747771k652181J40836K240977K522714J177925q24306k153411
42707C878325j928871m45154J111425J666019J044865p30o70481j107972j938946
42698A608480k604381j411922J764388M233704L735229J812114J545111K702306
42690A3385029K250186l20853j751295k01100J731644J277245j25485M24241K305035
42681A8974647K467362L29085j683597j949026r56926R27942L832790O239547
$$ plain form
42673 28181824 33853880 36369117 36754146 38083141 41118125 43477635 42967473 39812959
42665 39812959 35597421 31999509 30850832 33284037 37841876 40983171 40501159 37439935
42657 37439935 34199469 32178849 31767518 32751675 33622905 32258746 28741459 25930023
42649 25930023 25677137 26184950 25118070 23553362 23941444 25369717 24479050 20981292 18587485
42640 18587485 19543065 21560025 21824427 21188723 22051347 24138956 25011397 23559149 20641971
42631 20641971 17121291 13604782 11660898 12891821 16583336 20084237 21765900 22065883
42623 22065883 21515970 19623823 16434486 13617808 12742924 13226163 13088199 11529221 10030580
42614 10030580 10837364 14577739 19359112 22261983 21951906 19786115 18211594 18388243
$$ packed form
42673B8181824N672056K515237L85029J328995L034984K359510n10162l154514
42665C9812959m215538l597912j148677K433205M557839L141295m82012l061224
42657C7439935l240466k020620m11331R84157Q71230j364159l517287k811436
42649B5930023k52886N07813j066880j564708L88082J428273q90667l497758k393807
42640A8587485R55580K016960K64402o35704Q62624K087609Q72441j452248k917178
42631B0641971l520680l516509j943884J230923L691515L500901J681663K99983
42623B2065883n49913j892147l189337k816678q74884M83239j37964j558978j498641
42614A0030580Q06784L740375M781373K902871l10077k165791j574521J76649
$$ plain form
42606 18388243 19707581 21113672 22066713 22367275 21883770 20607108 18509595 15534919
42598 15534919 12355354 10748670 12059739 15247908 17673686 18136989 17893063 18117806
42590 18117806 17890585 16104856 14321433 15587389 20284725 24967738 26108083 23654538
42582 23654538 19916131 16301987 12938204 10693028 11059754 13503314 15078116 13940592
42574 13940592 11591118 10158541 9210823 7591698 7002704 10252987 15970273 18829551
42566 18829551 16556098 13527051 14869854 19278040 20919204 17353017 12215655 10054228
42558 10054228 11436008 13928700 15547224 15928167 15682881 16034096 18286493 22463184
42550 22463184 26703707 28686826 27633692 24865902 22750307 23005370 25350704 27585186
$$ packed form
42606A8388243J319338J406091R53041L00562m83505j276662k097513k974676
42598A5534919l179565j606684J311069L188169K425778M63303k43926K24743
42590A8117806k27221j785729j783423J265956M697336M683013J140345k453545
42582B3654538l738407l614144l363783k245176L66726K443560J574802j137524
42574A3940592k349474j432577r47718j619125n88994L250283N717286K859278
42566A8829551k273453l029047J342803M408186J641164l566187n137362k161427
42558A0054228J381780K492692J618524L80943k45286L51215K252397M176691
42550B2463184M240523J983119j053134k767790k115595K55063K345334K234482
$$ plain form
42542 27585186 27437443 24566104 20668399 17902520 17413832 18788901 20385242 20801140
42534 20801140 20656833 22105212 25723361 29021785 29551723 28524961 29265322 32537016
42526 32537016 35726032 36647924 35746209 34111092 31897254 29784190 29592701 31658391
42518 31658391 33331917 32064864 28811293 26458387 25776779 24995985 23074102 21413528
42510 21413528 21935556 24708294 27983206 29974404 30413042 30640252 31965019 33723562
42502 33723562 33666746 30873285 27474208 26405996 27922324 29587669 29662566 29223916 30408276
42493 30408276 33351228 35717063 35292962 32550052 30122967 29709100 30192059 29510394 27773284
42484 27773284 27184379 28900943 31519188 33288765 34461177 36375495 39165756 41597002
$$ packed form
42542B7585186j47743k871339l897705k765879m88688J375069J596341M15898
42534B0801140j44307J448379L618149L298424N29938j026762P40361L271694
42526C2537016L189016R21892r01715j635117k213838k113064j91489K065690
42518C1658391J673526j267053l253571k352906o81608p80794j921883j660574
42510B1413528N22028K772738L274912J991198M38638K27210J324767J758543
42502C3723562n6816k793461l399077j068212J516328J665345P4897m38650J184360
42493C0408276K942952K365835m24101k742910k427085m13867M82959o81665j737110
42484B7773284n88905J716564K618245J769577J172412J914318K790261K431246
$$ plain form
42476 41597002 42713962 42674620 42224675 42023157 42162313 41911412 40493306 38489060 37596377
42467 37596377 38444055 39717162 40258308 40854922 42802129 45867870 49160898 52870586
42459 52870586 57145248 60088185 59475922 56532377 55428293 58159778 62065416 63786637
42451 63786637 63951759 65994078 71256420 77461211 82184825 86033396 91344643 98666426
42443 98666426 105844629 110640129 113296695 116111530 121209113 129396645 140470650 153345298
42435 153345298 166012572 176812220 186146812 195751356 205878095 214700899 221315471
42428 221315471 227611950 235486906 243392903 247826254 247866340 246207519 245571796 245869671
42420 245869671 245289478 242624755 237913715 232078975 226657157 222825411 219914604 215711610
$$ packed form
42476D1597002J116960l9342m49945k01518J39156k50901j418106k004246q92683
42467C7596377Q47678J273107N41146N96614J947207L065741L293028L709688
42459E2870586M274662K942937o12263k943545j104084K731485L905638J721221
42451F3786637J65122K042319N262342O204791M723614L848571N311247P321783
42443I8666426P178203M795500K656566K814835N097583Q187532J1074005J2874648
42435A53345298J2667274J0799648R334592R604544J0126739Q822804O614572
42428B21315471O296479P874956P905997M433351M0086j658821o35723K97875
42420B45869671n80193k664723m711040n834740n421818l831746k910807m202994
$$ plain form
42412 215711610 209044573 201542636 196173996 194396827 195189367 196439219 196755933 196243614
42404 196243614 196146228 197878610 202156651 208810820 217177663 226557560 236582271 247472268
42396 247472268 259824384 273886768 289064706 304159461 318010246 330323947 342526460
42389 342526460 357240258 375383064 393770116 407595581 416025661 423161785 432003922
42382 432003922 439672941 440993458 435004510 424796638 412100241 395920577 376559220
42375 376559220 357033409 339162548 321353546 302040279 282808950 266018818 251134566
42368 251134566 235550284 218010855 199666908 182697379 169045540 159316099 151747395
42361 151747395 143514879 134107754 125892522 120231895 115137496 108602070 102048111 97585107
$$ packed form
42412B15711610o667037p501937n368640j777169P92540J249852L16714n12319
42404A96243614r7386J732382M278041O654169Q366843R379897J0024711J0889997
42396B47472268J2352116J4062384J5177938J5094755J3850785J2313701J2202513
42389C42526460J4713798J8142806J8387052J3825465Q430080P136124Q842137
42382D32003922P669019J320517n988948j0207872j2696397j6179664j9361357
42375C76559220j9525811j7870861j7809002j9313267j9231329j6790132j4884252
42368B51134566j5584282j7539429j8343947j6969529j3651839r729441p568704
42361A51747395q232516r407125q215232n660627n094399o535426o553959m463004
$$ plain form
42353 97585107 93427550 85762907 74948866 66220815 63186513 63336061 61581436 56481486
42345 56481486 51336720 49996234 52750048 55994697 55505146 50515891 44590273 41679821
42337 41679821 41571042 40582155 36712082 32208386 30345312 31471141 33555081 35172768
42329 35172768 36083374 35628723 32725274 27820059 23429276 21944547 23352762 25336107
42321 25336107 25238628 22121757 17708880 15381923 17320702 22192950 26322461 27490459
42313 27490459 26792775 26268908 25861308 24058810 20863425 18246833 17448366 17468087 16869759
42304 16869759 15602560 14144426 12313800 10285483 9512319 10837199 12530721 12188305
42296 12188305 10110059 8772527 9226340 10227553 10902792 11775057 12696997 12387020 11051838
$$ packed form
42353I7585107m157557p664643j0814041q728051l034302J49548j754625n099950
42345E6481486n144766j340486K753814L244649m89551m989255n925618k910452
42337D1679821j08779r88887l870073m503696j863074J125829K083940J617687
42329C5172768R10606m54651k903449m905215m390783j484729J408215J983345
42321B5336107r7479l116871m412877k326957J938779M872248M129511J167998
42313B7490459o97684n23867m07600j802498l195385k616592p98467J9721n98328
42304A6869759j267199j458134j830626k028317p73164J324880J693522l42416
42296A2188305k078246j337532M53813J001213O75239Q72265R21940l09977j335182
$$ plain form
42287 11051838 10980004 13009276 14628135 13435828 10518479 8296819 6853468 4939169
42279 4939169 3212686 3589510 6036911 8610505 10206172 10844182 9811901 6406154
42271 6406154 2462351 1209916 3042970 4887842 4361114 2242841 291505 -874275
42263 -874275 -864702 959771 3769589 5312300 5096862 5465238 7985792 10830237 11511254
42254 11511254 10308334 8906222 7326257 4633928 1559082 34700 772685 3167100
42246 3167100 6697762 10470453 12421652 11350185 9001593 7765241 7077163 4824843
42238 4824843 1668068 631807 2327012 4006339 4071663 4130448 5346050 6178153 5743143
42229 5743143 6191675 8891582 10876086 8621067 3637250 555071 631169 1078152 573184
$$ packed form
42287A1051838p1834K029272J618859j192307k917349k221660j443351j914299
42279D939169j726483L76824K447401K573594J595667O38010j032281l405747
42271F406154l943803j252435J833054J844872n26728k118273j951336j165780
42263h74275R573J824473K809818J542711k15438L68376K520554K844445O81017
42254A1511254j202920j402112j579965k692329l074846j524382P37985K394415
42246C167100L530662L772691J951199j071467k348592j236352o88078k252320
42238D824843l156775j036261J695205J679327O5324N8785J215602Q32103m35010
42229E743143M48532K699907J984504k255019m983817l082179P6098M46983n04968
$$ plain form
42220 573184 1200929 3951854 6163194 5529813 3748842 3651094 4847410 5037595 4245156
42211 4245156 4651441 6511947 7005917 3816890 -1889097 -6714573 -8141461 -6129530
42203 -6129530 -2728465 -397418 150544 475933 2010549 3673758 3469969 2165240 3043149
42194 3043149 7258388 11570862 12152110 9028411 5069345 1991210 -414319 -1910772
42186 -1910772 -1328063 1204500 3512254 3617159 1537247 -1434771 -3859050 -4216813 -1561604
42177 -1561604 2893813 6135596 6488283 5470995 5403965 6139792 5695742 3530662 1383947
42168 1383947 775860 1283472 1834246 2394710 3467380 4758779 5379364 4981132 3764581
42159 3764581 1507923 -2376424 -7405727 -11393376 -12176923 -10018614 -7528189 -6731117
$$ packed form
42220E73184O27745K750925K211340o33381j780971r7748J196316J90185p92439
42211D245156M06285J860506M93970l189027n705987m825476j426888K011931
42203f129530L401065K331047N47962L25389J534616J663209k03789j304729Q77909
42194C043149M215239M312474N81248l123699l959066l078135k405529j496453
42186a910772N82709K532563K307754J04905k079912k972018k424279l57763K655209
42177a561604M455417L241783L52687j017288o7030P35827m44050k165080k146715
42168A383947o08087N07612N50774N60464J072670J291399O20585l98232j216551
42159C764581k256658l884347n029303l987649p83547K158309K490425P97072
$$ plain form
42151 -6731117 -6781492 -5446732 -2556703 -563612 -1124463 -2502842 -1806816 910218 2602791
42142 2602791 1304638 -1554845 -3512145 -4094580 -4332609 -4566685 -4329723 -3649569 -2783750
42133 -2783750 -1032036 2424233 6455021 8487671 7560575 5404231 3880984 2829883
42125 2829883 1373243 -68339 -499527 -141690 31636 -59915 11062 -424309 -2514723
42116 -2514723 -5558842 -7087175 -5872328 -3278996 -712190 2678416 8044186 13583367
42108 13583367 15622089 13317606 10288532 10275584 12472784 12982991 10347370 7353661
42100 7353661 6804720 7727590 7544561 6477236 7178755 10323954 13222901 13433084 11514688
42091 11514688 9246119 7236601 5666812 5328753 5996376 5476469 2566333 -416933
$$ packed form
42151f731117n0375J334760K890029J993091n60851j378379O96026K717034J692573
42142B602791j298153k859483j957300n82435k38029k34076K36962O80154Q65819
42133b783750J751714L456269M030788K032650r27096k156344j523247j051101
42125B829883j456640j441582m31188L57837J73326r1551P0977m35371k090414
42116b514723l044119j528333J214847K593332K566806L390606N365770N539181
42108A3583367K038722k304483l029074j2948K197200N10207k635621k993709
42100G353661n48941R22870j83029j067325P01519L145199K898947K10183j918396
42091A1514688k268569k009518j569789l38059O67623n19907k910136k983266
$$ plain form
42083 -416933 -602003 1058590 1287350 -339276 -988725 642364 2410473 2226107 519934
42074 519934 -1604154 -3743897 -4678024 -2597410 1434709 3122571 222708 -4248199
42066 -4248199 -6389051 -6628270 -7837190 -10342520 -12062560 -12138744 -11065325 -8256419 -3094124
42057 -3094124 2053057 3640664 2215388 2420064 6612730 11421512 12310363 9294857
42049 9294857 6113050 5197178 5641090 5714424 5484176 6188684 7753872 8172723 6127411
42040 6127411 3506086 3516739 6120541 7684942 6360576 5194385 7464993 11218106
42032 11218106 12049153 9943461 9030254 10719445 11604304 9293983 6244455 5724967 7259322
42023 7259322 8555004 9317756 10331305 10684006 8985665 6424751 5871039 8053797 10625177
$$ packed form
42083d16933j85070J660593K28760j626626o49449J631089J768109j84366j706173
42074E19934k124088k139743r34127K080614M032119J687862k899863m470907
42066d248199k140852k39219j208920k505330j720040p6184J073419K808906N162295
42057c094124N147181J587607j425276K04676M192666M808782Q88851l015506
42049I294857l181807r15872M43912P3334k30248P04508J565188M18851k045312
42040F127411k621325J0653K603802J564401j324366j166191K270608L753113
42032A1218106Q31047k105692r13207J689191Q84859k310321l049528n19488J534355
42023G259322J295682P62752J013549L52701j698341k560914n53712K182758K571380
$$ plain form
42014 10625177 11141122 9589909 7825018 7411885 8197060 8683826 7905275 6662560 6194352
42005 6194352 6136160 5327917 4360525 5130005 7535671 9008217 8154210 6462734 5217549
41996 5217549 3338348 219561 -1664057 334795 4989964 8609834 9489602 8698479
41988 8698479 7449968 6199310 5782159 6954845 8763592 9229070 7656931 4934631
41980 4934631 2113059 239750 699720 3531322 5911865 4781064 1036159 -1246546
41972 -1246546 -250809 1195168 -203783 -3454020 -4514076 -1688634 1980531 2433785
41964 2433785 -140148 -1285884 1917808 6624842 7759212 4864014 2432567 3305009
41956 3305009 5354681 6148288 7121900 10190776 13265571 13096754 10707695 9879573 11298541
$$ packed form
42014A0625177N15945j551213j764891m13133P85175M86766p78551j242715m68208
42005F194352n8192q08243r67392P69480K405666J472546q54007j691476j245185
41996E217549j879201l118787j883618J998852M655169L619870Q79768p91123
41988H698479j248511j250658m17151J172686J808747M65478j572139k722300
41980D934631k821572j873309M59970K831602K380543j130801l744905k282705
41972a246546R95737J445977j398951l250237j060056K825442L669165M53254
41964B433785k573933j145736L203692M707034J134370k895198k431447Q72442
41956C305009K049672P93607R73612L068876L074795j68817k389059q28122J418968
$$ plain form
41947 11298541 12295305 11867471 11809922 12782293 13334791 13494245 15417876 19267034 21965291
41938 21965291 21677310 20419339 20362228 20307535 18075436 14331017 11787509 11861562 13724427
41929 13724427 15542507 15520904 13026638 9707362 8196057 8943303 9858979 9697413 9774542
41920 9774542 11345374 13426608 14662812 15429466 16386242 16543677 14594326 11081239 7777863
41911 7777863 5856901 5685927 7127723 8929435 9177997 7512499 5576504 4391190
41903 4391190 3042636 1085143 126011 1265321 2836159 2805851 1964987 2581538 5062335
41894 5062335 8045381 10796452 13408997 15363268 15852174 15115100 14048402 13168116 12978275
41885 12978275 14008716 15206512 14077327 10204654 6729379 6147928 6713836 5850964
$$ packed form
41947A1298541R96764m27834n7549R72371N52498J59454J923631L849158K698257
41938B1965291k87981j257971n7111n4693k232099l744419k543508P4053J862865
41929A3724427J818080k1603k494266l319276j511305P47246R15676j61566P7129
41920I774542J570832K081234J236204P66654R56776J57435j949351l513087l303376
41911G777863j920962j70974J441796J801712K48562j665498j935995j185314
41903D391190j348554j957493r59132J139310J570838l0308q40864O16551K480797
41894E062335K983046K751071K612545J954271M88906p37074j066698q80286j89841
41885A2978275J030441J197796j129185l872673l475275n81451N65908q62872
$$ plain form
41877 5850964 5029985 7325541 11451478 12853560 10692965 9245326 11444068 15176292
41869 15176292 17672198 19848862 23700090 28027982 29669508 27576626 23454551 19457421
41861 19457421 17152765 17649538 20525540 23014776 22238542 18524307 15249434 15032213
41853 15032213 16917671 17802540 16200029 13890154 13480040 14800209 14921893 12161236
41845 12161236 8645552 7538003 8759302 9438249 8196286 6804676 7317487 9469640
41837 9469640 11515183 12109509 10824764 8238817 5996152 5330823 5111717 3008126 -859526
41828 -859526 -3359108 -2459057 -45198 906494 482706 1219192 4109402 7131065 7759726
41819 7759726 5703746 2974070 1923544 3233940 5466886 6668537 6315668 5139457
$$ packed form
41877E850964q20979K295556M125937J402082k160595j447639K198742L732224
41869A5176292K495906K176664L851228M327892J641526k092882m122075l997130
41861A9457421k304656M96773K876002K489236p76234l714235l274873k17221
41853A5032213J885458Q84869j602511k309875m10114J320169J21684k760657
41845A2161236l515684j107549J221299O78947j241963j391610N12811K152153
41837I469640K045543N94326j284745k585947k242665o65329k19106k103591l867652
41828h59526k499582R00051K413859R51692m23788P36486K890210L021663O28661
41819G759726k055980k729676j050526J310396K232946J201651l52869j176211
$$ plain form
41811 5139457 3370705 506054 -3020163 -5536007 -6230853 -6181599 -6462183 -6622103 -6019008
41802 -6019008 -5147463 -4281848 -2234990 1726887 5766429 7223478 5879681 3742033
41794 3742033 2224075 1434376 1604221 2799799 3313857 976447 -3248446 -5313411 -2948354
41785 -2948354 1356945 3559018 2613350 268909 -2075104 -3974918 -4271323 -1678395
41777 -1678395 2411430 4004107 799202 -4851358 -8610126 -8858816 -7293782 -5597675
41769 -5597675 -3648166 -1284501 318286 457588 689484 2850337 5813099 6295065 3196874
41760 3196874 -708066 -2255457 -1522299 -769581 -1063454 -1660326 -1944085 -1906200 -863153
41751 -863153 2053877 5504012 6187069 3022078 -431618 256730 4950707 9330783 10349949
$$ packed form
41811E139457j768752k864651l526217k515844o94846M9254k80584j59920O03095
41802f019008Q71545Q65615K046858L961877M039542J457049j343797k137648
41794C742033j517958p89699J69845J195578N14058k337410m224893k064965K365057
41785b948354M305299K202073r45668k344441k344013j899814k96405K592928
41777a678395M089825J592677l204905n650560l758768k48690J565034J696107
41769e597675J949509K363665J602787J39302K31896K160853K962762M81966l098191
41760C196874l904940j547391P33158P52718k93873n96872k83759L7885J043047
41751h63153K917030L450135O83057l164991l453696O88348M693977M380076J019166
$$ plain form
41742 10349949 8945653 7057149 4698827 1595768 -442357 612556 3593770 4981548
41734 4981548 3002745 -1048864 -5309249 -8823614 -10357943 -8413970 -3684202 475334
41726 475334 1512647 280276 -890784 -1063749 -298082 1835261 5320497 8449742 9512082
41717 9512082 8921581 7975175 6583721 4226508 2034983 1448590 1571481 593954 -566978
41708 -566978 1010933 5775690 10786190 13718640 15003194 15250056 13471123 9367678
41700 9367678 5112885 3175477 3905150 6287515 9148708 10467700 7823681 1575405
41692 1575405 -3958784 -4568735 -556886 4311267 7134550 7704935 7159651 6561798 6349100
41683 6349100 6048093 4969771 3616309 3258693 3719458 3345703 1949073 1635017 3431972
$$ packed form
41742A0349949j404296j888504k358322l103059k038125J054913K981214J387778
41734D981548j978803m051609m260385l514365j534329J943973M729768M159536
41726D75334J037313j232371j171060j72965P65667K133343L485236L129245J062340
41717I512082n90501r46406j391454k357213k191525n86393J22891r77527j160932
41708e66978J577911M764757N010500K932450J284554K46862j778933m103445
41700I367678m254793j937408P29673K382365K861193J318992k644019o248276
41692A575405n534189o09951M011849M868153K823283N70385n45284n97853k12698
41683F349100l01007j078322j353462l57616M60765l73755j396630l14056J796955
$$ plain form
41674 3431972 5327505 5395214 4650942 4608357 4182356 1880295 -636470 -436020 2251883
41665 2251883 4624130 5643475 6682018 8209049 8944284 8360063 7213698 5455520
41657 5455520 2310465 -1341973 -3318763 -3174257 -2349566 -1103482 1805354 5805184
41649 5805184 7926850 6790716 4656212 4118196 4944991 5559701 5591920 5403972 4800165
41640 4800165 3762912 3162894 3495698 4085895 4397699 4734459 4907622 3939050 2031001
41631 2031001 1034340 1808049 2842277 2730797 2258771 2633548 3323809 3233098 2570085
41622 2570085 2070520 1786752 1991836 3539817 5705938 5601115 1939000 -2235018 -3055103
41613 -3055103 -797566 1212026 1479665 1224681 1170912 706839 235646 1279656 3659342
$$ packed form
41674C431972J895533O7709p44272m2585m26001k302061k516765K00450K687903
41665B251883K372247J019345J038543J527031P35235n84221j146365j758178
41657E455520l145055l652438j976790J44506Q24691J246084K908836L999830
41649E805184K121666j136134k134504n38016Q26795O14710L2219j87948o03807
41640D800165j037253o00018L32804N90197L11804L36760J73163r68572j908049
41631B031001r96661P73709J034228j11480m72026L74777O90261r0711o63013
41622B570085m99565k83768K05084J547981K166121j04823l662115m174018q20085
41613c055103K257537K009592K67639k54984n3769m64073m71193J044010K379686
$$ plain form
41604 3659342 5218200 5118513 4923998 5398044 4695092 1376217 -2759219 -4954103 -5376954
41595 -5376954 -6469617 -8813948 -9856045 -7420475 -3023210 -343371 -746801 -1681570
41587 -1681570 -197043 2857818 3671263 586480 -3278948 -3606317 45870 4145386
41579 4145386 5452965 3772382 808335 -1788403 -2798608 -1525511 1313286 3468054
41571 3468054 2926602 -218175 -3990397 -6446560 -7148274 -6914414 -6482127 -5766170 -4562944
41562 -4562944 -3428286 -3033513 -2909302 -2039976 -757989 -516137 -1363746 -1507526 -334690
41553 -334690 208467 -1045267 -1776706 680380 5014608 7756844 8376421 9081916 10010322
41544 10010322 8689000 5007338 2755738 4382441 7424923 8342443 7116204 5553315
$$ packed form
41604C659342J558858r9687j94515M74046p02952l318875m135436k194884m22851
41595e376954j092663k344331j042097K435570M397265K679839m03430r34769
41587a681570J484527L054861Q13445l084783l865428l27369L652187M099516
41579D145386J307579j680583k964047k596738j010205J273097K838797K154768
41571C468054n41452l144777l772222k456163p01714K33860M32287P15957J203226
41562d562944J134658L94773J24211Q69326J281987K41852q47609j43780J172836
41553c34690N43157j253734p31439K457086M334228K742236O19577P05495R28406
41544A0010322j321322l681662k251600J626703L042482R17520j226239j562889
$$ plain form
41536 5553315 3599862 533728 -1994174 -1647303 719820 2115123 1922105 2250072 3887830
41527 3887830 5139326 5169999 5309480 5847697 4534490 280137 -4006595 -4889216 -3300934
41518 -3300934 -3230281 -6100904 -9188117 -9882968 -9007753 -8741953 -9153872 -8585064 -6498491
41509 -6498491 -3997658 -1666735 1281966 5140319 8429952 9570707 8954137 8175997
41501 8175997 7742656 6862987 5355448 4356007 4778545 6145325 7371188 7775161 6939281
41492 6939281 4685308 1908949 444036 1141893 2795283 3844335 4375183 5353076 6594313
41483 6594313 6898420 5891285 4434258 3317757 2676518 2475735 2345278 1248331 -1085569
41474 -1085569 -2542555 -477867 4376839 7984314 7974045 6459134 6348223 6984602 6070664
$$ packed form
41536E553315j953453l066134k527902L46871K367123J395303j93018L27967J637758
41527C887830J251496L0673J39481N38217j313207m254353m286732q82621J588282
41518c300934P0653k870623l087213o94851Q75215K65800m11919N68808K086573
41509f498491K500833K330923K948701L858353L289633J140755o16570p78140
41501H175997m33341q79669j507539r99441M22538J366780J225863M03973q35880
41492F939281k253973k776359j464913O97857J653390J049052N30848R77893J241237
41483F594313L04107j007135j457027j116501o41239k00783j30457j096947k333900
41474a085569j456986K064688M854706L607475j0269j514911j10911O36379r13938
$$ plain form
41465 6070664 4424101 5124032 7826116 7708071 1917041 -5663389 -8790208 -6485180
41457 -6485180 -3374193 -3048060 -4283185 -4482048 -3866655 -4234621 -5412023 -5561906 -4446234
41448 -4446234 -3874508 -4490195 -4197070 -1013079 3718063 6362285 4851740 553027 -3472393
41439 -3472393 -5293604 -5362904 -5642083 -7460279 -9865035 -10421754 -8109889 -4851932 -3337211
41430 -3337211 -3902930 -4837657 -5372603 -6486892 -8380207 -9202367 -7660379 -5352214 -4569280
41421 -4569280 -4686214 -3074429 473030 2671609 1034094 -2639488 -4518114 -3279689
41413 -3279689 -803343 920610 1777637 2458046 2936389 2578279 1023857 -1309166 -3165469
41404 -3165469 -3148808 -1260230 595375 728986 -54730 169165 1012020 -10917 -3197905
$$ packed form
41465F070664j646563O99931K702084j18045n791030p580430l126819K305028
41457f485180L110987L26133j235125j98863O15393l67966j177402j49883J115672
41448d446234N71726o15687K93125L183991M731142K644222j510545m298713m025420
41439c472393j821211o9300k79179j818196k404756n56719K311865L257957J514721
41430c337211n65719r34727n34946j114289j893315q22160J541988K308165P82934
41421d569280j16934J611785L547459K198579j637515l673582j878626J238425
41413c279689K476346J723953Q57027O80409M78343l58110j554422k333023j856303
41404c165469J6661J888578J855605J33611p83716K23895Q42855j022937l186988
$$ plain form
41395 -3197905 -5179234 -3560176 -916162 -1368306 -4434044 -5653714 -3223294 -576807
41387 -576807 -1319697 -4480989 -6563892 -6098331 -4059315 -1462667 1010447 1982124 456274
41378 456274 -2315897 -4043643 -4311922 -4463088 -4813789 -4157307 -2251201 -594147 -2679
41369 -2679 582749 1784389 2069558 -111100 -3683712 -6033435 -5962497 -4196384 -1669503
41360 -1669503 1127050 3423127 4302027 3672915 2173106 294758 -1405907 -1623220 701930
41351 701930 4548153 7264837 7286728 5495730 3679671 2706140 2565222 3040611 3572422
41342 3572422 3258107 1771903 -196595 -1876270 -3126058 -3760265 -3078506 -948411 1322615
41333 1322615 2259305 2025565 2024751 2967468 4288876 5285449 5752480 5459073 4101750 2151660
$$ packed form
41395c197905j981329J619058K644014m52144l065738j219670K430420K646487
41387e76807p42890l161292k082903M65561K039016K596648K473114R71677j525850
41378D56274k772171j727746k68279j51166l50701O56482J906106J657054N91468
41369b679N85428J201640K85169k180658l572612k349723P0938J766113K526881
41360a669503K796553K296077Q78900o29112j499809j878348j700665k17313K325150
41351G01930L846223K716684K1891j790998j816059r73531j40918M75389N31811
41342C572422l14315j486204j968498j679675j249788o34207O81759K130095K271026
41333A322615R36690k33740q14R42717J321408R96573M67031k93407j357323j950090
$$ plain form
41323 2151660 846037 803596 1329723 1662312 2274137 4088338 6655698 8054848 6914163
41314 6914163 3969871 1134258 -665009 -2000317 -3225572 -3190648 -648187 3390070
41306 3390070 6037336 5733260 3970682 2979141 2615295 922298 -2563523 -5540688 -5311066
41297 -5311066 -1499313 3860621 8194057 10160301 10347246 10476089 11363690 11714434 9703467
41288 9703467 5610427 1767754 -93750 -102603 1187238 3562855 5752534 5352769 1868254
41279 1868254 -1628886 -1916832 216540 1354232 386507 -337527 1168703 3910772 5768854
41270 5768854 5978980 4813235 2528943 -63133 -1305862 -462477 987285 1053646 -416427
41261 -416427 -2232072 -3905813 -5665079 -6887020 -6444194 -4935231 -4799832 -7151163 -9707042
$$ packed form
41323B151660j305623m2441N26127L32589O11825J814201K567360J399150j140685
41314F914163k944292k835613j799267j335308j225255L4924K542461M038257
41306C390070K647266l04076j762578r91541l63846j692997l485821k977165K29622
41297e311066L811753N359934M333436J966244J86945J28843Q87601L50744k010967
41288I703467m093040l842673j861504q853J289841K375617K189679l99765l484515
41279A868254l497140k87946K133372J137692r67725p24034J506230K742069J858082
41270E768854K10126j165745k284292k592076j242729Q43385J449762O6361j470073
41261d16427j815645j673741j759266j221941M42826J508963J35399k351331k555879
$$ plain form
41252 -9707042 -9360674 -6295481 -3925854 -4565709 -6682230 -7274920 -5698241 -3675326 -2365104
41243 -2365104 -1465156 -1144320 -2465802 -4934767 -5849385 -3946201 -1995987 -3325493 -6866117
41234 -6866117 -8575655 -7346925 -6171271 -6920450 -7468347 -5760941 -3762450 -4535338 -7234235
41225 -7234235 -8112482 -5764115 -2572698 -1122062 -1688362 -3508160 -6138741 -8736486
41217 -8736486 -9823559 -8849529 -6851879 -4882750 -2912521 -917028 202890 -255655
41209 -255655 -1687262 -3142433 -4606753 -6283399 -7290479 -6453389 -4296059 -2926339
41201 -2926339 -3418854 -4167288 -2689099 1203650 4913569 5962399 4604263 2840293
41193 2840293 1438086 -725219 -4253627 -7680189 -9207980 -8876761 -7814112 -6249548
$$ packed form
41252i707042L46368L065193K369627o39855k116521n92690J576679K022915J310222
41243b365104Q99948L20836j321482k468965r14618J903184J950214j329506l540624
41234f866117j709538J228730J175654p49179n47897J707406J998491p72888k698897
41225g234235q78247K348367L191417J450636n66300j819798k630581k597745
41217h736486j087073R74030J997650J969129J970229J995493J119918m58545
41209b55655j431607j455171j464320j676646j007080Q37090K157330J369720
41201b926339m92515p48434J478189L892749L709919J048830j358136j763970
41193B840293j402207k163305l528408l426562j527791L31219J062649J564564
$$ plain form
41185 -6249548 -3852417 -1578353 -1394077 -3923051 -7635076 -10570153 -11766412 -11012199
41177 -11012199 -8643129 -5938812 -4377607 -3915499 -3009495 -715652 2243919 4627769
41169 4627769 5553492 4095037 -193539 -5696893 -9453397 -10433811 -10514017 -11236911 -11525005
41160 -11525005 -10022557 -7717097 -6209306 -5085803 -3409095 -2335404 -3381905 -5150280
41152 -5150280 -5038522 -3743775 -4566385 -8015546 -10616758 -9975098 -7715676 -6035763 -4565586
41143 -4565586 -2653810 -1836039 -3369752 -5560639 -6331081 -6537533 -7715035 -8233426 -5358096
41134 -5358096 -227826 3085459 3375108 3350947 4377861 4075308 800389 -2784121 -3050551
41125 -3050551 -82605 3322278 5548890 6675653 6513871 4797974 2727193 2008039
$$ packed form
41185f249548K397131K274064J84276k528974l712025k935077j196259P54213
41177a1012199K369070K704317J561205M62108R06004K293843K959571K383850
41169D627769R25723j458455m288576n503354l756504r80414q0206p22894k88094
41160a1525005J502448K305460J507791J123503J676708J073691j046501j768375
41152e150280J11758J294747q22610l449161k601212O41660K259422J679913J470177
41143d565586J911776Q17771j533713k190887p70442k06452j177502n18391K875330
41134e358096N130270L313285K89649k4161J026914l02553l274919l584510k66430
41125c050551K967946L404883K226612J126763j61782j715897k070781p19154
$$ plain form
41117 2008039 2523295 2699974 1876128 657981 -621707 -2005660 -2868616 -2671783 -2390379
41108 -2390379 -3049334 -3155544 -329963 4166020 5599737 1891180 -2998896 -3884894 -701437
41099 -701437 2245277 1995640 -599864 -3330150 -4865218 -4539989 -2280220 589125 2142105
41090 2142105 2148472 2313772 3767359 5675267 7007659 8279765 10317272 12152242 11629787
41081 11629787 8157033 3898957 1822948 2845203 5157614 6273424 5411787 3600130
41073 3600130 1781402 -187078 -2286516 -3193436 -1576005 1896941 5007913 6300136
41065 6300136 5945339 4630793 2926068 1699333 1653076 2108593 1586961 -14848 -1191884
41056 -1191884 -1210217 -1121574 -1601097 -1451385 371119 2627976 3479877 3403758 4433930
$$ packed form
41117B008039N15256J76679q23846j218147j279688j383953q62956J96833K81404
41108b390379o58955j06210K825581M495983J433717l708557m890076q85998L183457
41099g01437K946714k49637k595504k730286j535068L25229K259769K869345J552980
41090B142105O367J65300J453587J907908J332392J272106K037507J834970n22455
41081A1629787l472754m258076k076009J022255K312411J115810q61637j811657
41073C600130j818728j968480k099438r06920J617431L472946L110972J292223
41065F300136l54797j314546j704725j226735m6257M55517n21632j601809j177036
41056a191884j8333Q8643m79523J49712J822504K256857Q51901p6119J030172
$$ plain form
41047 4433930 6721712 7722227 5263748 255348 -4142731 -5398172 -3485726 -454964
41039 -454964 1676511 2648537 3241999 3059843 536973 -4015512 -7074665 -5601775 -1207843
41030 -1207843 1587944 949882 -700948 -813028 11665 -311824 -2442713 -5591837 -8823033
41021 -8823033 -11093607 -11345249 -9991733 -9269866 -10579681 -12173419 -10996545 -6466653
41013 -6466653 -1099624 2388327 3322086 2498360 790171 -1087021 -2254084 -2027951 -747898
41004 -747898 101787 -874065 -3291681 -4991913 -4506626 -3181869 -3604575 -5927703 -7393318
40995 -7393318 -6128807 -3799197 -3302369 -5105313 -7266939 -8068828 -7099428 -4589933 -1395098
40986 -1395098 864844 1214442 437542 -593161 -2750640 -6679477 -9685443 -7590054
$$ packed form
41047D433930K287782J000515k458479n008400m398079j255441J912446L030762
41039d54964K131475R72026N93462j82156k522870m552485l059153J472890M393932
41030a207843K795787o38062j650830j12080Q24693l23489k130889l149124l231196
41021h823033k270574k51642J353516P21867j309815j593738J176874M529892
41013f466653N367029L487951R33759q23726j708189j877192j167063K26133J280053
41004g47898Q49685r75852k417616j700232M85287J324757m22706k323128j465615
40995g393318J264511K329610M96828j802944k161626q01889R69400K509495L194835
40986a395098K259942L49598p76900j030703k157479l928837l005966K095389
$$ plain form
40978 -7590054 -314718 6870368 8893502 5981352 2253195 911821 2019705 3638760
40970 3638760 3828462 2350831 1201913 2487863 5309197 6249161 3655826 -307707
40962 -307707 -2824924 -3589994 -3383839 -1764852 1414885 3889786 3311389 874048 -106440
40953 -106440 1295889 3154933 4237515 5027158 5260066 3653214 798549 -580588 603728
40944 603728 2283748 2672472 2789739 4127264 6100974 7539039 8618964 9444227 8663916
40935 8663916 5712954 2830707 2595360 4751199 7508653 10360425 13154474 14116202
40927 14116202 12092882 9629442 10097753 12261066 11699631 7835399 5174931 6219128
40919 6219128 7375769 4584122 -408801 -2986171 -2694352 -3325992 -6703539 -10129763
$$ packed form
40978g590054P275336P185086K023134k912150l728157j341374J107884J619055
40970C638760J89702j477631j148918J285950K821334R39964k593335l963533
40962c07707k517217p65070K06155J618987L179737K474901n78397k437341r80488
40953a06440J402329J859044J082582P89643K32908j606852k854665j379137J184316
40944F03728J680020L88724J17267J337525J973710J438065J079925Q25263p80311
40935H663916k950962k882247k35347K155839K757454K851772K794049R61728
40927A4116202k023320k463440M68311K163313n61435l864232k660468J044197
40919F219128J156641k791647m992923k577370K91819o31640l377547l426224
$$ plain form
40911 -10129763 -10565737 -8429842 -6028594 -4243560 -2356678 -117324 1558137 1840262
40903 1840262 956964 -395988 -2080729 -4333700 -6634825 -7717334 -7422490 -7690572 -10212389
40894 -10212389 -13376313 -13409684 -8952865 -2750574 1838420 4107675 4786063 3757548
40886 3757548 966864 -2015529 -3687932 -4853648 -6836535 -8329956 -6721677 -2275792
40878 -2275792 1704981 3088057 2786509 2078710 694114 -1515567 -3373337 -4115542 -4403730
40869 -4403730 -4473642 -3327302 -1112132 -75835 -1203490 -1964905 -22713 2404779 1157225
40860 1157225 -3493139 -6494338 -4530165 59869 2939909 2773207 952327 -1441919
40852 -1441919 -4057105 -5942888 -6371712 -6587601 -8383042 -10833625 -10785422 -7319445 -3542661
$$ packed form
40911a0129763m35974K135895K401248J785034J886882K239354J675461K82125
40903A840262q83298j352952j684741k252971k301125j082509K94844k68082k521817
40894a0212389l163924l3371M456819O202291M588994K269255O78388j028515
40886C757548k790684k982393j672403j165716j982887j493421J608279M445885
40878b275792L980773J383076l01548p07799j384596k209681j857770p42205k88188
40869d403730o9912J146340K215170J036297j127655p61415J942192K427492j247554
40860A157225m650364l001199J964173M590034K880040j66702j820880k394246
40852a441919k615186j885783m28824k15889j795441k450583M8203L465977L776784
$$ plain form
40843 -3542661 -2560184 -3559310 -3901085 -3585690 -4810216 -7637579 -9292887 -8384768 -6941245
40834 -6941245 -6921416 -7302432 -6562064 -5717973 -6232481 -6642099 -4507943 -856872 673610
40825 673610 -938976 -2843242 -2688465 -1372983 -673006 -794777 -1296044 -2037994 -2198125
40816 -2198125 -740194 1072870 318199 -2948012 -4483225 -1445473 3299560 5078574
40808 5078574 3528270 1821075 1369738 646953 -1402947 -3795416 -5231004 -5121011 -3275353
40799 -3275353 -645325 358283 -1355348 -3200152 -1938415 1580093 3562873 2706764
40791 2706764 1367544 1434061 2353615 3584145 5631787 7817041 8190714 6809789 6122741
40782 6122741 6822721 6296688 2808693 -1613556 -4367426 -5708530 -6882982 -7337787 -6270900
$$ packed form
40843c542661R82477r99126l41775L15395j224526k827363j655308R08119J443523
40834f941245J9829l81016P40368Q44091n14508m09618K134156L651071J530482
40825F73610j612586j904266J54777J315482O99977j21771n01267p41950j60131
40816b198125J457931J813064p54671l266211j535213L037752M745033J779014
40808E078574j550304j707195m51337p22785k049900k392469j435588J09993J845658
40799c275353K630028J003608j713631j844804J261737L518508J982780q56109
40791B706764j339220O6517R19554J230530K047642K185254L73673j380925o87048
40782F122741O99980n26033l487995m422249k753870j341104j174452m54805J066887
$$ plain form
40773 -6270900 -4815580 -4046164 -2689646 376597 3018047 2380403 -598312 -2418439
40765 -2418439 -2095671 -1795507 -2620862 -3083979 -2355506 -2052874 -3438129 -4958350 -4191937
40756 -4191937 -1075647 2116502 3414571 2873981 1953119 1780676 2167570 2333011 2326026
40747 2326026 2927886 3991315 4069206 2430403 323968 -762501 -1013690 -1262134 -1189477
40738 -1189477 -119457 1279519 1802792 1588380 1498000 1160133 -602671 -3677271 -6548029
40729 -6548029 -8014438 -7776162 -6058123 -4179030 -4467490 -7505143 -10276831 -9511573 -6273594
40720 -6273594 -4484961 -5217293 -5641943 -3980149 -2137707 -2133944 -2739265 -1541682 1521431
40711 1521431 4358687 5107783 3151623 -886128 -5078641 -7284818 -7070051 -5527053
$$ packed form
40773f270900J455320P69416J356518L066243K641450o37644k978715j820127
40765b418439L22768L00164q25355m63117P28473L02632j385255j520221P66413
40756d191937L116290L192149J298069n40590r20862j72443L86894J65441o985
40747B326026O01860J063429P7891j638803k106435j086469k51189k48444P2657
40738a189477J070020J398976N23273k14412r0380l37867j762804l074600k870758
40729f548029j466409K38276J718039J879093k88460l037653k771688P65258L237979
40720f273594J788633p32332m24650J661794J842442L763o05321J197583L063113
40711A521431K837256P49096j956160m037751m192513k206177K14767J542998
$$ plain form
40703 -5527053 -3221456 -230515 1735749 107003 -4589000 -8216461 -8017797 -5673913
40695 -5673913 -3761732 -1957574 725277 2491072 1146623 -1398255 -752737 3867807
40687 3867807 8169914 7922460 3407576 -1760802 -4507024 -4412993 -3278832 -3183589 -4399942
40678 -4399942 -5179760 -3958712 -1258128 1062642 1600998 -56057 -3290276 -6058290
40670 -6058290 -6048170 -3548847 -1746169 -2709044 -4642813 -4849465 -3602720 -2675449 -1636211
40661 -1636211 1276520 5422722 8005577 7759219 5679108 2489214 -1709229 -5552689
40653 -5552689 -7350073 -7982635 -9741840 -12149416 -12414140 -10495388 -9728711 -11060999 -10651171
40644 -10651171 -5591143 1366371 5751320 7301276 8581920 9784859 8766440 5375261
$$ packed form
40703e527053K305597K990941J966264j628746m696003l627461J98664K343884
40695e673913J912181J804158K682851J765795j344449k544878O45518M620544
40687C867807M302107k47454m514884n168378k746222R4031J134161R5243j216353
40678d399942p79818J221048K700584K320770N38356j657055l234219k768014
40670f058290J0120K499323J802678r62875j933769k06652J246745R27271J039238
40661a636211K912731M146202K582855k46358k080111l189894m198443l843460
40653e552689j797384o32562j759205k407576k64724J918752P66677j332288M09828
40644a0651171N060028O957514M384949J549956J280644J202939j018419l391179
$$ plain form
40636 5375261 2090470 240664 -1452386 -3947411 -5783663 -4848191 -902362 4253295
40628 4253295 8241773 9563140 8453404 6407849 4334244 1636184 -2068386 -5038562
40620 -5038562 -4694022 -796425 3785786 5676635 3738964 -472879 -4092573 -4961195
40612 -4961195 -3259438 -1257775 -900699 -1816615 -2230460 -1310351 345614 2195064 4460792
40603 4460792 7134669 9258820 9803147 8887795 7654308 6904180 6180567 4659832 3016757
40594 3016757 3485830 7090507 11470146 13075238 11422397 9362583 8897046 8862770 7566208
40585 7566208 5422015 3427475 1050211 -2231552 -4789499 -4606789 -2237034 100502
40577 100502 1389555 1581665 -283262 -4706959 -9033608 -9443534 -5967724 -2503333 -1177230
$$ packed form
40636E375261l284791j849806j693050k495025j836252R35472L945829N155657
40628D253295L988478J321367j109736k045555k073605k698060l704570k970176
40620e038562L44540L897597M582211J890849j937671m211843l619694q68622
40612d961195J701757K001663L57076r15916m13845R20109J655965J849450K265728
40603D460792K673877K124151N44327r15352j233487p50128p23613j520735j643075
40594C016757M69073L604677M379639J605092j652841k059814m65537l4276j296562
40585G566208k144193j994540k377264l281763k557947J82710K369755K337536
40577A00502J289053J92110j864927m423697m326649m09926L475810L464391J326103
$$ plain form
40568 -1177230 269205 4165205 8738302 10324955 8028042 4259680 1738284 1400845
40560 1400845 2310077 2384752 113644 -3475941 -5573381 -5135347 -4340061 -5418780 -7472720
40551 -7472720 -7896412 -5767011 -2264765 1189480 3503928 3572803 1346370 -1175205 -1732573
40542 -1732573 -321040 1481195 3065622 4875557 6375329 6061322 3701284 815453
40534 815453 -1350394 -2779670 -3441993 -2781154 -851751 1516773 3959302 6372288 7330724
40525 7330724 4912652 -79218 -3858606 -3899115 -1571613 776833 3169522 6314998
40517 6314998 8603495 7874045 5187245 3611187 3462913 1939249 -2053368 -5728850
40509 -5728850 -6242097 -4223981 -2153801 -1346137 -2019913 -4325552 -7491869 -9590828 -9932040
$$ packed form
40568a177230J446435L896000M573097J586653k296913l768362k521396l37439
40560A400845R09232P4675k271108l589585k097440M38034P95286j078719k053940
40551g472720m23692K129401L502246L454245K314448O8875k226433k521575n57368
40542a732573J411533J802235J584427J809935J499772l14007k360038k885831
40534H15453k165847j429276o62323O60839J929403K368524K442529K412986R58436
40525G330724k418072m991870l779388m0509K327502K348446K392689L145476
40517F314998K288497p29450k686800j576058j48274j523664l992617l675482
40509e728850n13247K018116K070180Q07664o73776k305639l166317k098959l41212
$$ plain form
40500 -9932040 -10148409 -11157313 -10937296 -7756053 -3919179 -3219175 -5718027 -8343963 -9934902
40491 -9934902 -11947674 -14279480 -14561687 -12544389 -11182831 -11652496 -11045335 -7466761 -3953296
40482 -3953296 -3957335 -5611796 -4468890 -395989 2236788 659387 -3477307 -7131514 -8579687
40473 -8579687 -7252629 -3998971 -1635074 -2248464 -3812205 -2637727 575403 909175
40465 909175 -3458517 -7964820 -7861473 -4407465 -2016762 -1902454 -2053499 -1792667 -2487146
40456 -2487146 -4179771 -4958471 -4070953 -2950349 -2495820 -1633690 488782 2694675 3224940
40447 3224940 1758978 -749653 -3046942 -3724381 -1816755 1556842 3174351 813920
40439 813920 -3917317 -6951888 -5847065 -1715792 2604942 5228515 6046991 6018341 6131686
$$ packed form
40500i932040k16369j008904K20017L181243L836874P00004k498852k625936j590939
40491i934902k012772k331806k82207K017298J361558m69665O07161L578574L513465
40482c953296m039j654461J142906M072901K632777j577401m136694l654207j448173
40473h579687J327058L253658K363897o13390j563741J174478L213130L33772
40465I09175m367692m506303J03347L454008K390703J14308j51045K60832o94479
40456b487146j692625p78700Q87518J120604M54529Q62130K122472K205893N30265
40447C224940j465962k508631k297289o77439J907626L373597J617509k360431
40439H13920m731237l034571J104823M131273M320734K623573Q18476k8650J13345
$$ plain form
40430 6131686 6432307 5760123 3160223 -193865 -1591327 -102294 1733592 836865 -2527789
40421 -2527789 -5365354 -5899841 -4954956 -3665950 -2330956 -1957336 -4094937 -7735490 -9060614
40412 -9060614 -6458042 -3506109 -4268238 -7602650 -9423156 -8941192 -8532935 -8267846 -5444952
40403 -5444952 -183020 3254604 2583860 976054 1957612 4236805 4580195 3041626 1917013
40394 1917013 1549385 802793 422086 2243573 5494960 7222904 6595490 5968748 7195079
40385 7195079 9263849 10309551 9991319 9008293 7718099 6154372 4608581 3624230 3725295
40376 3725295 4997917 6522769 6803338 5410693 3457322 1797553 14612 -1775815
40368 -1775815 -1810827 740703 3543149 3893700 2692950 2793126 4064747 3416036 -135499
$$ packed form
40430F131686L00621o72184k599900l354088j397462J489033J835886q96727l364654
40421b527789k837565n34487R44885J289006J334994L73620k137601l640553j325124
40412i060614K602572K951933p62129l334412j820506M81964M08257K65089K822894
40403e444952N261932L437624o70744j607806R81558K279193L43390j538569j124613
40394A917013l67628p46592l80707J821487L251387J727944o27414o26742J226331
40385G195079K068770J045702l18232r83026j290194j563727j545791r84351J01065
40376C725295J272622J524852K80569j392645j953371j659769j782941j790427
40368a775815l5012K551530K802446L50551j200750J00176J271621o48711l551535
$$ plain form
40359 -135499 -3739118 -4975304 -4843078 -4969158 -4382616 -1202145 4026664 8693056 10989784
40350 10989784 10940354 9250690 6468736 3027623 -593883 -3444850 -3782464 -370167
40342 -370167 5319152 9457639 9540980 7010287 5255246 5613119 6419553 5783698 4191663
40333 4191663 3803520 5479408 7290148 6720756 4085573 2374934 3209095 4606733 4170236
40324 4170236 2944519 3800886 6819363 8948146 8187980 5596177 2847317 291751
40316 291751 -1877943 -2884001 -2909927 -3542922 -5564916 -7754197 -8662658 -8152329 -6720908
40307 -6720908 -5093629 -4949438 -7859872 -12612365 -15705393 -15540622 -14035562 -13080872 -11903813
40298 -11903813 -9497453 -7142790 -6286642 -5883098 -4214993 -1816394 -295837 384664
$$ packed form
40359a35499l603619j236186J32226j26080N86542L180471N228809M666392K296728
40350A0989784m9430j689664k781954l441113l621506k850967l37614L412297
40342c70167N689319M138487Q3341k530693j755041L57873Q06434o35855j592035
40333D191663l88143J675888J810740n69392k635183j710639Q34161J397638m36497
40324D170236j225717Q56367L018477K128783p60166k591803k748860k555566
40316B91751k169694j006058k5926o32995k021994k189281r08461N10329J431421
40307f720908J627279J44191k910434m752493l093028J64771J505060R54690J177059
40298a1903813K406360K354663Q56148M03544J668105K398599J520557O80501
$$ plain form
40290 384664 1159852 1587260 661690 -999534 -1951256 -2103546 -2136238 -1660477 -57173
40281 -57173 1689856 2140460 1698607 1766912 2345572 2485658 2334731 2603057 2730483 1715694
40271 1715694 -4123 -1615521 -3768197 -6792122 -8262764 -5686414 -1027734 1141185
40263 1141185 142983 86779 3409348 7169388 7516925 4855435 2292248 1128712 370040
40254 370040 -525000 -773105 17028 745788 -157485 -2825681 -5121814 -4414954 -967099
40245 -967099 1461813 31354 -3029290 -3019831 940286 5001910 6005314 4667879 2612259
40236 2612259 -474187 -4861650 -8562683 -9494805 -8392255 -7678731 -8573415 -10669940 -12978186
40227 -12978186 -13965914 -12046622 -7654699 -3602219 -1895170 -1515449 -868687 -838709 -3269069
$$ packed form
40290C84664P75188M27408r25570j661224r51722j52290l2692M75761J603304
40281e7173J747029M50604m41853O8305N78660J40086j50927K68326J27426j014789
40271A715694j719817j611398k152676l023925j470642K576350M658680K168919
40263A141185r98202n6204L322569L760040L47537k661490k563187j163536p58672
40254C70040q95040k48105P90133P28760r03273k668196k296133P06860L447855
40245i67099K428912j430459l060644R459L960117M061624J003404j337435k055620
40236B612259l086446m387463l701033r32122J102550P13524q94684k096525k308246
40227a2978186r87728J919292M391923M052480J707049L79721O46762K9978k430360
$$ plain form
40218 -3269069 -7527362 -10951798 -12262732 -12435476 -12315986 -11265018 -8500469 -4560623
40210 -4560623 -1157983 -140264 -2141708 -5456076 -6884804 -4801642 -980980 1484327
40202 1484327 1482794 218347 -862665 -1097423 -103488 2220025 5121766 7365007 8164016
40193 8164016 7329711 5125422 2678295 1699367 2731962 4280126 4651376 4005194 3616017
40184 3616017 3987079 4960826 6848515 9811185 12550795 13216295 11506631 8625920 5455217
40175 5455217 2157988 -636858 -1861265 -1464675 -630565 -232360 34752 790341 1928785
40166 1928785 2517892 1378298 -1755577 -5095059 -5683153 -2554667 1612237 3276517
40158 3276517 2012489 445605 692505 2339183 3725334 3751742 2378627 539646 -467138
$$ packed form
40218c269069m258293l424436j310934j72744J19490J050968K764549L939846
40210d560623L402640J017719k001444l314368j428728K083162L820662K465307
40202A484327j533j264447j081012k34758R93935K323513K901741K243241P99009
40193H164016q34305k204289k447127r78928J032595J548164L71250o46182l89177
40184C616017L71062R73747J887689K962670K739610O65500j709664k880711l170703
40175E455217l297229k794846j224407L96590Q34110L98205K67112P55589J138444
40166A928785N89107j139594l133875l339482n88094L128486M166904J664280
40158C276517j264028j566884K46900J646678J386151K6408j373115j838981j006784
$$ plain form
40149 -467138 -508729 -1169907 -3579058 -6235771 -6636190 -4734550 -2965792 -2900141 -3788728
40140 -3788728 -4611795 -5560426 -6828897 -7636469 -7312947 -6110137 -4342216 -1999577 232021
40131 232021 958672 -129173 -1604656 -2194321 -2293022 -2923924 -4212087 -5625730 -6867207
40122 -6867207 -7839245 -8385109 -8440100 -7734252 -5348128 -819745 4077413 6202017 4431488
40113 4431488 963630 -1451556 -2329953 -2739695 -3162005 -3355395 -3534141 -4423650 -6318164
40104 -6318164 -8582189 -9776369 -8400319 -4538789 -730571 296144 -1016716 -1691762
40096 -1691762 -566297 257070 -681726 -1337697 751094 4366904 6066899 4653325 1932609
40087 1932609 -140492 -821384 271613 2946278 5431778 5565640 3102060 -509500
$$ packed form
40149d67138m1591o61178k409151k656713m00419J901640J768758O5651q88587
40140c788728q23067r48631j268471q07572L23522J202810J767921K342639K231598
40131B32021P26651j087845j475483n89665r8701o30902j288163j413643j241477
40122f867207r72038n45864n4991P05848K386124M528383M897158K124604j770529
40113D431488l467858k415186q78397m09742m22310j93390j78746q89509j894514
40104f318164k264025j194180J376050L861530L808218J026715j312860o75046
40096a691762J125465Q23367r38796o55971K088791L615810J699995j413574k720716
40087A932609k073101o80892J092997K674665K485500J33862k463580l611560
$$ plain form
40079 -509500 -4084198 -6797493 -7288213 -5192686 -3163071 -4510498 -8565913 -11029900
40071 -11029900 -9427152 -5565988 -1944414 1239257 4103056 5143000 3647638 1833057
40063 1833057 1941002 2789138 1803645 -851847 -2988446 -4198086 -5772162 -7267460 -6640941
40054 -6640941 -4299072 -3634396 -6044533 -8158089 -6133927 -877126 3193403 3360868
40046 3360868 620305 -2501867 -4021665 -3019196 -279546 1642119 810316 -1625461
40038 -1625461 -2993072 -2883707 -3203480 -4302831 -3756818 -261141 3592367 4501797 2897171
40029 2897171 1906893 2728939 3364777 1817666 -1453571 -4493075 -5705247 -4624132 -2292722
40020 -2292722 -978079 -2059305 -4186515 -5135196 -5286409 -6866811 -9359186 -8772430 -3358866
$$ packed form
40079e09500l574698k713295m90720K095527K029615j347427m055415k463987
40071a1029900J602748L861164L621574L183671K863799J039944j495362j814581
40063A833057J07945Q48136r85493k655492k136599j209640j574076j495298O26519
40054f640941K341869O64676k410137k113556K024162N256801M070529J67465
40046C360868k740563l122172j519798J002469K739650J921665q31803k435777
40038a625461j367611J09365l19773j099351N46013L495677L853508R09430j604626
40029B897171r90278Q22046O35838j547111l271237l039504j212172J081115K331410
40020b292722J314643j081226k127210r48681j51213j580402k492375N86756N413564
$$ plain form
40011 -3358866 2526625 3268316 -731286 -3942397 -3484324 -2485291 -4682351 -8664760 -9779492
40002 -9779492 -6260162 -1045729 2200581 2858922 2621390 2486925 1828079 204318 -1130877
39993 -1130877 -374948 2430036 5001728 5121179 2782863 -265751 -2424569 -3043778 -2071314
39984 -2071314 -119294 1306669 920636 -738942 -1851763 -1772457 -1830506 -3111442 -4607921
39975 -4607921 -4627975 -3162446 -1502944 -76985 1643400 3095100 2378800 -1102782 -5257519
39966 -5257519 -7877811 -9521137 -12092203 -15128751 -15652567 -12101072 -6538088 -2064880
39958 -2064880 363698 1344846 886167 -1116777 -3219561 -3681693 -3287060 -4601429 -8013630
39949 -8013630 -10786205 -10955043 -9935292 -9655994 -9084914 -6046975 -1412195 1315709 607902
$$ packed form
40011c358866N885491P41691l999602l211111M58073R99033k197060l982409j114732
40002i779492L519330N214433L246310O58341k37532j34465o58846j623761j335195
39993a130877P55929K804984K571692J19451k338316l048614k158818o19209R72464
39984b071314J952020J425963l86033j659578j112821P9306n8049j280936j496479
39975d607921k0054J465529J659502J425959J720385J451700p16300l481582m154737
39966e257519k620292j643326k571066l036548n23816L551495N562984M473208
39958b064880K428578R81148m58679k002944k102784m62132L94633j314369l412201
39949h013630k772575j68838J019751K79298N71080L037939M634780K727904p07807
$$ plain form
39940 607902 -1287340 -1743044 -904537 -366061 -386707 -127293 155128 -991416 -3897184
39931 -3897184 -6628516 -6868194 -4392063 -1083408 1164903 1838272 1250084 -247174 -1832291
39922 -1832291 -1950933 112214 2641810 3019818 1107664 -448843 106866 1366110 1298778
39913 1298778 336156 -34795 -441626 -2745522 -6417959 -8607499 -8277235 -7713072 -8847333
39904 -8847333 -10317376 -9761301 -7294649 -4840572 -3279288 -2303270 -2267153 -3935357 -6542401
39895 -6542401 -8150844 -8238204 -8157586 -8498063 -7736135 -4641754 -756720 1065325 168878
39886 168878 -1121596 -225838 3100251 6975048 9388303 9727158 8923223 8491011 9180056
39877 9180056 10399624 11086456 10850039 9666947 6827623 1663378 -4172411 -6805006
$$ packed form
39940F07902j895242m55704Q38507N38476k0646K59414K82421j146544k905768
39931c897184k731332k39678K476131L308655K248311O73369n88188j497258j585117
39922a832291j18642K063147K529596L78008j912154j556507N55709J259244o7332
39913A298778r62622l70951m06831k303896l672437k189540L30264N64163j134261
39904h847333j470043N56075K466652K454077J561284R76018L6117j668204k607044
39895f542401j608443q7360Q0618l40477P61928L094381L885034J822045q96447
39886A68878j290474Q95758L326089L874797K413255L38855q03935m32212O89045
39877I180056J219568O86832k36417j183092k839324n164245n835789k632595
$$ plain form
39869 -6805006 -4195326 712598 2846508 801409 -2214750 -3297350 -3205131 -3797877 -4629806
39860 -4629806 -4264189 -3273415 -3249271 -3710012 -2821233 -994368 -880643 -3232382 -5409686
39851 -5409686 -5097064 -3182981 -1490445 182780 2690166 4916512 5205053 4635995 6116602
39842 6116602 10005521 13038217 12500850 9667188 7790288 7848061 7811168 5758731 2352948
39833 2352948 -116364 -365528 782305 1707464 1847045 1920753 2493419 2902589 2062989
39824 2062989 119699 -1317123 -797663 1510698 4291931 6604270 8306187 9138693
39816 9138693 8448752 6445659 4838491 4896731 5194295 3038477 -1381372 -4142988 -2325719
39807 -2325719 1810134 3440801 1181687 -1997301 -3740798 -5330377 -8685340 -12858045
$$ packed form
39869f805006K609680M907924K133910k045099l016159j082600R2219n92746q31929
39860d629806L65617R90774K4144m60741Q88779J826865J13725k351739k177304
39851e409686L12622J914083J692536J673225K507386K226346K88541n69058J480607
39842F116602L888919L032696n37367k833662j876900N7773l6893k052437l405783
39833B352948k469312k49164J147833R25159J39581P3708N72666M09170q39600
39824B062989j943290j436822N19460K308361K781233K312339J701917Q32506
39816I138693o89941k003093j607168N8240K97564k155818m419849k761616J817269
39807b325719M135853J630667k259114l178988j743497j589579l354963m172705
$$ plain form
39799 -12858045 -15538444 -16404154 -16593775 -15769467 -12430732 -7339049 -4133815 -5212392
$$ packed form
39799a2858045k680399q65710j89621Q24308L338735N091683L205234j078577
$$ [...]
##END NTUPLES=NMR SPECTRUM
##END=
