##TITLE=31Pdec_DE-82K5_TFA
CDCl3, 24 sc
 4.8.2025
##JCAMPDX= 6.0         $$ Bruker NMR JCAMP-DX V2.0
##DATA TYPE= NMR SPECTRUM
##DATA CLASS= NTUPLES
##ORIGIN= UXNMR, Bruker Analytische Messtechnik GmbH
##OWNER= root
$$ XWIN-NMR		Version 3.5
$$ Mon Aug  4 15:54:16 2025 Russian Standard Time (UT+4h)  she@DPX200
##.OBSERVE FREQUENCY= 81.013821
##.OBSERVE NUCLEUS= ^31P
##.ACQUISITION MODE= SIMULTANEOUS
##.ACQUISITION SCHEME= undefined
##.AVERAGES= 64
##.DIGITISER RES= 17
##SPECTROMETER/DATA SYSTEM= spect
##.PULSE SEQUENCE= zgpg30
##.SOLVENT NAME= CDCl3
##.SHIFT REFERENCE= (INTERNAL, CDCl3, 0, 198.062)
##AUDIT TRAIL= $$ (NUMBER, WHEN, WHO, WHERE, WHAT)
$$ ##TITLE= Audit trail, XWIN-NMR		Version 3.5
$$ ##JCAMPDX= 5.01
$$ ##ORIGIN= Bruker BioSpin GmbH
$$ ##OWNER= she
$$ F:/spectra/data/she/nmr/P31/2/pdata/1/auditp.txt
$$ ##AUDIT TRAIL=  $$ (NUMBER, WHEN, WHO, WHERE, WHAT)
(   1,<2025-08-04 15:53:22.92 +0400>,<she>,<DPX200>,
      <created by zg, POWCHK disabled, PULCHK disabled
       configuration hash MD5:
       00 E9 B6 7A A2 85 ED C7 34 08 36 98 17 FE 4E 26
       data hash MD5: 32K
       12 8E EC 8F 8B 71 04 51 24 95 6D A5 E7 CB 9D 8F>)
(   2,<2025-08-04 15:53:25.10 +0400>,<she>,<DPX200>,
      <Start of raw data processing
       efp BC_mod = 2 LB = 1.5 FT_mod = 6 PKNL = 1 PHC0 = 1124.52 PHC1 = 870.499 SI = 64K 
       data hash MD5: 64K
       4C 4B 4D 63 49 33 5F 5F ED 52 B9 D6 3E 5A F5 93>)
(   3,<2025-08-04 15:53:42.64 +0400>,<she>,<DPX200>,
      <pk PHC0 = 0.6264825 PHC1 = 0 
       data hash MD5: 64K
       C3 59 43 CF 2D E7 F6 5A FD A7 34 F0 4B D8 EA 4D>)
(   4,<2025-08-04 15:53:49.07 +0400>,<she>,<DPX200>,
      <abs ABSG = 5 
       data hash MD5: 64K
       82 13 4A 51 60 B5 D9 86 CE 91 29 C4 0B 61 09 50>)
$$ ##END=
$$ 
$$ hash MD5
$$ 07 8C A6 53 A3 18 16 85 1C 8A F1 CA 91 07 00 CD
##$RELAX= 
##$RELAX= 
##$RELAX= 
##$RELAX= 
##$RELAX= 
##$RELAX= 
##$RELAX= 
##$RELAX= 
$$ Bruker specific parameters
$$ --------------------------
##$DU= <F:/spectra>
##$EXPNO= 2
##$NAME= <P31>
##$PROCNO= 1
##$TYPE= <nmr>
##$USER= <she>
##$AMP= (0..31)
100 100 100 100 100 100 100 100 100 100 100 100 100 100 100 100 100 100 
100 100 100 100 100 100 100 100 100 100 100 100 100 100 
##$AQSEQ= 0
##$AQ_mod= 1
##$AUNM= <au_zg>
##$AUTOPOS= <>
##$BF1= 81.014009
##$BF2= 200.13
##$BF3= 200.13
##$BF4= 200.13
##$BF5= 200.13
##$BF6= 200.13
##$BF7= 200.13
##$BF8= 200.13
##$BYTORDA= 1
##$CFDGTYP= 0
##$CFRGTYP= 5
##$CHEMSTR= <none>
##$CNST= (0..31)
1 1 145 1 1 1 1 1 1 1 1 1 1 1 1 1 1 1 1 1 1 1 1 1 1 1 1 1 1 1 1 1 
##$CPDPRG= <waltz16>
##$CPDPRG1= <>
##$CPDPRG2= <waltz16>
##$CPDPRG3= <>
##$CPDPRG4= <mlev>
##$CPDPRG5= <mlev>
##$CPDPRG6= <mlev>
##$CPDPRG7= <mlev>
##$CPDPRG8= <mlev>
##$CPDPRGB= <>
##$CPDPRGT= <>
##$D= (0..31)
0 1 0 0 0 0 0 0 0 0.06 0 0.03 2e-05 3e-06 0 0 0.0002 0 0 0 0 0 0 0 0 0 
0 0 0 0 0 0 
##$DATE= 1754308402
##$DBL= (0..7)
120 120 120 11 120 120 24 19 
##$DBP= (0..7)
150 150 150 150 150 150 150 150 
##$DBP07= 0
##$DBPNAM0= <>
##$DBPNAM1= <>
$$ [...]
##$SUBNAM3= <"">
##$SUBNAM4= <"">
##$SUBNAM5= <"">
##$SUBNAM6= <"">
##$SUBNAM7= <"">
##$SUBNAM8= <"">
##$SUBNAM9= <"">
##$SW= 400.765351723535
##$SWIBOX= (0..15)
0 1 3 0 0 0 0 0 0 0 0 0 0 0 0 0 
##$SW_h= 32467.5324675325
##$TD= 32768
##$TD0= 1
##$TE= 0
##$TE2= 300
##$TE3= 300
##$TEG= 300
##$TL= (0..7)
0 120 53 12 22 120 120 120 
##$TP= (0..7)
150 150 150 150 150 150 150 150 
##$TP07= 0
##$TPNAME0= <>
##$TPNAME1= <>
##$TPNAME2= <>
##$TPNAME3= <>
##$TPNAME4= <>
##$TPNAME5= <>
##$TPNAME6= <>
##$TPNAME7= <>
##$TPOAL= (0..7)
0.5 0.5 0.5 0.5 0.5 0.5 0.5 0.5 
##$TPOFFS= (0..7)
0 0 0 0 0 0 0 0 
##$TUNHIN= 0
##$TUNHOUT= 0
##$TUNXOUT= 0
##$USERA1= <user>
##$USERA2= <user>
##$USERA3= <user>
##$USERA4= <user>
##$USERA5= <user>
##$V9= 5
##$VALIST= <valist>
##$VCLIST= <CCCCCCCCCCCCCCC>
##$VD= 0
##$VDLIST= <DDDDDDDDDDDDDDD>
##$VPLIST= <PPPPPPPPPPPPPPP>
##$VTLIST= <TTTTTTTTTTTTTTT>
##$WBST= 1024
##$WBSW= 4
##$XGAIN= (0..3)
0 0 0 0 
##$XL= 0
##$YL= 0
##$YMAX_a= 13004
##$YMIN_a= -6055
##$ZGOPTNS= <>
##$ZL1= 120
##$ZL2= 120
##$ZL3= 120
##$ZL4= 120
##$ABSF1= 198.0616
##$ABSF2= -202.7028
##$ABSG= 5
##$ABSL= 3
##$ALPHA= 0
##$AQORDER= 0
##$ASSFAC= 0
##$ASSFACI= 0
##$ASSFACX= 0
##$ASSWID= 0
##$AUNMP= <proc_1d>
##$AZFE= 0.1
##$AZFW= 0.5
##$BCFW= 0
##$BC_mod= 2
##$BYTORDP= 0
##$COROFFS= 0
##$CY= -3
##$DATMOD= 1
##$DC= 0
##$DFILT= <>
##$DTYPP= 0
##$F1P= 0
##$F2P= 0
##$FCOR= 1
##$FTSIZE= 65536
##$FT_mod= 6
##$GAMMA= 0
##$GB= 0
##$INTBC= 1
##$INTSCL= 9.790993e-09
##$ISEN= 30
##$LB= 1.5
##$LEV0= 0
##$LPBIN= 0
##$MAXI= 10000
##$MC2= 0
##$MEAN= 0
##$ME_mod= 0
##$MI= 50
##$NCOEF= 0
##$NC_proc= -9
##$NLEV= 6
##$NOISF1= 182.463
##$NOISF2= 159.3651
##$NSP= 0
##$NTH_PI= 0
##$NZP= 0
##$OFFSET= 198.0616
##$PC= 4
##$PHC0= 1125.146
##$PHC1= 870.499
##$PH_mod= 1
##$PKNL= yes
##$PPARMOD= 0
##$PSCAL= 0
##$PSIGN= 0
##$REVERSE= no
##$SF= 81.0140089999434
##$SI= 65536
##$SIGF1= 159.3651
##$SIGF2= -187.1042
##$SINO= 113.3802
##$SIOLD= 16384
##$SREGLST= <1H.CDCl3>
##$SSB= 0
##$STSI= 65536
##$STSR= 0
##$SW_p= 32467.5324675325
##$SYMM= 0
##$S_DEV= 0
##$TDeff= 32768
##$TDoff= 0
##$TI= <>
##$TILT= no
##$TM1= 0
##$TM2= 0
##$TOPLEV= 0
##$USERP1= <user>
##$USERP2= <user>
##$USERP3= <user>
##$USERP4= <user>
##$USERP5= <user>
##$WDW= 1
##$XDIM= 65536
##$YMAX_p= 178444099
##$YMIN_p= -457189171
$$ End of Bruker specific parameters
$$ ---------------------------------
##NTUPLES= NMR SPECTRUM
##VAR_NAME=  FREQUENCY,     SPECTRUM/REAL,   SPECTRUM/IMAG
##SYMBOL=    X,             R,               I
##VAR_TYPE=  INDEPENDENT,   DEPENDENT,       DEPENDENT
##VAR_FORM=  AFFN,          ASDF,            ASDF
##VAR_DIM=   65536,         65536,           65536
##UNITS=     HZ,            ARBITRARY UNITS, ARBITRARY UNITS
##FACTOR=    0.49542278885378, 1,            1
##FIRST=     16045.7642231865, 0,            0
##LAST=      -16421.768244346, 0,            0
##MIN=       -16421.768244346, -457189171,   0
##MAX=       16045.7642231865, 178444099,    0
$$ Real data points
##PAGE= N=1
##DATA TABLE= (X++(R..R)), XYDATA
$$ [...]
9381 -19754162 -14558720 -10314558 -7228574 -3269296 2465380 7540366 9108167 8263222
9373 8263222 9263811 14167356 20196528 23281879 22522855 19843514 16814045 13838479
9365 13838479 11383178 9350351 5610722 -1675351 -9581249 -11531498 -4936750 4710259
9357 4710259 9817437 8792129 5403813 2110203 -1792144 -5982903 -7798668 -6409625
9349 -6409625 -4584020 -4156917 -2590744 3241232 11496229 16212698 13328779 4484606
9341 4484606 -4605073 -8802852 -7629649 -5450213 -6512822 -9651207 -9868639 -5327687
9333 -5327687 407399 4203548 7543414 12227613 15624930 14465140 10841601 9542141
9325 9542141 10809646 10814298 8708696 7863847 9591224 10749288 8960807 5650073 2310572
9316 2310572 -1607217 -4933687 -3764204 2354362 7370208 6197398 2166603 2412907
9308 2412907 8182666 14695982 19033789 22587027 25875618 26511587 23755001 20534409
9300 20534409 18654549 15522570 8442556 -187778 -4850729 -3023496 2662168 7492704
9292 7492704 8300383 4915590 -215613 -3964881 -5010213 -4224273 -2523897 225919 3310611
9283 3310611 3959538 215970 -5605099 -8530134 -6311047 -1615690 1634170 2668854
9275 2668854 3614702 5738084 7440805 6449871 3341462 1859003 5056728 11443198 16043098
9266 16043098 15716905 12459450 10617911 11830891 14149395 15427942 15318670 13581659
9258 13581659 8878500 1010346 -7040502 -11443985 -11508618 -9574168 -7180164 -3445095
9250 -3445095 2214105 7755428 10410248 9978802 8901412 9485303 12033171 15187628 16973847
9241 16973847 15869881 12250892 8888893 8670920 11258308 13132228 11862991 9421875
9233 9421875 9749157 13178749 15068798 11101566 2925919 -3228180 -3591645 -864688 -493560
9224 -493560 -4446932 -10086584 -14132318 -15741706 -15872507 -15545151 -15259494 -14914049 -14021977
9215 -14021977 -12904790 -13151626 -15266695 -16617822 -14503569 -11127194 -11870318 -17536090
9207 -17536090 -22068702 -20104906 -13286497 -6406312 -1101252 2734195 3102028 -689688
9199 -689688 -3258520 1181745 9055850 10774180 4827124 777636 5013315 10823169
9191 10823169 8328409 -1089925 -7350423 -5740519 -1242557 454997 -331934 -625113
9183 -625113 534585 2992639 7280759 12840464 16608660 15644800 10200959 2993535 -3565455
9174 -3565455 -8500453 -11684231 -13352041 -14119966 -14951189 -16673470 -18893642 -19415855 -16120719
9165 -16120719 -10194098 -5966391 -6130485 -8551970 -9750589 -10210361 -13482941 -20454220
9157 -20454220 -27352877 -29978857 -27771723 -23053045 -18048293 -13522021 -9177368 -4695142
9149 -4695142 -783865 1196053 1432181 2406012 5772887 9512719 10535030 9405854 9518515
9140 9518515 11637947 12616687 10415886 7218616 5805258 5402174 3396462 -517075 -4096126
9131 -4096126 -5371626 -3883262 -108910 4412740 7072643 6392875 4337573 4773002 8958809
9122 8958809 13485508 13606963 8623975 3209281 2446303 5677600 7028465 3097355 -1962410
9113 -1962410 -1784138 3078082 5401646 1052398 -5802838 -9157338 -8806515 -8049165 -6911390
9104 -6911390 -2746035 3385317 6180001 3131730 -1932437 -4407132 -4845883 -6576893
9096 -6576893 -9658522 -10792613 -8530554 -5012190 -2001040 1492525 5880382 8158159
9088 8158159 5710205 1652375 2328133 8697543 13615347 9742298 -2099996 -14744728
9080 -14744728 -22918820 -26670915 -27694326 -26047212 -21555860 -16028262 -12341225 -11854289
9072 -11854289 -13120442 -12782452 -8416853 -1637189 2418270 383965 -5085441 -8093460
9064 -8093460 -5859564 -403922 5010030 8300656 8264785 5467449 3459868 5450238 9364140
9055 9364140 10050942 6969997 5102864 6776527 7692929 4041420 -1203999 -3289745 -3025585
9046 -3025585 -4050180 -5767440 -4869742 -2300916 -2587891 -6201840 -8044370 -4676224 1315117
9037 1315117 5571530 6994719 7058937 7013266 7075031 6169370 2037434 -5766382 -12961675
9028 -12961675 -14202508 -10265571 -7575895 -9200071 -10633545 -7109981 -1006358 2003809
9020 2003809 1291218 1132455 3732989 7091906 9577349 12063323 14353581 13307331 6922357
9011 6922357 -1965534 -8505457 -11214675 -12474696 -14327920 -15949131 -15609082 -13554031
9003 -13554031 -11965211 -12488237 -14172328 -13693652 -8120217 1377547 8714578 7748025 -1002967
8994 -1002967 -10197647 -13908182 -14332665 -17571566 -23976950 -26973772 -22280086 -14144589
8986 -14144589 -9840444 -10867167 -12719451 -11338166 -6381494 596639 7516118 11603283
8978 11603283 11273377 8705704 7868724 9393498 9813036 6576081 1401220 -2635321 -5446444
8969 -5446444 -9509646 -15700110 -21009181 -21014905 -14560974 -5366545 1860150 6230950 9594808
8960 9594808 11250883 7943273 744401 -2894948 1762235 9269336 11191780 8046405
8952 8046405 7153251 9956552 9747998 3161389 -4186241 -6793487 -6841470 -7995443 -7866179
8943 -7866179 -2878053 3656634 5070429 724220 -3952219 -5255611 -3757852 -423687
8935 -423687 4277126 7825418 7497637 5156591 5653114 9806656 13101577 12169214 8632408
8926 8632408 5379698 2782769 417461 -456720 1701978 6533653 12240276 16721915
8918 16721915 17747338 14136468 7712844 2203627 -770364 -2988952 -6148872 -8813812
8910 -8813812 -7988670 -2627588 5313192 12592726 16978337 18380275 17950043 16251597 13515409
8901 13515409 11864501 14532723 20850505 24746991 21752615 15449124 12572640 13213788
8893 13213788 11465572 5604745 1241284 2478279 5799456 6123917 4110046 3121433
8885 3121433 2681780 150638 -3055860 -2057910 4735125 13047942 17272023 15418230 9966425
8876 9966425 5816769 6706582 11524699 14684888 11923442 4954903 -1237057 -4348439
8868 -4348439 -5715813 -6630765 -6793081 -6357089 -6913106 -9733812 -14289424 -18513007 -19790905
8859 -19790905 -16692182 -10996421 -6876441 -6624239 -8425965 -9662750 -10363749 -11383414
8851 -11383414 -11601890 -10022559 -8530316 -8760099 -7945484 -2449643 5435191 9053620 5792554
8842 5792554 -524395 -5728513 -9057560 -10477761 -9630097 -8804437 -11633918 -16664295 -17292784
8833 -17292784 -10755470 -2212718 3069479 6163534 9181521 9497391 5416494 2796358
8825 2796358 8199093 18114619 22978919 20639515 17729700 17799168 16747613 12020422 8127037
8816 8127037 8947318 11128019 10110153 7607110 7685375 9290451 8366441 4898125 2419159
8807 2419159 2055085 2028161 2038839 3301987 4724580 3862421 2009028 3878719 11103290
8798 11103290 19653747 24935877 26241749 24886271 21169229 15261575 8812920 3554601
8790 3554601 -345473 -3170408 -4315386 -3256480 -529171 3182725 7468067 11009379
8782 11009379 12001644 10820191 10011907 10128341 8192265 2829137 -1572575 235978 6468490
8773 6468490 9766587 6845108 2284594 1117228 1857234 246469 -3190256 -4193805
8765 -4193805 -2397272 -2672578 -7413202 -11731535 -9540476 -2021190 3476327 1940112
8757 1940112 -5075202 -13074614 -18815634 -20444107 -17231376 -11207121 -6527652 -4979935
8749 -4979935 -3840425 -90850 5116520 8457593 9160046 9031778 9080975 8970318 8819645
8740 8819645 8558292 6395710 1297963 -3702666 -4517040 -2059746 -1013620 -2296520 -1758508
8731 -1758508 2193797 4938846 2543413 -2313939 -5196029 -6569868 -8692582 -9170791
8723 -9170791 -3901022 4863033 9622267 7266336 2404313 131424 344330 866359 1504149
8714 1504149 2115939 284899 -5479529 -12309443 -15949040 -15816161 -14272508 -11976730 -7283142
8705 -7283142 -450374 4485432 3743293 -1320701 -4855471 -2381469 4458375 9660592
8697 9660592 9516208 6591043 6144732 9510043 13034547 13561678 12428228 12534826 13186899
8688 13186899 10317306 1984134 -7934860 -12627146 -9072210 -1602802 1983351 -1556544
8680 -1556544 -7512946 -9016356 -5423813 -2606993 -4760425 -9025706 -10311238 -9071288
8672 -9071288 -10562263 -16498205 -21119250 -17636052 -6643070 4491886 9970917 10549133
8664 10549133 9881514 9212409 8114548 8049143 11045078 15342002 16764071 15257469 15461811
8655 15461811 18711903 19434548 13550645 6041802 4162311 6112586 3800850 -4287898
8647 -4287898 -11020776 -12119886 -11431207 -11983553 -9980692 -2841027 3661259 3130721 -1489978
8638 -1489978 -2956915 -1060507 -1223687 -4354260 -6491966 -7530884 -11490640 -17265347
8630 -17265347 -17704391 -10649344 -3281218 -1540160 -1965091 813489 4240870 2140234
8622 2140234 -4725886 -9262106 -7791636 -3290198 669666 3834682 6584024 7914613
8614 7914613 7573988 7065094 7263384 7310768 6534715 5215939 2932856 -1519494 -7753847
8605 -7753847 -13252341 -15886431 -15416022 -12416757 -7830866 -3783029 -2333137 -2757943 -2589348
8596 -2589348 -2187450 -5292486 -13191999 -20959515 -22127346 -15515280 -5211016 4347036
8588 4347036 10373127 10600774 4529431 -3837674 -8264132 -6936016 -4477224 -5855775
8580 -5855775 -10358665 -13315155 -11965723 -7415719 -2010480 2565013 4808441 3753663
8572 3753663 943905 295435 4123324 9650443 11095450 5922739 -1822335 -5411041
8564 -5411041 -2387237 3521283 7518170 9052625 10756649 13496376 14979858 13354964
8556 13354964 9935865 7445841 7111787 8376111 10049869 10783717 9757553 7925818
8548 7925818 7202482 7413539 5888661 1722565 -1419125 693526 7020152 11970786 11585753
8539 11585753 6962942 2200158 1171010 5511515 12908978 17694121 16130415 11077120
8531 11077120 8339538 8602098 7035199 1528643 -3481504 -3697619 -1189005 -498027 -1926908
8522 -1926908 -2858231 -3272657 -5202068 -7880944 -8130355 -5524139 -3082379 -2316706 -1217493
8513 -1217493 1880810 5502764 7169031 5760776 1038821 -6290284 -12998611 -15000887
8505 -15000887 -12465680 -10512350 -12495050 -15085925 -13061267 -7083687 -2941526 -3696230
8497 -3696230 -6506070 -7932963 -8829950 -11881863 -16618574 -19505201 -18128409 -13316355
8489 -13316355 -7792026 -4675659 -6567952 -13237098 -19783998 -20075185 -13738154 -7526840
8481 -7526840 -7436879 -11161319 -11266253 -4868348 3184005 6727281 4562686 -369325 -4881311
8472 -4881311 -7025032 -6207959 -3779778 -1973352 -1108943 361139 2311528 2212940 -715636
8463 -715636 -3818007 -5553732 -8231232 -13027682 -15788978 -12436073 -5988652 -2676682
8455 -2676682 -2555041 -162678 5737999 9791497 8919611 7139423 8363985 10015362 8443715
8446 8443715 6322202 8606612 13298848 12657347 4081236 -5393804 -7510944 -2219946
8438 -2219946 3893800 6382944 6879723 8534690 10527389 9043025 2708918 -5207331
8430 -5207331 -10621381 -12927324 -14022675 -14193029 -11258697 -4187802 4045869 8368674
8422 8368674 6373711 1091071 -1347985 2165673 7880168 9227006 5278991 2544411
8414 2544411 6452090 13791738 16938026 13597980 8207533 4708483 2601292 368456
8406 368456 -1524520 -2152101 -1394265 942020 4153680 4793061 -257660 -8405609 -13204933
8397 -13204933 -12381874 -9855688 -9166024 -9781905 -10911167 -13230794 -14800411 -11271356 -3345817
8388 -3345817 1657577 -530337 -5417833 -7842642 -9659436 -13676241 -15786904 -10759781
8380 -10759781 -1824000 3461634 4118855 4734895 5938574 4476839 1747293 3364636
8372 3364636 9390121 12841003 9624803 3347581 -1250442 -3421503 -3723041 -2566711
8364 -2566711 -2862705 -7645262 -13493777 -13173624 -6814471 -2949410 -5313439 -6472065 433851
8355 433851 10626182 14763822 11634256 6893249 3161834 -1527038 -7828367 -14100694
8347 -14100694 -19905681 -25038272 -26450935 -21443883 -13035670 -7373866 -6492747 -7799377
8339 -7799377 -9448722 -11489839 -12662959 -11215674 -8749860 -8394454 -8986213 -6004458 826675
8330 826675 5646153 4055380 -1167336 -4179200 -3065074 -460007 819023 501583 -5989
8321 -5989 240006 549096 -430947 -2478577 -3650947 -3168456 -2733733 -3369953 -2965919 434610
8311 434610 4675163 6117639 4935068 4165466 4544709 4412133 4141240 5979479 9279434
8302 9279434 10738412 10337198 12098283 17050442 20172958 17236648 10729542 5641241
8294 5641241 2746496 -74786 -2531678 -2429876 -336065 218951 -2824787 -8022889 -12565743
8285 -12565743 -14415896 -12934269 -9328461 -5851254 -3022612 1183052 7833901 14551625
8277 14551625 18609007 20296241 20368154 16829163 8837612 1876167 2736415 9044879 10237617
8268 10237617 1316167 -10157946 -14693674 -13539859 -15081136 -21601695 -26278358 -23074019
8260 -23074019 -13865236 -4440898 2032511 5550725 6898586 7298875 8113921 8794312 7074293
8251 7074293 2930447 -7432 708798 2384624 1169977 -1663346 -1286430 3235518 6867245
8242 6867245 4884309 -1597210 -7575208 -9575627 -8040298 -5952905 -5931983 -7415095 -6621819
8233 -6621819 -1033712 6493785 10932257 12193937 14742114 18926818 18146409 8685129
8225 8685129 -2036243 -3245405 5244447 13564590 15770500 15902640 18254890 19167377
8217 19167377 13775567 5582616 2064031 3066631 1219599 -5813827 -11037070 -9235969
8209 -9235969 -6055274 -9937164 -18417462 -19862810 -9091056 5396637 12582351 12070516
8201 12070516 11318259 13192910 12914712 7401358 1366923 886623 4603883 5483031 11239
8192 11239 -7928986 -12447169 -12082202 -9742505 -7924868 -5893853 -1955004 2571861 3550974
8183 3550974 -716822 -6011758 -6677685 -3207428 -1797722 -5314044 -8756532 -6872501
8175 -6872501 -3058068 -5641615 -16173034 -26524958 -28812381 -24078715 -18829259 -16107206
8167 -16107206 -13611144 -9582215 -6736984 -8672773 -14039780 -16849513 -13356123 -6946812
8159 -6946812 -4148932 -6400754 -8510797 -5709934 890826 7407629 12466396 16446202
8151 16446202 18086540 15820042 11117749 6765699 3032596 -462743 -566514 6112396
8143 6112396 15643300 18598882 11511377 1505883 -3103932 -2235304 -832487 -723224
8135 -723224 -372864 215822 -399273 -1290697 -90963 2411831 2552264 -703681 -3648034
8126 -3648034 -2519354 1560557 3687845 679218 -5259461 -8799180 -7617545 -5089507
8118 -5089507 -5294682 -6862279 -5333537 -946002 1205387 -155261 151415 4396526 6279051
8109 6279051 686556 -5907481 -3139646 7589004 14351994 11889760 8546743 13048685
8101 13048685 22095452 26354430 23505282 19247925 18055521 18566982 17522469 13957065
8093 13957065 8971263 3997034 -44903 -3159251 -6020717 -8851328 -11157690 -12784382
8085 -12784382 -13972375 -14142584 -12426344 -9897629 -9067502 -10164518 -10212278 -7339694 -3998283
8076 -3998283 -4059209 -8213072 -13842230 -18024609 -19259879 -17840922 -16032352 -16273257 -17813259
8067 -17813259 -17133815 -13324824 -10471513 -12055322 -15333011 -14947339 -10692899 -7479255
8059 -7479255 -7764781 -8269137 -5534751 -1484364 -1128355 -6318888 -13800133 -18977894 -20217689
8050 -20217689 -19206182 -17857640 -15891553 -12157279 -7669015 -5554356 -7595968 -12435366
8042 -12435366 -17672398 -21679892 -22533748 -17945135 -8400031 1762016 8733113 12826481
8034 12826481 15544074 15714691 11893288 6373922 2876195 2022522 3109870 7874633
8026 7874633 16711274 22978874 18852151 7553892 1941348 8106319 17348215 18478630
8018 18478630 11753401 5221004 2615317 1613446 655443 479946 406585 -903628 -1921260
8009 -1921260 -739947 34337 -3640976 -10108867 -13649224 -12801633 -11007624 -8926346 -3049944
8000 -3049944 6232941 11783501 8405160 -433113 -7827826 -11106084 -11167831 -8793081 -5826227
7991 -5826227 -6250351 -11187208 -15294705 -12722475 -4884540 1762015 3837309 2662291
7983 2662291 -496716 -5725153 -11394014 -14493059 -14694564 -14674776 -16051024 -17933336 -19328357
7974 -19328357 -19901862 -18778705 -15913988 -13903928 -14318351 -12922251 -3979425 10039845
7966 10039845 18902363 17011051 10099361 6454108 6518172 5687625 3251896 2642411 4769216
7957 4769216 6682412 6368237 4407173 1228842 -3055365 -6269380 -5967586 -3928419 -4456644
7948 -4456644 -7269555 -6639150 276726 8346369 10887168 8101107 5284583 4619899 3178549
7939 3178549 -1128747 -5676258 -6632232 -3832759 -456874 727369 -648239 -3209115
7931 -3209115 -4846578 -3658631 223831 3434659 1674906 -5554388 -13298669 -15513095
7923 -15513095 -10890688 -3446279 2176503 4509451 4683554 4249361 4358948 5284662 5584874
7914 5584874 3357471 -428542 -1766999 1327277 5494242 6402263 4775318 4551578 6123713
7905 6123713 5799875 2041018 -2521187 -6469982 -11999144 -19213057 -22693303 -18214515
7897 -18214515 -9778898 -4964810 -5106849 -5163296 -2251108 1270932 3462837 5923754 9395459
7888 9395459 10901058 8087225 3159956 -151745 -967155 -414139 750945 1220712 -1254067
7879 -1254067 -6250067 -9258733 -7383001 -4045523 -3847450 -4762936 -680829 8928660 17218423
7870 17218423 18402903 13248766 5330624 -3043215 -9213708 -9550579 -4017724 2126595
7862 2126595 4657932 5494799 8147482 11242859 11032487 8064641 6354228 7115217 8338940
7853 8338940 9999446 14109765 18885854 18551518 11576088 4611345 4511171 9284363 10788753
7844 10788753 4778457 -5310350 -13733490 -18005282 -18760093 -17126129 -13914250 -10100870
7836 -10100870 -6628411 -3852754 -1736482 -422455 -193099 -857702 -1598242 -1838992 -2118334
7827 -2118334 -3447033 -5759619 -7965815 -9842799 -12444936 -15635902 -16802508 -13979301
7819 -13979301 -9223985 -6497982 -6587384 -6534809 -4099231 -384172 2302736 2998219 2041391
7810 2041391 528604 229633 2099477 4594269 5336763 4207134 2427098 -683616 -6384126
7801 -6384126 -12141255 -13217260 -9659155 -7018169 -8357090 -10417794 -10234395 -10285789 -13136161
7792 -13136161 -15758279 -14255377 -10333181 -7550145 -4560840 1630769 8363090 10216387
7784 10216387 7713172 6193296 6893186 6338901 4345381 4733543 6947428 4861503 -3468200
7775 -3468200 -12095284 -16470297 -19263074 -22464009 -20743441 -9455131 5639232 14171812
7767 14171812 14182822 12607241 14264785 16834735 16474484 12477873 5583309 -3239227 -10845707
7758 -10845707 -12966640 -9118854 -3380138 1250186 6027757 11800549 14313999 8373161
7750 8373161 -3819914 -12587546 -11110927 -3595916 -114029 -4192767 -9526361 -9927953
7742 -9927953 -7730067 -8409821 -10742128 -8845673 -2753147 569306 -1745432 -3376815
7734 -3376815 1755963 10727013 16766413 18463919 18601585 17595797 14095455 9854742
7726 9854742 8167225 8466150 7409694 4441587 1791449 183105 -607963 1822755 9733749
7717 9733749 18987127 21421028 14672522 4829644 -1882319 -5285523 -7433750 -7303665
7709 -7303665 -2429889 6729704 16409309 22188682 21634460 16547955 12584512 13741217
7701 13741217 17264766 17267206 12909282 8600895 6243470 3050730 -1520155 -2838265 1505046
7692 1505046 6404930 5722706 482094 -3738999 -4903438 -5759392 -8796104 -13644341 -18251509
7683 -18251509 -19891805 -16641038 -10305412 -5811449 -5239362 -5105412 -2444901 -366584
7675 -366584 -3352233 -9545710 -12494856 -8983147 -753077 9556617 18813672 21360891
7667 21360891 13473964 466062 -7076582 -6157456 -4869088 -10297438 -18229321 -19247190
7659 -19247190 -11371514 -1576987 3570940 4121993 3819729 4857933 6668201 7764421
7651 7764421 7589027 7187164 8195216 10622013 12045520 9892781 4358384 -1468747 -4013728
7642 -4013728 -1484611 5199633 12721010 17273217 17394181 14827746 11891873 8397145
7634 8397145 2194441 -7208333 -16500406 -20657248 -17316963 -9205241 -2068078 399590
7626 399590 -155557 1085412 6525520 13351365 16557841 13971546 7777998 1970495 -775722
7617 -775722 -392717 1086315 1421046 537707 800336 3855214 7656036 8427557 5648015
7608 5648015 2774776 2112388 1536988 -1565056 -5461303 -6670658 -5998369 -7404006 -10745500
7599 -10745500 -10818603 -5602352 -384042 304204 672720 7813113 20177720 28578704 28500992
7590 28500992 24925994 23524406 23295504 21008614 17583722 15605450 14262540 11483560
7582 11483560 8472706 7475290 7062078 4478691 1321484 1769387 5637360 8333256 8189302
7573 8189302 8827596 12724068 16857583 17072035 13236128 7647437 1562620 -3725638 -5189023
7564 -5189023 -1375539 3830249 4428591 -718864 -6719336 -8482553 -5588885 -1507378
7556 -1507378 -332410 -4457918 -12868792 -20690888 -22638952 -18587521 -14273837 -14821430
7548 -14821430 -18879393 -21226435 -20000831 -18246127 -18246843 -17862662 -14292564 -8805590 -4998833
7539 -4998833 -3949892 -3949058 -3844731 -3321388 -618501 5668240 11707625 9886820 -1929766
7530 -1929766 -15489097 -20012400 -13728406 -4684408 -868541 -2472552 -4204258 -2783731
7522 -2783731 -427762 -1088435 -4461046 -5703549 -2236871 1548823 45461 -4357578
7514 -4357578 -3373690 4942874 12333868 11975339 7978394 7837028 10351201 8470952 1457700
7505 1457700 -3691903 -2411441 2816372 8062666 11534776 11179621 5661290 -888007
7497 -888007 -1735462 2922209 5774213 3908663 3411853 8959651 15837826 17481796 15033659
7488 15033659 13356461 12333460 8800097 3808902 1470796 2725822 5869114 10964445
7480 10964445 18016437 22992575 21941653 17606413 15802728 16580494 15585817 13109089
7472 13109089 13955990 17789210 17811002 11784949 7060974 10222042 17448717 20488462 18102493
7463 18102493 15644841 15373340 13215046 5696988 -4294360 -10772996 -11731903 -10869045 -12262707
7454 -12262707 -14838985 -13830643 -7641272 -666258 2332808 2025665 1575554 200345
7446 200345 -5485913 -14360733 -20377188 -20295918 -17160324 -14481927 -11550221 -7045041 -3287870
7437 -3287870 -3496452 -7271512 -11348036 -12654924 -9191922 -1370976 5461179 4135697
7429 4135697 -5228507 -13107204 -11792511 -5123577 -1958608 -3455116 -3705952 -1012186
7421 -1012186 -286873 -3530771 -5876138 -4274589 -3472831 -8334374 -14900726 -15227956 -8905397
7412 -8905397 -3590580 -3941012 -5362385 -981426 8710454 16468373 17143980 12765154 8652316
7403 8652316 7298211 7685907 8631756 9917175 10556929 9013681 5950531 4107217 4100446
7394 4100446 3046199 -554461 -3292667 -1471426 2841081 4558936 3307845 3643224
7386 3643224 7344352 10440688 9654958 7436534 7598360 9151321 8092043 3551065 -1223546
7377 -1223546 -3278374 -2670033 -1118754 -52834 173823 589141 2699721 6140736 8171520
7368 8171520 6903575 4019101 2801799 4568862 8491148 13261466 16782611 16066267
7360 16066267 10789055 5932895 6982218 12358037 14354529 8570642 -809760 -6467514
7352 -6467514 -5853980 -2206338 -347097 -3210412 -10127872 -16620336 -17999966 -14979444
7344 -14979444 -13328963 -15903794 -17955928 -13777577 -5660205 -1717569 -5596567 -12710692
7336 -12710692 -16805037 -16235007 -13187540 -10811967 -12508112 -20015591 -29604394 -33226858
7328 -33226858 -26665938 -14813359 -6168992 -3624858 -3477819 -2219967 -674033 -1106730
7320 -1106730 -3209019 -4459559 -3298098 -873976 160989 -1604524 -4925640 -7800212
7312 -7800212 -10466480 -14606800 -18935480 -18300810 -9792311 1848266 8223500 6488356
7304 6488356 1753799 79785 1797299 2744053 -8689 -5106322 -8643002 -8208422 -5583800
7295 -5583800 -4873534 -7027883 -7703885 -2972598 4159402 6765857 3396063 -23319 1110411
7286 1110411 4112821 4473869 3065305 3558740 5435497 4776778 1210605 -773726 1809053
7277 1809053 6347561 8093333 5243519 -305439 -5171796 -6657072 -4504087 -1334006
7269 -1334006 -243235 -1846938 -4639318 -7289989 -8653390 -6816604 -1439744 3548050
7261 3548050 3695827 856289 1624419 7292346 10290105 4274211 -6198559 -11118239
7253 -11118239 -7743527 -2143469 1177898 4826658 11894491 19242978 21510059 18897240
7245 18897240 16470865 16559706 15951114 11407860 4672207 -60245 -1620694 -2175197 -2912782
7236 -2912782 -2526698 -635845 288185 -1384166 -2993677 -1132522 2459133 2623793 -1348727
7227 -1348727 -4196483 -2945954 -2041763 -6226189 -12043661 -12418638 -7975324 -6705502 -11436007
7218 -11436007 -14646533 -9412737 83339 4439470 1792841 -1710596 -2453175 -3120734
7210 -3120734 -5080993 -4119033 2162813 7683283 4577287 -5305239 -11454336 -7845139
7202 -7845139 -180153 2236900 -1723173 -4905766 -1877802 4860701 9158409 8755075
7194 8755075 6668144 6273027 7021634 5560333 383988 -5469450 -6994333 -2559293 4141373
7185 4141373 8204696 8833738 9207399 11519727 14160327 14266553 11132902 6067897 695494
7176 695494 -3012973 -2667454 2092220 7579195 8847241 4967579 189756 -443956 4108832
7167 4108832 10091661 12086136 7778564 702725 -2999411 -1983247 -1917913 -7712904 -15668755
7158 -15668755 -17679655 -12129640 -5227738 -1341320 1745860 5866050 7187058 2457993
7150 2457993 -4221795 -6439150 -4217055 -2307571 -2140442 -1240917 836643 1939877 2130456
7141 2130456 3396331 4635862 2573075 -1959732 -4440511 -4252468 -5786974 -10159270
7133 -10159270 -12079763 -8311193 -3851729 -5346300 -12214406 -18447630 -20133491 -17516763
7125 -17516763 -12520328 -7831195 -5851641 -5426322 -2509054 3070778 5443154 1063362
7117 1063362 -5022593 -6231922 -3776857 -3022107 -4156769 -3666246 -2444850 -4283692 -7472892
7108 -7472892 -6417068 -1802052 -641477 -4784673 -7776989 -5816088 -3721691 -6010395
7100 -6010395 -9410608 -9322239 -7357719 -6815558 -6213167 -3423303 -1258919 -2119486 -1308951
7091 -1308951 6555335 17309180 21616941 18328273 15325802 16814086 17724266 12923572
7083 12923572 5273639 1050140 2029630 5359118 7682891 6639758 1623509 -3975712
7075 -3975712 -4121456 3040581 11609654 14133556 10003361 4964033 3483524 4818903
7067 4818903 6546080 8661311 12293068 16022353 16364139 12738040 9848392 12460164
7059 12460164 18202596 18967224 11002419 563587 -3487043 -525900 2351071 627948
7051 627948 -2539546 -2335234 715016 2042641 -943157 -6166430 -9104634 -6715025 -228219
7042 -228219 5619865 7426678 7019185 8675794 12868710 15533010 13807366 9568523 6515227
7033 6515227 6492032 9400600 13616013 15371456 11087434 2134718 -5652262 -8991167 -10569801
7024 -10569801 -13433226 -15523439 -13013204 -6294725 792771 5488534 6718193 3822294
7016 3822294 -1419487 -3916626 -1147047 1769453 -1975326 -10833785 -16416533 -15006143
7008 -15006143 -11559634 -10849129 -10555168 -6428500 337875 5288436 7450482 9451184
7000 9451184 12129461 13066718 10680146 6774083 3909890 1846531 -1990719 -8472199
6992 -8472199 -14009798 -13321235 -5936678 1482148 1751653 -4421540 -9582979 -9197209 -6591986
6983 -6591986 -7008954 -10493045 -13444330 -14283529 -13936050 -12494209 -9292654 -5599714 -3687046
6974 -3687046 -3405390 -2989680 -3237674 -7097953 -14057392 -18578972 -16489702 -10506135 -6794267
6965 -6794267 -7596784 -9908310 -10440741 -8951503 -6694244 -4379705 -2553446 -1738809 -868893
6956 -868893 2463650 8266414 12300609 10890778 7021127 8096979 16488649 25370638
6948 25370638 26383918 19415650 11866120 9453861 11137899 12922896 13012930 11818833
6940 11818833 9538201 5942375 1661662 -1584027 -1788116 1998923 7762467 10475922
6932 10475922 6424605 -2116278 -8837400 -10138981 -7209514 -1839067 5084326 9853912
6924 9853912 6680347 -4034434 -13005419 -12722147 -7013751 -4358833 -5283863 -3775777
6916 -3775777 981517 3100210 680698 -425490 3862759 9587504 11362160 9263557
6908 9263557 5516721 -112312 -7332890 -12469622 -13008318 -11074940 -8624056 -3706881
6900 -3706881 4182188 9939324 9446991 6044282 4715351 4197497 1317361 -1458393 -852905
6891 -852905 -975293 -6801044 -12363567 -7198724 5933065 12539043 7975762 4591498
6883 4591498 11674063 20315223 17410072 5564499 -1965194 -364847 3876560 5837688
6875 5837688 6698382 6058260 160334 -10054782 -17081034 -16179814 -11085574 -7850689 -7497650
6866 -7497650 -7107847 -4528267 156423 5155582 7693929 6642802 4890702 6224674
6858 6224674 9619656 10055067 5624183 203896 -2197717 -2409277 -3616682 -6504281 -8857612
6849 -8857612 -8598533 -6029082 -3839601 -4699293 -7607347 -7858303 -3050925 2250159 1443613
6840 1443613 -5309935 -11404010 -12763795 -12002048 -13041084 -16122298 -19370751 -21068862
6832 -21068862 -19001024 -11863373 -3059353 1222108 -155668 -1438760 1897592 7522809
6824 7522809 11193492 12624546 13099476 11733804 8247175 5541165 5129970 3713338 -910467
6815 -910467 -4245122 -1286321 4611687 5805450 1791878 -324505 3326075 8610051
6807 8610051 10546714 9448094 7990895 7050837 6957370 9013754 12887404 15053151 12433819
6798 12433819 6209235 421410 -2094833 -1536135 -86453 352162 235751 2023055 6740840
6789 6740840 11731258 13445005 11695872 9487295 9674751 13439463 20175796 26362604
6781 26362604 26619702 19361341 9795451 3677812 -21646 -5778200 -12801097 -15598169
6773 -15598169 -12644577 -8238076 -5183687 -1755931 2728899 5247047 4070591 1287763
6765 1287763 -1459065 -4423816 -5361101 -141019 9388407 14695816 11706068 6505122
6757 6505122 5426047 5920686 3242562 -31422 996415 3749849 2163140 -2668804
6749 -2668804 -4990789 -5705414 -11374327 -21670673 -27367310 -23040955 -13443439 -4301797
6741 -4301797 5048502 15314958 21031904 17618217 10144236 8030092 13083846 18759687
6733 18759687 20150869 18940879 18039791 16423041 11656770 4813463 344309 1573595
6725 1573595 7411701 13434884 15855690 14385317 11277650 8247496 5362743 2618696
6717 2618696 756309 -190735 -1588192 -4116306 -5904083 -4264400 673296 5001384
6709 5001384 4353683 -1522023 -7668510 -8265365 -2502393 4900493 9537710 11683870 13162449
6700 13162449 12453395 7001490 -504917 -3258223 777959 5260141 3342322 -3911429
6692 -3911429 -9895075 -10741376 -7818052 -3626760 916960 5348728 9042804 12215829
6684 12215829 15129015 15883365 11520222 2565665 -5283339 -5776006 1880210 12304503
6676 12304503 18735310 17942560 11087556 1284297 -8664312 -16553281 -20543535 -20210611
6668 -20210611 -17671907 -16222891 -17132007 -18394809 -17069661 -12350740 -6197442 -1627627
6660 -1627627 -537950 -2400394 -4834961 -6030876 -6423289 -7134329 -7379658 -5230982 -834359
6651 -834359 3361387 6011328 8066934 9607505 8183194 2311552 -5494613 -11572418
6643 -11572418 -15282378 -17684220 -17536451 -12160284 -2224259 7425637 12488308 12708897
6635 12708897 10365170 7624443 6179036 7091404 9147473 8615061 2608256 -7274569
6627 -7274569 -15684894 -18199907 -15032785 -10067312 -6475796 -3885409 -395490 3485800
6619 3485800 5029866 3815634 3442656 6683142 10887832 11211206 7430285 4179201 4379792
6610 4379792 5798840 5132337 2622192 893346 1206719 2670925 3943023 4326446 4123878
6601 4123878 4774668 7438410 10626709 10724260 6040589 -906753 -6339414 -9315501 -11686300
6592 -11686300 -14949463 -18319731 -19280700 -15521308 -7515516 339153 2950510 -124142
6584 -124142 -4391472 -6486511 -8061648 -11838736 -16504967 -18548646 -17179387 -14022184
6576 -14022184 -9606127 -4209210 -936623 -2793449 -6409885 -4044303 6167468 16518054
6568 16518054 19178050 15488084 12158587 11562137 10956040 9733549 11365074 16815616
6560 16815616 20894301 18430683 11481290 6792023 7015934 7992672 5300481 189697
6552 189697 -3287256 -4742569 -7237371 -10938577 -11300613 -5555819 2325486 6386576 6233799
6543 6233799 6226881 8687630 12114186 15297189 18321829 19190476 14572095 5443806 -2645140
6534 -2645140 -6834551 -9781749 -12991300 -12853983 -7289228 -1101805 732581 702435 3208925
6525 3208925 5256686 901672 -7120289 -9522797 -4542289 -663307 -2876164 -4982696
6517 -4982696 -343017 6891419 7676113 605264 -7616807 -11206898 -9235521 -2893089
6509 -2893089 5442164 11283585 11106742 6583308 2607864 1522828 1926062 2103538 1642334
6500 1642334 493710 -803940 -868285 133294 -689195 -4891625 -9082328 -8828253 -5115413
6491 -5115413 -3440750 -7021350 -13827634 -19537929 -20655700 -16008896 -8395462 -3521669
6483 -3521669 -4100485 -6605351 -7232717 -8365676 -13953486 -20822262 -21512368 -15163693 -8429844
6474 -8429844 -5151948 -2669673 84645 -930733 -6541122 -9988140 -6383247 -599475
6466 -599475 494851 -1108302 1492571 8461956 12756081 9851026 1492729 -9378734
6458 -9378734 -20934040 -29493187 -30689251 -25546422 -20593779 -19771551 -20120512 -17623998
6450 -17623998 -13580571 -12103728 -13799077 -15271173 -13886655 -10295393 -6417568 -3041371
6442 -3041371 132319 3347526 6333878 8390592 8493926 5831462 912794 -4140687
6434 -4140687 -7480438 -9841059 -13557939 -18624881 -21589367 -19961462 -15763932 -12146973
6426 -12146973 -8458320 -2551549 3538830 5632445 4927152 7149583 12673941 14306866
6418 14306866 8553395 2672285 4843984 12319533 16049477 13319352 8255660 2375841
6410 2375841 -6645821 -16979392 -21875944 -19023230 -14014626 -11944158 -11307921 -9077198
6402 -9077198 -6328597 -4923265 -2877951 2513098 9586416 14226502 15199312 14473879 13551806
6393 13551806 12202846 10166690 8226247 7892869 10425950 14886302 17316975 14374050
6385 14374050 7986806 3228650 1073805 -2518946 -8740285 -12029871 -7664824 517073
6377 517073 4595649 2458485 -1331756 -2923769 -2567581 -1206377 1342982 3822956 3139511
6368 3139511 -1573193 -6956853 -9095780 -7517123 -4493249 -2022469 -702192 -350987
6360 -350987 -529386 -1049162 -2527821 -5601973 -9115018 -10223688 -7311696 -2110443 2088541
6351 2088541 3878408 4430244 5312752 7185791 10556254 15569127 19904405 19170136 12035243
6342 12035243 3629771 432236 2271047 3440433 1975629 2562199 8079047 13747332
6334 13747332 14006979 10571970 7921336 4677764 -3098309 -12372159 -15581151 -12538194
6326 -12538194 -11095285 -14082132 -14212715 -6018130 4593505 8297275 4492972 -143883
6318 -143883 -1273269 90879 989610 -1408761 -7961891 -14097811 -12366365 -2655439 4970867
6309 4970867 3012756 -2847960 -2669821 2796332 4666703 398940 -3951583 -4999159
6301 -4999159 -5825921 -7608347 -6735946 -2915919 -1928246 -6537992 -11610932 -12468284 -11882647
6292 -11882647 -13830350 -15555170 -11771539 -3548248 2612101 3150984 653897 -618558
6284 -618558 661701 2407212 1564118 -2315364 -5616273 -4671951 -1155353 -159035 -2516010
6275 -2516010 -3413668 -44374 4254793 6013451 6769818 8467289 8415629 3919006 -1683083
6266 -1683083 -3334688 -2170472 -3238838 -6952337 -8922510 -7640622 -5984799 -4503673
6258 -4503673 537773 10255513 19578221 23747097 24383541 25576220 27062729 25407560
6250 25407560 20223390 15128133 12848063 12722192 13387923 15058219 18103016 21438021
6242 21438021 23497033 23346548 20059896 12961987 3969413 -2390743 -3870825 -3934675 -7003842
6233 -7003842 -11315567 -11129306 -6361233 -4302695 -8996947 -14400424 -13212967 -8249165
6225 -8249165 -8074674 -13591250 -16895912 -13556258 -8175097 -5749512 -4761572 -2468273 -817552
6216 -817552 -2320556 -4820315 -5277771 -4723737 -4472345 -1416237 6816821 15023059 15661366
6207 15661366 9619486 5010203 5341888 5454691 473782 -7185218 -12343582 -13851832
6199 -13851832 -13418731 -10810801 -4125645 5960259 14940245 18221827 15737278 12445656
6191 12445656 13169564 16460284 15659986 7825695 -841363 -1865672 4812740 11155163
6183 11155163 11273553 6832690 2192232 -827788 -1821113 110968 4474459 8494366
6175 8494366 10372142 11192026 12057839 11955229 10151393 8075333 6955361 6169202 5810674
6166 5810674 7947210 12703952 15729077 12835396 5557462 -664930 -2216150 1304857
6158 1304857 9027504 18249356 23480504 20762432 13181027 8309723 9604444 13639151
6150 13639151 16298556 17812599 20134304 22934458 24747539 25467974 24999330 21705365
6142 21705365 15546074 11145313 13559522 20967449 25460974 22394431 15851551 12948824
6134 12948824 15316117 18799544 19642480 17598484 13675384 8394469 2988080 -516504
6126 -516504 -1769840 -2743479 -4762427 -6667603 -7060853 -6443015 -5582585 -3690789 -420720
6117 -420720 1790893 95883 -4620649 -8496538 -9583117 -9820991 -11914371 -16107664 -20401721
6108 -20401721 -22390531 -20731041 -16484903 -13180622 -13575346 -15748954 -14389277 -7133364
6100 -7133364 1953906 6729626 5688007 2605274 1079569 557136 -1547430 -5426405
6092 -5426405 -8362967 -8345473 -6305086 -3978670 -1301379 2270609 5184447 5412791 4381723
6083 4381723 5989645 10872209 14825823 14528814 11804842 9995836 9037973 7171348 5091720
6074 5091720 4729701 5471001 5188503 3907469 3023101 1904775 -1272475 -6192632 -11087104
6065 -11087104 -15373663 -18098377 -15864480 -7338982 1733053 4135333 1335824 1546118
6057 1546118 7434517 13089667 14683725 16038397 19805369 20740551 13882298 3905539
6049 3905539 -501121 1954156 5670138 7170399 7133363 5393547 738219 -4604610 -6237267
6040 -6237267 -3935488 -1824146 -1598723 -254589 4164912 8652900 9052922 5097002 53201
6031 53201 -2755739 -2109110 762870 3211943 3629687 2941176 2864774 3749608 5541907
6022 5541907 9113111 14014486 16530607 13734614 8928872 8944813 15354032 21969468 22411965
6013 22411965 17099106 10965420 6868530 3746291 -123222 -4626089 -8557246 -11170851
6005 -11170851 -12355265 -12030896 -10286199 -8184189 -7375231 -7844577 -6826323 -1865214 5198151
5996 5198151 9628129 9572816 7863408 7223431 6688912 4470506 1413885 -894516 -3110139
5987 -3110139 -6512109 -10209351 -12325969 -12214381 -9639373 -4334978 1469552 3428667
5979 3428667 1145671 510501 6091171 14462633 19610883 21495183 23469062 24285619 20013432
5970 20013432 12484446 8122965 8196017 7476925 3633067 928166 2535303 5511635 6252053
5961 6252053 5731522 6546134 9148824 13239127 18505203 22022082 19573281 11787912 4517424
5952 4517424 1160203 -509440 -1858091 404951 8023018 16368516 20056852 19258192
5944 19258192 16636934 12448071 7204035 5143419 9468193 16347428 18361770 12583297
5936 12583297 2173195 -7749273 -12934277 -11814016 -8011445 -8042859 -12963178 -15645555
5928 -15645555 -10409306 -1714423 1834785 -970264 -4341489 -5348546 -6924107 -11260731
5920 -11260731 -15591536 -15319858 -8023235 5114195 18584758 24623247 20089554 10602767
5912 10602767 4380969 3279434 3456694 2595201 1305139 -1005618 -5448407 -8990477
5904 -8990477 -6669072 262363 3820873 -851692 -9293366 -13727772 -11997744 -8174543
5896 -8174543 -6755126 -8703590 -12041163 -14388801 -14607460 -12125306 -5512871 5939393
5888 5939393 18527835 25315131 23509365 17875131 13845817 10391499 3777209 -4710469
5880 -4710469 -10346446 -12453765 -14507855 -17609948 -19449094 -19399363 -19173616 -18412722 -14969152
5871 -14969152 -9821671 -6569017 -5842182 -5368842 -5492180 -8735316 -13477237 -14323564 -9865584
5862 -9865584 -4009074 1413580 8524203 16237377 18847237 15171709 12026720 14076850
5854 14076850 16627256 13921504 8929298 8370850 12156355 14602454 13586977 12022046
5846 12022046 11569022 10791137 9288724 8661188 8831088 7333191 3357511 -24690 1017268
5837 1017268 6322918 10503952 7466191 -2237597 -9970280 -8560356 -2449721 -2913231
5829 -2913231 -12717759 -22234972 -23147964 -18737914 -15950002 -14238502 -9425421 -3513025
5821 -3513025 -2128442 -4742771 -5554234 -3056036 -1134916 -736407 2128092 8640697 13830224
5812 13830224 13417196 9295572 5901345 4886209 5419670 6563247 7351461 6897422 5843867
5803 5843867 5742333 6322377 5638573 3436742 1816978 1739466 1325817 -1181343 -4675309
5794 -4675309 -6561063 -5532578 -2199558 1842298 4793274 5330348 3343973 196265
5786 196265 -1751815 -740321 1864234 1402568 -4993765 -13199206 -15632012 -10892214 -5593109
5777 -5593109 -4687949 -4945979 -1745483 2314277 1095840 -5676085 -12162477 -13658913 -9367778
5768 -9367778 -394867 9531435 13579088 8401935 4110 -3059962 -1030796 -777914
5760 -777914 -3494239 -2861243 3618940 9589016 8768804 2315349 -5185708 -10656535 -11100540
5751 -11100540 -4506626 4081857 4531661 -5143214 -13752674 -11227849 -2352431 1149725
5743 1149725 -2268520 -3870006 170522 3101151 -992245 -7750332 -8668325 -2128972
5735 -2128972 5924783 10004953 10026738 8924089 8232549 6794565 2635668 -4601031 -12815034
5726 -12815034 -18733873 -20168783 -17329664 -12119461 -6265859 -545909 3961764 5088895
5718 5088895 1931097 -2400007 -3194092 -160537 1885574 -54385 -2755879 -1870635 1772611
5709 1772611 4540038 5651996 5947537 3756480 -2205401 -7619787 -6833205 -1743397 344655
5700 344655 -2130634 -3321917 -813959 -403897 -6642552 -15185579 -19096695 -17806534 -15405497
5691 -15405497 -14104645 -13523683 -13057821 -11443735 -7351746 -3328512 -4974883 -12765054
5683 -12765054 -19121054 -17870259 -12528664 -10438178 -12352311 -13156086 -10133806 -5176593
5675 -5176593 -660837 2114667 1936202 -742322 -2784686 -2387822 -1857212 -2942895 -2531472
5666 -2531472 2550144 9341374 12472360 11730365 10601778 9315457 5184275 -1157476
5658 -1157476 -5461066 -5647506 -3389948 -496988 1971404 1907207 -1725525 -5259161 -3275575
5649 -3275575 4538796 12751629 15893243 11975008 2042568 -9910728 -17874378 -18458728
5641 -18458728 -13791952 -7606680 -1344436 3204709 2367723 -3358476 -6835138 -4429860
5633 -4429860 -3492810 -11291181 -21315921 -21445144 -12582065 -6617365 -6836306 -4290376 4099271
5624 4099271 7842384 -673288 -13413449 -17997512 -13260141 -6425763 -2186734 -1647161
5616 -1647161 -5549273 -11394516 -12860531 -8549822 -5867570 -10014962 -15195832 -13896250
5608 -13896250 -8936031 -7850843 -10237986 -10040514 -7010841 -6357260 -8857460 -10361494
5600 -10361494 -10122382 -10913678 -11209529 -6055717 3281191 8701760 6394039 1606422 -8200
5591 -8200 519196 -308657 -2991232 -6980399 -12974978 -19570696 -21780495 -16872669 -8676367
5582 -8676367 -2453727 1873067 7411410 13116675 13712788 7305355 -570439 -2652224
5574 -2652224 1897690 7380625 9317360 9481393 11407609 13398162 10389969 2663936
5566 2663936 -2561163 -829822 2602312 -194170 -8728136 -15094068 -14631654 -10285966
5558 -10285966 -6379190 -3272263 76244 2347887 1611530 -1128852 -2704987 -1700740
5550 -1700740 -146314 -1005211 -4313433 -6404510 -3831267 2193482 6876386 7475750 5620219
5541 5620219 3462104 491776 -4234089 -9563904 -14072582 -17750256 -19755355 -17648732
5533 -17648732 -11651703 -6356835 -4716532 -3584546 715523 5780274 7137385 5842717
5525 5842717 6066490 7276306 5416552 787597 -1748365 28213 4428312 11083609
5517 11083609 20551615 28918671 30533039 27211093 27017597 31878512 34152199 28622349
5509 28622349 20411636 16771337 17818929 20203388 23341435 26120791 23476443 13661890
5501 13661890 4653004 5440472 13345387 17412752 13192951 7008780 5356073 6535615
5493 6535615 4727758 -1873746 -9062722 -10873492 -5622254 921353 39157 -9800970
5485 -9800970 -19471164 -19378353 -11152434 -4807202 -5815136 -10282743 -12554445 -11884862 -10139325
5476 -10139325 -7582338 -3516820 1609845 6590069 10152823 10662156 7377654 2486259
5468 2486259 -530616 -945976 -699803 -178029 2548590 7289522 9963588 7428970 1913070
5459 1913070 -1381407 298332 5511032 10719047 12801419 10924683 7369555 5644804
5451 5644804 6903252 9035199 9538802 7858263 4639319 661797 -2698160 -3933725
5443 -3933725 -3569957 -4213194 -7130611 -10194189 -10466834 -7408159 -2218643 4365647 11661685
5434 11661685 17487441 19253258 16564549 11390878 5952083 1754609 259749 2466082
5426 2466082 6977363 9701172 7043776 -98803 -6146174 -5681895 1065426 8337080
5418 8337080 11036211 9674088 7815079 6040086 1509436 -6413578 -13521332 -15379726
5410 -15379726 -12104969 -6680354 -932157 4237084 6753860 5297061 2744078 4084370
5402 4084370 10278253 16879661 19462448 18039871 15405787 13636123 13470001 14804163
5394 14804163 15995212 14431296 9678287 4632638 1654761 -1026203 -6625279 -14347809
5386 -14347809 -19266144 -17705441 -10736920 -2372647 3602945 5074677 2653762 235302
5378 235302 1960561 6895198 8649027 2427556 -8746706 -16995888 -18035631 -14586126
5370 -14586126 -11814049 -11730068 -12511746 -11445798 -7524930 -2048256 2765986 6174442 9457912
5361 9457912 12944424 13432501 7394114 -2831500 -9332322 -7321339 -1177227 1193707
5353 1193707 -1617671 -3992911 -2250590 520813 105533 -2585448 -4131460 -4395271 -5326624
5344 -5326624 -5715060 -2478868 2553718 2592700 -5001887 -13907438 -16614452 -13557759 -10115203
5335 -10115203 -7300273 -1498343 7108072 12336024 10238365 4421895 29229 -3445050
5327 -3445050 -9169988 -15656707 -17434038 -12424674 -4484449 1941815 6593605 11834543
5319 11834543 18388958 23639944 23300352 15097422 2380993 -6324430 -3828679 8574040
5311 8574040 21598398 26301811 21341305 12196989 4916799 1656703 1370607 2847794
5303 2847794 5637089 8365956 8492090 5590505 3328000 5053135 8105399 6708183
5295 6708183 1107884 -1173655 4367038 12559210 16274624 16518074 19156357 24557803
5287 24557803 27261068 24973486 21316328 19233290 17628532 15634046 14630133 14235343
5279 14235343 11333964 5456993 890224 942608 3632367 5269940 5099934 4378111 3898390
5270 3898390 4343674 6358176 8817920 9729156 9681972 11234151 14319687 16018835 15301755
5261 15301755 13646187 10777594 5367468 562840 1992096 8442228 11814032 9084634
5253 9084634 6364083 7200575 5832545 -1652361 -8211085 -6656886 -2261667 -4123368
5245 -4123368 -9500156 -8430879 -599993 4582310 3538267 2164975 3205497 1449676
5237 1449676 -5763240 -13276169 -17004531 -19426203 -22175820 -21037537 -13181824 -3160517
5229 -3160517 2963404 4594360 4230333 3064148 2231985 3703923 6825259 8237873 7386246
5220 7386246 7262913 8081173 6306146 2129279 960378 4310686 6391192 3789197 994761
5211 994761 1192775 -558307 -8009860 -14907322 -14247502 -10491020 -12540954 -18593625 -18797588
5202 -18797588 -11216636 -4424510 -3882721 -5678946 -5799764 -6651510 -10648395 -14371055 -13608722
5193 -13608722 -9493139 -5879081 -4211858 -3904589 -4555152 -5069012 -3206507 1644583 7124882
5184 7124882 10622428 11315532 9003319 3805248 -2031858 -4923625 -3803874 -974851
5176 -974851 1264153 2097261 414073 -4425459 -9317539 -9438317 -5328563 -3485181 -7264962
5167 -7264962 -11709979 -11397234 -9460532 -13014074 -21321473 -24688459 -16213402 -387274
5159 -387274 11843511 13922448 8028553 837073 -2712834 -1949542 1282956 5498947
5151 5498947 9995894 12908448 11074655 3855390 -3796115 -4797537 2616878 12421312
5143 12421312 16709853 13166579 6190813 2029502 3876991 10427589 17293177 20183390
5135 20183390 18539019 16289423 17591337 21666733 23541005 20233605 14073456 8926345
5127 8926345 5704591 3760393 4250760 8293056 12774639 12501394 7422102 3811325 6145607
5118 6145607 10714567 10110128 2439522 -6616792 -10325404 -7447073 -2359032 127373
5110 127373 -167795 840198 5261646 8580361 4506369 -5300189 -10868195 -5972929 3180453
5101 3180453 5547979 -834188 -7425567 -6794296 -648149 4401480 4792605 2020062 -161400
5092 -161400 1432711 7267546 14075866 17439079 16407116 14035643 12770884 11642834
5084 11642834 9338731 7508093 8357720 10306778 9038117 2974236 -4520835 -8985598
5076 -8985598 -9293575 -7638661 -6744904 -8342906 -13051323 -19504822 -23664867 -21375146 -12968137
5067 -12968137 -4039158 -245964 -2271349 -7106924 -12575434 -17878300 -20688692 -17759578
5059 -17759578 -9770083 -2656113 -1941431 -7135340 -13083800 -15372964 -13202121 -8728203
5051 -8728203 -5408634 -5901176 -9985980 -14994191 -18635796 -20072900 -18301672 -12393202
5043 -12393202 -4412579 1202954 3356282 6226448 12448556 17391038 14752306 6199840
5035 6199840 285852 1598099 5606648 5806188 2345422 925467 4872262 10882228
5027 10882228 12871335 9024819 4180665 4586082 10619516 16246912 16061318 10810061
5019 10810061 4747462 -203987 -5172155 -10478547 -13821091 -12575453 -6792070 -121815
5011 -121815 2129638 -2403129 -9745474 -12946038 -10030825 -6150221 -6243167 -8468295 -7433156
5002 -7433156 -1467645 6123587 10957025 10144382 3482235 -4796577 -7778005 -2919631
4994 -2919631 4312819 6841113 3971030 113200 -1670087 -1055760 1847691 5641274
4986 5641274 6618422 3279101 -44516 1059087 3435434 -102901 -10290427 -19438519
4978 -19438519 -20085418 -12147117 -2041689 2650804 -481247 -5155827 -2478481 6717372
4970 6717372 11031171 4541114 -3171314 -568834 8875523 13427866 11339033 9928380
4962 9928380 10105954 6124931 -112776 544453 7948678 10951809 6025867 3668396 10678765
4953 10678765 19295572 21331850 20910675 24032455 26033078 19997085 9771105 4178538
4945 4178538 3978208 3777647 2008744 486333 -1646989 -5466658 -7234228 -2981036 4650402
4936 4650402 9676704 9653811 5136366 -2832569 -10174251 -10390046 -2908805 4587429 6772257
4927 6772257 7295497 10229027 12614337 11432555 10110231 11313474 11121438 7576445 6684952
4918 6684952 11689662 14872726 9509609 1939032 1389385 5226968 5228513 1694539 144649
4909 144649 334477 -269822 1642089 8731970 14884269 14666417 13608640 17468502 19812163
4900 19812163 13588089 6062622 6986648 10678576 6872971 1099999 5669381 17867012
4892 17867012 26587238 32936662 43082451 48793371 39403505 26121290 27922506 39606631
4884 39606631 42840089 42166623 55761575 75301774 75240654 61219795 64076532 82672205
4876 82672205 85341948 76839526 97041013 124569075 56491501 -151779992 -379740291
4869 -379740291 -457189171 -362856249 -229961090 -165931987 -151574546 -128487106 -98332555
4862 -98332555 -90834716 -94971644 -79365404 -49207662 -34014947 -36951807 -36862605 -28768921
4854 -28768921 -26605202 -32326930 -33613261 -29829798 -33592600 -46374454 -54890661 -52940367
4846 -52940367 -47932521 -44561076 -39283627 -32877413 -32479330 -37796179 -39000173 -32177759
4838 -32177759 -25008693 -23129229 -21725023 -15677725 -8875305 -7423652 -10262374 -12525481
4830 -12525481 -13865422 -17803920 -24669250 -29505707 -27342293 -18790730 -9714574 -5343757
4822 -5343757 -5512506 -7127561 -10138721 -17114392 -26604728 -32258151 -31046409 -27447803
4814 -27447803 -25982941 -24454075 -19237457 -12859698 -10437094 -11718522 -12758874 -13220108
4806 -13220108 -15680182 -18980299 -18690539 -14323980 -10556400 -10441321 -11910287 -11891889 -9966989
4797 -9966989 -6909315 -3034739 634582 2035974 145813 -3908915 -7998563 -10177924
4789 -10177924 -9523248 -7320661 -6360822 -7352112 -7564521 -5346076 -4309323 -9601440 -20446554
4780 -20446554 -29629162 -31050922 -25833557 -20419770 -19773052 -22531457 -22456966 -15555333 -6021955
4771 -6021955 -3018353 -10378525 -21887787 -28601306 -28281483 -24855115 -20990567 -15564261
4763 -15564261 -8158413 -2141326 -1613781 -6701563 -12921428 -15204438 -12769095 -9742614
4755 -9742614 -10061768 -12670197 -14005375 -14160393 -16357344 -20070683 -20010408 -14175702 -7933419
4746 -7933419 -6695967 -9037646 -11150014 -13678865 -18726062 -23600086 -23912728 -20870868
4738 -20870868 -19295688 -19671923 -18393945 -15282890 -14258140 -15779802 -14823136 -8541482
4730 -8541482 -1154944 1400424 -1524444 -5545667 -5985660 -1340511 5344375 7858448
4722 7858448 2367710 -7750170 -15191697 -16980305 -16388799 -16728751 -17376359 -17061837 -17067657
4713 -17067657 -18933900 -21748066 -23623696 -23692119 -21382840 -16225449 -9726746 -4986611
4705 -4986611 -3010477 -1711837 146489 640848 -1984085 -6180857 -9489366 -12126328
4697 -12126328 -15890777 -20873400 -25493782 -28993202 -31892453 -34217330 -34755399 -32325747
4689 -32325747 -27297381 -21828324 -18372979 -17345072 -16546609 -13719357 -9217752 -5283222
4681 -5283222 -3585362 -4758573 -9014546 -15059036 -19566215 -20493740 -20210517 -22410495 -26463747
4672 -26463747 -27972622 -24512659 -17485446 -8890678 -426462 4525808 3326468 -469496
4664 -469496 419055 6656569 9527644 2209981 -10269007 -16768184 -13003372 -4485437
4656 -4485437 1601700 3091239 2027406 867496 183799 -1328666 -4468173 -7082272
4648 -7082272 -6083359 -2505200 -1402859 -5113137 -9947855 -11696490 -10664295 -8430671
4640 -8430671 -3974707 2533497 6083156 3019496 -1681117 -10927 7454889 12500404
4632 12500404 11713273 10531614 13020446 14790250 10466709 3216894 1351985 7535803
4624 7535803 15906429 19535770 17706509 15526444 18024492 24994925 31188550 31569922
4616 31569922 25926493 17760032 10083301 4187692 929193 -182409 -2457576 -8565081
4608 -8565081 -15435875 -16791736 -11482527 -4984446 -1533776 274556 2131781 1974570
4600 1974570 -836148 -1444980 3800341 10156874 10193385 4470139 155709 253083 1023515
4591 1023515 236522 891152 4620112 7566845 6376904 3636572 3320289 4288756 2605561
4582 2605561 -1945500 -5793676 -6705710 -5359187 -2876010 -496269 -1085873 -6823762 -14714251
4573 -14714251 -18107308 -14407090 -8462774 -6110984 -6577345 -4253405 3143860 11753581
4565 11753581 17356395 20478826 23347804 24178571 18603532 6861674 -4453218 -9942578
4557 -9942578 -11820486 -15655916 -21608569 -24062044 -19793409 -12338969 -6898425 -4337548
4549 -4337548 -2467143 -627628 -96197 -1324316 -3418436 -5727854 -7919495 -9176159
4541 -9176159 -9326466 -10125781 -13200743 -16958365 -17717280 -14160725 -8950475 -5723079 -6044936
4532 -6044936 -9328665 -13702369 -16266578 -14372496 -8123739 -791925 4366587 7192878
4524 7192878 9629170 12184677 12838600 9960294 5173672 1758839 253767 -2368773
4516 -2368773 -7900575 -13192177 -13951873 -11259473 -10653623 -14453440 -18949328 -20637719 -21109180
4507 -21109180 -22929378 -24311792 -21819848 -15780402 -8996496 -2489607 2956381 3491409
4499 3491409 -3470131 -12632582 -15211446 -10679497 -7894017 -12683857 -20099582 -21922120
4491 -21922120 -17012647 -10673038 -7404856 -7712419 -9367197 -9207640 -6143099 -3858911
4483 -3858911 -7001460 -13359307 -14878954 -8899106 -2544737 -2026750 -3839158 -2577790
4475 -2577790 -1502749 -6549780 -13605770 -12237485 -1809172 6033823 3185011 -5167778
4467 -5167778 -10273208 -11715761 -13860501 -15737059 -11649085 -448607 11432612 17117684
4459 17117684 16533163 15485498 18583302 23741525 24178456 16307215 4438754 -3999634
4451 -3999634 -6507831 -5973670 -4463260 -1064704 3776243 6561022 5377519 2611937
4443 2611937 887484 -555321 -3300318 -6730354 -10070228 -14523481 -20420788 -24677405
4435 -24677405 -24247723 -20239476 -15699521 -11341071 -6813793 -4312465 -6601331 -11965984
4427 -11965984 -15095398 -13180561 -7688709 -12298 10240669 20840743 24971792 17884362
4419 17884362 4297136 -4711419 -2988537 4877016 9967331 9031670 6052295 5255989
4411 5255989 5709888 3511170 -3006725 -11662227 -18465545 -20002261 -15491146 -8286794
4403 -8286794 -3897108 -4340937 -5594066 -2854679 2966722 6909241 7111041 6714458 8682811
4394 8682811 12223199 14986188 15750533 14211409 11015415 8671118 9378265 11160908 9330443
4385 9330443 2740110 -4711821 -9779353 -13219626 -15926667 -16036732 -12763684 -9594325
4377 -9594325 -10270866 -14095725 -18070554 -21074931 -23046544 -22858098 -20443030 -18596068 -19192684
4368 -19192684 -19950705 -18458658 -16818316 -18070327 -20297747 -19083372 -14251650 -9400096
4360 -9400096 -6108025 -3604638 -2897680 -5465341 -8321246 -6489864 -838376 2624358
4352 2624358 2244345 3034324 7385166 10144776 6854886 1099006 -1486442 -1806332 -3710763
4343 -3710763 -5145481 -257555 10301130 17938048 16510505 9234280 3263047 1365785
4335 1365785 1460148 1210997 -217484 -3398038 -8396379 -13232912 -14520209 -10129457 -732669
4326 -732669 10604453 19439638 21742422 16870637 8882971 3102039 962296 -140729
4318 -140729 -1760075 -1983377 129964 430557 -6157983 -17995410 -27164154 -28407790 -24339029
4309 -24339029 -20336857 -17664854 -14437036 -10790072 -9057543 -9463156 -9247123 -6614691
4301 -6614691 -2958633 -490269 168987 -678049 -2754164 -4929733 -5136013 -2716100 154150
4292 154150 815813 -756958 -2512203 -3508078 -4936484 -7726890 -10641462 -11949151 -12391236
4283 -12391236 -14973073 -21242495 -28580677 -32052318 -28852319 -20569402 -11429936 -4881620
4275 -4881620 -1666845 -579211 -794660 -3055199 -7871213 -13080398 -15232551 -14042697
4267 -14042697 -13158939 -14912439 -16626610 -14662546 -10059479 -6764527 -5730846 -4637740
4259 -4637740 -2497954 -358209 1877387 4621295 5033007 -158879 -7828482 -10543794
4251 -10543794 -6919835 -3544399 -4380081 -5353043 -3375847 -3414559 -10212374 -18788122 -20837780
4242 -20837780 -16683271 -13118882 -12312090 -11019609 -9061845 -9938243 -13022671 -13315333 -10300522
4233 -10300522 -9718960 -14326136 -19408810 -20307147 -18552390 -17052151 -14372094 -8515549
4225 -8515549 -3103779 -4745665 -14768907 -26506337 -30942610 -24079540 -9568046 4768019
4217 4768019 13093505 14595171 11265922 5134092 -1117929 -3789184 -1656078 1796446
4209 1796446 2601785 1061924 -667192 -3168997 -7561467 -10673051 -7747457 453644
4201 453644 7680618 9063536 4523129 -3102623 -9211207 -8844507 -2173197 3178807 767508
4192 767508 -5779651 -8716928 -8437650 -11551700 -18196630 -21056164 -17967764 -15994033 -20181838
4183 -20181838 -26504046 -29264666 -28241596 -25199174 -20108180 -14173752 -10492649 -8955700
4175 -8955700 -6553488 -4649006 -8805388 -19039481 -27758517 -30079031 -28576404 -25397838
4167 -25397838 -18655982 -10321591 -8317519 -15411676 -24038818 -27144128 -26384103 -25271269
4159 -25271269 -23108648 -20780067 -23391856 -31567586 -38955611 -43144415 -49127825 -57940335
4151 -57940335 -64402509 -70601348 -85670664 -105947434 -115562709 -116952482 -134914729 -169587377
4143 -169587377 -171528852 -98722654 15984961 93629889 101671944 79936206 72426161
4136 72426161 74762380 64127573 44147744 32915138 30070782 23873691 17299809 22244646
4128 22244646 35853679 43927470 42967113 40933944 40120928 35882540 29951375 29725368
4120 29725368 34835457 37245176 34485793 31545008 29884081 25276728 17245781 11348071
4112 11348071 10778886 12945049 14878574 15811208 14713344 11206754 8262476 8688973 10386295
4103 10386295 10155703 9625269 11447177 12520349 8148007 915351 -1959272 1083842
4095 1083842 5354897 8579329 12819727 17835327 19534135 16143602 10608257 6261237
4087 6261237 4455277 5787847 8822405 8682783 2466517 -4696887 -4767303 2376999 8963462
4078 8963462 10080529 8554311 8597914 10345148 12126193 13372086 13442536 11083725 6567246
4069 6567246 2217227 521784 3033121 9365026 15320518 15266603 9604019 5901602 8295789
4060 8295789 10772678 7323673 3281982 7040855 14349803 12757986 931989 -8772458
4052 -8772458 -8809662 -5439998 -5199743 -4077530 2747518 9872743 9353635 3204159 -344018
4043 -344018 1245265 4518951 8180356 13359363 17435711 15334533 7345116 -142993
4035 -142993 -2402847 -544464 2141355 3728470 3149357 220997 -2641375 -1841253 2869032
4026 2869032 7368634 7786201 4668228 1827152 2293734 6059582 10853342 14373540 16029468
4017 16029468 16895084 18181002 20021905 21636839 22114866 20945601 18194760 14210401
4009 14210401 9155177 3484245 -1078725 -2639363 -1948305 -1994581 -3246192 -1947769 3921881
4000 3921881 9528924 8526141 2258239 -1409726 1657445 7817145 12268713 14186652
3992 14186652 13775286 10177019 5664812 6610158 15144492 23282460 21009033 8664225
3984 8664225 -3917525 -9941784 -11894015 -14237414 -15146160 -9561534 1566361 9600407
3976 9600407 7237161 -2851837 -10477183 -8557100 491568 8769436 10747410 6188412
3968 6188412 -1844759 -9115658 -11887801 -9506216 -5003875 -1367783 1535878 4374812
3960 4374812 5155324 2419951 -132733 2747030 9798365 13580046 9641824 1331720
3952 1331720 -5271805 -7280944 -5179079 -1347897 352362 -2527713 -7224685 -8433875
3944 -8433875 -5557402 -3135456 -3352329 -3261501 -1076621 289761 -1264153 -3028044 -2315923
3935 -2315923 -777446 -444974 39947 1475432 939189 -2867487 -5305734 -2135963 3224806
3926 3224806 4448336 1670047 164653 1338921 1190364 -2407165 -6148974 -5943091 -1632887
3917 -1632887 3404413 5006284 1110349 -5817436 -10248911 -9546515 -6730048 -5244528
3909 -5244528 -3803953 368352 6039552 9772830 10877181 10372480 7403166 1405622
3901 1405622 -4220009 -5678394 -4366897 -3894355 -3472092 -173916 3698628 2332741 -4525209
3892 -4525209 -10569772 -11656944 -9816580 -8122987 -7578838 -9808893 -16294862 -23211452
3884 -23211452 -23413304 -16128756 -8906636 -7255534 -8280539 -7947991 -8470328 -13334468 -19740312
3875 -19740312 -21884381 -19004393 -15105169 -12760613 -11575090 -10805477 -9229454 -4279562
3867 -4279562 4170366 10576599 9119493 1941158 -2500254 250999 5862044 7743407
3859 7743407 5061848 2468973 3835749 7990858 9987984 5806239 -3754533 -13488860
3851 -13488860 -18251272 -16989154 -12649959 -9147639 -8552603 -9760449 -9254122 -4626530
3843 -4626530 1989104 5777208 5264993 3941571 4291756 3372150 -2236219 -9335991 -10807364
3834 -10807364 -5135110 1460345 3572160 2937462 3705995 5149509 3441369 -987954
3826 -987954 -2812677 771266 5979542 7748128 6043564 4083281 2622692 -66777
3818 -66777 -3493051 -4724990 -3640913 -4218086 -8552463 -13179672 -14285322 -13536094 -14842932
3809 -14842932 -17513478 -17372588 -13920070 -11456993 -12411627 -13925562 -12791515 -10278319
3801 -10278319 -9770694 -12092829 -15366178 -17626836 -17602293 -14649621 -10263700 -8507871 -12314385
3792 -12314385 -19187259 -22411468 -17463917 -6727192 2722405 5909148 3900489 655548
3784 655548 -2614054 -7509246 -13289030 -15752881 -13341051 -10498504 -11113946 -11759653 -6833512
3775 -6833512 1534202 5372346 2740374 945264 5885544 14088245 18556119 17709011
3767 17709011 14693144 11571117 8307785 5040503 1846166 -1929541 -5723600 -7619255
3759 -7619255 -8348980 -11997244 -19501294 -24851825 -22046361 -13395728 -6579056 -5407091
3751 -5407091 -7878292 -11463044 -15015946 -16190391 -12498196 -5896857 -1981390 -3165746
3743 -3165746 -5995185 -6597617 -5776452 -6706295 -9544980 -10622952 -6871039 -51017 4197659
3734 4197659 2366544 -2240641 -2978909 1436179 4716131 1511035 -4837028 -6509816
3726 -6509816 -1329067 5141019 6777568 2829536 -2759204 -4846243 -447115 8271241
3718 8271241 14574590 13473812 7125311 1630601 -316228 -543835 -648392 -323501 76310
3709 76310 -349650 -96913 3578365 9911228 14622695 15256643 13244589 10605945 8522568
3700 8522568 9329540 15017652 22330800 23987725 17106813 6747986 -808760 -4235432
3692 -4235432 -4408784 -391961 7497929 13999964 13560224 7641241 3334496 5072934 10887595
3683 10887595 16424743 19387429 19642642 17748612 14677014 11630551 9113030 6654851
3675 6654851 3883744 1565882 1109445 2656324 3916752 2157589 -2070540 -4857464
3667 -4857464 -4021583 -2432909 -3966033 -8082245 -11740635 -14756727 -18481312 -20365603
3659 -20365603 -16148340 -8079651 -4232395 -7189534 -9982132 -7390111 -5111039 -11343826
3651 -11343826 -23460947 -30538557 -27556941 -20123721 -15013489 -12424171 -9520279 -6630642
3643 -6630642 -6403809 -8894550 -10381209 -7226740 -132476 5935230 6821670 4022596 2626763
3634 2626763 4124157 4192115 -791515 -8163644 -12624937 -12804526 -10866605 -7857178 -3453898
3625 -3453898 945799 2765917 1382063 -2083554 -6756885 -10730353 -9728667 -1422112
3617 -1422112 9777892 16398544 15956124 11723390 6629914 1027956 -4009175 -6291639
3609 -6291639 -6074154 -5785786 -5763350 -4354145 -2403326 -3008731 -6272746 -8978931 -10109455
3600 -10109455 -11636140 -12926629 -10055433 -2696676 3660354 5027694 3721094 3375669
3592 3375669 4075201 5168638 7699401 10596616 9644177 4341293 808666 3317020 7930015
3583 7930015 9696185 10682656 14056144 15313369 8537141 -1530510 -3814274 2834209
3575 2834209 7266502 1821933 -7947659 -12518003 -10012917 -4341352 2112187 8585160
3567 8585160 12902255 13657786 13006100 13009400 11295414 4477116 -5598502 -13105793 -15259010
3558 -15259010 -14684569 -14766938 -15512301 -14719451 -11311297 -6555831 -2783779 -1411728 -2122867
3549 -2122867 -4022322 -7139904 -11773164 -16591549 -19077857 -18284703 -15660494 -12740922
3541 -12740922 -9724839 -6795246 -4620832 -2375118 2478767 10325592 16828467 16786022
3533 16786022 10306619 3166278 661703 2329328 3293315 197065 -5037815 -7835317
3525 -7835317 -6962434 -6376142 -10096114 -16753998 -21376539 -21667879 -19740758 -17814948 -15372959
3516 -15372959 -11409272 -6761421 -2953542 -802595 -914348 -3123397 -4711252 -2192710
3508 -2192710 3790703 8370194 8826945 7791492 7963851 7273728 2671649 -4214849 -9293129
3499 -9293129 -11874983 -14136225 -15947540 -14490634 -8886007 -1887028 3053301 4053611
3491 4053611 1057624 -3521857 -5612314 -3943504 -2427345 -4891630 -9201414 -10768472
3483 -10768472 -10150159 -11551011 -14320757 -12409222 -3825759 4947450 6600337 921430
3475 921430 -6975540 -12170347 -11583870 -4812219 3321824 4946572 -2175156 -10877795 -13047117
3466 -13047117 -9341192 -6939919 -9948137 -15970387 -20572069 -21145292 -17120527 -9891788
3458 -9891788 -2614630 2028077 3445758 1594800 -3811446 -10578339 -13650434 -11022329
3450 -11022329 -7617577 -9226907 -14605995 -18025265 -17701874 -16260796 -14119113 -9016874
3442 -9016874 -2590127 -665093 -4625687 -8252608 -6603931 -3240940 -4291120 -8943664
3434 -8943664 -10866012 -7149152 -1037044 3700757 6947551 10282994 14026508 17430812
3426 17430812 20017549 21667141 22086053 20527010 15935234 8149895 -581254 -6695446
3418 -6695446 -9067155 -10145263 -11658662 -10983586 -4877919 3937602 7896154 3525248
3410 3525248 -3825605 -6370999 -2769311 2085472 4423640 4818341 4077488 433361 -6538085
3401 -6538085 -12363321 -12365608 -8967791 -9699423 -16932799 -23752250 -22542693 -14506667 -7298649
3392 -7298649 -5555780 -7864959 -11652883 -16003852 -19142501 -17884671 -11828046 -4992119
3384 -4992119 -1141127 132174 928466 1420625 1134118 1397401 3444312 5733011 6284539
3375 6284539 6411746 8643000 11539000 10364636 3605505 -4191615 -7271638 -4294758
3367 -4294758 1683244 6738507 8558701 7321858 5483897 5490560 6801467 6356562 2464096
3358 2464096 -3470289 -9613007 -15665978 -20783722 -22191513 -18582409 -13097002 -9726304
3350 -9726304 -7871491 -4159068 688527 1207342 -5087827 -13031199 -15609135 -12133117
3342 -12133117 -7755549 -6395351 -7253401 -7730877 -6772088 -4914425 -3225816 -2767131 -3525630
3333 -3525630 -3584837 -879610 3915636 7587234 7627622 4117957 -1195589 -5854613 -7034972
3324 -7034972 -3479334 2352765 6208327 6670631 5756670 4680638 2177837 -1659360 -3165436
3315 -3165436 581150 7160571 11046321 9296744 3451885 -2526483 -4645639 -1517676
3307 -1517676 3187358 3095829 -3647477 -11680228 -15318408 -15263047 -15203687 -15068277 -12488963
3298 -12488963 -8400689 -5354724 -1944157 4512422 10426179 8481337 -1216718 -9729063
3290 -9729063 -11377440 -10449237 -12409940 -15031622 -13398790 -8478419 -4666437 -2494849
3282 -2494849 73630 1680324 -776913 -5718706 -7911956 -5727512 -2461476 -460582
3274 -460582 1328204 3529048 4662858 4549281 5566224 8932533 12721501 14926741 15692842
3265 15692842 15070712 11446318 4495793 -2310126 -4853312 -3312677 -1795641 -3169438
3257 -3169438 -6219260 -8495196 -10083220 -12616705 -15398666 -15511395 -12720132 -11088402
3249 -11088402 -12996693 -14380220 -10455701 -4356505 -3793130 -9014106 -11301313 -5933700
3241 -5933700 447566 18491 -5001758 -7641104 -7540119 -9156250 -11941305 -11011821 -6513395
3232 -6513395 -4098349 -5836996 -8040807 -8598652 -9007778 -8260062 -2864949 4973078 7662582
3223 7662582 4250756 3635511 10348789 15298945 8710107 -3985976 -9100762 -4096547
3215 -4096547 522174 -1803838 -5364840 -3684721 -282451 -2114254 -8194035 -11705597
3207 -11705597 -10610254 -9298285 -10046243 -9247006 -4419723 -141367 -2737028 -11302839
3199 -11302839 -18557330 -20284699 -19567122 -20554603 -22307195 -21748320 -19592462 -19261987 -21319997
3190 -21319997 -22777765 -21313964 -16880832 -9965564 -2102822 2467257 379963 -4939378
3182 -4939378 -5564910 996084 8085896 8149324 1165101 -7336590 -13034514 -14570907 -11649119
3173 -11649119 -5402525 515679 2415254 173410 -2893703 -3072887 1141715 7535758
3165 7535758 10693835 6507339 -2943311 -11411431 -15603556 -16814251 -15468131 -9680712
3157 -9680712 -1273988 2953132 230502 -3039472 -341706 5144226 5768592 734035
3149 734035 -4605242 -7991589 -11282940 -13733339 -12220476 -8322669 -7568946 -10243870 -9931437
3140 -9931437 -3572702 3311352 4611098 1527345 -1088935 -1815133 -2117586 -2184519 -1390659
3131 -1390659 -741895 -1345465 -1846949 -157137 3250116 5732676 5409293 2885121 1398496
3122 1398496 5084252 14029219 20593487 15020990 -2804778 -20756979 -26812786 -21314039
3114 -21314039 -13750331 -10181889 -8365451 -4024523 2843606 8618219 9884719 5810437
3106 5810437 -1175338 -6611736 -7687933 -6002242 -5175984 -5793413 -4612254 679580 7556719
3097 7556719 10701816 7572497 1279542 -2313544 -498981 3556813 4738293 2319297
3089 2319297 677502 3081973 6775940 6204469 182920 -6341084 -7728718 -3197939
3081 -3197939 3389970 7814837 8684475 7263401 5524428 4712719 5049950 5920466 6263750
3072 6263750 5465935 4094115 3104827 2222584 232128 -2687619 -4420094 -3703447 -1966765
3063 -1966765 -1091392 -1110127 -1937410 -5219622 -11429555 -16742947 -16580252 -11407028 -5158326
3054 -5158326 1152131 9188958 16711031 17507633 10377789 2923042 2639144 7972514 11909454
3045 11909454 11144171 7583082 3373868 -995044 -4888784 -7602600 -9519181 -10502230
3037 -10502230 -8558707 -2854790 3706608 8009292 10972011 14849576 18254330 18083767
3029 18083767 15045138 12685350 11542882 8774463 3556304 -1312879 -3384490 -2483411
3021 -2483411 868092 4702984 4008500 -4397329 -14692497 -15822925 -4825674 8709873
3013 8709873 14261746 11721859 8025391 7377087 9327170 12600846 15453575 14737007 9899408
3004 9899408 6173991 8483080 13361694 12732388 5652394 221699 2138085 6923596
2996 6923596 7012767 2551402 491560 4642973 11121657 14092406 12752889 10927560 11332562
2987 11332562 12360527 10839736 6614313 2849748 1687959 1215765 -1961382 -8146276
2979 -8146276 -14326929 -18004581 -19117287 -18134639 -14768104 -9697775 -5568954 -4564996
2971 -4564996 -6103797 -8173703 -9612195 -9664763 -6985412 -1484435 3761664 5069977 2379309
2962 2379309 -1326696 -4256912 -6500345 -6755180 -2532399 4925004 9894896 9187511 6779815
2953 6779815 7970098 11615064 12687898 10684726 9858608 11275474 10563119 5227174 -1111546
2944 -1111546 -4690108 -7228925 -11658902 -15952879 -16183101 -13436813 -12377720 -13867554
2936 -13867554 -14260610 -12230678 -11265985 -13971972 -18153725 -20585627 -21045341 -20159329 -16537121
2927 -16537121 -9411783 -1965387 1594771 1295220 620793 1177093 1359983 232372 -756046
2918 -756046 -972086 -2507146 -6832842 -11517849 -12661042 -9629609 -5256136 -1991963 -172171
2909 -172171 133719 -1678125 -4729503 -6131726 -4180052 -638935 1746508 2651567 3294033
2900 3294033 3613751 2798103 1545421 868946 -563875 -4215499 -7004178 -3601701 4984238
2891 4984238 9709073 3695156 -9085715 -18859529 -20976125 -17790722 -12315947 -5557869
2883 -5557869 590571 3413120 3408455 4106560 6767089 8925047 9078622 8754005 8420835
2874 8420835 5553992 -663872 -6182145 -6758238 -3353251 -52585 1131127 528297 -1782808
2865 -1782808 -5218450 -6755502 -3484105 3255629 9131537 11747034 11811692 10472386 8859836
2856 8859836 9678588 15109459 22411474 25423180 22043080 17029466 15435181 16331314 15759424
2847 15759424 13159957 10937655 9200938 5724233 1462972 1363257 7392932 14421530
2839 14421530 16474131 14511019 13614173 13924402 10087068 672151 -7446846 -7367455 -603792
2830 -603792 6823026 12963479 18858779 21529936 15980338 4938190 -1054366 3141672
2822 3141672 9807088 8830804 1060205 -4545288 -3972231 -1663700 -1871261 -3057726 -2317262
2813 -2317262 -372871 245552 -1128571 -3413992 -5256208 -5047786 -1733970 3258901 7188155
2804 7188155 10037218 14575846 20950048 24497302 21748438 16026450 13396250 14487293
2796 14487293 14331450 10018578 4509040 1915187 2471765 3998442 5541883 7083584
2788 7083584 7669648 6755012 6159185 7584158 9006317 7282631 4331585 6025993 12984094
2779 12984094 17049246 11096547 -746800 -7896024 -6662996 -2935769 -1847692 -1586072
2771 -1586072 408127 1514056 -1416068 -6210564 -9368685 -12399037 -18425963 -24913447
2763 -24913447 -26211744 -22501837 -19867145 -21092149 -22390177 -20548060 -17539544 -15680423
2755 -15680423 -13329991 -8598900 -3230399 409928 2513303 2807079 -1662801 -11409078
2747 -11409078 -20276702 -21193691 -14216452 -4623869 4512369 12467218 15727589 10235785
2739 10235785 -285794 -5200078 429873 8875288 9303940 867892 -7993448 -10950528
2731 -10950528 -9558965 -8009322 -6752232 -3418371 2247594 6926402 7159775 2981767
2723 2981767 -2374370 -5789845 -6413600 -4658749 -670858 4838277 9139576 8963879 3885415
2714 3885415 -2842083 -6930645 -5852907 -42547 6739807 9058603 4793046 -1421783
2706 -1421783 -2933969 173768 909470 -4399691 -9973574 -8201816 -23695 7078594
2698 7078594 9390067 9792856 10904758 11246972 9586016 7936953 7440639 5075006 -2015300
2689 -2015300 -11138547 -16162309 -13829937 -5927602 3182251 8988354 8696595 3682708
2681 3682708 -926541 -1808111 -1607583 -4804784 -10644889 -14027025 -13195774 -12141805 -13971270
2672 -13971270 -15864753 -13536466 -8197864 -5598538 -8832808 -14822929 -18098475 -16241635
2664 -16241635 -11280487 -6996168 -5360092 -5131640 -3909512 -1623732 -1090835 -4312261
2656 -4312261 -9156801 -11247790 -8979711 -5260474 -3985643 -5836415 -8019665 -7434978
2648 -7434978 -3647350 776267 2470418 109456 -4588339 -8619232 -10304330 -10116007
2640 -10116007 -9585104 -10139548 -12541748 -16182168 -18744284 -17769551 -13194133 -7620202 -3782704
2631 -3782704 -2781823 -4989072 -10472452 -16730293 -18035053 -10704183 986641 7863135
2623 7863135 6356310 2919177 5629018 13984700 20331749 19635733 13915032 7871046
2615 7871046 4564986 5620044 10940158 16558971 17017947 12443034 9576446 12722769
2607 12722769 17289711 16498628 11432615 8845981 10549147 11396427 8569702 6836545
2599 6836545 11436650 19558997 22743956 16478683 4863128 -3807335 -4656696 256299
2591 256299 5100980 6482648 5678424 4668838 2609248 -1425683 -4645399 -3531070 659683
2582 659683 3838962 5696962 9126323 13310064 13816580 10936511 11109110 16848346 21540583
2573 21540583 18853804 11924966 7712631 6751904 4736997 732137 -2888847 -6118540
2565 -6118540 -10016939 -11513022 -6822958 468394 1961568 -4262522 -11434856 -14222439
2557 -14222439 -14554615 -15502463 -15793858 -13740540 -11472318 -11416426 -12300579 -12104419 -11867844
2548 -11867844 -13298165 -15093222 -14630173 -11502381 -7267914 -3583376 -2084673 -3656459
2540 -3656459 -6256903 -6188235 -3225594 -1614944 -4145168 -8269087 -10157396 -9371552 -7113663
2531 -7113663 -3324135 1227093 3062002 184386 -3884860 -3994952 95867 4104461
2523 4104461 4552647 915949 -5405194 -10857722 -10550265 -3364857 5045905 8203983 6490408
2514 6490408 5011295 5422922 4987200 3084877 2729506 4390482 3753017 -1550092 -6943996
2505 -6943996 -6144377 758421 7357164 7897525 2111465 -5851432 -11248102 -11752134 -8161607
2496 -8161607 -2846962 2005749 4280301 1602911 -6332657 -15271600 -19263509 -17344154
2488 -17344154 -15049889 -17371351 -21867691 -21246581 -12356688 -491168 5817483 3248509
2480 3248509 -3526552 -6937037 -3902383 1812267 4251029 1591437 -2751215 -4777158
2472 -4777158 -4089723 -2765137 -1598222 275789 2068818 510296 -5495195 -11249133
2464 -11249133 -11060349 -6547763 -5590744 -11124352 -15897092 -12865386 -6644199 -7366911 -14921748
2455 -14921748 -18236799 -11805688 -3907164 -3552208 -6947503 -4434156 4272560 10497573
2447 10497573 9799265 6172797 3552133 1270265 -775119 122989 3690784 4575962 -322611
2438 -322611 -6671268 -8150013 -3696477 3448650 10407361 15125526 15292543 10782585 5441237
2429 5441237 2930491 1894094 -1640980 -7857397 -12296423 -11497408 -6927410 -2593000
2421 -2593000 -494937 583197 2789893 6880895 12055004 16998917 20181569 19705305
2413 19705305 14695746 7378242 1961097 318500 427190 107734 -216690 -289242 -2152832
2404 -2152832 -5905201 -6346158 935981 11965738 18761867 20316446 22399643 26207971
2396 26207971 25149333 15892956 5626049 3448121 9464310 17216649 22687722 25606596
2388 25606596 25248085 20975877 15458479 12237067 10883241 8771082 6666862 8071243
2380 8071243 13120614 17179015 16263359 11191996 5924398 3774811 5191976 7524827
2372 7524827 7316709 4282986 2250591 4747117 10652220 15437232 15388878 9760257 1063018
2363 1063018 -5436671 -5381267 -493609 2739550 1511319 196406 2798816 6305674 5703382
2354 5703382 1498318 -2890715 -7367973 -12589761 -14680510 -10238824 -4480663 -5832919
2346 -5832919 -12925023 -15697682 -10270421 -3774265 -2014367 -1241819 3295835 8405566
2338 8405566 8770653 6046311 5509267 7402930 7827152 5627076 2651647 -978512 -6357548
2329 -6357548 -11511898 -12560377 -8982334 -3895974 509689 4237208 6679934 6398857
2321 6398857 3966886 1803227 690321 -827277 -3234111 -5074899 -6099386 -8857574
2313 -8857574 -15406213 -23661317 -28720193 -27820010 -23114172 -18985381 -16840986 -13734986
2305 -13734986 -6994378 1149412 5748354 5288049 2734027 389540 -2773476 -7535888
2297 -7535888 -11737921 -13281483 -12863427 -11378169 -7496273 -693165 5902877 8944938
2289 8944938 9049609 8479742 7139474 4670001 4033168 7911317 12818897 12263985 5776355
2280 5776355 -253157 -1250141 994699 3467695 6306488 9513986 9837890 4696481 -3403264
2271 -3403264 -9537586 -11497345 -9742578 -4668918 2609809 8234126 8215058 3233818 -1854981
2262 -1854981 -3684249 -3468550 -4064966 -5935235 -7159117 -6465622 -5052122 -5261452 -7831266
2253 -7831266 -10844084 -11616437 -9258075 -4898033 -78152 3827249 5129717 2937799
2245 2937799 -652658 -1396551 2843378 9869070 15956222 19318615 19792955 17194260 12196732
2236 12196732 7555072 5863766 6421604 6430023 5107602 4531897 6369382 9880893 13498079
2227 13498079 16197858 16498831 12311318 3672075 -5427294 -9850329 -8056685 -3241491
2219 -3241491 38731 -238004 -2542722 -3633467 -1275299 4217243 10654370 15901049
2211 15901049 18901194 19185017 16498050 11548757 6493389 3832954 4722893 8300940
2203 8300940 12062869 12833253 8594677 410118 -7962757 -13198311 -14788220 -13923086 -11217330
2194 -11217330 -6918251 -2483107 42588 152447 -1298622 -4260552 -9308915 -14835896
2186 -14835896 -16817770 -12993428 -5865761 -13622 2580173 3230448 3735649 4522014 4887405
2177 4887405 3599066 -88574 -4575932 -5989532 -2098074 4337952 8227838 7917198
2169 7917198 6070478 4926146 3556740 740343 -2329969 -4303900 -6550347 -10862168
2161 -10862168 -15104233 -14384592 -7528090 -74640 1316909 -3188301 -6398717 -2530259
2153 -2530259 5821703 10894560 9075135 4392951 2312472 3045151 3127070 1258994 -814353
2144 -814353 -2157672 -3544901 -4321481 -2066566 3323899 8204420 9434696 7492580 3769695
2135 3769695 -2159234 -9754772 -14519927 -11802528 -2895075 6113252 11456307 14320183
2127 14320183 15957867 14050602 6469016 -3636205 -10007353 -10588340 -10009276 -13505660
2119 -13505660 -20007096 -23320952 -19742295 -12191250 -6063848 -3109526 -1238524 1125916
2111 1125916 3154981 3718605 3009016 1905704 1552894 3320679 7085966 10062148 10109304
2102 10109304 9726170 13013558 18572129 20100865 15425585 10012810 8963052 10422210
2094 10422210 10634645 10637486 12574223 13424553 9307830 3676702 3629088 8484894 9482171
2085 9482171 2085717 -8091378 -13867967 -14930211 -14555706 -13222942 -9640276 -4344614
2077 -4344614 1790836 9723203 19124900 25726973 25914941 22242012 20354180 21489505
2069 21489505 21931358 19596773 17390013 18993137 23711652 26818841 24234047 16549532
2061 16549532 8804202 5801394 7202048 8094171 4798944 -1266058 -6044022 -7239167
2053 -7239167 -5205071 -1603491 1001648 40556 -4300162 -8362943 -9004737 -7142177 -5520138
2044 -5520138 -4457989 -2168414 1876333 6393002 10180450 12173973 10736732 5839252
2036 5839252 1189762 848274 3752657 4869226 2231122 -389232 1071413 5663740
2028 5663740 9179728 9143945 6472884 3710445 3025351 4831556 7458387 9322793 11728499
2019 11728499 17299835 24605487 27145810 20507789 9039420 2112513 3886389 9759037
2011 9759037 13538120 14927034 17588827 21903049 23461019 19326251 12804080 9867144
2003 9867144 12381470 17366113 22231480 27528160 33596868 37433461 35394563 27734591
1995 27734591 18174284 9713237 3080434 -1237596 -2195540 56778 3815898 8017806
1987 8017806 12886050 17536297 19137750 16310087 11882475 10015719 11158848 11924407
1979 11924407 9771624 5696139 2006986 -271910 -691903 1694360 6400685 9856620
1971 9856620 8823018 5432129 5422297 9964141 12526405 6930657 -3751479 -10582947 -10219290
1962 -10219290 -8091066 -9287466 -11526070 -10519901 -8170751 -9975945 -15783053 -18777786
1954 -18777786 -14647804 -7437901 -4299466 -7509408 -13895096 -19467176 -21512686 -17813015
1946 -17813015 -7938140 3939692 10648247 8684497 2151421 -1864220 -1333987 -669819
1938 -669819 -3874896 -8728041 -9593827 -4596978 2465882 6981789 7787743 6374985 4532904
1929 4532904 3908451 5502387 7791930 7173230 2283743 -3523762 -5996295 -4890740 -2894563
1920 -2894563 -1115852 1351952 4072928 4816898 2920200 455381 -763332 -1365807 -2961083
1911 -2961083 -6117010 -10104369 -12969671 -11907787 -5964750 1034011 2736324 -3088370
1903 -3088370 -11672259 -16076951 -13454508 -5770275 3454666 11063986 14365830 12252507
1895 12252507 6964880 3175704 3790882 6501331 5580282 -1632279 -10314282 -12167836
1887 -12167836 -4639380 5799586 10937034 9185055 4650127 725087 -1391111 204734
1879 204734 6826019 14715105 17149957 12679574 6938286 4526178 3475659 121119
1871 121119 -4911784 -8781732 -10620892 -10013054 -4945396 4209741 11520585 11402217 6183263
1862 6183263 3270472 6001398 11500501 16059214 17805564 15357412 9555687 6166349
1854 6166349 10648494 19437622 22805718 18376546 15146905 20052769 26551910 23098330
1846 23098330 9643672 -1586060 -1374013 6761334 13496136 14976335 13883257 12583103
1838 12583103 9568541 2517402 -7783422 -17240544 -21074434 -16804543 -6307161 4430812
1830 4430812 8953045 5219246 -3057937 -10259404 -13435974 -12765971 -9282148 -4441030
1822 -4441030 -1211018 -2361158 -6632586 -9124441 -6990070 -2553507 921080 4017382
1814 4017382 8982801 14849848 18368477 18731618 17634944 15214655 10135676 4110692
1806 4110692 2043931 6096304 12994951 18701529 22118271 22288614 16385998 4645460
1798 4645460 -5664333 -6421287 1842192 10823013 14649005 15070775 16021265 17454623 16855656
1789 16855656 13716103 9541977 5152166 776224 -2115292 -1818720 897991 3416935
1781 3416935 4802112 6479627 8783509 9292000 6432836 2994663 3335441 7498564 10757120
1772 10757120 9582665 5752322 3252523 3071795 3178546 2620856 3140967 6370634 11089772
1763 11089772 14116469 13353201 9679463 6183173 5414836 7045410 8499049 7947726 5637205
1754 5637205 1869976 -4426558 -13340097 -21552443 -24849486 -22808978 -18884596 -16070574
1746 -16070574 -14735884 -14602301 -16018582 -18333875 -19185034 -16603492 -10553511 -2151641
1738 -2151641 6747192 13062491 14293694 11790009 9781960 10105441 10520105 9476054 9161799
1729 9161799 11220485 12330805 7733785 -2276534 -12633244 -19209132 -21216773 -18985588
1721 -18985588 -12971804 -5030466 2200955 7361208 9739125 7645662 757403 -6532090
1713 -6532090 -8392341 -4902365 -2081764 -3274143 -4702637 -2029337 2658574 4308417
1705 4308417 2576128 1332147 1684369 395207 -4190530 -8938191 -10618222 -10778540 -13219443
1696 -13219443 -18118616 -21266442 -18852151 -11223507 -2007165 4935390 7621889 6799744
1688 6799744 5624225 7357210 12081306 16066446 15548083 11155349 7566661 8436764 12546350
1679 12546350 15623013 15286707 13112212 11868127 11917453 11248970 8629683 5396458 3406714
1670 3406714 2170438 -238487 -3246274 -2905873 3165029 11058609 13420015 7514788
1662 7514788 -1396121 -5503334 -1806254 6578293 14550080 18934594 19479564 17731166
1654 17731166 14799930 9818100 1708553 -7123323 -11211559 -8115406 -2234068 230171
1646 230171 -1082875 -1375485 1532922 4189973 3387029 1354537 2383932 6402592 9018495
1637 9018495 7401101 3535891 1223249 1492292 1990692 319190 -2948485 -5058378 -4803966
1628 -4803966 -4534508 -7354020 -12670660 -16143649 -14542198 -9238862 -4001793 -696930
1620 -696930 1240319 1906688 -190004 -5589910 -11636313 -14247234 -11833890 -6537834 -1560104
1611 -1560104 1606637 2849273 1995130 -356513 -1418871 1428706 6295363 7777240
1603 7777240 4003058 -112503 587630 4064594 4009209 -1222514 -7071919 -9740111 -9691166
1594 -9691166 -7403419 -1064367 8564419 15295339 13745078 6022610 -1524571 -6186993
1586 -6186993 -9452025 -11245155 -8696770 -1338873 6421911 9726860 7835296 3128017
1578 3128017 -2274156 -7383259 -11339644 -13268811 -12952155 -11066363 -8942375 -7876246
1570 -7876246 -7917789 -7550768 -5527738 -2840823 -1859487 -3743140 -7771041 -12759029 -17528448
1561 -17528448 -20083103 -18257069 -12000556 -3989292 2563222 6031161 6510363 5249377
1553 5249377 4309690 5496154 8828074 12613326 15261476 16433036 16521486 15914935 14725998
1544 14725998 12418826 8138146 2704867 -272697 2536369 9661346 15502399 16538090
1536 16538090 15137815 15916730 19833357 23724139 24814780 23543925 21674885 19366139
1528 19366139 15432163 10013302 5439149 3546079 3043193 1255966 -1652815 -2512454
1520 -2512454 10592 3115549 4437408 6091685 10457331 13926059 10110657 -632497
1512 -632497 -10042629 -11837830 -8280846 -4795662 -2524270 365506 3500048 4550763
1504 4550763 2646019 -1665136 -7629013 -12401351 -10976859 -2458338 5970426 6593110
1496 6593110 1293672 -1278901 2278570 7061705 8721740 8434184 7333467 3015518
1488 3015518 -4615361 -9945358 -9291162 -7443374 -10539078 -15493551 -13451217 -2871403
1480 -2871403 7557621 10254617 7410397 5797470 7220168 7954361 5688085 3180077
1472 3180077 4564808 10048963 15474462 16845811 14370932 11217750 8841705 5685130
1464 5685130 1295782 -1031959 1389787 5330000 4665697 -1374876 -7031666 -8104749
1456 -8104749 -7172023 -8269577 -9891529 -7382607 -578855 5441342 7302961 7062681 7815401
1447 7815401 9033699 8614257 7028829 6207517 5518902 2471245 -2441999 -5153380 -3713197
1438 -3713197 -1378784 -1311354 -786233 4934635 13663594 16275480 7520964 -6835455 -16532137
1429 -16532137 -17953886 -15658359 -14714947 -15401415 -15088714 -11907896 -5986573 508254 4223067
1420 4223067 3688036 1585733 1688456 3819327 4841449 4537702 6371082 11004512 13203526
1411 13203526 8294042 -970805 -7362923 -7513029 -4426124 -2752842 -4125044 -6428643
1403 -6428643 -5615199 774725 9868860 14555688 10784107 2731674 -1696818 692583
1395 692583 6929807 12974230 16463555 15719839 10905467 6315865 6781019 10792673 11725261
1386 11725261 7339465 3251054 4374298 7594630 6948947 2427208 -1225675 -2021258
1378 -2021258 -1860124 -1562651 -197275 845928 -1455645 -5960221 -7345254 -4052277 -1632737
1369 -1632737 -4748203 -9564720 -8793269 -2236604 2824576 1419865 -3837269 -8163599
1361 -8163599 -10468318 -11202304 -8524802 -1257271 6273724 7466198 1769051 -4460927
1353 -4460927 -6487021 -6613284 -9084903 -13201500 -14688852 -11393546 -4156896 5968833
1345 5968833 17361873 25890788 27716911 24054278 19510311 15936540 12030968 8866602
1337 8866602 10257867 15745824 18368905 12923585 2831819 -4700337 -7197992 -6852682
1329 -6852682 -4935288 -1045690 3588755 6641238 8070512 9380309 10147346 8904183
1321 8904183 6971944 7601887 11150605 14353806 14491253 11406835 6003686 407847 -832268
1312 -832268 5564959 15723234 20679906 16172405 7038935 389626 -2039306 -2827904
1304 -2827904 -3895741 -5572374 -7971952 -10133285 -9457798 -4714995 1521467 5420926
1296 5420926 5639319 3095320 -927358 -4422764 -4566361 -816199 3232843 3799674 1681698
1287 1681698 449037 870063 205766 -3194746 -7679045 -11305161 -14448449 -17927161 -20220006
1278 -20220006 -18681303 -13503434 -8723889 -7784670 -8598711 -5436451 3152045 10887091
1270 10887091 11024467 4911030 -995539 -5086838 -11243570 -18993293 -20671212 -12520515
1262 -12520515 -2486234 -876606 -7212749 -12611864 -12248273 -8568995 -3911721 2505725
1254 2505725 9827342 14381070 14885781 13894785 12879124 10491887 6581041 2964909 -934452
1245 -934452 -7975215 -17036581 -22154515 -20474933 -16156487 -13302649 -9815566 -2287897
1237 -2287897 7069401 13183410 15179925 16217143 17887008 18481191 15685938 8460745
1229 8460745 -1867505 -10103702 -9831809 -1099339 7161732 6427787 -1664714 -8502064
1221 -8502064 -8908357 -3991803 3735593 12101669 17297903 16439619 12563199 11785787 14822170
1212 14822170 16296606 13140504 8264564 4445764 69418 -6407505 -12449127 -15076121
1204 -15076121 -14790829 -12994485 -9214841 -4197361 -2245090 -6424783 -13836131 -19333267
1196 -19333267 -21809700 -23208258 -23555890 -21321977 -17384734 -14399372 -12875461 -11634270
1188 -11634270 -11374004 -13614635 -16332721 -14999310 -8638624 -1063346 4731049 9588265
1180 9588265 14379130 17176395 16746648 15850579 17923506 22054345 24065541 21988742 18388405
1171 18388405 17222586 19374811 21227961 17745309 7965655 -2852166 -8396945 -8509353
1163 -8509353 -8700815 -12253961 -16201478 -16441643 -13143719 -8582648 -3099263 3136522 7111904
1154 7111904 6197460 2761122 1148764 1304442 89950 -2146934 -2195261 -1306248 -5147584
1145 -5147584 -13949191 -18776110 -12147124 1683397 11713815 12440713 6434257 -2490204
1137 -2490204 -12401468 -20026962 -20595570 -13266775 -3385454 2666993 3003125 -15436 -2983356
1128 -2983356 -3214505 413163 6502669 11964131 14826887 15526205 15084773 13315288 9708656
1119 9708656 5462524 3813412 7766889 16476247 23853619 23170705 14838176 7393043
1111 7393043 7811298 12696934 13088684 6692495 -26759 -2133214 -2503280 -5406450 -9267835
1102 -9267835 -10145997 -8659473 -8329491 -8879719 -6103538 1719954 10810202 15556574 13041606
1093 13041606 4547569 -5048752 -9979828 -8094157 -2470016 2862844 7363060 12154367
1085 12154367 15940789 16282626 13786030 11280890 9394894 6670960 3778753 3600610
1077 3600610 6786514 10976868 14856830 19000404 22023897 20499813 14547011 9288374
1069 9288374 8149038 8345256 5979633 2231409 813636 1918303 2869834 3356645 6053815
1060 6053815 12357649 20223412 25710159 24831389 15873406 2957140 -4686068 -1404696
1052 -1404696 7470413 11065450 5700123 -1968339 -4672908 -2614641 -498488 -1238088
1044 -1238088 -5233035 -11952671 -18810298 -21428359 -18664469 -15048759 -14486253 -13762526 -7056707
1035 -7056707 4272054 11884701 11057274 6053214 3132068 2823064 2294852 1641640 3243047
1026 3243047 6624069 8481480 7554437 5569482 3038802 -1893083 -8876352 -13148039
1018 -13148039 -10841110 -4603452 -818898 -1860634 -3852539 -2199160 3278356 9679644
1010 9679644 15205763 19788248 22400061 20429474 12996271 3620299 -2314615 -3026564
1002 -3026564 -1998881 -3473122 -7237807 -9047128 -5803679 831755 5920581 5378073
994 5378073 -1234027 -10862222 -19496159 -24984758 -27268260 -25963028 -19635314 -9149502
986 -9149502 208380 3419543 1980243 1646217 3861529 4116531 284208 -2594428 592566
977 592566 7279122 11142723 10676782 8751775 6044788 859040 -5610100 -9887660 -11991747
968 -11991747 -14742982 -17095845 -14721312 -8675317 -6540109 -11628255 -17261138 -16342893
960 -16342893 -11274759 -8765424 -9235125 -8184802 -5250930 -4329570 -5380082 -3432338 2902214
951 2902214 8060076 7165758 2297487 -1748328 -3956307 -5781678 -6383293 -3774138 124439
942 124439 -104695 -6618045 -14531033 -16815847 -11915789 -4744011 -606436 -388477 -2402939
933 -2402939 -6227353 -11688533 -15335395 -12287640 -2808359 6505357 10332563 10643254 12451874
924 12451874 16156041 17798517 15395614 10860557 5961111 311034 -5891118 -10333968
916 -10333968 -11115151 -8751442 -4924912 -1100123 1187359 845785 -1102660 -2073109 -834536
907 -834536 1646169 4648920 9071652 15454399 22114715 26265512 26198072 22037097 15328473
898 15328473 8144190 1837966 -3150658 -5753592 -4042352 1518722 5996489 4444187
890 4444187 -1702725 -5941856 -4933373 -2165570 -2185909 -4318889 -4471829 -1244065 2315857
881 2315857 2484595 -1221646 -5767109 -7476921 -5303413 -1247062 2584800 6155897 9528215
872 9528215 10292479 5735262 -2793023 -10270106 -12800649 -10059386 -3861055 2838438 6447631
863 6447631 5953378 5160768 7801971 11170383 9733018 4622451 2645907 4509526 1911830
854 1911830 -9433885 -20780693 -20597713 -9132074 3630512 10850418 12958905 11717695
846 11717695 7706029 3157313 827707 -413963 -3854470 -8779984 -10841167 -8561541
838 -8561541 -4822161 -1902080 171369 259792 -3651033 -9800829 -12840969 -10040470 -3628865
829 -3628865 3482617 9909511 13159623 10128446 2433370 -3034986 -1455018 5135855
821 5135855 11965190 16851577 19669694 20258389 19240358 18048023 16478654 13331291 10580549
812 10580549 12602305 19207545 24009111 22713761 18743456 17008598 16359942 13073365
804 13073365 8526162 7611969 10903483 13636784 12440752 9144589 7693834 10078223
796 10078223 15081457 18911635 18086937 13870843 12156506 16253881 21752183 21946543 16551540
787 16551540 10940488 8047634 5721087 1885952 -2223566 -4738509 -5369071 -4068347
779 -4068347 -636024 3461228 5580851 5024194 3541406 2566463 2154800 2389692 3289498
770 3289498 3713512 3068163 3277937 5676104 6898357 2369713 -6263921 -12031329 -11438633
761 -11438633 -7386383 -2634319 3561043 10118921 11851560 6827834 1054057 838028
753 838028 4430810 6473459 7089620 10109842 14510336 14830101 10140768 6269237 7708031
744 7708031 12334770 15876270 17271141 17411954 16078960 12708893 8089404 3541992 123437
735 123437 -692086 1802534 4677226 2887932 -4295855 -11140800 -12282614 -9467950 -8561230
726 -8561230 -11593897 -15207507 -16061353 -14033947 -9864183 -3431668 3773098 7275395 3851775
717 3851775 -3568403 -8043935 -6328045 -2388312 -1869347 -4693230 -5710968 -2353551 1471971
708 1471971 514331 -5235681 -11399848 -14881320 -15689065 -14185921 -10285513 -5718269 -3568490
699 -3568490 -4259513 -4781377 -3188634 -1046602 62590 1242150 3231411 3982888 2629919
690 2629919 2882502 7923418 13991865 14537371 10023647 7582396 10134246 12140031 8926545
681 8926545 4416897 4616977 7506479 5904837 -1000929 -5493872 -1790002 6570467 12346566
672 12346566 13705201 14021799 14781073 13133922 6957621 -998986 -5977595 -6596880 -5234514
663 -5234514 -3623863 -534644 5282586 11756318 15036246 13690469 9656791 5564802
655 5564802 3209403 4400462 10309964 18696581 24218411 23615746 19201769 15476918 13779908
646 13779908 12321951 9952779 7052138 3582566 -489930 -2857710 -250031 6824216
638 6824216 13250684 14552203 11163628 6641044 3782687 3747796 6689115 11089794 13926108
629 13926108 13663040 12130361 11427145 10006797 4585895 -4059786 -9951878 -7861194 1051296
620 1051296 10629174 15545763 14512478 9004033 1446765 -4744912 -5847108 -1262867
612 -1262867 4073263 3447906 -4270434 -12767733 -15122368 -10784536 -3922539 3118069 11162752
603 11162752 19677673 25059978 24769767 20252033 14393837 8788698 4916411 4729601 7339273
594 7339273 7773232 2630487 -4502395 -6879834 -3180395 1109546 761927 -3898892 -9032251
585 -9032251 -11572198 -10623013 -7125034 -3417581 -1505420 -915856 457603 3242487 5949625
576 5949625 7297080 6990930 4343398 -909098 -5968600 -6728330 -3704146 -2655399 -6646113
567 -6646113 -10700659 -8250275 -738126 3965447 2225146 -993846 572894 6798807
559 6798807 12755599 14900318 13086314 8605298 3339135 -65317 -111189 1337901 908072
550 908072 -1959318 -4361190 -3858280 -1071615 2176564 5051161 6719625 5364939 509526
541 509526 -5031503 -8158351 -9643443 -12370216 -15863204 -16233629 -12212844 -7292944 -4006621
532 -4006621 -46598 6566497 11907197 10821075 5499855 3692057 8129718 13059995
524 13059995 12767714 8603432 4879672 2148602 -1424006 -4892568 -5253972 -2129057 2043232
515 2043232 5787991 9172705 11149736 9961886 6474160 3813046 2938934 1528201 -1661672
506 -1661672 -4086859 -2746532 1874756 6942094 10659064 12663361 12397710 9338476 4523119
497 4523119 157980 -2438297 -3647867 -4541627 -5728048 -6718711 -5790584 -1341692 5533155
488 5533155 10684288 10792837 7344366 5014672 5978455 7628222 6597361 3208132 372594
479 372594 -697184 -1481287 -3026397 -4098055 -3432269 -2108117 -1869998 -1921685 330121
470 330121 4954143 7956482 5529195 -1200844 -7259260 -9212902 -7911088 -5998604 -4582434
461 -4582434 -3085002 -812016 2714870 8001360 14474351 19486852 20226223 17027943 13351017
452 13351017 11709510 10889056 8381857 4563157 2579940 4169713 7468821 9750294
444 9750294 10833836 12334624 14390668 15077791 13341825 10887989 10004751 10212839 8425482
435 8425482 2768587 -4456768 -8293364 -5734624 1317019 7708065 9536127 7139767
427 7139767 4252897 4770201 9884503 17156546 22030128 21450007 16988558 13670260 14609617
418 14609617 17419182 17236864 12778087 7557821 5080390 4897073 4329019 2389477 529893
409 529893 496758 2889347 7219724 11975202 14848532 14177945 10351124 5170813 132325
400 132325 -3839560 -5434212 -3388866 1407971 5255294 4460549 -748622 -5687141 -5431659
391 -5431659 123676 5992780 7321423 4117063 -97962 -3168029 -5589604 -7250641
383 -7250641 -6074245 -1437531 3466448 4959947 3081515 322813 -2312537 -5249430
375 -5249430 -7421160 -6811625 -4030653 -2312069 -3234939 -4981156 -5567696 -5152492 -3995656
366 -3995656 -894966 4318543 8838078 9871706 8250473 6713152 5626651 3114459
358 3114459 -748835 -2565642 541046 7172427 12693970 13302454 8611157 1060958 -6370865
349 -6370865 -12009734 -15634994 -17346085 -16822695 -13910262 -9452587 -5001481 -1771269 -79333
$$ [...]
##END NTUPLES=NMR SPECTRUM
##END=
