##TITLE=31Pdec_DE-82K
 CDCl3, 64 sc
 26.3.2025
##JCAMPDX= 6.0         $$ Bruker NMR JCAMP-DX V2.0
##DATA TYPE= NMR SPECTRUM
##DATA CLASS= NTUPLES
##ORIGIN= UXNMR, Bruker Analytische Messtechnik GmbH
##OWNER= root
$$ XWIN-NMR		Version 3.5
$$ Wed Mar 26 14:01:19 2025 Russian Standard Time (UT+4h)  she@DPX200
##.OBSERVE FREQUENCY= 81.013821
##.OBSERVE NUCLEUS= ^31P
##.ACQUISITION MODE= SIMULTANEOUS
##.ACQUISITION SCHEME= undefined
##.AVERAGES= 64
##.DIGITISER RES= 17
##SPECTROMETER/DATA SYSTEM= spect
##.PULSE SEQUENCE= zgpg30
##.SOLVENT NAME= CDCl3
##.SHIFT REFERENCE= (INTERNAL, CDCl3, 0, 198.062)
##AUDIT TRAIL= $$ (NUMBER, WHEN, WHO, WHERE, WHAT)
$$ ##TITLE= Audit trail, XWIN-NMR		Version 3.5
$$ ##JCAMPDX= 5.01
$$ ##ORIGIN= Bruker BioSpin GmbH
$$ ##OWNER= she
$$ F:/spectra/data/she/nmr/P31/2/pdata/1/auditp.txt
$$ ##AUDIT TRAIL=  $$ (NUMBER, WHEN, WHO, WHERE, WHAT)
(   1,<2025-03-26 13:58:48.70 +0400>,<she>,<DPX200>,
      <created by zg, POWCHK disabled, PULCHK disabled
       configuration hash MD5:
       00 E9 B6 7A A2 85 ED C7 34 08 36 98 17 FE 4E 26
       data hash MD5: 32K
       2A 68 42 44 04 4E 85 36 3A 35 A7 6D 18 23 9E 78>)
(   2,<2025-03-26 14:00:16.82 +0400>,<she>,<DPX200>,
      <Start of raw data processing
       efp BC_mod = 2 LB = 1.5 FT_mod = 6 PKNL = 1 PHC0 = 1323.713 PHC1 = 332.8942 SI = 64K 
       data hash MD5: 64K
       FD 57 0C DE 32 29 0E 2D 34 64 C3 8D C4 EA 5B 61>)
(   3,<2025-03-26 14:00:45.56 +0400>,<she>,<DPX200>,
      <pk PHC0 = -9.010244 PHC1 = 29 
       data hash MD5: 64K
       1F 20 CE 60 75 E2 8C 82 5D 0C 86 FE 32 4E AB C2>)
(   4,<2025-03-26 14:00:49.75 +0400>,<she>,<DPX200>,
      <abs ABSG = 5 
       data hash MD5: 64K
       1F BD 42 BA 69 90 58 85 EA 1E 3C D9 AF BD A4 38>)
$$ ##END=
$$ 
$$ hash MD5
$$ 5E EB CB 25 31 8F 2F 2C AE 18 39 FB 61 17 B0 4D
##$RELAX= 
##$RELAX= 
##$RELAX= 
##$RELAX= 
##$RELAX= 
##$RELAX= 
##$RELAX= 
##$RELAX= 
$$ Bruker specific parameters
$$ --------------------------
##$DU= <F:/spectra>
##$EXPNO= 2
##$NAME= <P31>
##$PROCNO= 1
##$TYPE= <nmr>
##$USER= <she>
##$AMP= (0..31)
100 100 100 100 100 100 100 100 100 100 100 100 100 100 100 100 100 100 
100 100 100 100 100 100 100 100 100 100 100 100 100 100 
##$AQSEQ= 0
##$AQ_mod= 1
##$AUNM= <au_zg>
##$AUTOPOS= <>
##$BF1= 81.014009
##$BF2= 200.13
##$BF3= 200.13
##$BF4= 200.13
##$BF5= 200.13
##$BF6= 200.13
##$BF7= 200.13
##$BF8= 200.13
##$BYTORDA= 1
##$CFDGTYP= 0
##$CFRGTYP= 5
##$CHEMSTR= <none>
##$CNST= (0..31)
1 1 145 1 1 1 1 1 1 1 1 1 1 1 1 1 1 1 1 1 1 1 1 1 1 1 1 1 1 1 1 1 
##$CPDPRG= <waltz16>
##$CPDPRG1= <>
##$CPDPRG2= <waltz16>
##$CPDPRG3= <>
##$CPDPRG4= <mlev>
##$CPDPRG5= <mlev>
##$CPDPRG6= <mlev>
##$CPDPRG7= <mlev>
##$CPDPRG8= <mlev>
##$CPDPRGB= <>
##$CPDPRGT= <>
##$D= (0..31)
0 1 0 0 0 0 0 0 0 0.06 0 0.03 2e-05 3e-06 0 0 0.0002 0 0 0 0 0 0 0 0 0 
0 0 0 0 0 0 
##$DATE= 1742983128
##$DBL= (0..7)
120 120 120 11 120 120 24 19 
##$DBP= (0..7)
150 150 150 150 150 150 150 150 
##$DBP07= 0
##$DBPNAM0= <>
##$DBPNAM1= <>
$$ [...]
##$SUBNAM3= <"">
##$SUBNAM4= <"">
##$SUBNAM5= <"">
##$SUBNAM6= <"">
##$SUBNAM7= <"">
##$SUBNAM8= <"">
##$SUBNAM9= <"">
##$SW= 400.765351723535
##$SWIBOX= (0..15)
0 1 3 0 0 0 0 0 0 0 0 0 0 0 0 0 
##$SW_h= 32467.5324675325
##$TD= 32768
##$TD0= 1
##$TE= 0
##$TE2= 300
##$TE3= 300
##$TEG= 300
##$TL= (0..7)
0 120 53 12 22 120 120 120 
##$TP= (0..7)
150 150 150 150 150 150 150 150 
##$TP07= 0
##$TPNAME0= <>
##$TPNAME1= <>
##$TPNAME2= <>
##$TPNAME3= <>
##$TPNAME4= <>
##$TPNAME5= <>
##$TPNAME6= <>
##$TPNAME7= <>
##$TPOAL= (0..7)
0.5 0.5 0.5 0.5 0.5 0.5 0.5 0.5 
##$TPOFFS= (0..7)
0 0 0 0 0 0 0 0 
##$TUNHIN= 0
##$TUNHOUT= 0
##$TUNXOUT= 0
##$USERA1= <user>
##$USERA2= <user>
##$USERA3= <user>
##$USERA4= <user>
##$USERA5= <user>
##$V9= 5
##$VALIST= <valist>
##$VCLIST= <CCCCCCCCCCCCCCC>
##$VD= 0
##$VDLIST= <DDDDDDDDDDDDDDD>
##$VPLIST= <PPPPPPPPPPPPPPP>
##$VTLIST= <TTTTTTTTTTTTTTT>
##$WBST= 1024
##$WBSW= 4
##$XGAIN= (0..3)
0 0 0 0 
##$XL= 0
##$YL= 0
##$YMAX_a= 11501
##$YMIN_a= -29351
##$ZGOPTNS= <>
##$ZL1= 120
##$ZL2= 120
##$ZL3= 120
##$ZL4= 120
##$ABSF1= 198.0616
##$ABSF2= -202.7028
##$ABSG= 5
##$ABSL= 3
##$ALPHA= 0
##$AQORDER= 0
##$ASSFAC= 0
##$ASSFACI= 0
##$ASSFACX= 0
##$ASSWID= 0
##$AUNMP= <proc_1d>
##$AZFE= 0.1
##$AZFW= 0.5
##$BCFW= 0
##$BC_mod= 2
##$BYTORDP= 0
##$COROFFS= 0
##$CY= -3
##$DATMOD= 1
##$DC= 0
##$DFILT= <>
##$DTYPP= 0
##$F1P= 0
##$F2P= 0
##$FCOR= 1
##$FTSIZE= 65536
##$FT_mod= 6
##$GAMMA= 0
##$GB= 0
##$INTBC= 1
##$INTSCL= 9.790993e-09
##$ISEN= 30
##$LB= 1.5
##$LEV0= 0
##$LPBIN= 0
##$MAXI= 10000
##$MC2= 0
##$MEAN= 0
##$ME_mod= 0
##$MI= 50
##$NCOEF= 0
##$NC_proc= -7
##$NLEV= 6
##$NOISF1= 182.463
##$NOISF2= 159.3651
##$NSP= 0
##$NTH_PI= 0
##$NZP= 0
##$OFFSET= 198.0616
##$PC= 4
##$PHC0= 1314.703
##$PHC1= 361.8942
##$PH_mod= 1
##$PKNL= yes
##$PPARMOD= 0
##$PSCAL= 0
##$PSIGN= 0
##$REVERSE= no
##$SF= 81.0140089999434
##$SI= 65536
##$SIGF1= 159.3651
##$SIGF2= -187.1042
##$SINO= 113.3802
##$SIOLD= 16384
##$SREGLST= <1H.CDCl3>
##$SSB= 0
##$STSI= 65536
##$STSR= 0
##$SW_p= 32467.5324675325
##$SYMM= 0
##$S_DEV= 0
##$TDeff= 32768
##$TDoff= 0
##$TI= <>
##$TILT= no
##$TM1= 0
##$TM2= 0
##$TOPLEV= 0
##$USERP1= <user>
##$USERP2= <user>
##$USERP3= <user>
##$USERP4= <user>
##$USERP5= <user>
##$WDW= 1
##$XDIM= 65536
##$YMAX_p= 329105683
##$YMIN_p= -11241606
$$ End of Bruker specific parameters
$$ ---------------------------------
##NTUPLES= NMR SPECTRUM
##VAR_NAME=  FREQUENCY,     SPECTRUM/REAL,   SPECTRUM/IMAG
##SYMBOL=    X,             R,               I
##VAR_TYPE=  INDEPENDENT,   DEPENDENT,       DEPENDENT
##VAR_FORM=  AFFN,          ASDF,            ASDF
##VAR_DIM=   65536,         65536,           65536
##UNITS=     HZ,            ARBITRARY UNITS, ARBITRARY UNITS
##FACTOR=    0.49542278885378, 1,            1
##FIRST=     16045.7642231865, 0,            0
##LAST=      -16421.768244346, 0,            0
##MIN=       -16421.768244346, -11241606,    0
##MAX=       16045.7642231865, 329105683,    0
$$ Real data points
##PAGE= N=1
##DATA TABLE= (X++(R..R)), XYDATA
$$ [...]
46207 -1496035 -538539 946708 1936295 2101910 2161389 2767894 3494196 3439810 2595362 1934713
46197 1934713 2059945 2329013 1707196 200098 -1013601 -909097 216689 1081460 863711
46188 863711 168936 387732 1969122 3497790 2968894 213293 -2436628 -2542405 -413881
46179 -413881 1264187 762459 -693969 -799067 818497 2434872 2631436 1722441 796125
46170 796125 331149 38438 -620971 -1976115 -3610792 -4249686 -3002669 -907625 -273751
46161 -273751 -1980749 -4236964 -4664134 -2948131 -706744 683552 1227905 1561793 1910075
46152 1910075 1882708 940993 -841041 -2368052 -2393186 -1100700 -130143 -488785 -1201303
46143 -1201303 -827682 442628 1342439 1597476 2041950 2859765 3168720 2558287 1760870
46134 1760870 1400793 1202621 960345 1272006 2580131 4180406 4889922 4301243 2958347
46125 2958347 1744156 1396572 2043574 2824488 2514439 916322 -858989 -1769774 -1858538
46116 -1858538 -1584434 -985776 -139403 268605 -311365 -1376959 -1960351 -1849810 -1571521
46107 -1571521 -1428412 -1239246 -891546 -572454 -524747 -970572 -2051951 -3397703 -3991487
46098 -3991487 -2990836 -591381 2225422 4565606 5984151 6418830 6215889 5856711 5251963
46089 5251963 3773027 1445358 -502079 -993249 -506988 -316294 -751079 -1102157 -926443
46080 -926443 -519854 -294924 -518833 -1393085 -2536878 -2805160 -1710002 -635252 -1297415
46071 -1297415 -3245089 -4453005 -4360570 -4487849 -5645548 -6469468 -5688182 -4142019 -3171679
46062 -3171679 -2335809 -370058 2454111 4594636 5379247 5354871 4818868 3562347 2059487
46053 2059487 1415210 1801149 2163619 1926861 1928307 3075055 4930396 6363356 7032015
46044 7032015 7447515 7818659 7578831 6223951 4195976 2553165 1748558 1055711 -452049
46035 -452049 -2489820 -3667691 -3095036 -1269536 842542 2803410 4242979 4281522 2473632
46026 2473632 -127658 -1947598 -2686037 -3078074 -3138062 -2039738 111676 1785209 1840836
46017 1840836 749036 -529951 -1756600 -2779095 -2822744 -1556873 -159313 -96061 -1150667
46008 -1150667 -1712003 -876707 637228 1603201 1503413 644435 -222093 -351722 310097
45999 310097 863217 375018 -993340 -2261878 -2815290 -2680745 -1902416 -557606 671279
45990 671279 981406 697347 1018817 2156279 2751146 1791700 178118 -518297 -152005
45981 -152005 187905 -12754 -268124 -327723 -610583 -1168375 -1283812 -635010 -72033 -576062
45971 -576062 -1951992 -3172692 -3637165 -3468599 -2900037 -2143382 -1783514 -2481719 -4015283
45962 -4015283 -5175162 -4974978 -3600719 -1882409 -255110 1268816 2391257 2504653
45954 2504653 1517942 190124 -699084 -1233150 -2043501 -3249935 -4175978 -4258369 -3855434
45945 -3855434 -3743100 -3931785 -3517443 -1951562 -58456 709456 -74754 -1371607 -1886527
45936 -1886527 -1238533 123843 1517434 2223639 1764084 598115 49716 763278 1595430
45927 1595430 990161 -749984 -1744550 -1221194 -637670 -1515394 -3274632 -4194236 -3704015
45918 -3704015 -2561893 -1288222 239400 1729205 2271552 1487604 26865 -1276382
45910 -1276382 -1950943 -1519679 333615 2760768 3871700 2634624 98982 -1906598
45902 -1906598 -2762001 -3068368 -3198693 -2789558 -1621150 -259992 373424 -214246 -1672628
45893 -1672628 -2898998 -2755290 -1081945 1116971 2737824 3537076 3765154 3386790 2323371
45884 2323371 1119268 544524 580097 464285 -262274 -1323904 -2199520 -2396136 -1422122
45875 -1422122 617117 2420235 2549434 1370088 888713 2111236 3531121 3100293 995280
45866 995280 -629830 -337426 1128467 2051053 1619320 453614 -178626 501814 2067901
45857 2067901 3216732 3072359 2075416 1251102 794185 -10408 -1415088 -2438481 -1925214
45848 -1925214 -90684 1466469 1354395 -232894 -1828307 -2255600 -1680338 -1086749 -1028579
45839 -1028579 -1243143 -1339385 -1326941 -1342903 -1338668 -1294172 -1348258 -1433116 -1146429 -302850 704717
45828 704717 1357111 1460603 948189 -198703 -1472009 -1953511 -1485926 -1076315 -1419828
45819 -1419828 -1737261 -1076302 -98838 -207869 -1270906 -1783201 -1271283 -875055 -1197819
45810 -1197819 -1239558 -227653 963769 1275272 1122928 1361029 1562581 749974 -797374
45801 -797374 -1899897 -2270082 -2542863 -2696037 -1918623 -256503 950368 821176 133448
45792 133448 135151 901043 1581266 1800737 2031219 2658611 3295063 3266794 2565795 2019797
45782 2019797 2374547 3329768 3785717 3095917 1735058 578661 -78382 -497250 -874525
45773 -874525 -1168510 -1319114 -1295441 -1110779 -975248 -1072672 -1027636 -216191 1046496 1393622
45763 1393622 100503 -1835244 -3063732 -3552128 -3901522 -3841168 -2852194 -1751708 -1936652
45754 -1936652 -3143555 -3638050 -2780028 -1735822 -1310010 -826471 152762 712730 284005
45745 284005 9716 1021874 2369800 2141587 103721 -2018775 -2571772 -1359061 596038
45736 596038 1852814 1563856 419681 46203 827167 1199269 9156 -1500533 -1480890
45727 -1480890 -392061 -295374 -1612302 -2572040 -2062036 -1153339 -1102532 -1356249 -598638
45718 -598638 1125342 2339990 1806356 -325021 -2698924 -3724008 -2713772 -415311
45710 -415311 1709330 2702127 2453034 1301948 -24872 -471994 346691 1320097 1023387
45701 1023387 -318540 -1144838 -821437 -279151 -199195 -52402 480469 592913 -215212
45692 -215212 -1068253 -1236471 -1607646 -3178647 -4875171 -4594886 -2213762 23806 309328
45683 309328 -833447 -1851009 -2246993 -2665524 -3574425 -4672293 -5459248 -5837742 -5982630
45674 -5982630 -5836474 -5047355 -3606085 -2349862 -2324248 -3499329 -4575834 -4350896 -2929560
45665 -2929560 -1353292 -452575 -350088 -617757 -523114 464488 2009095 3120994 3312133
45656 3312133 3002576 2526003 1609487 411186 50049 1064967 2191322 1995378 1096361
45647 1096361 1199553 2279963 2513931 1075583 -808446 -2029984 -3055512 -4384756
45639 -4384756 -5185727 -4745296 -4055533 -4458685 -5478564 -5465713 -3930533 -1838595 106076
45630 106076 2003530 3599816 4053527 3270185 2317552 1958929 1680206 756888 -507051
45621 -507051 -1280592 -1281095 -589299 1031867 3620612 6040914 6619105 5032875 2798842
45612 2798842 1503657 1189834 984452 686059 813533 1287763 1147545 -18702 -1155474
45603 -1155474 -985199 243985 1074448 789252 209829 384608 1289361 2293978 3240171
45594 3240171 4270526 4917791 4286749 2301518 130729 -933921 -658188 235369 912430
45585 912430 921659 287453 -467675 -668373 -271161 -68511 -640994 -1331706 -927700 646977
45575 646977 2050944 2195879 1544894 1287734 1773143 2432418 2907512 3388896 3801405
45566 3801405 3476568 2067089 345542 -388785 389444 1938843 2948962 2598899 1096812
45557 1096812 -594242 -1543034 -1459264 -659011 331358 1020063 1107745 766041 579238 805666
45547 805666 902463 345343 -265015 234427 1771728 2703758 1748522 -439386 -2192505
45538 -2192505 -2751780 -2603989 -2352543 -2038114 -1456669 -563480 444360 1191219 1476183
45529 1476183 1692234 2366766 3074230 2673112 1177787 341461 1293001 2521046 1778302
45520 1778302 -569367 -1982496 -1448426 -680694 -1112855 -1722884 -1040492 311566 749930
45511 749930 403345 859975 2617208 4397476 5057396 4836477 4390270 3652968 2227873
45502 2227873 319512 -1207968 -1516040 -468637 1111752 1952427 1472553 329546 -525851
45493 -525851 -1080063 -1980259 -3287429 -4346073 -4903436 -5441869 -6090328 -6040649 -4633886
45484 -4633886 -2470228 -803099 -165571 -145778 -209474 -129657 180230 581084 540592 -259306
45474 -259306 -1155342 -1141157 -438394 -494117 -1878071 -3096546 -2489117 -670228 257560
45465 257560 -275990 -610744 478836 1946725 2237515 1655739 1593422 2125862 1956087
45456 1956087 590090 -874067 -1324684 -824422 80994 1185449 2314287 3067906 3377115
45447 3377115 3686802 4253351 4854977 5341347 5674266 5283368 3442819 697429 -1164203
45438 -1164203 -1184544 -322900 159430 312871 662063 915086 736470 848269 1852709
45429 1852709 2612385 1491480 -1037484 -2696589 -2422050 -1570797 -1751744 -2778278 -3359605
45420 -3359605 -2807972 -1451991 -131320 205045 -908378 -2747410 -3830067 -3485102 -2556083
45411 -2556083 -2286636 -3007720 -4129393 -4820789 -4423547 -2832327 -871178 211738 -5443
45402 -5443 -783400 -1326732 -1606408 -1773333 -1502148 -580014 342797 361545 -492678 -1309449
45392 -1309449 -1520876 -1503582 -1793478 -2132132 -1753367 -644410 -72390 -1298662 -3771307
45383 -3771307 -5284355 -4340496 -1774637 541396 1954391 3050574 3979435 4179323 3758785
45374 3758785 3670466 4042148 3630095 1714554 -480062 -1195495 -265597 1041606 1707770
45365 1707770 1574183 749907 -544187 -1672896 -2014118 -1756544 -1640723 -1860676 -1788386
45356 -1788386 -931493 253877 744850 37685 -1233413 -1820396 -1113807 231353 1141064
45347 1141064 1343594 1228491 733498 -689734 -2839909 -4469566 -4734342 -4210109 -3944735
45338 -3944735 -4158554 -4412469 -4393065 -3938666 -2948477 -1927731 -1970861 -3426857 -5123954
45329 -5123954 -5702767 -5231860 -4729889 -4585400 -4299394 -3395742 -1795107 309680 2216076
45320 2216076 2887965 2207979 1482692 1792596 2519891 2612393 2518805 3341107 4633571 4884655
45310 4884655 4027930 3577755 4095692 4420807 3929837 3728931 4693483 5859244 5855357 4718418
45300 4718418 3202562 1399291 -739232 -2399472 -2748021 -2222128 -1818279 -1532582 -635758
45291 -635758 783657 1639029 1183093 -242547 -1696361 -2252241 -1399648 406142 1749364
45282 1749364 1547440 292075 -592201 -499827 -128869 -314644 -1048933 -1736499 -1927475
45273 -1927475 -1678432 -1442257 -1533659 -1561372 -786929 605139 1147504 -283936 -2824117
45264 -2824117 -4425874 -4189362 -3107799 -2539556 -2759187 -3154578 -3096702 -2303669 -906841
45255 -906841 504775 1264772 1268649 968951 733767 626138 791207 1458940 2409921 3022799
45245 3022799 3110543 3172548 3499863 3576856 2862672 1766158 1245171 1575293 2008028 1661256
45235 1661256 449442 -854377 -1303434 -658824 228472 163589 -966387 -1806182 -1067759
45226 -1067759 756628 1920271 1691996 1261022 1932921 3164688 3282525 1844361 254059
45217 254059 -122054 512109 1227852 1885904 2840086 3566304 2848904 633500 -1276362
45208 -1276362 -1111183 704176 2005552 1430131 -88306 -529014 897120 2935638 3657690
45199 3657690 2350701 5954 -1766868 -1975227 -548339 1929250 4384773 5620975
45191 5620975 5246194 4218402 3861148 4256281 4172566 2723967 506791 -1167959 -1615643
45182 -1615643 -1032687 -14946 649076 186497 -1442491 -3169151 -3680111 -2608310 -597385
45173 -597385 1482885 2920489 3138745 2065563 516789 -423407 -526742 -499515 -959912
45164 -959912 -1851779 -2878453 -3884757 -4607969 -4631533 -3951073 -3168016 -2730330 -2312514
45155 -2312514 -1394622 -214158 429864 331515 273284 962551 1975313 2323732 1971773
45146 1971773 2051328 3226769 4527795 4617352 3836256 3842707 5121470 6090257 5295174 3415980
45136 3415980 2105102 1676076 1230035 561136 426539 964567 1297306 1006848 711830
45127 711830 706558 283243 -868141 -1741195 -1506305 -1008536 -1561462 -2858197 -3403259 -2729792
45117 -2729792 -1842549 -1433068 -958963 131618 1366995 2046702 2221104 2178057 1621314
45108 1621314 211522 -1438719 -2159638 -1544718 -235590 1032473 1976158 2322055 1633635
45099 1633635 13902 -1559566 -2166761 -1948846 -1677441 -1514294 -810428 794869 2620622
45090 2620622 3589878 3347060 2469417 1752488 1534955 1604877 1481374 747554 -692952
45081 -692952 -2502417 -3995091 -4439222 -3525453 -1716592 -14455 826860 795513 227004
45072 227004 -776758 -2137677 -3286714 -3560784 -3151550 -2966316 -3340102 -3554341 -2956368
45063 -2956368 -1896137 -1105104 -778523 -828918 -1413367 -2453724 -3137564 -2769033 -1782931
45054 -1782931 -1049020 -486104 598518 1920467 2128583 573291 -1713838 -3149529 -3073885
45045 -3073885 -1916976 -570940 186932 241310 252427 686504 884527 17533 -1105781
45036 -1105781 -518306 2196965 4981547 5892402 5498607 5605412 6472837 6692972 5477026
45027 5477026 3742707 2815282 2958717 3378695 3085692 1694520 -157160 -1234171 -976230
45018 -976230 -200477 -100730 -792920 -1400941 -1361628 -1009472 -976676 -1606139 -2887146 -4413844
45008 -4413844 -5437359 -5424101 -4501284 -3039271 -1181153 646406 1255604 -235631 -2927725
44999 -2927725 -4717820 -4536076 -3220128 -2045688 -1322765 -836083 -791491 -1546091 -2765238
44990 -2765238 -3504545 -3120999 -1846979 -538218 50366 -103272 -313991 61830 1042533
44981 1042533 2329665 3766378 4984097 5067527 3532605 1511182 861144 1853312 2732044
44972 2732044 1995365 206386 -1030801 -1085124 -573091 -263140 -476561 -1106685 -1489496
44963 -1489496 -641494 1627482 4121781 5462096 5605350 5492278 5510408 5165661 4134240
44954 4134240 2743796 1352772 43275 -965266 -1391226 -1578933 -2293226 -3435440 -3733329
44945 -3733329 -2366487 -372119 374776 -607950 -1956758 -2291157 -1790067 -1584149 -2073696
44936 -2073696 -2487277 -2068249 -1122807 -588895 -899791 -1693084 -2476720 -3061357 -3301051
44927 -3301051 -2976741 -2220211 -1585965 -1287643 -751927 527010 1997068 2635881 2434698
44918 2434698 2458209 3202948 3712081 2918704 1308003 393177 673825 972916 97381
44909 97381 -1464459 -2079728 -979561 853113 1895241 1706813 1008383 444189 -136002
44900 -136002 -1021871 -1776119 -1553566 -226603 1274085 1932372 1663059 1100255 609296
44891 609296 -59042 -1125066 -2239556 -2863525 -2937177 -2819360 -2664337 -2242920 -1425823
44882 -1425823 -480525 283029 873019 1389829 1670234 1450134 752447 -152448 -1055045
44873 -1055045 -1788625 -2018261 -1454051 -367532 396887 131153 -1039077 -2176127 -2286450
44864 -2286450 -1290070 -343987 -841175 -2768374 -4419302 -4244440 -2672252 -1417448 -1253647
44855 -1253647 -1451028 -1416661 -1661038 -2576679 -3306899 -2799084 -1356327 -100386 768788
44846 768788 2084546 4094979 5749452 5933148 4701034 2890153 1069054 -607616
44838 -607616 -1845915 -2171029 -1565804 -799742 -839624 -1960268 -3588794 -4971556 -5683356
44829 -5683356 -5413782 -3856565 -1448277 186286 -397229 -2506661 -3746710 -2813187 -874178
44820 -874178 378997 867321 1250086 1019257 -813090 -3549383 -5133401 -4780039 -3699773
44811 -3699773 -2871873 -1724350 193343 1686091 1350491 -304701 -1463826 -1349102 -873979
44802 -873979 -1093681 -1906429 -2351356 -1559561 662624 3699602 6406810 7742426 7270414
44793 7270414 5268056 2712718 999093 880422 1467319 1059213 -663257 -2133426 -2130750
44784 -2130750 -1525913 -1809947 -2695138 -2562957 -976405 675443 1157425 793874 517336
44775 517336 470231 93472 -975237 -2506650 -3800731 -4019289 -2838200 -943785 464683
44766 464683 703213 -151148 -1716435 -3312016 -3787961 -2446555 -301660 622180 -331075
44757 -331075 -1654882 -1745703 -872391 -391779 -775871 -1348330 -1529168 -1385909 -1077602 -550193
44747 -550193 121427 593087 553676 -59387 -1019268 -1765615 -1691352 -840685 -84402 -205533
44737 -205533 -995489 -1623708 -1708863 -1620551 -1837232 -2367118 -2773808 -2585249 -1778351 -911653
44727 -911653 -501948 -266295 500607 1701663 2320068 1833440 913726 188470 -757094
44718 -757094 -2234784 -3158297 -2220995 19003 1555907 1341311 88967 -1241845 -2441917
44709 -2441917 -3339875 -3390227 -2501241 -1357065 -503780 82583 313262 -103624 -760069
44700 -760069 -686719 116522 432766 -252124 -758317 -6329 1307891 1911383 1840073 1857436
44690 1857436 1821677 1121910 212776 142969 757696 882421 340019 357659 1657717 3325802
44680 3325802 3976574 3133227 1218452 -867179 -1929093 -1298065 93644 333869 -1328296
44671 -1328296 -3686872 -5160736 -5265604 -4257492 -2495181 -812982 -468240 -1785172
44663 -1785172 -3551139 -4550757 -4994249 -5617850 -6172412 -5940364 -5245808 -5235477 -6294303
44654 -6294303 -7634504 -8349712 -8052712 -6663018 -4478805 -2389773 -1175955 -643422 -196486
44645 -196486 -4822 -571556 -1310870 -908337 606111 1425153 277022 -1817400 -2933428
44636 -2933428 -2660145 -2175351 -2297490 -2447427 -1652203 36913 1459944 1605306 820338
44627 820338 504230 1340215 2178225 1354073 -1031992 -3095738 -3571593 -3179180 -3113901
44618 -3113901 -3243595 -2708981 -1520611 -425941 375546 1239046 1959921 1754168 502843
44609 502843 -815633 -1183293 -529994 355940 434910 -880455 -2989143 -4263935 -3700385
44600 -3700385 -2205231 -1376836 -1298584 -814252 88343 -106866 -1830842 -3086105 -1992839
44591 -1992839 498751 2005281 2074154 2359373 3615726 4372240 3174473 730656 -1175765
44582 -1175765 -2082958 -3054053 -4756065 -6334830 -6480081 -5069152 -3315483 -2425296 -2499024
44573 -2499024 -2847107 -2961616 -2724420 -1919394 -317394 1604227 2785665 2819170 2372509
44564 2372509 1903431 793502 -1368901 -3381831 -3580523 -2090028 -644771 -230297 -196582
44555 -196582 181549 645636 874050 1195597 1767860 2141365 2286607 2943129 4169482
44546 4169482 4694209 3759615 2571792 2602120 3260915 2776699 898305 -851067 -1415003
44537 -1415003 -1140512 -419830 1031427 3049049 4442440 4289474 3045677 1797452 987368
44528 987368 303119 -633121 -1758484 -2435564 -1889575 -262181 1091417 1225094 1192272
44519 1192272 2697765 5193255 5973898 3760648 684894 -299597 1172558 3156113
44511 3156113 4097985 3967959 3345029 2725064 2517352 2689366 2527088 1461983 -177540
44502 -177540 -1862792 -3683677 -5578067 -6444935 -5323666 -3070262 -1476504 -880618 -86051
44493 -86051 1300150 2013410 1136476 -345943 -810873 63148 1396160 2487017 3302267
44484 3302267 3954585 4371176 4406673 3966777 3110852 2096625 1102933 -3572 -1235285
44475 -1235285 -2005357 -1745207 -925234 -645050 -1122747 -1467339 -1166105 -839711 -1070799
44466 -1070799 -1384157 -1058984 -257168 371691 662302 806842 723982 313413 57717 658960
44456 658960 2133482 3686737 4365547 3637819 1741758 -222754 -1063225 -817919 -841810
44447 -841810 -2089169 -3825796 -4630370 -4159783 -3218075 -2519348 -2172868 -2077473 -2051697 -1799966
44437 -1799966 -1396347 -1433055 -1980186 -1942180 -493389 1268828 1426452 -95493 -1314009
44428 -1314009 -794294 832924 2258143 3002547 2920465 1576573 -755306 -2421526 -2026407
44419 -2026407 -290655 869161 842973 783604 1621526 2777964 3230720 3003040 2940978
44410 2940978 3380127 3636688 2878196 1225655 -186571 -298836 766887 1821847 1855748
44401 1855748 959120 -104015 -949791 -1832058 -2897729 -3578706 -3029181 -1186437 815619
44392 815619 1595916 989148 264436 612158 1716415 2312442 1900097 1148652 643887
44383 643887 182256 -373926 -485671 132505 673911 169349 -1199605 -2526790 -3509074
44374 -3509074 -4415786 -5011953 -4586209 -3080797 -1261578 316215 1607671 2297327 1847515
44365 1847515 667012 90560 561055 880136 151633 -477823 720914 3391790 5253744
44356 5253744 4842181 2887625 863041 -646769 -1696915 -2125319 -1715019 -721748 364351
44347 364351 1323684 2117457 2595368 2601609 2102643 1019020 -702141 -2671066 -4183310
44338 -4183310 -4996487 -5461958 -5664549 -5175112 -4103648 -3521342 -3992126 -4419736 -3477544
44329 -3477544 -1663649 -614493 -690286 -798799 -600013 -1024916 -1998219 -1539599 1438161
44320 1438161 4767127 5288374 2834810 148653 -916229 -1183365 -1857223 -2378045 -1714640
44311 -1714640 -524978 -507540 -2017973 -3612583 -3996822 -3441663 -2979616 -2932272 -2773733
44302 -2773733 -2145066 -1467969 -1456246 -2277501 -3395230 -4161693 -4335691 -3995668 -3302365
44293 -3302365 -2641038 -2686961 -3753143 -5107434 -5558992 -4913307 -4263411 -4473395 -4906549
44284 -4906549 -4260008 -2363442 -467479 222801 -284243 -1146421 -1690295 -1779072 -1571394
44275 -1571394 -1276630 -1020380 -733478 -250816 385577 886267 1089460 1148255 1134456 710027
44265 710027 -385742 -1601781 -1877574 -926308 206088 308913 -506864 -1048703 -706154
44256 -706154 -184335 -317106 -804779 -740851 1488 682067 901800 1128869 1841858 2768070
44246 2768070 3250625 2879099 1519835 -696802 -3022802 -4290417 -4065696 -3256796 -3019275
44237 -3019275 -3393615 -3617833 -3384136 -2945680 -2231855 -885764 793449 1985012 2632076
44228 2632076 3500608 4494741 4059240 1182335 -2825832 -5618755 -6303899 -5580893 -4020042
44219 -4020042 -1755940 248973 438817 -1183090 -2514821 -1928016 -370599 165409 -539527
44210 -539527 -957100 -217364 928159 1601894 1997743 2657862 3474526 3964363 3930619 3380024
44200 3380024 2286056 922218 55154 315360 1540223 3000592 4035213 4284352 3704489
44191 3704489 2682008 1792191 1116027 142840 -1322563 -2614925 -3072847 -3016789 -3170009
44182 -3170009 -3394933 -2861828 -1461030 -205484 13830 -590043 -1243415 -1509552 -1256554
44173 -1256554 -339420 1047465 2048925 1889350 895878 248834 695304 1966063 3428309
44164 3428309 4649860 5086904 3965764 1243298 -1611821 -2680790 -1597058 164502
44156 164502 1192022 1561172 1894656 1876498 809455 -719521 -1081513 230057 1823713
44147 1823713 2377969 2423658 3288480 4938644 5973003 5570274 4454232 3794956 3894812
44138 3894812 4251184 4438145 4542958 4802407 4977960 4330570 2559128 637626 -13973
44129 -13973 604605 932156 77943 -851840 -635641 -116704 -918105 -2576283 -2903755 -1227504
44119 -1227504 684390 1395032 1586993 2159840 2346427 1239129 -140743 -157176 776793
44110 776793 721681 -829714 -2295611 -2501718 -2198982 -2439404 -2758553 -2049588 -536206
44101 -536206 269370 -524792 -2188482 -3477762 -4106774 -4626814 -5169121 -5047600 -3820837
44092 -3820837 -2142246 -1009527 -538145 -139849 354131 595394 634865 944411 1412697
44083 1412697 1368160 880985 917335 1734288 2339270 2251338 2469179 3563873 4085907 2513344
44073 2513344 -97083 -1324208 -829179 -591824 -1692443 -2853544 -2673984 -1508872 -268009
44064 -268009 1133258 2979720 4546468 4952759 4534832 4220264 4012978 3235032 2070231
44055 2070231 1762930 3033006 4969277 5862405 4883513 2721727 663701 -689234 -1513462
44046 -1513462 -1702496 -516621 2078618 4380527 4464629 2642009 1193477 1490728 2641402
44037 2641402 3376041 3854307 4694128 5414417 5121574 3997536 2869080 1868019 759645
44028 759645 80044 468917 1096352 360896 -1649353 -2917375 -2266964 -1027985 -1101424
44019 -1101424 -2494600 -3889475 -4785874 -5627959 -6158606 -5264447 -2839808 -514629 309985
44010 309985 310661 1097149 2715918 3568884 2850267 1722498 1409375 1247421 -119136 -2192918
44000 -2192918 -2844795 -1236390 895139 1545575 931608 687828 1362595 1968113 1735061
43991 1735061 1069527 636690 550809 830817 1746722 3126929 4002183 3656664 2614264
43982 2614264 1877707 1511493 813836 -223671 -620482 103492 957464 620894 -951302
43973 -951302 -2727912 -4013799 -4829774 -5041065 -4099319 -1979929 310518 1596022 1505205
43964 1505205 389393 -1170958 -2499178 -3094538 -3198999 -3520779 -3999152 -3618377 -2089482
43955 -2089482 -838696 -1228001 -2402222 -2252892 -303830 1701498 2145495 1236941 175735
43946 175735 -203730 388557 1789417 3170834 3610354 3260490 3116860 3386237 3163942
43937 3163942 2133774 1373750 1734082 2454118 2257196 965127 -802748 -2670471 -4305366
43928 -4305366 -4966154 -4320332 -3183121 -2548208 -2430309 -2441604 -2714196 -3230315 -3056309
43919 -3056309 -1548364 297568 1097190 1188824 1985924 3570913 4622853 4698440 4820796
43910 4820796 5432226 5396342 3806314 1569321 331087 622650 1712958 2580830 2483385
43901 2483385 1255576 -373584 -1275115 -1124821 -602105 -197240 383639 1277175 1838956
43892 1838956 1586233 994856 631266 192922 -702738 -1386460 -984996 -183820 -813011
43883 -813011 -3276914 -5461786 -5070978 -2499271 -354647 -201192 -893276 -622985 426071
43874 426071 641891 -316162 -931732 -168202 1053799 1424883 1082690 886725 854344 532168
43864 532168 188257 330950 570004 259826 -170905 124714 861216 1205396 1496608 2620867
43854 2620867 3889328 3604508 1947849 1143286 2065371 2763308 1500270 -545225 -1087602
43845 -1087602 142138 1630211 2378311 2420436 1841181 805885 73670 176805 536568
43836 536568 546661 925592 2607905 4741134 5345640 3907908 1906051 619650 -265581
43827 -265581 -1483466 -2761490 -3283305 -2946455 -2457302 -2322226 -2203838 -1490244 -434100
43818 -434100 -264260 -1596823 -3033210 -2459752 17722 1696363 578716 -2075643 -3582341
43809 -3582341 -3260272 -2628448 -2792802 -3216724 -3006008 -2080985 -898873 52834 439599
43800 439599 493973 1007803 2090136 2409309 873888 -1270843 -1495315 826728 3642072
43791 3642072 4800307 4123514 2688149 1430529 955461 1489450 2351375 2398482 1503500
43782 1503500 678278 360765 -280239 -1752024 -3102601 -3205174 -2242198 -1077970 -10875
43773 -10875 997712 1683708 1989787 2427360 2966987 2417198 132514 -2371273 -2963906
43764 -2963906 -1649457 -287918 154781 396386 835809 646970 -433996 -1058135 -162868
43755 -162868 1290652 1842908 1885088 2824447 4340432 4366248 2143069 -351579 -938345
43746 -938345 -58400 97324 -1378658 -3182774 -3723594 -2888152 -1733091 -1202415 -1424976
43737 -1424976 -1826843 -1822711 -1678588 -2423162 -4355386 -6052475 -5836956 -4010370 -2396407
43728 -2396407 -1656173 -568765 1565779 3402347 3433098 2091146 722417 -458311 -1909209
43719 -1909209 -3103353 -3035492 -1993224 -1233800 -1090996 -881986 -504077 -505463 -586933 217608
43709 217608 1571315 1775287 282564 -1329506 -1736733 -1725891 -2535050 -3602313 -3466144
43700 -3466144 -2190719 -1365084 -1836311 -2680742 -2644057 -1791396 -1352560 -2231219 -3895598
43691 -3895598 -4817848 -4129421 -2676831 -2037369 -2615177 -3295404 -2916429 -1371806 696616
43682 696616 2370878 2545320 706880 -1919240 -3073633 -1991484 -357808 -61385 -877571
43673 -877571 -1224491 -423979 843474 1832819 2419120 2676589 2643989 2540458 2699392 3268364
43663 3268364 4115370 4758977 4409231 2731182 638770 -574174 -1069029 -2246663 -4301140
43654 -4301140 -5468310 -4622875 -3179965 -3050606 -3912602 -4159327 -3606382 -3357557 -3568552
43645 -3568552 -3349714 -2703285 -2615586 -3099763 -2945334 -1748296 -535669 125540 1107572
43636 1107572 3106742 5309972 6450298 6261875 5298462 4174130 3481119 3633628 4366225
43627 4366225 5115416 6003937 7392714 8376155 7235384 3948862 786340 -435089 -336082
43618 -336082 -288655 -256424 246338 356542 -990296 -2747525 -2620771 -242735 2202365
43609 2202365 2769631 1744560 532445 -58383 157458 1228866 2689771 3417120 2694816
43600 2694816 1062282 -392763 -1151790 -1233142 -607340 647351 1914214 2498855 2481475
43591 2481475 2547704 2960260 3222867 2895691 2303500 2163611 2729641 3529226 3867985 3474006
43581 3474006 2688546 2067670 1805745 1676522 1613295 2027704 3148830 4272991 4361903
43572 4361903 3455180 2713746 2739233 2716766 1927610 1271805 2047791 3640759 3970905 2420725
43562 2420725 818342 839361 1720940 1625169 331056 -765602 -872386 -665991 -926615
43553 -926615 -1415943 -1432849 -784042 112086 704048 775550 709706 1208934 2485229 3956105
43543 3956105 5010119 5601586 5643722 4509105 2042728 -428147 -1270136 -595767 -57416
43534 -57416 -628447 -1668236 -2217851 -2057902 -1302334 -149979 597543 -36138 -1698001
43525 -1698001 -2710109 -2230604 -1382070 -1451917 -1985371 -1724483 -672237 6545 -238693
43516 -238693 -797597 -1020976 -961464 -940283 -1043378 -1122655 -902702 -204275 624233 845113
43506 845113 339787 51674 821916 2164319 2895939 2667646 2090395 1584544 994235
43497 994235 297144 -180004 -394100 -697641 -1150077 -1416763 -1591199 -2419639 -4262363
43488 -4262363 -6304231 -7269292 -6669707 -5029409 -3154002 -1570296 -517804 -32731 101365
43479 101365 295604 873504 1793581 2658269 3049852 2893354 2436506 1860817 1073771 22375
43469 22375 -938330 -1277092 -942198 -569699 -830642 -1573914 -1811556 -774734 1014532
43460 1014532 2002582 1157563 -870904 -2359042 -2141480 -428899 1718879 3234288 3467102
43451 3467102 2426859 874139 -178717 -297277 173128 670757 864925 622855 -11072
43442 -11072 -756894 -1374257 -1911345 -2284600 -1926560 -618466 562685 241677 -1217960
43433 -1217960 -1905247 -1020546 -116387 -889779 -2773102 -3781742 -3061100 -1517213 -378875
43424 -378875 -154487 -722942 -1506438 -1655014 -791275 487914 1282266 1242646 397190 -1195063
43414 -1195063 -2941014 -3563831 -2419725 -540683 470064 129641 -1050550 -2569658
43406 -2569658 -3727469 -3267453 -813484 1789717 2232151 656058 -777877 -1068632 -1256480
43397 -1256480 -1973785 -2122030 -722096 1554433 3555180 4940397 5483471 4536790 2314357
43388 2314357 507286 394634 1235901 1599905 1331578 1019680 460458 -853222 -2275484
43379 -2275484 -2530779 -1485615 -169986 785663 1553785 2067110 1794449 727402 -363047
43370 -363047 -854921 -736936 -108463 1017381 2339785 3392003 4088995 4571848 4669374
43361 4669374 4269393 3999903 4495153 5015393 4008766 1317455 -1378632 -2812901 -3602146
43352 -3602146 -4650628 -5272467 -4271431 -2210817 -1008751 -1303655 -1620311 -497055 1699150
43343 1699150 3587045 4387040 4013237 2451033 106655 -1719351 -1886552 -891245 -305213
43334 -305213 -685287 -1037343 -577441 75540 99073 -29513 848191 2911827 5145771
43325 5145771 6480489 6431443 4934655 2413845 -84190 -1571672 -1939911 -1614471 -739856
43316 -739856 552892 1500512 1451700 1063793 1481764 2323291 1949270 66230 -1512107
43307 -1512107 -1438196 -646165 -462009 -320470 938456 2474179 2282818 446884 -538797
43298 -538797 797866 2889849 3527002 2929527 3042817 4474031 5664502 5148704 3387308
43289 3387308 1843078 1081300 556458 -156951 -831877 -1290377 -1780967 -2271210 -2036859
43280 -2036859 -612332 1248424 2305408 2329845 2100101 2004001 1582419 674226 86404
43271 86404 542124 1560771 2025861 1561210 843521 724160 1357125 2020490 1658328 -68862
43261 -68862 -2129891 -2942631 -2042935 -518153 337262 224383 -454794 -1335691 -2126421
43252 -2126421 -2548729 -2687704 -2851331 -2807409 -1955591 -634687 -225323 -1218080 -2157846
43243 -2157846 -1510881 213647 1297950 1072473 155627 -925987 -1978010 -2400685 -1647733
43234 -1647733 -315339 425756 299964 -309130 -1596331 -3765193 -5538304 -5211529 -3381693
43225 -3381693 -2612857 -3793483 -4791557 -3716537 -1650995 -690007 -827696 -641351 -11361
43216 -11361 -105305 -1088654 -1776720 -1588970 -1193257 -956554 -263096 1100752 2168231 2166141
43206 2166141 1716909 1822831 2335457 2341520 1660090 1036074 952814 1057076 877066 494906
43196 494906 314190 622611 1514894 2732227 3406391 2632732 744452 -611999 -359150
43187 -359150 579403 621711 -145968 -236583 764197 1499295 1021971 217629 194870 500361
43177 500361 99255 -806051 -1231039 -1015631 -706292 -392191 52185 100126 -619338 -1107506
43167 -1107506 -228087 1117027 881732 -978096 -2119170 -995295 1308127 3040247
43159 3040247 3904696 4328634 4148143 3238200 2388519 2406852 3068206 3737832 4208169 4240424
43149 4240424 3304012 1620638 486021 632888 1159813 923120 9580 -1034132 -2281232
43140 -2281232 -3649592 -4203022 -3504882 -2586531 -2202358 -1302472 1066359 3464635 3769802
43131 3769802 2388499 1451216 1311256 437940 -1243350 -1717733 -308099 815100 -156127
43122 -156127 -2024577 -2728191 -2434176 -2640995 -3377888 -3339468 -2296203 -1480298 -1542626 -1672607
43112 -1672607 -1105690 -302596 -31496 -88838 326424 1323238 2106774 2108309 1806588 2058698
43102 2058698 2861889 3338349 3023545 2556120 2689732 3127225 2961006 1980302 892806
43093 892806 407127 676482 1477144 2338025 2674269 2409522 2245774 2660852 2961824 2181188
43083 2181188 638315 -366481 -206476 759958 2256092 4126336 5408884 4965569 3335751
43074 3335751 2420858 2832210 3116569 2310442 1570512 2076719 2802975 2000198 -75838
43065 -75838 -1602828 -1790296 -1439283 -1170506 -597108 639452 2152916 3314111 3708144
43056 3708144 3142836 1896657 747610 41453 -903422 -2602695 -4071755 -3851194 -2138400
43047 -2138400 -635018 -268493 -318881 8261 402337 291161 -217088 -826208 -1605789
43038 -1605789 -2428864 -2637774 -2032180 -1636468 -2638525 -4734951 -6161693 -5414237 -2664627
43029 -2664627 451973 2266727 2403103 1843636 1710229 2160032 2678992 3085295 3590768
43020 3590768 4008467 3757498 2879458 2282397 2531317 2993991 2723701 1726959 729306
43011 729306 -20396 -971745 -2239800 -2969136 -2188455 -203091 1286395 820803 -1110028
43002 -1110028 -2465163 -1992680 -673880 -327748 -1265902 -2208406 -2270924 -1878410 -1545828
42993 -1545828 -968439 50274 773653 576985 165399 718418 2163362 3308126 3580667
42984 3580667 3662725 4242713 4962563 4972023 4003424 2543459 1268502 566790 361431 202285
42974 202285 -260530 -753375 -556518 609103 2030360 2540047 1588460 -282679 -1967774
42965 -1967774 -2726245 -2634703 -2255995 -2041703 -2138304 -2534698 -3004612 -2937241 -1743225 338183
42955 338183 2244416 3173527 3255348 2872133 1951057 580369 -229552 574058 2589760
42946 2589760 4331198 5108554 5516048 5894351 5537247 4047522 2399137 1665980 1443649
42937 1443649 654068 -567824 -1030978 -383326 366220 397490 97545 137923 359800 69104
42927 69104 -1099724 -2932835 -4714767 -5362410 -4204792 -1979794 -333891 87396 272907
42918 272907 1069028 1732771 1171517 -191035 -1013837 -989584 -870554 -862878 -493448 -61736
42908 -61736 -594044 -1929579 -2412036 -1312101 -214951 -868349 -2689472 -3703548 -3187261
42899 -3187261 -1949816 -500882 1415272 3442038 4311221 3463143 1931675 1035104 895223
42890 895223 706516 -163971 -1783845 -3772981 -5325391 -5577380 -4445717 -2798634 -1458993
42881 -1458993 -391459 814595 2108716 3079347 3509900 3297376 2102170 -254372 -3041069
42872 -3041069 -4824400 -4674255 -2991658 -1106821 -228548 -717664 -2042935 -3258739 -3675257
42863 -3675257 -3308943 -2790978 -2770750 -3253905 -3496751 -2749403 -1212564 8399 152560
42854 152560 -274134 -227297 486253 1124855 1142355 669027 -72682 -903866 -1077999 347066
42844 347066 2888578 4358120 3204119 537328 -1230202 -1338974 -1091602 -1509775 -1973253
42835 -1973253 -1575792 -706925 -513837 -1371878 -2559772 -3166502 -2858048 -1960871 -1135898
42826 -1135898 -810047 -717233 -195726 947129 2174455 2934707 3209686 3140001 2619793
42817 2619793 1697553 950490 832314 839858 -2181 -1753310 -3202739 -3151626 -1709591
42808 -1709591 -43065 947484 1386273 1926774 2820491 3640176 3790607 3089288 1854179
42799 1854179 616648 -199740 -542107 -815159 -1481885 -2365922 -2613401 -1716776 -367902
42790 -367902 233207 -122502 -399952 345967 1917525 3404635 4094704 3705757 2363660
42781 2363660 855520 380505 1342063 2616188 2638433 1103871 -901677 -2231067 -2495163
42772 -2495163 -1735838 -170620 1491706 2188242 1459734 -5834 -1080546 -1251379 -850401
42763 -850401 -537307 -714151 -1179296 -1234767 -430601 707566 1079438 285305 -938799
42754 -938799 -1773219 -2256811 -2740525 -2920981 -2186560 -768858 254311 328918 236586 1138272
42744 1138272 3054511 4677751 4729966 3328812 1862096 1461816 1753520 1420961 20093
42735 20093 -1276727 -1128646 191441 1144595 945938 449444 765477 1681470 2030312
42726 2030312 1287059 193581 -158061 569140 1779720 2523251 2208912 1061950 -14697
42717 -14697 -232314 357252 1063064 1399416 1393333 1064393 174939 -1099552 -1665936 -377528
42707 -377528 2581762 5738787 7875266 8958853 9293513 8481946 6015713 2549972 -380166
42698 -380166 -2037961 -3085388 -4237287 -5108184 -4968147 -4052484 -3365160 -3462864 -4090030
42689 -4090030 -4773255 -5067089 -4409114 -2619049 -620676 174862 -502891 -1422733 -1367870
42680 -1367870 -337127 1039875 2438071 3577996 3760593 2585956 855132 -35015
42672 -35015 470962 1762184 2929721 3373997 2810218 1408058 -123510 -1174177 -1844650
42663 -1844650 -2407639 -2536244 -1931106 -1385334 -1957102 -3004062 -2442355 444069 3632755
42654 3632755 4674947 3487428 1876164 1035835 723233 514419 607876 1286324 2478693
42645 2478693 3981386 5429779 6052074 5205385 3257142 1260059 -332641 -1923448
42637 -1923448 -3622987 -4655324 -4310228 -2902422 -1349101 -213969 466364 815816 1031045
42628 1031045 1451592 2364673 3775973 5410152 6733750 7073030 6201045 4873735 4234727
42619 4234727 4527835 4974944 5103647 5411543 6252330 6879764 6471353 5600377 5635063 6746485
42609 6746485 7460391 6440987 4089733 2090381 1777653 3126609 4937060 5763650 4956127
42600 4956127 3085778 1345104 528772 660003 1379773 2298677 2970396 2945948 2122430
42591 2122430 947938 140167 101755 476678 359429 -681679 -1739507 -1340885 532231
42582 532231 1847337 713158 -2258159 -4704335 -5367484 -5083928 -4931385 -4708763 -3820786
42573 -3820786 -2608281 -1883201 -1726594 -1597067 -1286645 -1010876 -761384 -287249 304662
42564 304662 503347 52869 -660686 -935301 -343525 881077 1972116 2407105 2604834
42555 2604834 3396059 4700466 5425043 5022712 4346520 4281803 4278190 3239591 1371250
42546 1371250 -27436 -402194 -405104 -541775 -557150 -365288 -402574 -623484 -257372 784630
42536 784630 1256911 211317 -1480992 -2233436 -1820819 -1255556 -899568 53730 2028866
42527 2028866 4043998 4783434 4086222 2822682 1684263 704508 -140177 -488989 -60917
42518 -60917 736343 1086794 674447 -36119 -564457 -1070546 -1878505 -2669577 -2778168 -2228601
42508 -2228601 -1790594 -1842509 -1837410 -1238175 -399608 -29940 -204569 -433165 -385620 -76551
42498 -76551 338458 457330 -261225 -1602613 -2181562 -872267 1420600 2427251 1184621
42489 1184621 -852697 -1778695 -1455222 -1083144 -1246603 -1385790 -993638 -349703 104543
42480 104543 337136 308153 -399955 -1977357 -3773710 -4901040 -5287722 -5503134 -5571809
42471 -5571809 -4758230 -2887102 -1189228 -1115303 -2592080 -4110564 -4368609 -3167873 -887170
42462 -887170 1948745 4365554 5169492 4128448 2414532 1343536 1060769 855705 266774
42453 266774 -590503 -1263793 -1031273 621161 2904151 3831115 2465839 535033 520871
42444 520871 2415578 3815835 3287595 2060235 1848334 2457393 2585396 1983688 1578438
42435 1578438 1905634 2475414 2534182 1748140 353916 -758902 -458607 1383297 3290769
42426 3290769 3621680 2507132 1572860 1742149 2184993 1716755 454559 -519348 -734750
42417 -734750 -884190 -1755501 -3092151 -3849530 -3468524 -2532454 -2006284 -2130551 -2420418
42408 -2420418 -2507528 -2384879 -1889268 -737515 672241 1296025 817427 303668 753669
42399 753669 1544964 1296442 18557 -656556 476635 2765858 4612737 5197738 4978355
42390 4978355 4917388 5522529 6403080 6641013 5785449 4396012 3308260 2605893 1880625
42381 1880625 1307835 1628990 2965482 4454898 5337630 5691097 5787714 5506297 4862531
42372 4862531 4387636 4321637 4031690 2968201 1663729 899788 305640 -1102016 -3073923
42363 -3073923 -3986763 -2863206 -592482 1344571 2522687 3210954 3053559 1286186 -1715766
42354 -1715766 -4131290 -4501370 -3360004 -2477869 -2681047 -3015293 -2136507 22212 2295508
42345 2295508 3602815 3714440 2896362 1480914 11859 -755765 -578329 -290602 -1083691
42336 -1083691 -3031910 -4682607 -4456403 -2415443 -358364 5901 -1162750 -2157252 -1823822
42327 -1823822 -907836 -947039 -2168972 -3214876 -3004362 -2065450 -1535535 -1502657 -1164617
42318 -1164617 -300627 431023 746313 1281598 2381240 3124195 2389845 523283 -912431
42309 -912431 -963059 -89346 892907 1809268 2662223 2897982 1888118 -104964 -2052047
42300 -2052047 -3166146 -3358000 -2875207 -2072270 -1496390 -1582118 -2109630 -2417623 -2224946
42291 -2224946 -1751878 -1028752 170357 1479902 1865894 925854 -461904 -1473500 -2613094
42282 -2613094 -4671418 -6939545 -7736008 -6615537 -4795278 -3212749 -1441266 927488
42274 927488 2992292 3585278 2882675 1984268 1307137 358622 -1076793 -2431167 -3095602
42265 -3095602 -2978902 -2232027 -1029982 202102 867011 746034 135003 -667468 -1550782
42256 -1550782 -2085819 -1416864 719526 3063228 3623363 1682964 -1363513 -3514224 -4229543
42247 -4229543 -4517145 -5123838 -5486500 -4898325 -3997856 -4165527 -5614306 -6994467 -7037562
42238 -7037562 -5819940 -4178510 -2704110 -1765642 -1756357 -2587046 -3413337 -3571710 -3445630
42229 -3445630 -3764519 -4411245 -4682070 -4479589 -4425928 -4848781 -5369928 -5477955 -4862171 -3280726
42219 -3280726 -902717 1171364 1597111 325229 -1147486 -1355121 -225828 1251677
42211 1251677 2120250 2002828 1173236 415870 372084 801320 917314 521018 168518 108376
42201 108376 -121753 -732250 -1182467 -1124605 -985545 -981840 -457023 905742 2034134 1818539
42191 1818539 931619 911491 1714083 1726775 361212 -928130 -856655 -212688 -465432 -1331234
42181 -1331234 -1078021 905596 3001977 3185190 1305106 -881814 -1647136 -835818 422120
42172 422120 1067249 886585 200760 -638599 -1239381 -1122074 -150633 1155336 2106771
42163 2106771 2506088 2527331 2223433 1632321 1133036 1080665 1191961 899432 224842 -346386
42153 -346386 -739267 -1234331 -1598190 -1257701 -470390 -221950 -608931 -503067 540817
42144 540817 1245807 500012 -748284 -868613 -188748 -693356 -3173115 -6038356 -7226020
42135 -7226020 -6311943 -4499016 -3272510 -3185166 -3314908 -2004834 1107122 4012498 4299388
42126 4299388 2092316 -119717 -585897 86169 567923 552528 311026 -49966 -48956 1170551
42116 1170551 3304850 4519572 3748359 2286298 1813759 1902085 1128006 -151108 -135029
42107 -135029 1548021 3235222 3676828 3389405 3184153 2935870 2466785 2286106 2606882
42098 2606882 2693463 2047424 1379928 1552023 2260120 2634256 2580674 2657558 2979164 3060452
42088 3060452 2612920 1890046 1309077 1116916 1289359 1460939 1147893 298506 -568620
42079 -568620 -924069 -675696 -25949 695611 999225 570957 -225755 -731058 -957201 -1501284
42069 -1501284 -2391950 -2888728 -2672637 -2239637 -1680387 -198791 2363754 4545683 4891791
42060 4891791 3848249 2934841 2609801 2137292 1169660 210258 -374368 -688628 -628939
42051 -628939 186930 1703921 3328735 4512973 4883164 4109693 2412542 886908 457665
42042 457665 757791 861736 715902 831795 1042816 904934 1029698 2460627 4726157
42033 4726157 6093011 5960993 5430831 5170853 4463127 3066843 2303823 3115984 4390923
42024 4390923 4555620 3813586 3412826 3455945 2909877 1457606 82354 -135124 1033256
42015 1033256 2999639 4608313 4684904 3168931 1488747 1106861 1935687 2816328 3169250
42006 3169250 3373834 3799534 4318948 4725086 4985871 5119779 5214259 5311528 4940480 3320281
41996 3320281 613463 -1595930 -1831266 -285804 1810146 3757523 5458890 6590160
41988 6590160 6870415 6755548 6754403 6483611 5591968 5073082 6057111 7608063 7631447 6086893
41978 6086893 5252482 6177836 6922659 5582408 3359356 2818063 4117193 4974441 4110724
41969 4110724 2929934 3420634 5675113 8090621 9224202 8827682 7515495 6045866
41961 6045866 4869327 3949437 2817401 920815 -1827613 -4707653 -6534358 -6566932 -5084623
41952 -5084623 -3024747 -1258399 -278610 -66630 154829 1456352 3734006 5222899 4575851
41943 4575851 3083041 3344143 5674577 7544385 7191348 6034122 6221162 7236804 6807654
41934 6807654 4411365 1871613 599212 149838 -99011 455995 2466280 5193976 7261078
41925 7261078 8169122 8250422 7680412 6447138 4989616 3965988 3388207 2665880 1579190
41916 1579190 616536 176805 -47290 -569326 -1306707 -1602121 -889815 873356 3220448
41907 3220448 5304460 6208932 5613863 4204680 3035601 2432031 1958143 1519727 1773371
41898 1773371 2987115 4174684 4209398 3439662 3227718 3989455 4742954 4772000 4659894
41889 4659894 5147534 5848891 5825614 4814604 3173076 1170681 -820514 -1850184 -1106672
41880 -1106672 925435 2817827 3771255 4183581 4595963 4799053 4351105 3570179 3563712
41871 3563712 5201251 8081734 10620497 11462069 10852291 10145987 9853970 9027643 7141015
41862 7141015 5597050 6089803 7992006 8967533 8219077 7481512 8212899 9329362 8902399
41853 8902399 7081694 5881565 6449776 7844445 8491523 7750848 5870222 3408420 1203026
41844 1203026 211665 720781 1941621 2799256 2979128 2950829 3196109 3741216 4268811
41835 4268811 4298885 3361728 1496183 -308564 -677763 734481 2665350 3527439 3106828
41826 3106828 2458783 2228317 1869311 815065 -352615 -608893 48889 596007 290491
41817 290491 -661374 -1637854 -2117726 -1693316 -304042 1399371 2559500 3138494 3818304
41808 3818304 4731892 5038298 4081616 2267174 384570 -1214331 -2234373 -2008601 -303020
41799 -303020 1923257 3429811 4094739 4637532 5227187 5250688 4393897 3159317 2296404
41790 2296404 2359892 3670069 5847739 7420548 6896463 4529404 2245837 1528667 2067849
41781 2067849 2705242 2846926 2542643 2024283 1768175 2331208 3507900 4254818 4047403
41772 4047403 3662947 3919931 4303774 3745250 2265778 891079 302837 529663 1592441
41763 1592441 3315814 4712846 4816214 4170734 4294098 5462401 6218615 5419687 3623257
41754 3623257 1992771 982539 710142 1447328 2853817 3747560 3685805 3905894 5528106
41745 5528106 7595061 8296801 7630559 7276298 7976723 8652396 8424191 8098539 8971926
41736 8971926 11145090 13713069 15914600 17447857 18181493 18200194 17905974 17690043 17651904
41727 17651904 17720364 17717192 17291080 16270423 15106453 14399764 13975569 13148547 11989426
41718 11989426 11431352 11784836 12035342 11186973 9596733 8359451 7963974 8166760 8624389
41709 8624389 8972318 8751857 7943667 7190628 6895101 6550763 5620626 4568644 4183441
41700 4183441 4244822 3771560 2423764 837531 -334460 -969315 -1153201 -1027918 -888066
41691 -888066 -784234 -172234 1347548 3116714 4048686 4070594 4086867 4535423 4884000 4664916
41681 4664916 4131767 3668317 3317337 3118827 3187327 3236099 2741765 1814096 1225195 1389785
41671 1389785 2008836 2819658 3823987 4585800 4315277 3053052 1826648 1200020 690160
41662 690160 140100 438368 1946048 3341962 3327768 2653580 2976363 4256840 4943982
41653 4943982 4586878 4509161 5471503 6191888 5121998 2765459 1232246 1887144 4159058
41644 4159058 6419659 7430740 7073109 6241198 6135732 7307356 9182736 10600018 10888896
41635 10888896 10406755 9996767 9997914 9966368 9438195 8667637 8220576 8004404 7331656 6064919
41625 6064919 5034515 4960369 5540953 6083565 6471946 6870023 6959349 6299100 5183015
41616 5183015 4336916 3919882 3580506 3333313 3528242 4035845 4370691 4622243 5293809
41607 5293809 6138235 6253401 5613807 5325332 5782627 5724854 4054526 1686369 435591
41598 435591 659584 1223098 1463732 1872602 2772368 3546550 3632318 3432510 3712186 4607311
41588 4607311 5620639 6179649 5919247 4884653 3795720 3656813 4647488 5702121 5638755
41579 5638755 4512795 3465426 3415439 4309616 5502178 6349504 6398173 5486099 3930914
41570 3930914 2419384 1564507 1687251 2944389 5201557 7548273 8414535 6848956 3770243
41561 3770243 1469465 1522210 3308915 4797698 4682930 3518429 2773198 3077149 3629840
41552 3629840 3258970 1793681 234864 -325350 266210 1285331 1959915 2046271 1783205
41543 1783205 1640811 2090742 3189978 4215339 4146513 2931304 1969121 2722760 4908219
41534 4908219 6755513 7255387 7388650 8531457 10233402 10596961 8810805 6272428 4770875
41525 4770875 4366988 3807333 2525526 1298525 1012060 1642185 2652784 3690134 4531565
41516 4531565 4911701 4869543 4901625 5327461 5771033 5672156 5070318 4498372 4355902 4786183
41506 4786183 5841658 7213879 8100474 8093589 8063631 9274420 11523548 13120684 13132871
41497 13132871 12752231 13639412 15522321 16512962 15700937 14374892 14261684 15298830 15903270
41488 15903270 15192497 14094553 13954677 14670348 14950469 14261961 13614767 14042270 15050247
41479 15050247 15329025 14597916 13878320 14072818 15121458 16566961 18054575 19072077 19096597
41470 19096597 18462703 18397036 19685933 21824892 23863141 25477001 26765248 27675013 28310401
41461 28310401 29297869 31108530 33334803 35275322 36986723 39234607 42685282 47580743
41453 47580743 53784738 60627926 67179843 73307805 80077953 88569136 98850967 110783721
41445 110783721 125083645 142550884 162758130 184631224 207889113 232549657 257062664
41438 257062664 278097168 292218869 296946375 290757710 273864600 249294145 221750373
41431 221750373 194789002 169872659 147925694 130052598 116244111 105025161 95286365
41424 95286365 87257996 80986309 75278025 69202317 63437158 59000877 55704266 52991453
41416 52991453 51253545 50992049 51573666 52171842 53108481 54792571 56122574 55707922 54242189
41407 54242189 53889172 55500767 58200744 61715980 67232450 75456514 85432593 96020836
41399 96020836 107321720 119947199 134005293 149649562 167811321 189531370 214920983
41392 214920983 243026183 271908547 298384159 318503060 329105683 328799592 317558563
41385 317558563 296472357 268427734 237963543 209254832 184280183 163195136 145726212
41378 145726212 131505815 119733638 109569684 100773122 93391806 87156769 81827954
41371 81827954 77775156 75419806 74287785 73368862 72287474 71362374 70596233 69470755
41363 69470755 67864152 66321023 65036557 63236625 60080074 55768144 51293260 47384649
41355 47384649 44137785 41407030 38987701 36477580 33565258 30658982 28764468 28390413
41347 28390413 28910908 29468989 30236959 32027414 34562368 36016673 35002488 32584860
41339 32584860 31460356 33122403 36528057 39682972 41842877 43792806 46500342 50021451
41331 50021451 53486883 55728344 56008856 54443858 51742059 48565646 45365419 42702105
41323 42702105 41055714 40048780 38533210 36038257 33654171 32749705 33119857 33258018
41315 33258018 32405390 31449113 31555274 32664687 33806581 34406710 34749852 35361239 36347945
41306 36347945 37292654 37589087 37019198 36178615 36134946 37405216 39372401 40906352 41441831
41297 41441831 41267892 40946890 40774537 40763386 40821000 40804488 40538982 39896840 38860545 37542753
41287 37542753 36186399 35078227 34388430 34118197 34162388 34263908 33961038 32948678 31622659
41278 31622659 30828573 30721580 30265330 28398471 25448799 22781742 21208074 20410859 19809720
41269 19809720 19122093 18036162 16356687 14776933 14423446 15067324 14904082 13018221 11018526
41260 11018526 10943994 12380974 13248080 12868136 12338825 12004402 10769440 8485026 6912055
41251 6912055 7099454 7478774 6130139 3722619 2454361 2833452 3294375 2683378 1477607
41242 1477607 566228 272843 726194 1927810 3208492 3687731 3474884 3450104 3802164
41233 3802164 3913179 3792514 4256755 5236693 5258202 3458653 1106973 162304 1042656
41224 1042656 2735727 4511116 6461925 8573812 10193595 10592961 9667397 8080340
41216 8080340 6878350 6705867 7204070 7487790 7290111 7083883 6924328 5993251 3828352
41207 3828352 1333270 -130911 -201621 547877 1614319 2747572 3516422 3556176 3147567
41198 3147567 2899478 2975989 3192681 3630657 4443270 5185910 5100785 4139444 3100535 2666685
41188 2666685 2812471 3214592 3723691 4286982 4809418 5251824 5628359 5878039 5935875 5854886
41178 5854886 5686663 5451729 5399016 5844507 6365237 5744709 3524944 1251335 1141920
41169 1141920 3484304 6255866 7484728 7106715 6182742 5218860 4008254 2622961 1724162
41160 1724162 1888321 3079010 4806170 6501358 7695623 8077239 7586045 6520394 5478964
41151 5478964 4988781 5067187 5277712 5301523 5257756 5382510 5715446 6237865 6842590 6895875
41141 6895875 5501133 2858964 798846 972373 2751797 3945774 3558856 2750717 2857512
41132 2857512 3592151 3811733 3224315 2532701 2325604 2513390 2646252 2292279 1263761
41123 1263761 -138769 -1225456 -1545547 -1332389 -1186039 -1468373 -2073260 -2548259 -2377614
41114 -2377614 -1421299 -145749 807586 1224140 1210550 738744 -135516 -783222 -521825
41105 -521825 338496 737607 234320 -662773 -1549498 -2455612 -2956161 -2291682 -969342
41096 -969342 -896421 -2882488 -5112146 -5364976 -3859058 -2433852 -1612572 -237930 2196917
41087 2196917 4650436 6218064 7138687 7585919 6859875 4661557 2169270 852954 790898
41078 790898 1003102 1038876 1394044 2492534 3967872 5091581 5524390 5465571 5196655
41069 5196655 4645091 3541994 2011866 697650 81649 26494 340897 1326422 3081895
41060 3081895 4652077 4843724 3781058 2630314 1781271 514417 -1263997 -2321739
41052 -2321739 -1865463 -835207 -443832 -399009 220081 1104469 1209197 716430 971033
41043 971033 2438392 4131265 5335730 6591017 8406834 10136142 10902699 10827797 10543348
41034 10543348 10179315 9745097 9996596 11800557 14670351 16872765 17255378 16365623 15522093
41025 15522093 15321601 15432836 15448241 15356806 15173773 14546717 13028952 10680690 8200486
41016 8200486 6390803 5566985 5512186 5871913 6480346 7393721 8696920 10140879 10904535
41007 10904535 10073806 7702400 5070058 3323481 2110466 377504 -1555465 -1871614
40999 -1871614 305696 3391562 5163544 5365017 5367338 5750503 5670571 4688935 3812144
40990 3812144 4086317 5135051 5868131 5999714 6056878 6242782 6086025 5225016 4060229
40981 4060229 3517298 4257869 5981030 7495506 7883012 7713009 8568167 11076206 14014570
40972 14014570 15887326 16842780 18244237 20609852 22841859 23596046 22769573 21364871
40964 21364871 20239140 19275204 17771718 15583719 13635071 12872647 12799284 11830919 9399760
40955 9399760 6837908 5575627 5337873 5028692 4555568 4476760 4439719 3557744 2122599
40946 2122599 1319342 1240964 910187 467801 1346022 3552223 4793835 3623909 1756225
40937 1756225 1566359 2686882 3114959 2681389 3014388 4393294 5060100 3996641 2308059
40928 2308059 1189082 346668 -631172 -952442 75457 1586463 2310616 2369360 2675799
40919 2675799 3203988 3162862 2462518 1659802 628331 -1315209 -3761714 -4976891 -3939309
40910 -3939309 -1768055 -450002 -676484 -1520695 -1832898 -1325965 -491160 -11149 -247272
40901 -247272 -949665 -1499431 -1655163 -1872527 -2596332 -3538277 -4174478 -4696546 -5640029 -6524491
40891 -6524491 -5871593 -3152558 58634 1760511 1912132 2170941 3463485 4955790 5602583
40882 5602583 5557911 5409597 4903431 3401552 1233182 -327459 -458295 404902 1208467
40873 1208467 1348873 1093910 1189042 2002134 2996571 3361550 3237544 3682695 5060760
40864 5060760 6225512 6043445 5046381 4528413 4521544 4021532 3007939 2620395 3022315
40855 3022315 2725082 926377 -808348 -502544 1408637 2619024 1963522 554336 -93877
40846 -93877 156963 546242 730666 963836 1414341 1905365 2256376 2536886 2910382 3342756
40836 3342756 3591414 3600781 3818233 4760248 6168516 7080031 7082584 7024022 7881350 9285298
40826 9285298 9972161 9567287 8992957 8938370 8859857 8037236 6914477 6603660 7358785 8255305
40816 8255305 8318831 7411090 6018617 4743369 4154712 4602253 5728737 6389475 5584087
40807 5584087 3675722 2403991 3232883 5543948 6865274 5399092 2225000 364515
40799 364515 1454690 3953970 5061731 3811129 1557355 -50955 -420659 530591 2800487
40790 2800487 5523710 6894757 6005609 4257944 3891615 5340586 7021794 7602621 7359606
40781 7359606 7099548 6837241 6189699 5405244 5277315 6273972 8141293 10101563 11193401
40772 11193401 10834656 9426643 8085628 7477233 7270298 6965613 6666372 6553230 6220117
40763 6220117 5327357 4533636 4843190 6086175 6913955 6474359 5377654 4694842 4549266
40754 4549266 4117637 2736248 651660 -1218639 -2054358 -1709867 -705081 214416 460856
40745 460856 -202540 -1402547 -2084420 -1304735 589956 2091642 2247528 1743427 1777159
40736 1777159 2420584 2832362 2626750 2124722 1549126 962940 858480 1728625 2946180
40727 2946180 3078096 1643210 -196725 -987544 -410970 781572 1598946 1436105 540444
40718 540444 -5257 634567 1996130 3017607 3566014 4231978 4766328 4161498 2552721
40709 2552721 1545621 2015954 2926510 3129467 3040732 3473080 3964784 3576816 2554055
40700 2554055 1925972 2023061 2482830 3126973 3727004 3533338 2294376 1231046 1643355
40691 1643355 2877243 3059748 1728234 380234 315203 1135203 1660764 1379786 657806
40682 657806 156806 259845 719451 1006315 1256850 2254892 3950295 4904827 4154122
40673 4154122 2686231 1829611 1210111 73329 -282989 2145396 6474833 9234467 8738567
40664 8738567 6910482 6065794 6110818 5985694 5756698 5752605 5329590 4182298 3554365 4439348
40654 4439348 5617234 5149267 3025307 793190 -670713 -1457556 -1441297 -571409 72667
40645 72667 -732874 -2447334 -3390738 -3200539 -3144785 -3931701 -4712984 -4575175 -3743903 -2911294
40635 -2911294 -2392212 -2232966 -2214983 -1596460 115217 1971204 2315232 1036917 -61840
40626 -61840 339641 1386036 1403381 37558 -1716308 -2883235 -3114622 -2482832 -1461111
40617 -1461111 -778392 -669264 -524841 268887 1513658 2653111 3563741 4287532 4392892
40608 4392892 3418280 1877842 1110130 1933539 3833135 5580982 6354567 6162283 5484894
40599 5484894 4778482 4304102 4187175 4328744 4216794 3254223 1641725 557209 813264
40590 813264 1560416 1177984 -557052 -2180042 -2616845 -2388464 -2157491 -1314491 783577
40581 783577 3022499 3551942 2352406 1290182 1505732 2154423 2137344 1734400 1732174 1990658
40571 1990658 1907190 1646834 1887427 2691522 3496192 3967327 4095822 3714703 2743917 1732292
40561 1732292 1328445 1336754 1114808 732750 749767 950535 538184 -270807 -232560 848001
40551 848001 1447056 613985 -415233 -201415 461522 -129774 -1538560 -1569835 323227
40542 323227 2063059 1914857 652049 -104870 -131339 40437 713519 2378580 4180560
40533 4180560 4656555 3816827 3098470 3204996 3278167 2528776 1539304 1274674 1544553 1257327
40523 1257327 -47338 -1534506 -1966414 -924472 928684 2584784 3479369 3553768 2841771
40514 2841771 1413657 -256027 -1350386 -1455967 -1007409 -762018 -1056990 -1709197 -2258932
40505 -2258932 -2122221 -1025005 366392 819498 45821 -756534 -560292 -99805 -790801
40496 -790801 -2454169 -3368402 -2589345 -999399 212504 943925 1531994 1790601 1548224
40487 1548224 1418853 2080313 3156707 3676374 3464314 3308711 3756396 4400220 4486216
40478 4486216 3743970 2472242 1188047 352175 116969 120635 -257912 -1191869 -2050466
40469 -2050466 -2001387 -987801 140666 614479 621960 876040 1482879 1843184 1789159 2054705
40459 2054705 3023897 3614137 2407799 -232992 -2219757 -2172069 -942587 -265654 -637212
40450 -637212 -1214937 -1287273 -973768 -614839 -258334 91307 264957 227732 239870 458459
40440 458459 607392 345776 -113336 -85266 721340 1628425 1633370 691013 -12743 609160
40430 609160 2131904 2965222 2146697 438257 -503469 199342 1961746 3527430 4187391
40421 4187391 4180674 4062871 3989328 3861169 3931830 4614131 5515300 5401370 3740153 1777954
40411 1777954 1263326 2341817 3559664 3843749 3543999 3411226 3506018 3537405 3544733 3688843
40401 3688843 3768337 3334703 2071386 40868 -2006585 -2709886 -1321693 1041832 2330092
40392 2330092 2043984 1799995 2945918 4706845 5491526 5024043 4088396 2975293 1520068
40383 1520068 194077 -273740 -240671 -797948 -2004168 -2723342 -2485688 -2288211 -2967111
40374 -2967111 -3764951 -3320497 -1484826 594101 1828683 1992940 1450088 763066 544734
40365 544734 1128318 2212892 3138887 3615440 3872628 3940223 3171254 1021988 -1752751
40356 -1752751 -3369101 -2879788 -1287289 -229813 5624 318219 958142 1084033 316536
40347 316536 -528272 -813660 -1052894 -1717685 -2134100 -1619579 -836553 -774991 -1079973 -745745
40337 -745745 73762 439212 419865 853923 1460058 1002480 -419134 -1057365 -148893 737520
40327 737520 -86509 -2154160 -3772591 -4138672 -3499653 -2158575 -449599 987859 1930074
40318 1930074 2961406 4258225 4726439 3442482 1328033 185085 493163 1326863 2064492
40309 2064492 2902224 3886158 4713218 5435358 6148990 6032262 4037920 724091 -1920619
40300 -1920619 -2819329 -2722033 -2419455 -1548024 -21305 769304 -390814 -2510712 -3494976
40291 -3494976 -2862230 -1965890 -1677619 -1308221 -80095 1612891 2967709 3776212 3981067
40282 3981067 3084317 926153 -1430368 -2513103 -1946864 -433505 1465481 3568880
40274 3568880 5228045 5495927 4607119 4223239 5347043 6738324 6475696 4647693 3225571
40265 3225571 3298624 3774677 3285560 2192838 1785032 2283137 2781614 2792980 2673504 2532598
40255 2532598 1880637 750552 215371 1076338 2581485 3164915 2183482 335109 -1374512
40246 -1374512 -2399976 -2553015 -1948372 -1203055 -1004472 -1218695 -1046615 -373374 -232484
40237 -232484 -1320416 -2684879 -2801717 -1624181 -566319 -551349 -1127897 -1638591 -2142675
40228 -2142675 -2746531 -3063509 -3031024 -3371231 -4380700 -5037133 -4359576 -3054793 -2584656
40219 -2584656 -2947728 -2706917 -1137762 989988 2925751 4867670 6881376 8105063
40211 8105063 7861469 6751774 5840996 5349884 4882654 4424647 4314656 4530526 4703272
40202 4703272 4667854 4432614 3751874 2290430 271852 -1341091 -1437775 332145 2970360
40193 2970360 4613941 4191145 2604063 1635459 1743500 1873319 1507464 1561203 2641538
40184 2641538 3721723 3611991 2767114 2419612 2652762 2581364 1850375 677477 -1054446
40175 -1054446 -3333930 -5048486 -5011778 -3806345 -3093251 -3141549 -2654536 -1205601 -137059
40166 -137059 -475179 -1425448 -1682747 -1055388 -141008 465325 56320 -1777706 -3835494
40157 -3835494 -3769713 -1000656 1977875 2473475 791382 -793031 -1258199 -1263033 -1009127
40148 -1009127 146414 1766065 1975601 -129965 -3020361 -4572541 -4475933 -3932629 -3699480
40139 -3699480 -3511779 -3168279 -3075694 -3401083 -3423773 -2397525 -831136 -146764 -764443
40130 -764443 -1169518 321159 3109840 4665171 3553461 1125267 -418937 -729714 -1069718
40121 -1069718 -1962602 -2365840 -1223321 1147166 3455798 4544760 3947202 2045966 -14526
40112 -14526 -1057131 -831934 -70104 378421 150512 -678468 -1661715 -2069185 -1562061 -823028
40102 -823028 -864681 -1622238 -1949605 -1243973 -365463 -520096 -1751835 -2989107 -3234899
40093 -3234899 -2373197 -1121818 -465890 -821214 -1531787 -1512838 -517741 667266 1381848
40084 1381848 1796689 2190258 2261546 1717437 935787 347691 -364588 -1638902 -2904772
40075 -2904772 -3011703 -1840367 -739790 -1089631 -2819086 -4493449 -4627741 -2972615 -781925
40066 -781925 345161 192228 161711 1252496 2235726 891059 -2909506 -6482148 -7207248
40057 -7207248 -5256618 -2767854 -1093524 30048 941218 1061844 -80457 -1728849
40049 -1728849 -2601400 -2423320 -2070281 -2186062 -2242162 -1261284 823364 2870812 3550617
40040 3550617 2515678 692193 -415320 97448 1681155 2723156 2218199 1048520
40032 1048520 1018169 2412483 3228986 1463527 -2322499 -5558911 -6572494 -5998290 -5275726
40023 -5275726 -4849805 -4406599 -3992225 -3938379 -4040554 -3724133 -3023577 -2705748 -3307752 -4572105
40013 -4572105 -5937399 -7083253 -7801318 -7793136 -6959917 -5694455 -4609732 -4005487 -3634616
40004 -3634616 -2875114 -1216862 1103928 2960963 3258916 2152170 940323 538725 518275
39995 518275 39990 -743428 -910777 -192818 619875 813311 602657 516041 505784 218006
39985 218006 -223912 -397761 -457340 -1094327 -2378584 -3270577 -2863413 -1745234 -1337550
39976 -1337550 -1876375 -1933544 -430917 1589874 2131941 897853 -291381 100309 1523749
39967 1523749 2465506 2453215 2070136 1637183 1024293 476640 393997 242861 -1072310 -3366507
39957 -3366507 -4830815 -4205881 -2384375 -1026957 -382778 439322 1574331 2087894 1534604
39948 1534604 676755 333929 378790 315712 219547 556645 1392954 2244044 2668120 2795563
39938 2795563 3198287 4119034 4813345 4086206 1876723 -101521 -5591 2012061 4038801
39929 4038801 4660445 4171558 3548240 3223506 3223380 3637833 4383578 5033691 5269850 5036012
39919 5036012 4136728 2467999 802711 258164 568608 156358 -1326354 -1920094 -84173
39910 -84173 2754450 4126388 4080644 4680111 6340751 7080837 5778519 3956104 3382676
39901 3382676 3688449 3553416 2853233 2310502 2075394 1919437 1965846 2024972 1069834 -1284643
39891 -1284643 -3524718 -3950335 -3107213 -2933530 -3830538 -4304806 -3497911 -2303159 -1617545
39882 -1617545 -1149946 -624255 -635105 -1324749 -1481157 -177924 1602752 2251335 1749078
39873 1749078 1297489 1277109 1102825 910952 1677350 3251233 3804177 2164232 -357713
39864 -357713 -1564410 -1131066 -664345 -1411047 -3046668 -4593422 -5393342 -5082041 -3742753
39855 -3742753 -2423465 -2406591 -3419381 -3625417 -2134349 -411950 -86367 -435513 254586
39846 254586 1544448 1276084 -787842 -2084720 -886503 1202589 1798090 1143666 1109432
39837 1109432 1933849 2169909 1432557 981468 1349108 1344562 156946 -1022931 -486497
39828 -486497 1719999 3802868 4038589 2227907 -84662 -636993 1522258 4702068 6023239
39819 6023239 4537053 2112534 920453 1047327 1197656 734420 12068 -684189 -1446218
39810 -1446218 -2199881 -2675135 -2865494 -2997776 -3176701 -3419498 -3758508 -3962046 -3541255
39801 -3541255 -2418515 -1153304 -119611 975852 2242288 2909013 2257511 834079
39793 834079 -48130 241671 1343009 2702218 3949243 4725847 4848615 4501063 3764607
39784 3764607 2337110 322284 -1238160 -1544387 -1376399 -2167253 -3858422 -4783179 -3862069
39775 -3862069 -2001001 -966475 -1472624 -2651928 -3052665 -2079660 -659366 -243677 -951924
39766 -951924 -1370968 -722495 -247128 -1261123 -2648901 -2020841 846592 3492039 3916531
39757 3916531 2680190 1455500 985343 1122161 1600302 1974820 1756209 1222364 1206325
39748 1206325 1667116 1543153 451468 -697215 -1303765 -1924251 -2783953 -2912065 -1791642
39739 -1791642 -511910 -70204 161394 866272 983906 -695872 -3080185 -3926413 -2941871
39730 -2941871 -1802587 -1392289 -1023267 -410116 -396393 -1235678 -1850631 -1510073 -904776
39721 -904776 -833935 -927010 -402305 747366 1910517 2466789 1849374 -137927 -2573912
39712 -2573912 -3826862 -3336260 -2361012 -2405321 -3488610 -4535952 -4932565 -4989243 -5127502
39703 -5127502 -5235738 -4910722 -4083051 -3265702 -3032592 -3192806 -2874255 -1765406 -795836
39694 -795836 -968714 -1953982 -2641844 -2697934 -2593971 -2450560 -2057088 -1833911 -2385192 -3095356
39684 -3095356 -2672478 -1303355 -687567 -1477096 -2303166 -2041983 -1377581 -1069924 -280291
39675 -280291 1886621 4390893 5442330 4838685 3609071 2126345 240950 -1326510
39667 -1326510 -1578975 -1001860 -991282 -1571919 -1400029 -195168 569835 -92689 -1309696
39658 -1309696 -1933812 -2136763 -2449608 -2301797 -752813 1794519 3618632 3344646 1129779
39649 1129779 -1530624 -2815984 -1843744 513668 2228857 1877485 -258073 -2734304
39641 -2734304 -4064589 -3317801 -565338 2689597 4240250 3178384 907685 -439432
39633 -439432 -304825 160591 -107595 -1015416 -1964336 -2697459 -3214724 -3477910 -3611397 -4021469
39623 -4021469 -4919636 -5903615 -6292553 -5775175 -4566100 -3100624 -1806581 -1046987 -980678
39614 -980678 -1406825 -1870146 -1955411 -1462093 -420667 909976 2149238 3078612 3742943
39605 3742943 4093592 3728977 2411525 773133 -76935 177359 739589 943250 1180655
39596 1180655 2043194 3109309 3398496 2679334 1469551 50995 -1453332 -2209920 -1262401
39587 -1262401 716299 1556213 100124 -2463986 -4387901 -5330089 -5680809 -5111268 -3158533
39578 -3158533 -553206 1394819 2321356 2567697 1996240 494730 -717161 35257 2616268
39569 2616268 5156530 6550052 7415434 8307446 8562704 7591613 5976577 4487252 3131998
39560 3131998 1960664 1688216 2598177 3792312 4450869 4888368 5377217 4978789 2922210
39551 2922210 385402 -682952 -206045 34050 -980602 -2216369 -2105110 -276982 2416855
39542 2416855 4666850 5310754 4117644 2290315 1453868 1898343 2483660 2391672 2132817
39533 2132817 2547197 3632239 4776546 5440934 5136814 3397405 416414 -2655448 -4570688
39524 -4570688 -4930867 -4058721 -2426785 -630257 542134 634604 -9549 -673022 -960409
39515 -960409 -788893 -40963 1290902 2795754 3899371 4306917 3930123 2725779 1082664
39506 1082664 23971 291613 1308945 1789815 1453910 1372343 2327510 3580590 3838946
39497 3838946 2901204 1609575 488927 -720994 -2201437 -3540786 -4322801 -4574922 -4326826
39488 -4326826 -3377591 -1984532 -1173036 -1624663 -2632583 -2959645 -2493023 -2162673 -2330868
39479 -2330868 -2295326 -1538792 -425103 698140 2015399 3283818 3476143 2338960 1341902
39470 1341902 1781239 2636783 1891665 -333495 -1752365 -1268747 -641889 -1940020 -4586253
39461 -4586253 -6080503 -4990047 -2241007 154300 820172 -266191 -2025155 -3228672
39453 -3228672 -3528727 -3398278 -3032553 -1964347 -90940 1674469 2376125 2028857 1101444
39444 1101444 -221412 -1461149 -1425044 327442 2138043 1899441 -61108 -1252278 -346378
39435 -346378 1245629 1603887 697979 -272059 -760488 -980384 -883502 -226964 658602 1138775
39425 1138775 1178181 1227303 1354116 1189252 649971 78555 -309150 -550572 -530979 23544
39415 23544 1101843 2336460 3327683 3703632 3084979 1548865 10941 -516031 -141861
39406 -141861 -32279 -973884 -2469114 -3421363 -3298831 -2428840 -1493029 -926640 -573552
39397 -573552 127373 1344101 2332373 2237332 1428468 1310968 2474884 3711049 3492341
39388 3492341 1984204 806539 954380 1759198 2086841 1892014 2097196 3225992 4677836
39379 4677836 5434969 5206452 4671277 4625938 5045863 5123151 4243264 2778764 1750630
39370 1750630 1733921 2319104 2745399 2780892 2622274 2116095 794939 -1014701 -1837009
39361 -1837009 -635779 1541002 2514121 1649855 575283 875407 2103572 2753045 2266767
39352 2266767 1105341 -425789 -2176042 -3423280 -3467289 -2791827 -2414299 -2220529 -1311427
39343 -1311427 16829 254617 -974856 -2113227 -1889186 -903893 -156044 555177 1547563
39334 1547563 1854396 473827 -1757635 -3032613 -2811502 -1923696 -1034029 -402567 -605295
39325 -605295 -1870934 -3013140 -2697707 -1655150 -1900580 -3651441 -4816776 -3984584 -2215740
39316 -2215740 -1152637 -875384 -590790 -170366 112603 432025 913170 995964 279618
39307 279618 -549549 -521540 313606 1118651 1397615 1271604 1061274 1140057 1729527 2368727
39297 2368727 2168703 1051391 4451 -408459 -842908 -1703174 -1929452 -516962 1478629
39288 1478629 1941505 442828 -1351976 -1967687 -1583254 -1117873 -992504 -1100588 -1126077
39279 -1126077 -569242 874854 2735166 4098181 4587499 4474358 3906170 2759244 1287368
39270 1287368 174102 -216933 -92367 252505 558978 379938 -464472 -1235355 -943164
39261 -943164 291157 1432022 2103572 2870402 3758781 3799021 2656550 1525407 1437772
39252 1437772 1613281 663509 -1175343 -2316491 -2117546 -1659771 -2092712 -3260791 -4364888
39243 -4364888 -5108722 -5527950 -5240924 -3723530 -1291907 845607 1755139 1616885 1173114
39234 1173114 737512 200272 -275548 -286460 38473 63718 -219055 170347 1763855 3390650
39224 3390650 3253147 1093094 -1480674 -2771124 -2430198 -1212975 -89066 272601 -209496
39215 -209496 -1022654 -1686740 -2301109 -3032028 -3389035 -2809059 -1737769 -1133710 -961890
39206 -961890 -301521 944241 1673925 1268584 457175 9989 -244387 -452904 -26050
39197 -26050 1143395 1795034 801770 -1157964 -2479751 -2525420 -1644022 -100042 1731786
39188 1731786 2698166 1844285 -151732 -1695590 -2136663 -1789916 -657753 1274969 2755550
39179 2755550 2150953 -143973 -1897602 -2053855 -1856845 -2360030 -2623349 -1498748 367272
39170 367272 1763792 2880827 4359138 5310227 4214682 1408432 -1158953 -2577030
39162 -2577030 -3636486 -4702390 -4785315 -3401078 -1740128 -962785 -620366 39273 318743
39153 318743 -845143 -2758963 -3650915 -3243963 -2944144 -3313761 -3117828 -1594828 -111620
39144 -111620 -299325 -1577947 -1989637 -945494 309134 767825 756614 768622 504533
39135 504533 -376156 -1473598 -2209958 -2513587 -2491259 -2098391 -1613867 -1710382 -2384483 -2452609
39125 -2452609 -963318 1285511 2526936 2162217 1315754 1274882 2108569 2954558 3034930
39116 3034930 2124247 498914 -1184570 -2164891 -2097196 -1421202 -1131203 -1975341 -3674337
39107 -3674337 -5033854 -5161465 -4522348 -4326994 -4889186 -5311524 -5036990 -4830754 -5531972
39098 -5531972 -6541595 -6585964 -5671880 -5163336 -5795074 -6564806 -6050871 -4233933 -2449243
39089 -2449243 -1731890 -1684506 -1148414 208303 1403037 1495707 998018 1179379 2127966
39080 2127966 2576559 1915231 1206493 1543881 2502576 3134360 3415368 3474983 2435134
39071 2435134 -256906 -2992557 -3474104 -1865755 -568092 -778183 -1260222 -916080 -468336
39062 -468336 -645438 -594749 464127 1425180 776063 -996231 -2052147 -1751850 -1162087
39053 -1162087 -1259825 -1857717 -2317588 -2399104 -2287662 -2327162 -2665380 -2830719 -2026356 -259421
39043 -259421 1312748 1675053 1074235 309400 -456652 -1430844 -2279451 -2342345 -1445493 123371
39033 123371 1967710 3279351 2916419 804853 -1267848 -1415673 72209 1282691 1211911
39024 1211911 566662 208004 150346 337310 1193734 2799439 4234088 4315425 2748869
39015 2748869 430408 -1172521 -1185660 -299116 -194100 -1433422 -2490334 -1746453 183724
39006 183724 1418330 1626297 2172217 3445657 3927079 2571671 554192 -355791 -10741
38997 -10741 522983 649387 469112 40421 -516111 -620370 121295 1147969 1557087 1218491
38987 1218491 676532 289395 74418 46114 67967 -281245 -998681 -1122405 277135 2625509
38977 2625509 4083317 3408272 1148416 -1087178 -2168621 -2149332 -1737316 -1380919 -1057801
38968 -1057801 -887123 -1390139 -2626276 -3518563 -2983036 -1594954 -1002193 -1559198 -1849081
38959 -1849081 -1032041 -292937 -1031861 -2785715 -4104943 -4519485 -4343352 -3422320 -1658451
38950 -1658451 -185839 -304290 -1468657 -1943642 -1332389 -803905 -818696 -468511 552526
38941 552526 1104683 419362 -812135 -1938264 -3364532 -5083535 -5767401 -4722664 -3418715
38932 -3418715 -3376405 -3552992 -1780902 1759778 4547743 5087376 4309496 3401826 2238696
38923 2238696 705490 -232758 -85385 -172697 -1880559 -4328339 -5309071 -4202475 -2461065
38914 -2461065 -1241680 -99269 1504472 2760599 2539876 1031305 -621033 -1735395
38906 -1735395 -2137921 -1321988 1023888 3640560 4334573 2620324 612654 457715 1794983
38897 1794983 2778239 2790693 2756775 3190236 3528096 3510049 3751288 4477949 4926603 4626192
38887 4626192 4205660 4202607 4060699 3204123 2268280 2232789 2942706 3492723 3554652 3314900
38877 3314900 2619460 1364808 392547 729631 2036430 2951013 2895067 2392218 1718020
38868 1718020 635496 -388387 -214749 1166980 2143649 1486749 -173231 -1504058 -2039938
38859 -2039938 -1881042 -920793 672279 2079905 2892007 3727280 4860533 5164377 3659423
38850 3659423 1362045 168930 404691 913170 1178573 1712061 2384726 2046883 217688
38841 217688 -2117512 -3801991 -4521366 -4261664 -2975511 -1246309 -139763 188485 720479
38832 720479 1857717 2585629 2143868 1516269 2213749 4253612 6345602 7571019 7927564
38823 7927564 7634675 6891970 6119482 5573926 4838600 3417435 1714012 751617 1022973
38814 1022973 2183913 3655122 4847798 5028102 3840450 2005871 709826 137518
38806 137518 -651621 -2114040 -3195392 -2508546 -227844 1795682 1895468 219966 -1721023
38797 -1721023 -2945227 -3962101 -5647230 -7644814 -8563516 -7636202 -5454778 -3021630
38789 -3021630 -892035 551837 924802 427192 -220577 -958421 -2562267 -4918780 -6195389
38780 -6195389 -4935106 -2210050 -327645 46191 3502 101400 -239966 -1033175 -1254030
38771 -1254030 -589665 -101192 -418577 -623732 172387 1277480 1491162 901054 560897
38762 560897 934356 1583819 2000206 1957428 1402742 680509 496545 1019360 1416920 956115
38752 956115 169660 192431 1237471 2466913 3147281 3204382 2799012 2097994 1434751 1058726
38742 1058726 740606 192711 -219416 102252 838622 880604 -74 -318674 1498956
38733 1498956 4865265 7227273 6832447 4740282 3449927 3824805 4363807 3720524 2720868
38724 2720868 2839873 3549836 2882506 577507 -1064352 -116020 2543315 4632974 5206534
38715 5206534 4877619 4178995 3077311 1803171 927629 534983 131279 -575744 -1386990
38706 -1386990 -2023964 -2326092 -2193613 -1782053 -1522586 -1584239 -1728152 -2058088 -3196938
38697 -3196938 -5036705 -6071113 -4988110 -2398644 56812 1787249 3213202 4141637
38689 4141637 3786089 2440222 1623268 2143054 3130715 3353656 2513578 1008817 -550499
38680 -550499 -1320524 -797163 218514 234767 -1004804 -2241800 -2655470 -2848088 -3346784
38671 -3346784 -3467851 -2620796 -1654656 -1766954 -2804821 -3668326 -3748642 -2985329 -1198356
38662 -1198356 1409697 3518704 3763887 2517308 1569098 1965130 3012180 3511534 3166666
38653 3166666 2503880 1973142 1465081 509470 -1149526 -3096108 -4497647 -4921143 -4647728
38644 -4647728 -4125745 -3582349 -3285119 -3475882 -3710178 -3062627 -1541312 -475385 -726441
38635 -726441 -1313343 -830251 440375 1041746 490413 -415354 -1160665 -1978232 -2763318
38626 -2763318 -2903759 -2398714 -1901206 -1408001 -214082 1422629 1946158 609071 -1208171
38617 -1208171 -1734415 -1031994 -519423 -894905 -1508565 -1447812 -450240 1014424 1996840
38608 1996840 1771712 823641 616767 1726471 2779549 2144590 213615 -1085634 -837543
38599 -837543 -48624 46337 -537630 -1115295 -1445855 -1671997 -1765744 -1650995 -1529118 -1587984
38589 -1587984 -1618465 -1309000 -718871 -96545 612297 1690109 3103452 4347641 4940462
38580 4940462 4916860 4695390 4471355 3918215 2710938 1287689 660667 1230185 2206710
38571 2206710 2681275 2911788 3818490 5342266 6190847 5422236 3517051 1547576 -13873
38562 -13873 -1234901 -2169874 -2952957 -3867761 -4698485 -4567126 -3140549 -1468646 -765734
38553 -765734 -849362 -813985 -804646 -1765172 -3548098 -4782534 -4899797 -4835693 -5151223 -4880346
38543 -4880346 -3207586 -1110976 -112796 -235238 -462208 -552184 -946802 -1255221 -414601
38534 -414601 1487534 2866634 2555587 1161733 119429 77764 539331 543556 -498023
38525 -498023 -2181953 -3290287 -3065743 -2155196 -1650412 -1490335 -786750 461146 1246273
38516 1246273 1245885 1263290 1569802 1176110 -500464 -2441256 -3431987 -3653671 -3847579 -3800356
38506 -3800356 -2867814 -1350282 -97342 827278 1899020 2881506 3027770 2371043 1671694
38497 1671694 1140827 340259 -602225 -820463 -35178 897980 1132889 781840 426690
38488 426690 393811 833358 1840827 3069750 3712649 3264204 2002614 542107 -683936
38479 -683936 -1323773 -990800 345324 2009940 2909971 2249849 195225 -1974408 -2722364
38470 -2722364 -1736639 -315494 228287 212779 901156 2440875 3511321 3139556 1921725
38461 1921725 1088579 1107910 1628153 2190996 2513201 2445673 2050766 1534324 964623 267207
38451 267207 -558249 -1520256 -2722650 -3905447 -4222950 -3210620 -1731815 -1105474 -1497856
38442 -1497856 -2152759 -2939504 -4304963 -5688293 -5591158 -3710145 -1577543 -463409 -9378
38433 -9378 367821 248352 -557772 -982906 -286719 505514 267025 -143710 800770 2613000
38423 2613000 3302383 2274834 969971 646617 1114265 1743085 2240972 2201654 1217241
38414 1217241 -264051 -1326001 -1977018 -2973041 -4157843 -4365756 -3294485 -2074750 -1436873
38405 -1436873 -641058 1004500 2723900 3337866 2942391 2622145 3025059 3900209 4569005
38396 4569005 4356217 3114151 1750217 1562995 2570819 3199105 2164531 -12055 -1883385
38387 -1883385 -2676068 -2387193 -1148908 565999 1706222 1601098 846641 478500 624121
38378 624121 689614 446927 103573 -365630 -1095939 -1772515 -1999740 -2044033 -2421259 -2876100
38368 -2876100 -2554580 -1189169 521866 1716128 2065403 1798000 1490111 1668575 2248270
38359 2248270 2668476 2845308 3274320 3693482 2728942 14170 -2301302 -1883940 399018
38350 399018 1371920 -101760 -1628803 -753441 1818982 3501580 3057307 1412021 95439
38341 95439 -93156 586552 1064289 515138 -424921 -279668 1071722 1992263 1531335 849611
38331 849611 1021325 812398 -1491110 -4901447 -6561951 -5609385 -4145588 -4044975 -4699607
38322 -4699607 -4694583 -4071413 -3693513 -3436668 -2415665 -638566 696573 649369 -326195
38313 -326195 -844713 -6547 1621263 2457955 1552977 -327306 -1605424 -1677823 -1223983
38304 -1223983 -965796 -992216 -1260899 -1697628 -1599092 -100906 2279566 3705602 3337388
38295 3337388 2519259 2753690 3523240 3319586 1976575 536225 -603602 -1777010 -2574649
38286 -2574649 -2050844 -584995 111045 -640777 -1548004 -1456093 -1045781 -1471830 -2446148
38277 -2446148 -2864052 -2510119 -1866274 -831805 921227 2566223 2638776 1232426 381150
38268 381150 1557149 3657494 4316768 2765974 592397 -214621 672251 1905413 2081590
38259 2081590 1135049 230992 416720 1490293 2361680 2487510 2529012 3278329 4301659
38250 4301659 4337164 3076628 1803652 1799557 2667858 2978040 2273415 1466647 1131720 456615
38240 456615 -1429357 -3782645 -4829076 -3811630 -1728514 -163658 -51541 -1430623
38232 -1430623 -3559089 -5191984 -5538905 -5135932 -5062598 -5215632 -4346862 -2148139 -151107
38223 -151107 245423 -329767 -395322 79957 -41100 -889147 -1346421 -1118924 -1415694 -2857963
38213 -2857963 -4076981 -3534784 -1816525 -744135 -680643 -214324 1394154 2861047 2614416
38204 2614416 902273 -675156 -1115910 -600722 431149 1671804 2451033 2034937 878282
38195 878282 639273 2195447 4281594 4942508 3881675 2432179 1543219 973845 463673
38186 463673 392095 802627 869671 82435 -850154 -1079739 -949710 -1375981 -2391090 -3198505
38176 -3198505 -3316497 -2807028 -1726206 -324423 467385 -146160 -1563844 -2395253 -2348982
38167 -2348982 -2378268 -2778662 -2428733 -525785 1962985 3377872 3200213 2156235 1160314
38158 1160314 828777 1424789 2553250 3367176 3610392 3816559 3957156 2936849 477618
38149 477618 -1521050 -1148507 547653 676189 -1440685 -3313885 -2880041 -1107499 12557
38140 12557 322767 731374 861229 -459935 -2795647 -4144797 -3561397 -2185037 -1347502
38131 -1347502 -1061204 -873850 -884259 -1145237 -1189687 -1080354 -1962448 -4432742 -7061361
38122 -7061361 -7805602 -6511766 -4771789 -3523663 -2183857 -323708 1152363 1164335 -92957
38113 -92957 -1550271 -2529472 -2986473 -2918868 -2175705 -792762 742188 1505532 624012
38104 624012 -1680977 -3641121 -3468890 -1578951 -286528 -812927 -1692137 -1028056 687503
38095 687503 1328356 77471 -1855010 -3206763 -3847536 -3875143 -2994547 -1362095 42977
38086 42977 574906 700223 1070278 1518362 1571542 1359946 1375915 1749479 2307863 2970956
38076 2970956 3579155 3719536 3301850 3005010 3510151 4399899 4398890 2790571 244335
38067 244335 -1825176 -2483304 -1855675 -767114 -28589 -88024 -1094823 -2770648 -4028181
38058 -4028181 -3406431 -704980 2106966 2629620 779595 -1125622 -1226713 -38735 915237
38049 915237 1253091 1609866 2194219 2618064 2776605 2840106 2536116 1396445 -305281
38040 -305281 -1711850 -2515561 -3121424 -3558892 -3087622 -1325687 808746 1850520 1307985
38031 1307985 71419 -661237 -644995 -680012 -1476346 -2624413 -3004469 -2204069 -1064308
38022 -1064308 -597865 -812935 -986835 -721909 -235614 153615 344380 399874 550569 1066633
38012 1066633 1812943 2211212 1964654 1411993 770847 -371412 -2122793 -3429215 -3187375
38003 -3187375 -1924949 -1249330 -1681177 -2188352 -2000128 -1637564 -1656162 -1517446 -575210
37994 -575210 617692 1001383 577308 290961 477501 363160 -671588 -2044366 -2627750
37985 -2627750 -2079281 -1065810 -331286 -21103 29570 -131745 -342506 -74159 905534
37976 905534 1729798 1140214 -712422 -1947137 -1051515 1187969 2528166 1759004 -239554
37967 -239554 -1678710 -1501158 -27582 1455269 1835908 1294699 1050423 1691363 2319550
37958 2319550 1927678 951398 506056 595136 259411 -728655 -1532963 -1594356 -1181625 -562355
37948 -562355 267795 918880 775976 34403 -458046 -547368 -888707 -1565949 -1798265 -1334182
37938 -1334182 -966591 -1263210 -1872782 -2425912 -2978719 -3264255 -2782603 -1954114 -1752607
37929 -1752607 -1866965 -973966 641611 859035 -867497 -2132327 -1260575 -221772 -1585654
37920 -1585654 -4330995 -5468000 -4636570 -3997332 -4096339 -3109013 -522843 1387178 752597
37911 752597 -1484293 -3416697 -4533288 -5145284 -5100564 -4291501 -3261653 -2332009 -1168467
37902 -1168467 54792 286664 -742514 -1659715 -1216897 82114 1055036 1570885 2202598
37893 2202598 2999715 3646071 4182839 4668451 4748040 4362091 4167799 4437198 4348546 3344974
37883 3344974 2392742 2701277 3805779 4199313 3491475 2707079 2660230 3192773 3925007
37874 3925007 4668084 5045116 4614253 3460221 2038942 630148 -407858 -341893 957541
37865 957541 2200039 2161680 1699645 2657486 4696827 5099395 2481535 -912037 -1842532
37856 -1842532 126913 2766165 4204249 4260928 3218934 1035972 -1837232 -4081413
37848 -4081413 -4650593 -3761939 -2435540 -1587962 -1813216 -3364725 -5777189 -7857500 -8595889
37839 -8595889 -8012458 -6854693 -5678271 -4512779 -3191847 -1635967 61054 1519417
37831 1519417 2211086 2019362 1432065 800547 -258866 -2104278 -4007008 -4790382 -4520767
37822 -4520767 -4475864 -5122699 -5305264 -4162035 -2733265 -2489337 -3081976 -3021187 -2120543
37813 -2120543 -1615801 -1916605 -1982631 -1316447 -880049 -1210987 -1152682 310775 2143620
37804 2143620 2659360 2005137 1609140 1607694 629162 -1738417 -3932297 -4498046 -3934633
37795 -3934633 -3603858 -3668384 -3106893 -1385631 744285 2049215 1836120 198393 -2244671
37786 -2244671 -4649066 -6213118 -6417735 -5217139 -3147379 -1141673 85682 602017
37778 602017 1048113 1828109 2700434 3195014 3154699 2732239 2099998 1381694 738308 304553
37768 304553 49291 -191469 -529620 -889394 -1045245 -850619 -500297 -467853 -1005485 -1743605
37758 -1743605 -2003411 -1553367 -876924 -616536 -911022 -1392230 -1696471 -1773474 -1683921 -1298601
37748 -1298601 -408880 869872 2020561 2577575 2503796 1988628 1135516 153441 -432863
37739 -432863 -330097 -100448 -524862 -1308381 -1273200 -116115 966950 998905 647253 1002251
37729 1002251 1695793 1529539 591726 287473 1181316 2180815 2282342 1921506 1909628 2009883
37719 2009883 1453931 238157 -954163 -1714384 -2025243 -1739231 -738622 495787 1189654
37710 1189654 1228747 1305280 1996154 3034975 3597629 3081461 1524758 -586151 -2746526
37701 -2746526 -4512635 -5217687 -4216652 -2022486 -711319 -1971704 -4634289 -5483268
37693 -5483268 -3158711 -222 1008127 -51767 -891135 -681128 -766120 -1834980 -2577507
37684 -2577507 -1902127 -752920 -552509 -1063175 -1098402 -546350 -363748 -1012331 -2105448
37675 -2105448 -3338357 -4613656 -5338721 -4745931 -3105991 -1716980 -1446046 -2037389 -3015854
37666 -3015854 -4339027 -5700620 -6050106 -4647517 -2243087 -472111 -135339 -578376 -746046
37657 -746046 -369300 83162 362468 988775 2621603 4924725 6481891 6266668 4964654
37648 4964654 4171694 4255796 3829091 1752481 -1068783 -2670285 -2433472 -1634464 -1619907
37639 -1619907 -2250721 -2467627 -1837087 -1019857 -840157 -1257209 -1374616 -382949 1620726
37630 1620726 3798023 5380643 6038308 5571133 3864738 1444583 -486137 -1140551 -990355
37621 -990355 -1002641 -1344077 -1447948 -1068505 -483489 206968 1123814 1948776 2109908 1769449
37611 1769449 1730721 2091066 1895153 554085 -1263387 -2698038 -3770212 -4619016 -4487556
37602 -4487556 -2569123 497590 2961803 3641295 2539194 137586 -2885878 -5278473
37594 -5278473 -5626680 -3610157 -388173 2399756 3634568 2921155 635775 -2009280
37586 -2009280 -3626208 -3788105 -3214014 -2731292 -2492083 -2307819 -2190549 -2252237 -2465820
37577 -2465820 -2840670 -3535903 -4483707 -5099702 -4724736 -3431017 -2245879 -2325118 -3655680
37568 -3655680 -4728554 -4069099 -2194457 -1259218 -2285003 -3617299 -3067563 -863810 856761
37559 856761 1074783 777856 771770 357648 -1112894 -2798209 -3523481 -3390765 -3200148 -3042795
37549 -3042795 -2554184 -2007210 -2027647 -2467844 -2516442 -1856517 -1025350 -745733 -1428024 -3014447
37539 -3014447 -4672147 -4977458 -3203492 -305159 1996591 2894754 2660971 1582064 -219864
37530 -219864 -1990817 -2514000 -1507672 -155279 191590 -575181 -1448724 -1434115 -313594
37521 -313594 1343215 2642864 3017233 2584417 1834773 1070802 334781 -303385 -725742
37512 -725742 -932258 -926985 -576366 102823 691534 776387 455730 83327 -291081 -831128
37502 -831128 -1484900 -2061807 -2479976 -2510064 -1664545 36603 1555608 1876700 1321702
37493 1321702 1027733 1344533 1668924 1693128 1728419 1780058 1455936 1000105 1264600 2268763
37483 2268763 2889678 2510618 1919370 1894565 1910115 1140907 -51079 -636058 -356811 291348
37473 291348 1045460 1868795 2306419 1853707 847009 126652 -107838 -302240 -489416
37464 -489416 -135997 799874 1495529 1353917 892448 1045143 1864336 2401760 1897648 746547
37454 746547 -4880 -59684 -307710 -1490224 -2818310 -2717424 -922046 1080629 1962017
37445 1962017 1978053 1969735 1859852 998825 -636689 -2488466 -4170535 -5338325 -5353115
37436 -5353115 -4082735 -2583047 -1872118 -1391499 98128 2385595 3978947 4308168 4223662
37427 4223662 4159929 3493082 2274459 1908271 3015950 3958965 2874368 334375 -1394223
37418 -1394223 -1199935 99964 1521383 3048588 4830216 6317643 6687687 5659235
37410 5659235 3703013 1736601 510209 -100197 -1009777 -2671332 -4143476 -4033843 -2248616
37401 -2248616 -147868 1021379 1214746 1086809 1075798 1216607 1345846 1192913 584916
37392 584916 -215767 -603948 -236175 552649 973890 418343 -933392 -2054204 -2018167
37383 -2018167 -1226396 -1105655 -2085342 -2567711 -896042 2075665 3641955 2468335 -77621
37374 -77621 -2013072 -2820426 -2874797 -2128578 -522662 1086029 1678034 1456049 1432843 1796270
37364 1796270 1692350 692618 -451529 -856359 -680079 -841032 -1881028 -3401698 -4467206
37355 -4467206 -4391222 -3216108 -1541733 46201 1311668 2265326 3036433 3844380 4737508
37346 4737508 5365895 5482561 5586237 6232455 6591487 4900375 1048557 -2427956 -3102988
37337 -3102988 -1580148 -322446 -282441 -384939 49201 419839 609683 1605984 3533306
37328 3533306 4711059 3796918 1676131 178045 -7674 858679 2587214 4481417 4777946
37319 4777946 2469439 -737993 -1990383 -778041 584773 84561 -1711743 -2815461
37311 -2815461 -2160475 -367317 1054646 963080 -366501 -1372483 -977209 -39583 -198028
37302 -198028 -1500087 -2377220 -2012212 -1411895 -1761716 -2928613 -4128086 -4949714 -5062630
37293 -5062630 -3971622 -1917453 -172721 399087 340511 400826 226436 -734538 -1803399
37284 -1803399 -1831184 -973520 -491308 -1009875 -2086974 -3281620 -4415024 -4834446 -3787682
37275 -3787682 -1842823 -718451 -1158856 -1994045 -1942224 -1370684 -1355273 -1766777 -1548597
37266 -1548597 -653680 -402229 -1538214 -2890323 -2716873 -930657 805578 1121238 345181
37257 345181 -324966 -391586 -257539 -263533 -249460 -42319 235888 481264 759035 1007895
37247 1007895 1005403 721966 304310 -274506 -978206 -1162247 -132534 1536286 2220499
37238 2220499 1301009 70821 -119927 293691 103755 -595920 -653757 214236 1074644
37229 1074644 1300561 1292325 1584771 2206189 3029833 3921362 4500946 4521908 4337959 4139517
37219 4139517 3088271 462032 -2586567 -4002932 -3639047 -3373584 -4076809 -4358859 -3178090
37210 -3178090 -1798932 -1718674 -2156785 -1395408 366675 1339264 790756 -290191 -899688
37201 -899688 -926607 -582896 -295359 -954304 -2897390 -4808023 -5010326 -3714315 -2511829
37192 -2511829 -1822019 -657667 919290 1190096 -540506 -2420957 -2417492 -885324 451194
37183 451194 946171 1085241 999134 476588 -12297 228363 779500 451960 -1013139 -2575089
37173 -2575089 -3223213 -2830589 -1794370 -742329 -523812 -1503672 -2780067 -3001717 -2063732
37164 -2063732 -1116965 -830871 -678550 -172339 314186 475297 807658 1677371 2468150
37155 2468150 2520738 2322587 2851249 4100190 5097086 5160460 4411346 3260260 2121209
37146 2121209 1472293 1471095 1593711 1291829 829717 743628 704476 -85846 -1370033 -1811951
37136 -1811951 -806426 683796 1565476 1947506 2387097 2668591 2254817 1404647 887258
37127 887258 868889 906039 811434 719192 474827 -180584 -878211 -933370 -465015 -391896 -1118948
37116 -1118948 -1946502 -2028816 -1274651 -64887 1239366 2169314 2180701 1281513 165019
37107 165019 -639658 -1246680 -1716588 -1561686 -556159 511850 667956 19550 -508548
37098 -508548 -445622 -57712 412707 945621 1254266 1006181 666740 1205935 2585583 3378401
37088 3378401 2529424 850748 -56544 55164 24879 -702149 -1135800 -314013 1076122
37079 1076122 1591724 1134398 1034492 1948768 2804487 2458069 1505483 1404672 2288265 2879928
37069 2879928 2486631 1742624 1064167 -251842 -2509490 -4295345 -3993463 -2082448 -596350
37060 -596350 -472609 -718910 -319650 297372 194148 -660471 -1582621 -2130137 -2239321 -1911082
37050 -1911082 -1385604 -1275128 -1943254 -2971665 -3664673 -3789134 -3408798 -2423923 -931625
37041 -931625 259712 290966 -594241 -1280126 -1233926 -1008948 -1122869 -1252465 -1033866 -940351
37031 -940351 -1517217 -2110599 -1386739 727842 2467034 2078926 -213887 -2596193 -3662005
37022 -3662005 -3476792 -2853921 -2306938 -1923076 -1726337 -1699060 -1603303 -1158642 -467293 -80395
37012 -80395 -469130 -1345158 -1606138 -295773 2176053 4091802 4125828 2762147 1476860
37003 1476860 742283 -261888 -1864374 -2925044 -2293793 -454238 1146242 1882444 2155151
36994 2155151 2198861 1776814 1041797 693346 1017835 1512772 1723848 1801155 1932182 1834555
36984 1834555 1245059 529216 410354 1259530 2812748 4385035 5299831 5352581 4881462
36975 4881462 4202610 3183899 1754296 541250 328110 969234 1538593 1541290 1278290
36966 1278290 1044314 808458 774210 1334571 2219480 2557204 2082566 1431869 969010 323706
36956 323706 -509098 -755089 -218506 39996 -712803 -1566036 -1266495 -53617 880706
36947 880706 1075643 832515 219637 -709100 -1226012 -801174 -333806 -1190469 -3198876
36938 -3198876 -4840961 -5267814 -4866359 -4025891 -2797507 -1784262 -1837162 -2563382 -2506945
36929 -2506945 -1195253 284026 1143304 1950117 3174031 3961734 3299837 1522883 -180311
36920 -180311 -1127168 -1404141 -1415189 -1659156 -2317167 -2742810 -2142128 -963814 -545627 -1077498
36910 -1077498 -1227928 -332191 506922 349467 -28233 326104 834776 669919 502786
36901 502786 1265894 2160368 1774308 445458 -462555 -1058828 -2499467 -4305195 -4473933
36892 -4473933 -2591778 -668608 -243420 -621457 -805746 -1254677 -2479070 -3483398 -3126453
36883 -3126453 -1959806 -1271450 -1107659 -632691 176573 646408 900015 1831582 3507967
36874 3507967 4713113 4404953 2921516 1470385 888767 1090027 1366120 980652 -450587
36865 -450587 -2933464 -6045260 -8638213 -9138840 -7110944 -4436403 -3764299 -5438826 -7076653
36856 -7076653 -6697246 -5027376 -3852546 -3406853 -2849082 -2363308 -2902806 -4126785 -4409417
36847 -4409417 -3143493 -1553318 -811998 -662638 -488878 -594637 -1558622 -3020734 -3899168
36838 -3899168 -3488722 -1947169 -113008 870912 300442 -1318792 -2654326 -2991193 -2874690
36829 -2874690 -3130872 -3820946 -4442890 -4565883 -3906297 -2373447 -489223 762990 981749
36820 981749 809033 981910 1441354 1763111 1835946 1584458 674965 -799668 -1903482
36811 -1903482 -1920522 -1384570 -1242474 -1430817 -1196580 -455292 209518 655554 1187933 1609221
36801 1609221 1492126 1415827 2534355 4528727 5361981 3873180 1529615 592442 1316178
36792 1316178 2052957 1641099 587189 55387 624051 2032431 3409390 3742968 2778960
36783 2778960 1491795 1117408 1736712 2330805 2118376 1196750 -36358 -1261013 -1923807
36774 -1923807 -1445953 -173639 586987 70099 -894005 -923298 151737 1200782 1304315
36765 1304315 710641 214459 104669 31471 -288006 -558556 -279844 377212 371152 -1105670
36755 -1105670 -3363100 -4626396 -3947722 -2153383 -509498 867240 2438130 3583746
36747 3583746 2842086 54258 -2847032 -3877646 -3127008 -2152319 -1868095 -1945141 -1921698
36738 -1921698 -1794020 -1444732 -526996 664875 1022370 -46437 -1616838 -2222548 -1530212
36729 -1530212 -458923 121820 168759 68392 161621 727488 1796968 2778977 2824916 1856225
36719 1856225 792806 497738 939112 1660011 2497891 3337471 3675051 3174809 2401744
36710 2401744 2257795 2781168 3166602 2874430 1999710 658735 -1036590 -2303011 -2111225
36701 -2111225 -767591 -29697 -875215 -2071028 -2004393 -1181880 -1494878 -3295463 -4739300
36692 -4739300 -4299803 -2639326 -1419785 -1269549 -1617748 -1748102 -1258655 -77263 1209660
36683 1209660 1497083 389316 -1040044 -1415302 -675304 184563 622579 856464 811705
36674 811705 -126090 -2001331 -3771759 -4370447 -3760860 -2610359 -1458501 -603720 -320502
36665 -320502 -657880 -1265540 -1813368 -2380491 -3116413 -3762839 -3891030 -3483729 -2962311 -2687242
36655 -2687242 -2622405 -2431561 -1836476 -1016745 -608811 -979557 -1543442 -1347311 -435939 46668
36645 46668 -580891 -1613550 -2113806 -2243075 -2658617 -3208124 -3221320 -2690277 -2104395 -1427147
36635 -1427147 -423075 211121 -512810 -1968153 -2164078 -439900 1459069 1751470 788817
36626 788817 -88411 -578393 -948562 -606512 1060671 2890999 2824249 632589 -1778972
36617 -1778972 -2996877 -3495169 -3968398 -3801346 -2155872 457663 2711392 3908623 4089117
36608 4089117 3329820 1830906 224258 -1073796 -2449086 -4191128 -5396655 -4845479
36600 -4845479 -2911931 -1530206 -1941387 -3266111 -3738218 -2770999 -1319097 -587504 -898024
36591 -898024 -1667155 -2063546 -1683003 -877335 -484611 -1033981 -2136484 -2832830 -2662704
36582 -2662704 -2184387 -2141823 -2276114 -1559109 209323 1736251 1790381 888846 507993
36573 507993 949686 1236377 1133539 1748419 3489571 4848207 4347593 2651369 1417900
36564 1417900 927733 403176 5343 581187 1604699 1427163 -57049 -922606 -120449
36555 -120449 943641 860907 608072 1883768 4226376 5619478 5329085 4332024 3202064
$$ [...]
##END NTUPLES=NMR SPECTRUM
##END=
