##TITLE=31Pdec_DE-82
 CDCl3, 24 sc
 4.3.2025
##JCAMPDX= 6.0         $$ Bruker NMR JCAMP-DX V2.0
##DATA TYPE= NMR SPECTRUM
##DATA CLASS= NTUPLES
##ORIGIN= UXNMR, Bruker Analytische Messtechnik GmbH
##OWNER= root
$$ XWIN-NMR		Version 3.5
$$ Tue Mar  4 14:38:02 2025 Russian Standard Time (UT+4h)  she@DPX200
##.OBSERVE FREQUENCY= 81.013821
##.OBSERVE NUCLEUS= ^31P
##.ACQUISITION MODE= SIMULTANEOUS
##.ACQUISITION SCHEME= undefined
##.AVERAGES= 64
##.DIGITISER RES= 17
##SPECTROMETER/DATA SYSTEM= spect
##.PULSE SEQUENCE= zgpg30
##.SOLVENT NAME= CDCl3
##.SHIFT REFERENCE= (INTERNAL, CDCl3, 0, 198.062)
##AUDIT TRAIL= $$ (NUMBER, WHEN, WHO, WHERE, WHAT)
$$ ##TITLE= Audit trail, XWIN-NMR		Version 3.5
$$ ##JCAMPDX= 5.01
$$ ##ORIGIN= Bruker BioSpin GmbH
$$ ##OWNER= she
$$ F:/spectra/data/she/nmr/P31/2/pdata/1/auditp.txt
$$ ##AUDIT TRAIL=  $$ (NUMBER, WHEN, WHO, WHERE, WHAT)
(   1,<2025-03-04 14:36:34.15 +0400>,<she>,<DPX200>,
      <created by zg, POWCHK disabled, PULCHK disabled
       configuration hash MD5:
       00 E9 B6 7A A2 85 ED C7 34 08 36 98 17 FE 4E 26
       data hash MD5: 32K
       CE EE 9E 0E 2A 4F 2E 8A B6 7B A7 F6 D7 8D DC 04>)
(   2,<2025-03-04 14:36:37.03 +0400>,<she>,<DPX200>,
      <Start of raw data processing
       efp BC_mod = 2 LB = 1.5 FT_mod = 6 PKNL = 1 PHC0 = 1716.094 PHC1 = 207.6944 SI = 64K 
       data hash MD5: 64K
       85 BE 44 C8 F8 A1 FC 08 E9 5E 3B 8D CD B4 09 50>)
(   3,<2025-03-04 14:37:11.62 +0400>,<she>,<DPX200>,
      <pk PHC0 = 142.0726 PHC1 = -345.6 
       data hash MD5: 64K
       5C AE C2 9E 14 14 4F CD 5E 40 35 2C 3A 1F CF C0>)
(   4,<2025-03-04 14:37:15.28 +0400>,<she>,<DPX200>,
      <abs ABSG = 5 
       data hash MD5: 64K
       18 5D 8D E0 DD 1B E3 8E 5E 70 7C 72 DE B3 E1 84>)
(   5,<2025-03-04 14:37:28.00 +0400>,<she>,<DPX200>,
      <abs ABSG = 5 
       data hash MD5: 64K
       22 61 16 E6 C6 2C BE 9E 3D 34 F4 32 CC 5D F9 77>)
$$ ##END=
$$ 
$$ hash MD5
$$ 3A E6 60 09 6B B1 C2 CF 96 6C 65 14 41 26 5E ED
##$RELAX= 
##$RELAX= 
##$RELAX= 
##$RELAX= 
##$RELAX= 
##$RELAX= 
##$RELAX= 
##$RELAX= 
$$ Bruker specific parameters
$$ --------------------------
##$DU= <F:/spectra>
##$EXPNO= 2
##$NAME= <P31>
##$PROCNO= 1
##$TYPE= <nmr>
##$USER= <she>
##$AMP= (0..31)
100 100 100 100 100 100 100 100 100 100 100 100 100 100 100 100 100 100 
100 100 100 100 100 100 100 100 100 100 100 100 100 100 
##$AQSEQ= 0
##$AQ_mod= 1
##$AUNM= <au_zg>
##$AUTOPOS= <>
##$BF1= 81.014009
##$BF2= 200.13
##$BF3= 200.13
##$BF4= 200.13
##$BF5= 200.13
##$BF6= 200.13
##$BF7= 200.13
##$BF8= 200.13
##$BYTORDA= 1
##$CFDGTYP= 0
##$CFRGTYP= 5
##$CHEMSTR= <none>
##$CNST= (0..31)
1 1 145 1 1 1 1 1 1 1 1 1 1 1 1 1 1 1 1 1 1 1 1 1 1 1 1 1 1 1 1 1 
##$CPDPRG= <waltz16>
##$CPDPRG1= <>
##$CPDPRG2= <waltz16>
##$CPDPRG3= <>
##$CPDPRG4= <mlev>
##$CPDPRG5= <mlev>
##$CPDPRG6= <mlev>
##$CPDPRG7= <mlev>
##$CPDPRG8= <mlev>
##$CPDPRGB= <>
##$CPDPRGT= <>
##$D= (0..31)
0 1 0 0 0 0 0 0 0 0.06 0 0.03 2e-05 3e-06 0 0 0.0002 0 0 0 0 0 0 0 0 0 
0 0 0 0 0 0 
$$ [...]
##$SUBNAM3= <"">
##$SUBNAM4= <"">
##$SUBNAM5= <"">
##$SUBNAM6= <"">
##$SUBNAM7= <"">
##$SUBNAM8= <"">
##$SUBNAM9= <"">
##$SW= 400.765351723535
##$SWIBOX= (0..15)
0 1 3 0 0 0 0 0 0 0 0 0 0 0 0 0 
##$SW_h= 32467.5324675325
##$TD= 32768
##$TD0= 1
##$TE= 0
##$TE2= 300
##$TE3= 300
##$TEG= 300
##$TL= (0..7)
0 120 53 12 22 120 120 120 
##$TP= (0..7)
150 150 150 150 150 150 150 150 
##$TP07= 0
##$TPNAME0= <>
##$TPNAME1= <>
##$TPNAME2= <>
##$TPNAME3= <>
##$TPNAME4= <>
##$TPNAME5= <>
##$TPNAME6= <>
##$TPNAME7= <>
##$TPOAL= (0..7)
0.5 0.5 0.5 0.5 0.5 0.5 0.5 0.5 
##$TPOFFS= (0..7)
0 0 0 0 0 0 0 0 
##$TUNHIN= 0
##$TUNHOUT= 0
##$TUNXOUT= 0
##$USERA1= <user>
##$USERA2= <user>
##$USERA3= <user>
##$USERA4= <user>
##$USERA5= <user>
##$V9= 5
##$VALIST= <valist>
##$VCLIST= <CCCCCCCCCCCCCCC>
##$VD= 0
##$VDLIST= <DDDDDDDDDDDDDDD>
##$VPLIST= <PPPPPPPPPPPPPPP>
##$VTLIST= <TTTTTTTTTTTTTTT>
##$WBST= 1024
##$WBSW= 4
##$XGAIN= (0..3)
0 0 0 0 
##$XL= 0
##$YL= 0
##$YMAX_a= 7586
##$YMIN_a= -28232
##$ZGOPTNS= <>
##$ZL1= 120
##$ZL2= 120
##$ZL3= 120
##$ZL4= 120
##$ABSF1= 198.0616
##$ABSF2= -202.7028
##$ABSG= 5
##$ABSL= 3
##$ALPHA= 0
##$AQORDER= 0
##$ASSFAC= 0
##$ASSFACI= 0
##$ASSFACX= 0
##$ASSWID= 0
##$AUNMP= <proc_1d>
##$AZFE= 0.1
##$AZFW= 0.5
##$BCFW= 0
##$BC_mod= 2
##$BYTORDP= 0
##$COROFFS= 0
##$CY= -3
##$DATMOD= 1
##$DC= 0
##$DFILT= <>
##$DTYPP= 0
##$F1P= 0
##$F2P= 0
##$FCOR= 1
##$FTSIZE= 65536
##$FT_mod= 6
##$GAMMA= 0
##$GB= 0
##$INTBC= 1
##$INTSCL= 9.790993e-09
##$ISEN= 30
##$LB= 1.5
##$LEV0= 0
##$LPBIN= 0
##$MAXI= 10000
##$MC2= 0
##$MEAN= 0
##$ME_mod= 0
##$MI= 50
##$NCOEF= 0
##$NC_proc= -8
##$NLEV= 6
##$NOISF1= 182.463
##$NOISF2= 159.3651
##$NSP= 0
##$NTH_PI= 0
##$NZP= 0
##$OFFSET= 198.0616
##$PC= 4
##$PHC0= 1858.167
##$PHC1= -137.9056
##$PH_mod= 1
##$PKNL= yes
##$PPARMOD= 0
##$PSCAL= 0
##$PSIGN= 0
##$REVERSE= no
##$SF= 81.0140089999434
##$SI= 65536
##$SIGF1= 159.3651
##$SIGF2= -187.1042
##$SINO= 113.3802
##$SIOLD= 16384
##$SREGLST= <1H.CDCl3>
##$SSB= 0
##$STSI= 65536
##$STSR= 0
##$SW_p= 32467.5324675325
##$SYMM= 0
##$S_DEV= 0
##$TDeff= 32768
##$TDoff= 0
##$TI= <>
##$TILT= no
##$TM1= 0
##$TM2= 0
##$TOPLEV= 0
##$USERP1= <user>
##$USERP2= <user>
##$USERP3= <user>
##$USERP4= <user>
##$USERP5= <user>
##$WDW= 1
##$XDIM= 65536
##$YMAX_p= 211491979
##$YMIN_p= -351663099
$$ End of Bruker specific parameters
$$ ---------------------------------
##NTUPLES= NMR SPECTRUM
##VAR_NAME=  FREQUENCY,     SPECTRUM/REAL,   SPECTRUM/IMAG
##SYMBOL=    X,             R,               I
##VAR_TYPE=  INDEPENDENT,   DEPENDENT,       DEPENDENT
##VAR_FORM=  AFFN,          ASDF,            ASDF
##VAR_DIM=   65536,         65536,           65536
##UNITS=     HZ,            ARBITRARY UNITS, ARBITRARY UNITS
##FACTOR=    0.49542278885378, 1,            1
##FIRST=     16045.7642231865, 0,            0
##LAST=      -16421.768244346, 0,            0
##MIN=       -16421.768244346, -351663099,   0
##MAX=       16045.7642231865, 211491979,    0
$$ Real data points
##PAGE= N=1
##DATA TABLE= (X++(R..R)), XYDATA
$$ [...]
43864d287047k192158J719100L167925J645436j37100j25107J380319K555947
$$ -4287047 -6479205 -4760105 -1592180 53256 -83844 -208951 1171368 3727315
43856C727315J473056j874009m524544l643739q57434m81987k882261l470575
$$ 3727315 5200371 3326362 -1198182 -4841921 -5699355 -6181342 -9063603 -12534178
43848a2534178J31238M075590M097466J550875J81141J33300p24495k016355j777903
$$ -12534178 -12402940 -8327350 -4229884 -2679009 -2497868 -2364568 -3089063 -5105418 -6883321
43839f883321m42576K23128O93816K144280K871634P27551k125854j766599R80005
$$ -6883321 -7325897 -7102769 -6408953 -4264673 -1393039 -665488 -2791342 -4557941 -3577936
43830c577936J764017O9378l23350J369738J276477j874588l794166j729053Q59918
$$ -3577936 -1813919 -1744541 -2067891 -698153 578324 -1296264 -5090430 -6819483 -5959565
43821e959565L83949q32983R26430M010065M200376J680127J34354N18985N52709
$$ -5959565 -5575616 -6408599 -5482169 -1472104 2728272 4408399 4542753 5061738 5614447
43812E614447m87978j023217q83728j578904k794123k462710o18962M16399P5170
$$ 5614447 5126469 4103252 3219524 1640620 -1153503 -3616213 -4235175 -3818776 -3743606
43803c743606J78275R81420L84490j769772k389608k1305K334802J758829j11307
$$ -3743606 -3565331 -2583911 -2199421 -3969193 -6358801 -6380106 -4045304 -2286475 -2397782
43794b397782q3122J394566J475179m3900n81785O53322J387791J95484j210845
$$ -2397782 -2480904 -1086338 388841 344941 -236844 416478 1804269 1999753 788908
43785G88908r44236m4906p77180l002847m134480k492973O64010K700596K343884
$$ 788908 -155328 -200234 -977414 -3980261 -8114741 -10607714 -9943704 -7243108 -4899224
43776d899224N56802p77438o54473L39900Q50420L32621k38596L86338J724729
$$ -4899224 -4342422 -5119860 -5774333 -5434433 -4584013 -4251392 -4489988 -4103650 -2378921
43767b378921J573921j204174m426533m473115o85392L430099M208242J946509
$$ -2378921 -805000 -2009174 -6435707 -10908822 -11594214 -8164115 -3955873 -2009364
43759b009364j50939j80678J074758K468995L824314M356658K123289l081836
$$ -2009364 -2160303 -2340981 -1266223 1202772 5027086 9383744 11507033 8425197
43751H425197p632171p280180k377937K148452K535387R2134j591380j542257
$$ 8425197 793026 -6487154 -8865091 -6716639 -4181252 -4089118 -5680498 -7222755
43743g222755j457603j851976j059409J310053K620347Q89521j595692j081327
$$ -7222755 -8680358 -10532334 -11591743 -10281690 -7661343 -6771822 -8367514 -9448841
43735i448841K054878L628442J765292n79912n25453M07814o44968k837945k952922
$$ -9448841 -7393963 -3765521 -2000229 -2580141 -3105594 -2697780 -3342748 -6180693 -9133615
43726i133615o26138J271086J308130J192258K153186K677646J250656r79773
$$ -9133615 -9759753 -8488667 -7180537 -5988279 -3835093 -1157447 93209 -886564
43718h86564j937691j343387j84316J127880K553744L492937L476095K930471
$$ -886564 -2824255 -4167642 -4351958 -3224078 -670334 2822603 6298698 9229169
43710I229169K143475N06811k008445l759831l343052j770724j180703j899526
$$ 9229169 11372644 11879455 9871010 6111179 2768127 997403 -183300 -2082826
43702b082826k241211r18749J557054L632245L938510K219886r8098q42389N82419
$$ -2082826 -4324037 -5242786 -3685732 -53487 3885023 6104909 6006811 5164422 5746841
43693E746841K508692L296395L078941K293498K13417l243131n736972m953193
$$ 5746841 8255533 11551928 14630869 16924367 17137784 13894653 8157681 3204488
43685C204488j965900J72106M60410J39075l58847j643862k843903k104071N512
$$ 3204488 1238588 1410694 1871104 2010179 1651332 7470 -2836433 -4940504 -4934992
43676d934992O87304p41852j709527n84970R97460J358996J297324J573904Q19418
$$ -4934992 -4247688 -4989540 -6699067 -7284037 -6286577 -4927581 -3630257 -2056353 -1236935
43667a236935j629548l328163j987029Q43027K258555K441170L397900M625186
$$ -1236935 -2866483 -6194646 -8181675 -7338648 -5080093 -2638923 758977 5384163
43659E384163L680976N97854j803179k188114k116665k630722k450040o85330
$$ 5384163 9065139 9662993 7859814 5671700 3555035 924313 -1525727 -2211057
43651b211057J166391J412884N46481R2229M98355J336783K340036L091224K727164
$$ -2211057 -1044666 368218 914699 1006928 1505283 2842066 5182102 8273326 11000490
43642A1000490J048782q50486j908160k261410k392498k081757j157709m09995
$$ 11000490 12049272 11198786 9290626 7029216 4636718 2554961 1397252 987257
43634I87257n27708o41285P27066L232979M437419K607138q27308k543941j199011
$$ 987257 459549 -181736 545330 3778309 8215728 10822866 9995558 7451617 6252606
43625F252606Q12707L05923k441707l841651j757810J470627K025602m88320k866561
$$ 6252606 7065313 7371236 4929529 1087878 -669932 800695 2826297 2337977 -528584
43616e28584k556340l12531J490756J692200R93190P02243J259450J702935Q53736
$$ -528584 -3084924 -3397455 -1906699 -214499 778691 1480934 2740384 4443319 5297055
43607E297055p13215r26290P26987J855930N18703j535667j444582O5014j95916
$$ 5297055 4583840 3657550 4384537 6240467 6759170 5223503 3778921 3843935 3648019
43598C648019k398416l056208n57131K252022K498449J073024q420j053539k838527
$$ 3648019 1249603 -1806605 -2363736 -111714 2386735 3459759 3451339 2397800 -440727
43589d40727l702343j688211J810156L543003K736800J301818L98163n13130j461293
$$ -440727 -4143070 -5831281 -4021125 -478122 2258678 3560496 3958659 3445529 1984236
43580A984236j440752m18641K37054j47326o35991l24790M04221O93874K88488
$$ 1984236 543484 124843 361897 214571 -421420 -746210 -341989 351885 640373
43571F40373n17182j311155j811039k070617k238669j949721p29857P03111Q15014
$$ 640373 123191 -1187964 -2999003 -5069620 -7308289 -9258010 -9987867 -9284756 -8469742
43562h469742l90675q86826M49969K021906K039440J209145J044537J091790J76690
$$ -8469742 -8860417 -9747243 -9297274 -7275368 -5235928 -4026783 -2982246 -1890456 -1713766
43553a713766q80819m75579P30036P47386k39785j20898J517996K685549K077274
$$ -1713766 -2594585 -3070164 -2340128 -1592742 -1832527 -1953425 -435429 2250120 4327394
43544D327394N24228q18853j563027j320098p264J125047R18762M87355J573982
$$ 4327394 4851622 4032769 2469742 1149644 1142380 2267427 3186189 3673544 5247526
43535E247526L162307K644574J74785j460112j525032k308762m631626n982741
$$ 5247526 8409833 11054407 11229192 9769080 8244048 5935286 1303660 -4679081
43527d679081m577653k106602p72295l49887K07783Q28689J467724K655943L644329
$$ -4679081 -9256734 -11363336 -12135631 -12485518 -12277735 -11449046 -9981322 -7325379 -3681050
43518c681050K775982Q59263Q49024K721130K534078j213231m349653l222182
$$ -3681050 -905068 -45805 803219 3524349 6058427 4845196 495543 -2726639
43510b726639k63144M66081j70597J102970L585583L764292J228121j320819k749075
$$ -2726639 -2989783 -2523702 -2694299 -1591329 1994254 5758546 6986667 5665848 2916773
43501B916773l684504l225688k48898K775680K205865q14252j678731M06002J482946
$$ 2916773 -767731 -3993419 -4242317 -1466637 739228 -75024 -1753755 -1347753 135193
43492A35193l74852k477553k778679k667842k843655j310862K135302L919348
$$ 135193 -239659 -2717212 -5495891 -8163733 -11007388 -12318250 -10182948 -6263600
43484f263600K089727j98499K45356J636504P96430j317752j609753j17337O80990
$$ -6263600 -4173873 -4372372 -4127016 -2490512 -1694082 -3011834 -4621587 -4738924 -4057934
43475d057934K92427J68633K99985m94772j412570k58180K739270M621886L586553
$$ -4057934 -3765507 -3596874 -3296889 -3791661 -5204231 -5462411 -2723141 1898745 5485298
43466E485298Q96073j306998k078696j490079l45268j82161j631505k702088q26019
$$ 5485298 6381371 5074373 2995677 1505598 1160330 978169 -653336 -3355424 -4181443
43457d181443K997136M372604R93616l800484m674750p14430L524254L495005
$$ -4181443 -1184307 3188297 4181913 381429 -4293321 -5007751 -1483497 2011508
43449B011508j46223k744813j438646J731451L017126J800955N52044P18355J083928
$$ 2011508 1865285 -879528 -2318174 -586723 2430403 4231358 4783402 5501757 6585685
43440F585685N09903j68681j44393l64144j550841k318001j376803j96111r82945
$$ 6585685 7095588 6926907 6782514 6418370 4867529 2549528 1172725 976614 -6331
43431f331k907616l012986o11010J822727K367481J853578J697019J724238J249842
$$ -6331 -2913947 -5926933 -6537943 -4715216 -2347735 -494157 1202862 2927100 4176942
43422D176942N95879K18147m36967j846928l028554k585583p43114Q01129R40413
$$ 4176942 4772821 4990968 4554001 2707073 -321481 -2907064 -3650178 -2849049 -1908636
43413a908636J68367n05616q45326j222000j577043j106776P62950L193436M181290
$$ -1908636 -1740269 -2245885 -3091211 -4313211 -5890254 -6997030 -6234080 -3040644 1140646
43404A140646K482143p40242k718407j842662O85060K300189J877306M78579n56233
$$ 1140646 3622789 2882547 164140 -1678522 -993462 1306727 3184033 3662612 3106379
43395C106379j200677j826757j759367k40679J568038J502932l02971j087344
$$ 3106379 1905702 78945 -1680422 -1921101 -353063 1149869 846898 -240446
43387b40446N15388K187562J486441k21486n9844J500983J485046l81119j060817
$$ -240446 274942 2462504 3948945 3727459 3667615 5168598 6653644 6272525 5211708
43378E211708O16016J781745O5053k677119l139843q69731K018696L502319K493604
$$ 5211708 5827724 7609469 7674522 4997403 1857560 987829 3006525 6508844 9002448
43369I002448q69311m133484l952372m76145J917388L58071k428341k274649N58482
$$ 9002448 8133137 3999653 47281 -428864 1488524 1846595 -581746 -2856395 -2297913
43360b297913K742760L027791K486858J243709j193314l337683l257466k056204
$$ -2297913 444847 3472638 5959496 7203205 6009891 2672208 -585258 -2641462
43352b641462k203345l061747j954804Q10332K237183J870828K221500L537094
$$ -2641462 -4844807 -7906554 -9861358 -9051026 -6813843 -4943015 -2721515 815579
43344H15579K933317m4893j739358k84578J179682j78106k327786k286942j090452
$$ 815579 3748896 3704003 1964645 1680067 2859749 2681643 353857 -1933085 -3023537
43335c023537j193619j743908m94373J526490J371890q61262k191586j398435
$$ -3023537 -4217156 -5961064 -6455437 -4928947 -3557057 -4418319 -6609905 -8008340
43327h008340j70449K68535O80829J695423K632313K875286K590498J921624J022998
$$ -8008340 -8178789 -7910254 -7229425 -5534002 -2901689 -26403 2564095 4485719 5508717
43318E508717P18029J506283K173135J079597j345043l015968k922778j923709
$$ 5508717 6226746 7733029 9906164 10985761 9640718 6624750 3701972 1778263
43310A778263j054815n71095m47188m10376J84987J181465J028585r77156k746944
$$ 1778263 723448 152353 -294835 -705211 -520224 661241 1689826 712670 -2034274
43301b034274j891073N13610J242262l07424j561354j117195m62300n04922L83335
$$ -2034274 -3925347 -3411737 -2169475 -2476899 -4038253 -5155448 -5617748 -6122670 -5739335
43292e739335L100359N306272M539766J877142J8508p30175j852536l061219k422328
$$ -5739335 -2638976 2667296 7207062 9084204 9102712 8372537 6520001 3458782 1036454
43283A036454L3509J670624R50232m91246n91658Q9846m26921k396273l979150
$$ 1036454 1069963 2740587 3690819 3199573 2607915 2697761 2270840 -125433 -4104583
43274d104583l649243j759004K36072J264465J324426J247200J739626K367929
$$ -4104583 -7753826 -9512830 -9276758 -8012293 -6687867 -5440667 -3701041 -1333112
43266a333112J936677L68814n54087N48043K189887J467761j958919n104534n471772
$$ -1333112 603565 972379 418292 966335 3156222 4623983 2665064 -2439470 -7911242
43257g911242l840473k131576l29601K427290M941898M869188K419285N78636
$$ -7911242 -11751715 -13883291 -14212892 -11785602 -6843704 -1974516 444769 1023405
43249A023405R23308J319902r49563n188906p778400n992729n03549N284582P822273
$$ 1023405 1946713 3266615 2317052 -2871854 -10650254 -16642983 -17146532 -11861950 -4039677
43240d039677O113666K461933P449n78696j006874k100684k427960q49447J406424
$$ -4039677 2073989 4535922 4543371 3964675 2957801 857117 -1570843 -2420290 -1013866
43231a013866K452686K017141O97434j423877l648678l730157n83046K982136
$$ -1013866 1438820 3455961 4153395 2729518 -919160 -4649317 -5232363 -2250227
43223b250227L051173k2920j838414k1812K637585K423358k28488j946818j354888
$$ -2250227 800946 778026 -1060388 -1082200 1555385 3978743 3750255 1803437 448549
43214D48549m07234j034134k501663k779959j303331N54730J234716M59569q36023
$$ 448549 41315 -992819 -3494482 -6274441 -7577772 -7023042 -5788326 -5328757 -6164780
43205f164780j363088k52867K336995N016816N995858M609531J884847o17187
$$ -6164780 -7527868 -7780735 -5443740 -426924 5568934 10178465 12063312 11446125
43197A1446125k125994k568731j937958o29350J34981n46628j770020j659397
$$ 11446125 9320131 6751400 4813442 4184092 4319073 3772445 2002425 343028
43189C43028J37060J789204J417257q45372l061663l226527j063602J267826R82629
$$ 343028 480088 2269292 3686549 2841177 -220486 -3447013 -4510615 -3242789 -2260160
43180b260160j762995l200352o18662L435175M253216J431631j148607j465066
$$ -2260160 -4023155 -7223507 -7842169 -4406994 -153778 1277853 129246 -1335820
43172a335820j251381j162195J023217N164403O472725K171918l301855m191478
$$ -1335820 -2587201 -3749396 -2726179 2438224 8910949 11082867 7781012 3589534
43164C589534j630606j000445l086454l441400r5005L358848L250942M01824j908317
$$ 3589534 1958928 958483 -2127971 -5569371 -5664376 -2305528 945414 1347238 -561079
43155e61079j593088J213846M248879M245761N58872k918491k471141j14103l95544
$$ -561079 -2154167 -940321 3308558 7554319 8113191 5194700 2723559 2609456 2213912
43146B213912k684438k080770J872698L624257N55447k560529j292109J583279
$$ 2213912 -470526 -2551296 -678598 2945659 3501106 940577 -351532 1231747
43138A231747J254396j429341k456891j609820j525452j906087j58430L055743
$$ 1231747 2486143 1056802 -1400089 -3009909 -4535361 -6441448 -6599878 -3544135
43130c544135M015659J755887p05910j379931j533952k136076j873304j64683
$$ -3544135 471524 2227411 1521501 141570 -1392382 -3528458 -5401762 -5566445
43122e566445J045895L78112n60037J68840J569825J176054j320536l710585l972496
$$ -5566445 -4520550 -4142438 -4702475 -4533635 -2963810 -1787756 -3108292 -6818877 -10791373
43113a0791373j954198J173562L799549M399260K538204k35267j380117P8188
$$ -10791373 -12745571 -11572009 -7772460 -3373200 -834996 -1070263 -2450380 -2372192
43105b372192K343356K808042J035619r07871j090513K20427J449978J619081
$$ -2372192 -28836 2779206 3814825 2906954 1816441 2036868 3486846 5105927
43097E105927O15371j318342l101182k831150r4703K406299J735071j013092j822827
$$ 5105927 5721298 4402956 1301774 -1529376 -1624079 782220 2517291 1504199 -318628
43088c18628N56531K712261J427507j940331l596620k121166N33456J698307L64510
$$ -318628 237903 2950164 4377671 2437340 -1159280 -3280446 -2746990 -1048683 -684173
43079f84173k024309k309572J339290O214192O895358J786580m144979n186276
$$ -684173 -2708482 -5018054 -3678764 2535428 9430786 11217366 7072387 1886111
43071A886111j715633J255833J043698k92127k33068N33443j52648k331982l624045
$$ 1886111 170478 1426311 2470009 2177882 1944814 2478257 2325609 -6373 -3630418
43062c630418k249263N45932J736043L31794r97771O70144M206274N596868L294265
$$ -3630418 -5879681 -5333749 -3597706 -3265912 -4263683 -3593539 612735 6209603 9503868
43053I503868q5812j819596k016695j500257K02558K830023M002932K327579j17524
$$ 9503868 9418056 7598460 5581765 4081508 4284066 7114089 11117021 13444600 13327076
43044A3327076p46999j31354m47255k060872l907921n408229n710951l197101
$$ 13327076 12580077 12448723 12001468 9940596 6032675 624446 -5086505 -8283606
43036h283606J554006M506381L051077J31613K4174J964028K001000l75343j964354
$$ -8283606 -6729600 -2223219 827858 959471 983645 2947673 4948673 4573330 2608976
43027B608976j356793k82830J59920M26888m6701k098530l650465j691162K339531
$$ 2608976 1252183 969353 1129273 1556161 1509460 -589070 -4239535 -5930697 -3591166
43018c591166L640577J103538j216110o21044P38308L70334p77455r36831k93753
$$ -3591166 49411 1152949 -63161 -684205 54103 424437 -353018 -1289849 -1583602
43009a583602O19385J960688K580030N78689k678540l028881K25771K619486J310514
$$ -1583602 -964217 996471 3576501 4155190 1476650 -1552231 -1326460 1293026 2603540
43000B603540o59462J99046K211205K086266O53204Q08745K193496K120117K02758
$$ 2603540 1944078 2143124 4354329 6440595 7093799 7902544 10096040 12216157 12418915
42991A2418915j635877k490417k590245j479142P59766J797731k00337l216535
$$ 12418915 10783038 8292621 5702376 4223234 4983000 6780731 6580394 3363859
42983C363859l837592k086362p93409j060601j421741q97659L4786J115059K335641
$$ 3363859 -473733 -2560095 -3353504 -4414105 -5835846 -6733505 -6698719 -5583660 -3248019
42974c248019K769493J774153P47803J303069K493791K388110J449092J425749
$$ -3248019 -478526 1295627 2043430 3346499 5840290 8228400 9677492 11103241
42966A1103241J717045K69027k175437k365371L68907K622630J669796r85166
$$ 11103241 12820286 13089313 10913876 8548505 8917412 11540042 13209838 12224672
42958A2224672k210965j283556J72285P03252K890j662902l668232m929662m406441
$$ 12224672 10013707 8730151 8902436 9605688 9608578 7945676 4277444 -652218 -5058659
42949e058659j973311J103374K782125K137555O97291O79727J739343J375298
$$ -5058659 -7031970 -5928596 -3146471 -1008916 -311625 368102 2107445 3482743
42941C482743q21149j978433n90986N68762j012553k783074q52356L230642M236891
$$ 3482743 2661594 683161 92175 660937 -351616 -3134690 -3987046 -756404 3480487
42932C480487J334509o22178J229113L520030K254120j221391k904178k140272
$$ 3480487 4814996 4192818 5421931 8941961 11196081 9974690 7070512 4930240
42924D930240j497597j974857j701257N05569K822034K659541l1595k751946l383848
$$ 4930240 3432643 1457786 -243471 262098 3084132 5743673 5712078 2960132 -423716
42915d23716k235130q88828J27483J329747K238915J311893j238714k446042k38681
$$ -423716 -2658846 -3547674 -3420191 -2090444 148471 1460364 221650 -2224392 -2463073
42906b463073L132331L541532M18445k392990j419160K369850M792068L036390
$$ -2463073 669258 4210790 4629235 2236245 817085 3186935 7979003 11015393
42898A1015393j226760l404666j317894J504734n8936n300900p741044l976010
$$ 11015393 9788633 6383967 5066073 6570807 6511871 1210971 -6530073 -10506083
42890a0506083J432543K847862J517027K083656M181016L533770J10950j308570
$$ -10506083 -9073540 -6225678 -4708651 -2624995 1556021 5089791 5200741 3892171
42882C892171Q88893K662170J350403k29883Q34026K649689K021842o03247k623604
$$ 3892171 4781064 7443234 8793637 8563754 9397780 12047469 14069311 13466064 10842460
42873A0842460l080383k524990j393732n20891j027418k112326j498799N20468
$$ 10842460 7762077 5237087 3843355 3322464 2295046 182720 -1316079 -795611
42865g95611O50688j954242l334783n43690L374173L596792K45757k625440k858168
$$ -795611 -144923 -2099165 -5433948 -5977638 -2603465 993327 1239084 -1386356 -4244524
42856d244524j473367M72194K776022M463676M255853K478332M94269j100304
$$ -4244524 -5717891 -5245697 -2469675 1994001 6249854 8728186 9222455 8122151
42848H122151k040087j510787K13333P34448j383480l788385l297887o14413Q10489
$$ 8122151 6082064 4571277 4784610 5519058 4135578 347193 -2950694 -3565107 -2754618
42839b754618r6864j072381n14412M50366L67506l83759o06162M6024J016628
$$ -2754618 -2851482 -3923863 -4438275 -3987909 -3620403 -4004162 -4610324 -4564300 -3547672
42830c547672J567850J340884O94284K29751j93108j043329j600078n37765J494683
$$ -3547672 -1979822 -638938 55346 285097 91989 -951340 -2551418 -3089183 -1594500
42821a594500K084552P83474P1312J181109J882057N79633m34716J077617K823333
$$ -1594500 490052 1273526 1344838 2525947 4408004 4987637 4552921 5630538 8453871
42812H453871J281862k486751m423379l474152j922533p92660Q05170K335266
$$ 8453871 9735733 7248982 2825603 -648549 -2571082 -3363742 -2558572 -223306
42804b23306K154915J085878J620898L490498L943011K502350J334345O85558
$$ -223306 1931609 3017487 4638385 8128883 12071894 14574244 15908589 16594147
42796A6594147j537929m924431n947280l590577j166544p98332n13145R78459
$$ 16594147 15056218 10131787 4184507 593930 -572614 -1370946 -1884091 -905632
42788i05632J160212j476364l561829j755604J639448K247249M13577q2376J442760
$$ -905632 254580 -1221784 -4783613 -6539217 -4899769 -2652520 -2238943 -2321319 -878559
42779h78559J981575K66158j526261j832139j693496j815382r37083J398629L083206
$$ -878559 1103016 1369174 -157087 -1989226 -3682722 -5498104 -6435187 -5036558 -1953352
42770a953352K330267N32024K47962J401211J507260n14501k570381k129919L45023
$$ -1953352 376915 908939 1156901 2558112 4065372 3550871 980490 -1149429 -804406
42761h04406J896148Q27404j213206j534081L4598J080424L4271j615313j292685
$$ -804406 1091742 1919146 705940 -828141 -793543 286881 321152 -1294161 -2586846
42752b586846J105036K748613J394996j366756j717759J206901L481957J589422
$$ -2586846 -1481810 1266803 2661799 1295043 -422716 784185 4266142 5855564
42744E855564j908084j312601L572269O098393K073192l781430m460539n10357
$$ 5855564 3947480 2634879 6207148 12305541 14378733 10597303 6136764 5626407
42736E626407J807091K07216j539788p61547P15806J145663J426556J501430o67182
$$ 5626407 7433498 7640714 6100926 5339379 6055185 7200848 8627404 10128834 9461652
42727I461652m226417m453998J70229M241982K633072k155194m077553k116840
$$ 9461652 5235235 781237 951466 5193448 7826520 5671326 1593773 -523067
42719e23067j81523m14341j293737j461131j173983k21728J949393M044698L992105
$$ -523067 -704590 -1118931 -2412668 -3873799 -5047782 -5269510 -3320117 724581 4716686
42710D716686K206243R85661P89629m2262j822985k634163j439369K73708O60016
$$ 4716686 6922929 7908590 8698219 8655957 6832972 4198809 2759440 3033148 3693164
42701C693164l77074j653842j954564q12622Q03886J055401l43674j248959j51087
$$ 3693164 3316090 1662248 -292316 -1104938 -301052 754349 410675 -838284 -989371
42692i89371J238359O02245j100009j085081Q34740K233113J954198J091062M11983
$$ -989371 248988 851233 -248776 -1333857 -499117 1733996 3688194 4779256 5191239
42683E191239k68292m00286O01501J188130n39253k969391k550564M94678K001108
$$ 5191239 4922947 4522661 5124162 6312292 5773039 2803648 253084 747762 2748870
42674B748870K77711j473632p64803L35573n08544j598485o00547Q55603L0465
$$ 2748870 3026581 1552949 788146 1123719 615175 -983310 -1583857 -728254 -697789
42665f97789j667976p71118J997146K220196j205726l851563k032162K078984
$$ -697789 -2365765 -3136883 -1139737 1080459 -125267 -3976830 -6008992 -3930008
42657c930008L891422K604458J194693J407624J786683Q57224m23723p21808q45486
$$ -3930008 -38586 2565872 3760565 5168189 6954872 7812096 7388373 6666565 5821079
42648E821079k083468l192266j825298J157879J939335o42706k769714j079675
$$ 5821079 3737611 545345 -1279953 -122074 1817261 1174555 -1595159 -2674834
42640b674834K252245L015012J492373J412936L330072L658266P96477k130212
$$ -2674834 -422589 2592423 4084796 5497732 8827804 12486070 13282547 11152335
42632A1152335k231683r14676q29937j738433j938888j521334j528675j476172
$$ 11152335 8920652 8005976 7176039 5437606 3498718 1977384 448709 -1027463
42624a027463k67295J409150J795802N87768r09142j575300j217693k31987N51332
$$ -1027463 -1294758 114392 1910194 2497962 1588820 13520 -1204173 -1436160 -884828
42615h84828N68546N92610J677298K686525J207414k194628l578401j287779J054522
$$ -884828 -316282 276328 1953626 4640151 5847565 3652937 74536 -1213243 -158721
42606a58721k616k126259q83510K952753M338816J511239j878275k537695j379432
$$ -158721 -161337 -2287596 -3171106 -218353 4120463 5631702 3753427 1215732 -163700
42597a63700m36743N42703K438730M056075L247109j96726l967018n107195k449697
$$ -163700 -600443 -57740 2380990 6437065 9684174 9487448 5520430 413235 -2036462
42588b036462J844587L601660J008856k803652l462982j063516M06302q63326
$$ -2036462 -191875 3409785 4418641 1614989 -1847993 -2911509 -2505207 -3368533
42580c368533k207568j002020J645425L273782L549598L383571K573345N72023
$$ -3368533 -5576101 -6578121 -4932696 -1658914 1890684 5274255 7847600 8419623
42572H419623j604619k254709j167728M36794J501109J634776Q58323j68559m53488
$$ 8419623 6815004 4560295 3392567 3829361 5330470 6965246 7823569 7655010 7201522
42563G201522M551R5104o11242j175959j029271q40318p90504J77272K042419
$$ 7201522 7206073 7301177 6689935 5513976 4484705 3644387 2853883 3031155 5073574
42554E073574K548189L23933k389104k474119l16686J031868L69172o10629o00029
$$ 5073574 7621763 7945696 5556592 3082473 2765787 3797655 4166827 3556198 2956169
42545B956169l71826p32821j048802o70950j13572N8581J16976J54708m97231
$$ 2956169 2584343 1851522 802720 131770 18198 76779 193755 348463 -148768
42536a48768j908779k708061j694940L73599J595556J172678Q0595l49084P6924
$$ -148768 -2057547 -4765608 -6460548 -6086949 -4491393 -3318715 -3238120 -3587204 -3510280
42527c510280M44847N6221n11640o5776J387029K274932J578855M77750O32609
$$ -3510280 -3065433 -3009212 -3520852 -3586628 -2199599 75333 1654188 2131938 2764547
42518B764547J466316R78202q17968j455918K15951J868509Q69172j787094k715659
$$ 2764547 4230863 5209065 4391097 2935179 3151130 5019639 5888811 4101717 1386058
42509A386058p11331J827385K064294k10663k935204l937505k391653P78578L408595
$$ 1386058 674727 2502112 4566406 4355743 1420539 -2516966 -4908619 -4130041 -721446
42500g21446L790883K312384P96885J20095n00085j571220k132229j468342p24619
$$ -721446 3069437 5381821 6178706 6298801 5798716 4227496 2095267 626925 -97694
42491i7694j210329j921961p71670J895870L194967J658389o99595j387397p60302
$$ -97694 -1308023 -3229984 -4001654 -2105784 1089183 2747572 2047977 660580 -99722
42482i9722p45800j614978k031978j504117o71108L76079J805368K288287K23592
$$ -99722 -845522 -2460500 -4492478 -5996595 -6667703 -6291624 -4486256 -2197969 -1974377
42473a974377k801761k678900J589638N449204M295290m01380l197253j777214
$$ -1974377 -4776138 -7455038 -5865400 -416196 3879094 3477714 280461 -1496753
42465a496753J038033K028054J248031M24916L48599J000224K211970K927424
$$ -1496753 -458720 1569334 2817365 3242281 3590880 4591104 6803074 9730498
42457I730498J547817j604547l692362k754038l96690M95723m66765j544885j925867
$$ 9730498 11278315 9673768 5981406 3227368 2830678 3326401 2859636 1314751 -611116
42448f11116k131527j980485o97366R07662Q95662o07742j111372L07726J133204
$$ -611116 -2742643 -4723128 -5420494 -4512832 -3617170 -4224912 -5336284 -5028558 -3895354
42439c895354q04066l628273l814723j046091J790264K798096K743582K658552
$$ -3895354 -4699420 -8327693 -12142416 -13188507 -11398243 -8600147 -5856565 -3198013
42431c198013K285821J408221N77918j80076j442025k459451j373718J441598
$$ -3198013 -912192 496029 1073947 893871 -548154 -3007605 -4381323 -2939725
42423b939725K535427j55648l840686m301608j435780J333230K183657K234550
$$ -2939725 -404298 -559946 -4400632 -8702240 -10138020 -8804790 -6621133 -4386583
42415d386583K105420Q00539j158698r91463K050541M463595L090533j62618j134120
$$ -4386583 -2281163 -1480624 -2639322 -3630785 -1580244 2883351 5973884 5811266 4677146
42406D677146N04495J319517k12446j620996p44829R51884J034048j72004o99260
$$ 4677146 5181641 6501158 6288712 4667716 3922887 4874771 5908819 5736815 5037555
42397E037555m71785j284654l531510n106492m116778j219132J489974K831845
$$ 5037555 4565770 3281116 -250394 -5356886 -9473664 -10692796 -9202822 -6370977
42389f370977K956802K327959J469203J219476J923526K465408J415598p01755
$$ -6370977 -3414175 -1086216 382987 1602463 3525989 5991397 7406995 6705240
42381F705240j703837p97129K38107o8611m05888J111403L402715L473318P21011
$$ 6705240 5001403 4204274 4442381 4373770 3967882 5079285 8482000 11955318 12676329
42372A2676329k125473k644075j288425K9618n1315k094091n348990o881696l833436
$$ 12676329 10550856 7906781 6618356 6647974 6596659 4502568 -846422 -7728118 -11561554
42363a1561554K248992N988701M757895J962598J530186K109576K92380k808757
$$ -11561554 -9312562 -3323861 1434034 3396632 4926818 7036394 7328774 4520017
42355D520017k988541n6094J535960k32946j873625j10112L181802M231981K685795
$$ 4520017 1531476 1475382 3011342 2778396 904771 794659 3976461 8208442 10894237
42346A0894237R23223O7271o38555j666681k693786l489823l655513k421088k28759
$$ 10894237 11817460 11884731 11246176 9579495 6885709 3395886 -259627 -2680715 -2909474
42337b909474P05977p27771k211014p91899K624669L974964J276376k900946m689874
$$ -2909474 -2203497 -2931268 -5142282 -5934181 -3309512 665452 1941828 -959118 -5648992
42328e648992l073726j61051J489698J101720p9700k49337R96483K170882J719561
$$ -5648992 -8722718 -8883769 -7394071 -6292351 -6372051 -6621388 -5624905 -3454023 -1734462
42319a734462k9247j453129j798220j642318j258929O5855K380765L845644K550501
$$ -1734462 -1763709 -3216838 -5015058 -6657376 -7916305 -7850450 -5469685 -1624041 926460
42310I26460o44795k512563j300234R79678J347194J10910K36476K427818L524487
$$ 926460 281665 -2230898 -3531132 -2551454 -1204260 -1093350 -856874 1570944 5095431
42301E095431J235422k007172k542304j007822q77854k413503k274123M62411
$$ 5095431 6330853 4323681 1781377 773555 -104299 -2517802 -4791925 -4329514
42293d329514K190707L99264k293876k263109j06303J185041J043492J145107
$$ -4329514 -2138807 -1739543 -4033419 -6296528 -6402831 -5217790 -4174298 -3029191
42285c029191J930456K398611K444106K636984K372704P60005j270587k106910
$$ -3029191 -1098735 1299876 3743982 6380966 8753670 9513675 8243088 6136178
42277F136178k043162k380257k655704j338316J163630K724759K490548J352601
$$ 6136178 4093016 1712759 -942945 -2281261 -1117631 1607128 4097676 5450277
42269E450277j13940j717848k137605j92663K431901K582513M1833k112174j929424
$$ 5450277 5336337 3618489 1480884 1288221 3720122 6302635 6344468 4232294 2302870
42260B302870p76686n49042j155236j557404j271339k46771R71245Q97698j069431
$$ 2302870 1526184 977142 -178094 -1735498 -3006837 -3253608 -2282363 -1384665 -2454096
42251b454096k793771j916698J69959J35049j604561j063339K570911M669975
$$ -2454096 -5247867 -7164565 -6994606 -6859557 -8464118 -9527457 -6956546 -2286571
42243b286571J807351k907038l998720o41586L252256M176134J891573j458333
$$ -2286571 -479220 -3386258 -7384978 -8026564 -4774308 -598174 1293399 -164934
42235a64934l126268j743440J146636K658683K171258J498590J314301L85283
$$ -164934 -3291202 -5034642 -3888006 -1229323 941935 2440525 3754826 4140109
42227D140109j006432n99043J463250J750598q08513k486157p94202J174142J27534
$$ 4140109 3133677 2534634 3997884 5748482 4939969 2453812 1659610 2833752 2961286
42218B961286j661373n96377J638201J084833j418060j896398k27596L80605k17325
$$ 2961286 1299913 703536 2341737 3426570 2008510 112112 -115484 265121 47796
42209D7796P22329K629226J728202k062245m133695k355252M8172L53322M0681
$$ 47796 770125 3399351 5127553 3065308 -1068387 -3423639 -3375467 -3022145 -2981464
42200b981464O97087J006173K17679K39959J642390J695022o79552j951768N41735
$$ -2981464 -2284377 -1278204 -1060525 -820566 821824 2516846 1837294 -114474 427261
42191D27261L658366L007405k46929j471511K71089J493001J16584j830730j781741
$$ 427261 4085627 7093032 6846103 5374592 5645681 7138682 7255266 5424536 3642795
42182C642795p4791J068314M77179p66727o77474J019134J936018o3396l287512
$$ 3642795 3568004 4636318 5113497 4346770 3669296 4688430 6624448 6561052 3273540
42173C273540l829620j056301J364870Q88925o13250o46992J30001L97485J251419
$$ 3273540 -556080 -1612381 -247511 641414 28164 -618828 -488827 -91342 1160077
42164A160077L491074M566302K201161j007977r86939J249421J175116j693953
$$ 1160077 4651151 9217453 11418614 10410637 9423698 10673119 11848235 10154282
42156A0154282k866415j61630K730835J765048k020286m731086m562296k405592
$$ 10154282 7287867 7126237 9857072 11622120 9601834 4870748 308452 -2097140
42148b097140L21490K348692K595005J344679K38643j53640j257905l582615m614055
$$ -2097140 -1775650 573042 3168047 4512726 4751369 4597729 3339824 -242791 -4856846
42139d856846j876011K833404M759835J926211k346620l383917m38526K916048
$$ -4856846 -6732857 -3899453 860382 2786593 439973 -2943944 -3382470 -466422
42131d66422L190958Q37921o31792R93250L873873M211788P56801l613571n061751
$$ -466422 2724536 3562457 2930665 3923915 7797788 12009576 12766377 9152806 4091055
42122D091055k838021M58372K219873K344827K085311J544193j70146k519318
$$ 4091055 1253034 1711406 3931279 6276106 8361417 9905610 9735464 7216146
42114G216146l333942k055955j223886k628327l635516p20866L997053M217188
$$ 7216146 3882204 1826249 602363 -2025964 -5661480 -6382346 -2385293 1831895
42106A831895j389947n999139l550526K872866N780686L648679J285789J162681
$$ 1831895 441948 -5557191 -9107717 -6234851 -454165 3194514 4480303 5642984
42098E642984M50486k442420m041550j309369L075811M386796K199783k22008
$$ 5642984 6093470 3651050 -390500 -1699869 1375942 5762738 7962521 7740513
42090G740513j107222j468466k171769k702580k638665k073108p40984J330410
$$ 7740513 6633291 5164825 2993056 290476 -2348189 -4421297 -5162281 -3831871
42082c831871K592481J437539j152439k364890j141639P44775J391422P57427
$$ -3831871 -1239390 198149 -954290 -3319180 -4460819 -3716044 -2324622 -1567195
42074a567195l84604j619777k310094j568963K08969J287966J089806J206550
$$ -1567195 -1951799 -3571576 -5881670 -7450633 -7241664 -5953698 -4863892 -3657342
42066c657342K606342L461509J757977j153170k121510p51901L32506j64407n32704
$$ -3657342 -1051000 2410509 4168486 3015316 893806 141905 474411 310004 -222700
42057b22700M00033R34683m38451j984889j266313P97450J179774p56610k750220
$$ -222700 177333 1112016 673565 -1311324 -2577637 -1780187 -600413 -1357023 -4107243
42048d107243l261260k831073j746791P51589M060100N524116L637012K53370
$$ -4107243 -7368503 -10199576 -11946367 -11194778 -7134678 -1610562 2026450 2279820
42040B279820j697879j447552l49191J43639m57333j528762j580785K25712K479897
$$ 2279820 581941 -865611 -1214802 -1071163 -1528496 -3057258 -4638043 -4412331 -1932434
42031a932434K933634J707612J068785J705526J874575J049275J257903L154076
$$ -1932434 1001200 2708812 3777597 5483123 7357698 8406973 9664876 12818952
42023A2818952M002267K039967k21407j98436J55272k033298m713758l665574
$$ 12818952 16821219 18861186 18639779 18441343 18596615 16563317 11849559 8183985
42015H183985J55486J424800j330110l562527j974397Q06713J036697n33088p27285
$$ 8183985 8339471 9764271 8434161 4871634 2897237 3703950 4740647 4207559 3480274
42006C480274J040706K700985K843636J723071Q719j607767k279610j775362p93085
$$ 3480274 4520980 7221965 10065601 11788672 11797391 10189624 7910014 6134652 5341567
41997E341567J26551J091788J945919K156740J917349J872789J556782p5581k291088
$$ 5341567 5468118 6559906 8505825 10662565 12579914 14452703 16009485 15933904 13642816
41988A3642816k906734j519180j69852r6136k36128R2905l40303k075829l291847
$$ 13642816 10736082 9216902 9047050 8950914 8714786 8807691 8467388 6391559 3099712
41979C099712k577654j242691r06249p45767O76318K465676K571197Q37999j023352
$$ 3099712 522058 -720633 -1626882 -2372649 -1696331 769345 3340542 4178541 3155189
41970C155189j624106o21770J556801L360945K871588K93449j778969j812245
$$ 3155189 1531083 909313 2466114 5827059 8698647 8992096 7213127 5400882
41962E400882j168794j183499r02027K93132N28177j252356k289117J40147L797732
$$ 5400882 4232088 3048589 2146562 2439694 2967871 1715515 -573602 -433455 3364277
41953C364277M373301J935450K57395N00288J46623j695866k510671r39453Q86272
$$ 3364277 7737578 9673028 9930423 10430711 10577334 8881468 6370797 5431344 6317616
41944F317616J121237Q20640R99605L17979k002500l624886k176902Q80646K068595
$$ 6317616 7438853 8259493 9259098 9577077 7574577 3949691 1772789 2653435 4722030
41935D722030N24587j412610j623189l09666J039357J324028N54262j88846K41910
$$ 4722030 5246617 3834007 2210818 1901152 2940509 4264537 4818799 4629953 4871863
41926D871863J514319J883461M51195j408131j741138m78481P44883P56220j09369
$$ 4871863 6386182 8269643 8720838 7312707 5571569 5093088 5837971 6594191 6484822
41917F484822q45618q16336r4012N88372L75043o39443j109091J7241J708889
$$ 6484822 5639204 4822868 4728856 5317228 5692271 5052828 3943737 3960978 5669867
41908E669867J615601q93865l344762k936468l28804R62075o36816k411236j284054
$$ 5669867 7285468 6391603 3046841 110373 -218431 743644 106828 -2304408 -3588462
41899c588462J529522K331760N81544n37777N43801J395779o858j727294j132442
$$ -3588462 -2058940 272820 854364 316587 860388 2256167 2249309 522015 -610427
41890f10427Q47078J578035Q50076J09989p04632k178494k649837k91661K784448
$$ -610427 236651 1814686 2664762 2774751 2070119 -108375 -2758212 -3049873 -265425
41881b65425K648196k11991r95873K181128N184120L796157n34233l255561k699460
$$ -265425 2382771 2170780 1174907 3356035 8540155 12336312 11802079 8546518 5847058
41872E847058j058155p39066j812416k563955j476953R63485K374915J365528
$$ 5847058 4788903 4049837 2237421 -326534 -1803487 -840002 1534913 2900441
41864B900441j60409N06791K486810K170982j266693m325890m131290j930207
$$ 2900441 2740032 3246823 5733633 7904615 6637922 2312032 -1819258 -3749465
41856c749465k23904O67822J280951R72026m07929j008584L72539J963676J736322
$$ -3749465 -3973369 -3305547 -2024596 -1052570 -1460499 -2469083 -2096544 -132868 1603454
41847A603454O95765Q97627J788657J398685m818m69085J11005l5986j237823
$$ 1603454 2299219 3196846 4985503 6384188 6379370 5910285 6021290 5985304 4747481
41838D747481j771871q31399K90952N54779P30238J762578K958894K730333N50708
$$ 4747481 2975610 2144211 2435163 2989942 3720180 5482758 8441652 11171985 11722693
41829A1722693k302510l803399l064694j222356L8896O46447J635392K606417
$$ 11722693 9420183 5616784 2552090 1329734 1368630 2015077 3650469 6256886
41821F256886J779936p47830k198057j033528N69457J79119j083975p50449Q23183
$$ 6256886 8036822 7288992 5090935 4057407 4626864 4805983 3722008 2971559 3794742
41812C794742J558098J578707K552433L769116K555134j144492l900524l367632
$$ 3794742 5352840 6931547 9483980 13253096 15808230 14663738 10763214 7395582
41804G395582j045567M88538P88295Q50394J098626J254857R78019j15332j991146
$$ 7395582 6350015 6838553 7626848 8477242 9575868 10830725 11808744 11693412 9702266
41795I702266l445540l080620j281106P9761P1433m63862n17712J08054J404477
$$ 9702266 6256726 3176106 1895000 1974761 2046194 1582332 1064620 1172674 2577151
41786B577151L115473M032368K985443O85240r67144j364040j345950j163795
$$ 2577151 5692624 9724992 12710435 13395675 12428531 11064491 9718541 8554746
41778H554746l75342L78426p8086j001476m33033J275658J502353k89621j252679
$$ 8554746 8179404 8557830 8479744 7478268 7045235 8320893 9823246 9533625 8280946
41769H280946L86304K434029K229059N19579m37869n18143q79421j133353j75004
$$ 8280946 8667250 11101279 13330338 13849917 13412048 12893905 12014484 10881131 10706127
41760A0706127J124699P37672j350579k979724k717725j208034K15963P61340
$$ 10706127 11830826 12568498 11217919 8238195 5520470 4312436 4528399 5289739
41752E289739J93786j058304j927219j757834r89133j60506Q54020J812769J618526
$$ 5289739 5483525 4425221 2498002 740168 -248965 -409471 444549 2257318 3875844
41743C875844J41852p82727K08052J793199J982334J076111M51553l53920k502657
$$ 3875844 4017696 3234969 3443021 5236220 7218554 8294665 8746218 8392298 5889641
41734E889641m509924l353391P58064L760688K893066L5451j354391o42711Q7862
$$ 5889641 1379717 -1973674 -1215610 2545078 5438144 5473595 4119204 3476493 3564355
41725C564355q47939l017225m387302k913352J332552N261053N458007K257454
$$ 3564355 2716416 -300809 -4688111 -7601463 -6268911 -1007858 4450149 6707603
41717F707603n48102o48735J91998m33314j801758j678509m6261J127862R42269
$$ 6707603 6159501 5510766 5702764 5269450 3467692 1789183 1742922 2870784 3813053
41708C813053K34996k11752k44277L17643J058846L86719k293118m486107l338255
$$ 3813053 4048049 3836297 3592020 3909663 4968509 5355228 3062110 -1423997 -4762252
41699d762252j50680R98030m64683l20449L764494P681771O116601J61952m033121
$$ -4762252 -4912932 -3914902 -4379585 -4700034 -935540 6746231 12862832 13024784 8991663
41690H991663l384541q84657j65085o08015L68724K573808L097459M04277l446796
$$ 8991663 5607122 4722465 4557380 3949365 4318089 6891897 9989356 10393633 6946837
41681F946837m777409j742953L912799P965490P065443J834227l489711n020483
$$ 6946837 2169428 426475 4339274 12304764 19370207 21204434 17714723 12694240
41673A2694240k748548J10540Q00794m75237j421066l74561J900069K973008J405935
$$ 12694240 9945692 10056232 10857026 10381789 8960723 8586162 10486231 13459239 14865174
41664A4865174j412426k573863q63527K006412L593230L290382K166607J170375
$$ 14865174 13452748 10878885 10015358 12021770 15615000 18905382 21071989 22242364
41656B2242364N56941O06971J639377L136850L726630K456333j78644k531544
$$ 22242364 22799305 23406276 25045653 28182503 31909133 34365466 34186822 31655278
41648C1655278k956284j018565J842275L017126R03236l267698o231629n816303
$$ 31655278 28698994 27680429 29522704 32539830 33443066 30175368 23943739 18127436
41640A8127436l160521j342533j696327k222318n01336K393553K808819j14109
$$ 18127436 14966915 13624382 11928055 9705737 9204401 11597954 14406773 14292664
41632A4292664k300965q2348M118140M737084R84233k232616j878443r55512k953915
$$ 14292664 11991699 11909351 16027491 20764575 21748808 19516192 17637749 16682237 13728322
41623A3728322o028351o216802l690245j672405q52879P35966K989865L274100
$$ 13728322 7699971 1483169 -2207076 -3879481 -4732360 -3996394 -1006529 2267571
41615B267571J020855j056809j205206p80127j094888j127474K21413K025740
$$ 2267571 3288426 2231617 1026411 246284 -848604 -1976078 -1754665 271075
41607B71075K881513K629835J568173j37591j545923j545969r79927j809195l539107
$$ 271075 3152588 5782423 7350596 7213005 5667082 4121113 3141186 1331991 -2207116
41598b207116l208623O8427L377221M096862K927225J454003k50788j817436j537769
$$ -2207116 -5415739 -5347312 -1970091 2126771 5053996 6507999 6257211 4439775 2902006
41589B902006N51305J499636j20313j577005n40756R47752M74355j40790J367932
$$ 2902006 3453311 4952947 4832634 3255629 2714873 3662625 4136980 3996190 5364122
41580E364122K400863m65659m333542l365348J545227L392721j1446k615150J41206
$$ 5364122 7764985 7299326 2965784 -399564 1145663 4538384 4526938 1911788 2052994
41571B052994M448979M628455J406243p63668q58377r52834j282719m64867P26130
$$ 2052994 6501973 11130428 12536671 11773003 10914626 9961792 8679073 8214206 8940336
41562H940336K22436j279991j072890Q47105J466410l55675j967031j024994J080529
$$ 8940336 9162772 7882781 6809891 7656996 9123406 8767731 6800700 5775706 6856235
41553F856235J466358k85909j992555j826544j66079J257033J319087M94918l0790
$$ 6856235 8322593 8036684 6044129 4217585 4051506 5308539 6627626 7122544 7091754
41544G091754m6563m46711j447320j745853l88074J467483K001470J271839P14524
$$ 7091754 7045191 6598480 5151160 3405307 3017233 4484716 6486186 7758025 8472549
41535H472549N85490j45935j319689j140013R67996K797488J988238q19445k749246
$$ 8472549 9058039 8912104 7592415 6452402 7420398 10217886 12206124 11386679 8637433
41526H637433k045709L44751K093285J517869j218296l988649m175943j271579
$$ 8637433 6591724 6936475 9029760 10547629 9329333 5340684 1164741 -106838
41518a06838K250790L602771K815009J936366J537915J18343k534784l778289
$$ -106838 2143952 5746723 8561732 10498098 12036013 12154356 9619572 5841283
41510E841283j675561J600449K455688J066910Q50358K659118K912285q90323
$$ 5841283 4165722 5766171 8221859 9288769 10139127 12798245 15710530 14820207
41502A4820207n634526o348707k847182M98270R54258J70621M79260J568785K085560
$$ 14820207 9185681 2836974 -10208 488062 1442320 1612941 2092201 3660986 5746546
41493E746546K014108J689280M21999j761622k534443O882L801958M721866K002199
$$ 5746546 7760654 9449934 9871933 8110311 5575868 5582750 9384708 14106574 16108773
41484A6108773p90719p85037P16121J065036L39421M27900J429551J497231q4695
$$ 16108773 15318054 14533017 15249138 16314174 16653595 17081495 18511046 20008277 19923582
41475A9923582j892809k549130k007690m99107J737089L182106J780121j921588
$$ 19923582 18030773 15481643 13473953 12974846 14711935 17894041 19674162 17752574
41467A7752574m454684l738197j706678q42309l56409J406881K798665J047983
$$ 17752574 13297890 9559693 7853015 7010706 6654297 8061178 10859843 11907826
41459A1907826k340309k845022J79197K348580J151198m31487O46166K584232
$$ 11907826 9567517 6722495 6901692 9250272 10401470 9969983 10616149 13200381
41451A3200381K369928Q16008K00563l06654k582369m936511m083742n38317K291074
$$ 13200381 15570309 16386317 16586880 16280226 13697857 8761346 4677604 4139287 6430361
41442F430361L474776M523684M652485J265738m383852p165011n163494k226492
$$ 6430361 9905137 14428821 19081306 20347044 15963192 8798181 3634687 1408195
41434A408195j536193j116743J533540M320982L675790M4742l238118m571806
$$ 1408195 -127998 -1244741 288799 4609781 8285571 8330313 5092195 520389
41426E20389m366627k446334J398663N155489N929819L372050j91777k486019
$$ 520389 -3846238 -6292572 -4893909 261580 6191399 9563449 9371672 6885653
41418F885653k591712o74865J742826K328101N74141j166545q41639O27468J525544
$$ 6885653 4293941 3619076 5361902 7690003 8264144 7097599 6255960 6883428 8408972
41409H408972K146563L066501K806868M05660j547595k93258K012598R76537k844913
$$ 8408972 10555535 13622036 16428904 16834564 15286969 14993711 17006309 17982846 15137933
41400A5137933m185313r24651K999217L905688L145912L223299L053908N07415
$$ 15137933 10952620 10027969 13027186 16932874 20078786 23302085 26355993 26863408
41392B6863408k922793l714456j436254Q43011Q54947o32316j788032j868690
$$ 26863408 23940615 20226159 18789905 19632916 20487863 19855547 18067515 16198825
41384A6198825j117933j0132R46516J455579J708234K017549K317808K365779
$$ 16198825 15080892 15070760 16017276 17472855 19181089 21198638 23516446 25882225
41376B5882225K152212J848523J722352K218155L503091M775451M764230L168763
$$ 25882225 28034437 29882960 31605312 33823467 37326558 42102009 46866239 50035002
41368E0035002R54335q21675j644346j125142P70273K920850L860027L715350
$$ 50035002 50989337 50167662 48523316 47398174 48168447 51089297 54949324 58664674
41360E8664674L911374M620870M338847K728161J845737L130976M999757N333664
$$ 58664674 62576048 67196918 71535765 74263926 76109663 79240639 84240396 89574060
41352H9574060M856929N653899P298372P283909N312603M426880O841111J0628344
$$ 89574060 94430989 100084888 107383260 114667169 119979772 124406652 131247763 141876107
41344A41876107J2087012J0263947P441054N469432L349277p50955o079673r467784
$$ 141876107 153963119 164227066 171668120 177137552 180486829 179735874 173656201 164188417
41336A64188417r172057p158395o412684p000639o666094m896156l869902m778901
$$ 164188417 155016360 147857965 141445281 134444642 127778548 122882392 119012490 114233589
41328A14233589n812455n382435n002772o447982p811517n788477j288008R10274
$$ 114233589 108421134 103038699 98035927 91587945 83776428 77987951 76699943 77610217
41320G7610217j180897l726976k418819J744776M447231M106896L020226L016654
$$ 77610217 76429320 72702344 70283525 72028301 76475532 80582428 83602654 86619308
41312H6619308K958870J418142l29209L06042L657956P170382Q366560P417492
$$ 86619308 89578178 90996320 90667111 90973153 94631109 101801491 110168051 117585543
41304A17585543O388241O671231P882023Q996058R644314R948088R783547Q955423
$$ 117585543 123973784 130645015 138527038 147523096 157167410 167115498 176899045 185854468
41296A85854468P808049O856982N837410L941324J193746j270947k809099m352484
$$ 185854468 193662517 200519499 206356909 210298233 211491979 210221032 207411933 203059449
41288B03059449p019262j0131250j1756775j1250414j0170475j0231668j1204652
$$ 203059449 196040187 185908937 174152162 162901748 152731273 142499605 131294953
41281A31294953j1577016j0724670r454957q512931p555242o045876m506067m061561
$$ 131294953 119717937 108993267 99538310 91025379 83470137 77424261 72918194 68856633
41273F8856633m758314n022394l340784k98376J766531J488174K29713K50467
$$ 68856633 64098319 59075925 55735141 55436765 57203296 58691470 58921183 59171650
41265E9171650J438809J248880j687281n290993o501662m952617k671072q86035
$$ 59171650 60610459 61859339 60172058 54881065 48379403 43426786 40755714 39869679
41257C9869679Q56314K571037L093853K125877J137942J208701J435518N38793
$$ 39869679 40725993 43297030 46390883 48516760 49654702 50863403 52298921 52837714
41249E2837714j248441k835012l456180k393421O14808L463120K534650k286711
$$ 52837714 51589273 48754261 45298081 42904660 43519468 46982588 49517238 47230527
41241D7230527n580533k526352M320626P980490O001934K476887J164960J076648
$$ 47230527 41649994 39123642 43444268 51424758 57426692 59903579 61068539 62145187
41233F2145187J85174o58046j5482J104783J354807J761327L396196M311875K049376
$$ 62145187 62330361 61672315 61656833 62761616 64116423 65877750 69273946 73585821 75635197
41224G5635197k034231m152242l200437j576626j211824j613920j937384k291046
$$ 75635197 73600966 69448724 66248287 64671661 63459837 61845917 59908533 57617487
41216E7617487k430962j461234L98877J680826K032711K858455M677236N647504
$$ 57617487 55186525 53725291 54124168 55804994 57837705 60696160 65373396 71020900
41208G1020900M121410J378340K07367J419211L245683L995920L907553L969333
$$ 71020900 75142310 76520650 76728017 78147228 81392911 85388831 89296384 93265717
41200I3265717L982225K843405N35971j344551j675389j521106k554889m306994
$$ 93265717 97247942 100091347 100627318 99282767 97607378 96086272 93531383 89224389
41192H9224389m713566l376197k148740j881861j039520R42087J414450j687073
$$ 89224389 84510823 81134626 78985886 77104025 76064505 77006592 78421042 76733969
41184G6733969n598470n737736k260668J674j603449m270539m449221k719272
$$ 76733969 71135499 65397763 63137095 63138769 61535320 57264781 52815560 50096288
41176E0096288j964834k917749l879060l690997k892081k361282k293633k356663
$$ 50096288 48131454 45213705 41334645 37643648 34751567 32390285 30096652 27739989
41168B7739989k028950j087460j73496k32553j105759j618296j348471j075211
$$ 27739989 25711039 24623579 24450083 24217530 23111771 21493475 20145004 19069793
41160A9069793j067473m49651R98236J973978J589622O83157R0104p91686k321810
$$ 19069793 18002320 17552669 18550905 20524883 22114505 22797662 22887766 22096080 19774270
41151A9774270l165547k351072j288975j561792k010920o72284J310208Q63144
$$ 19774270 16608723 14257651 12968676 11406884 9395964 8723680 10033888 10897032
41143A0897032k028479l751226k264402L2055Q8288j504546j942920k72183K032667
$$ 10897032 8868553 5117327 2852925 2884980 2973268 1468722 -474198 -746381 1286286
41134A286286L511968L785597K766000O84198j206066j510129m25084N84990Q67594
$$ 1286286 4798254 8583851 11349851 12034049 10827983 9317854 8892770 9477760 10345354
41125A0345354J099391J592566J483658K52609j071412j189446l60997J8998o61180
$$ 10345354 11444745 13037311 14520969 14773578 13702166 12512720 12151723 12170721 11509541
41116A1509541j625971j913127j390318n39854J00441J77173k48477o58710p68424
$$ 11509541 9883570 7970443 6580125 6040271 6140712 6317885 6069408 5410698 4642274
41107D642274j093828k037395k597390j320999J173107K206901N19243j722687
$$ 4642274 3548446 1511051 -1086339 -2407338 -1234231 972670 1491913 -230774
41099b30774j837043l11864L73024k76018m17226P22820J751363J905145K352908
$$ -230774 -2067817 -2379681 -2006657 -2282675 -2699901 -1977081 -225718 1679427 4032335
41090D032335L575235L805104J797467p45093j543525j076170j330808k314914
$$ 4032335 7607570 11412674 13210141 12465048 10921523 9845353 8514545 6199631
41082F199631k247962p19053O98185R01709K73300p16424j824341j892219K83470
$$ 6199631 3951669 3232616 3930801 4832510 5105810 4389386 2565045 672826 956296
41073I56296L399660M267670K018877m05131l97521N83511n43314l630363n367106
$$ 956296 4355956 8623626 10642503 10237372 9839851 10423362 9880048 6249685 882579
41064H82579l886744j036404M34512K17039K8546R38327K230367K591029J609954
$$ 882579 -3004165 -4040569 -3606057 -3389018 -3360472 -2422145 -191778 2399251 4009205
41055D009205R2789o77025k3372J399068K021105R78514o31976p85089Q08539
$$ 4009205 4101994 3424969 3401597 4800665 6821770 7800284 7168308 6383219 7191758
41046G191758J890656N19673j856168j904410Q79501L010389J667842j346819
$$ 7191758 9082414 9602087 7745919 5841509 6721010 9731399 11399241 10052422
41038A0052422k258361n94642P48141J49652q93870q62472l23685R0872J245346
$$ 10052422 7794061 7199419 7947560 8097212 7203342 6340870 6017185 6108057 7353403
41029G353403L323269M188353K117891j236488k843648k216825j111657k18258
$$ 7353403 10676672 14865025 16982916 15746428 12902780 10685955 9574298 9356040
41021I356040J169370K505844J939908n04463k217065j528664J59718R85258J291515
$$ 9356040 10525410 13031254 14971162 14466699 12249634 10720970 10880688 11865946 13157461
41012A3157461J973768J996206M168k577398k715745K8008K776174L156129J740251
$$ 13157461 15131229 17127435 17131603 14554205 11838460 11866468 14642642 17798771 19539022
41003A9539022M5469j707460l477030l878515j808673J378561L307576L635967
$$ 19539022 19584491 17877031 14400001 10521486 8712813 10091374 13398950 17034917
40995A7034917L701309L524597J625824j795332m013366l387010j776609j613960
$$ 17034917 20736226 24260823 25886647 24091315 20077949 16690939 14914330 13300370
40987A3300370k245995j490961L07435O39967q98274j630057n1914J399081k62888
$$ 13300370 11054375 9563414 9870849 10510816 9612542 7982485 7930571 9329652 9066764
40978I066764l894566n273784k594063J138264J964339j04784j474100J3957K177105
$$ 9066764 5172198 -101586 -2695649 -1557385 406954 302170 -1171930 -1157973 1019132
40969A019132J735984p05447j229741J661615M550115L961288J375394M95743
$$ 1019132 2755116 2049669 819928 2481543 7031658 10992946 12368340 12864083
40961A2864083J098650l74947m222294n928341k845814J427519K192959K54660
$$ 12864083 13962733 13587786 9365492 3437151 591337 2018856 4211815 4466475
40953D466475k07880J548841K314446O76257q29859j34652J225086J100029L49050
$$ 4466475 4258595 5807436 8121882 8798139 7968280 7833628 9058714 10158743 10507793
40944A0507793J171399L191276L630330J260062j726044k518546j232960m05624
$$ 10507793 11679192 14870468 18500798 19760860 18034816 15516270 14283310 13877686
40936A3877686j237176j918241n50300J667706K106009Q20198L05901R93343K29635
$$ 13877686 12640510 10722269 10171969 11839675 13945684 14765882 15071783 16065126 16294761
40927A6294761k876947m862000k762269J107071K608505J953220K410619M201856
$$ 16294761 13417814 8555814 5793545 6900616 9509121 11462341 13872960 18074816
40919A8074816M290386K060274N97725J489030K453553J504733j63680r73172
$$ 18074816 22365202 24425476 25023201 26512231 28965784 30470517 30306837 29333665
40911B9333665j271064j224450K86106K813496L576008J564608o74786j367642
$$ 29333665 28062601 26838151 27124257 29937753 33513761 35078369 34403583 33035941
40903C3035941k171411m090688m543707j899963N91660m22475k712310k199088
$$ 33035941 30864530 26773842 22230135 20330172 20921832 20499357 17787047 15587959
40895A5587959K21017P96450k27902K72812J666484M95857k183507j219247L657764
$$ 15587959 15808976 16605426 16377524 16650336 18316820 18812677 16629170 15409923 19067687
40886A9067687N870397J674480l944444m655764j351267P95388J17063j141890
$$ 19067687 24938084 26612564 22668120 18012356 16661089 17456477 17573540 16431650
40878A6431650j610937j664391j105761L08949J199017N17862n6606J369811L346160
$$ 16431650 14820713 13156322 12050561 12359510 13558527 14076389 14019783 15389594 18735754
40869A8735754L130981J153203J66929P66066J020537J63457m96252k27854M11566
$$ 18735754 21866735 23019938 23186867 23952933 24973470 25136927 24640675 24412821 24824387
40860B4824387J443410L280763M727372L988740J801341P16046J007121K98177
$$ 24824387 26267797 29548560 34275932 38264672 40066013 40782059 41789180 42087357
40852D2087357k110324l640676k454628l97568k51225k090277l996403m731615
$$ 42087357 39977033 36336357 33881729 33484161 33232936 31142659 27146256 22414641
40844B2414641m221484k846920j614819j697583k615313k272960M7281K274979
$$ 22414641 18193157 15346237 13731418 12033835 9418522 7145562 7192843 9467822
40836I467822K415068J183466K49568m22682j426907j640663K24416K610958K538706
$$ 9467822 11882890 13066356 13315924 12893242 11466335 9825672 10050088 12661046 15199752
40827A5199752M5372j509356k74387J337047J20030l323914n235102l361371M62485
$$ 15199752 15245124 13735768 13461381 14798428 14918458 11594544 6359442 2998071 3460556
40818C460556K510057J151337j665605k716791j023894J284894J763049N56422
$$ 3460556 5970613 7121950 5456345 2739554 1715660 3000554 4763603 5320025
40810E320025l85285m86212j243625l283340m422636k263631K049539M565715
$$ 5320025 4934740 4448528 3204903 -78437 -4501073 -6764704 -4715165 -149450
40802a49450L231420K83334q00158N53746K145067K407561J966383J845584J803580
$$ -149450 3081970 3365304 2565146 3118892 5263959 7671520 9637903 11483487 13287067
40793A3287067J165188J70913m14111l53501J22722P75768J079584K75769j445841
$$ 13287067 14452255 14623168 14209057 13855556 13978278 14754046 15833630 16109399 14663558
40784A4663558k650141k569119k382355l189013l642551j643871K047198M234297
$$ 14663558 12013417 9444298 7061943 3872930 230379 -1413492 633706 4868003
40776D868003L483166J602273M27207m33956j562588j838762m41347J040672O26161
$$ 4868003 8351169 9953442 10380649 9946693 8384105 6545343 6103996 7144668 7770829
40767G770829j076352j910646j357680p74011j057716j818285k360715j977871
$$ 7770829 6694477 4783831 3426151 2652140 1594424 -223861 -2584576 -4562447
40759d562447q854K782364L885769K116563j1539N19569K546629K339724n07339
$$ -4562447 -4571301 -1788937 2096832 4213395 4201856 4721425 7268054 9607778 9100439
40750I100439k432517j544306r5404r8635k61015O02646O34042j574930l456299
$$ 9100439 6667922 5123616 5028212 4929577 4668562 5271208 5905250 4330320 874021
40741H74021k102353O79886R94953q18307q89187J563299K854140Q60177j708925
$$ 874021 -1228332 -548446 446507 -371800 -1260987 302312 3156452 4016629 2307704
40732B307704j801449l75184P9014k60746M02132J839287J981813J89435j804886
$$ 2307704 506255 131071 210085 -50661 351471 2190758 4172571 4362006 2557120
40723B557120k149145o92792J277270K117395R74189j303209k769722k476051
$$ 2557120 407975 -284817 992453 3109848 4084037 2780828 11106 -2464945
40715b464945j330885m64061J73561R10096J387000J503058J969396K706119K177881
$$ -2464945 -3795830 -4259891 -4086330 -3176234 -1789234 -286176 1683220 4389339 6567220
40706F567220o9230j735038p35664J481864K107134J316802J403708K273111J501349
$$ 6567220 6497990 4762952 4027288 5509152 7616286 8933088 10336796 12609907 14111256
40697A4111256q80079j546663Q31364K944981J641372j448493k643415j373340
$$ 14111256 13231177 11684514 12515878 15460859 17102231 15653738 13010323 11636983
40689A1636983J90499R79687J460082J266821m62996k684887l177448j815695
$$ 11636983 11827482 12807169 14267251 15534072 15071076 12386189 9208741 7393046
40681G393046p13915r03963j210164p90446l80125k47360P28150K666823L459675
$$ 7393046 6679131 5775168 4565004 3774558 3394433 3147073 3875223 6542046 10001721
40672A0001721J676615q41458j292828J78753R93714J01978p40608P1024J712803
$$ 10001721 11678336 10836878 9544050 9722803 10716517 10818495 10077887 10148911 11861714
40663A1861714K548644K559040K717290K769217J447231j008145k296759j054314
$$ 11861714 14410358 16969398 19686688 22455905 23903136 22894991 20598232 19543918
40655A9543918P99157L01202k437149m173741k844059j77049Q79251j05130j212359
$$ 19543918 20343075 20644277 18207128 14033387 11189328 11012279 11891530 11786400 10574041
40646A0574041j072732m0546R83765J381685O51007j218596l131756l663661k426685
$$ 10574041 9501309 9460763 10444528 11826213 12477220 11258624 8126868 4463207 2036522
40637B036522M8122L159919N795461N950977K912319m76297k71865L268723N295878
$$ 2036522 2084644 5244563 11040024 16991001 19903320 19427023 19155158 22423881 27719759
40628B7719759K490000k631684n313813m561087l061137k359967j275918P47352
$$ 27719759 30209759 27578075 22264262 17703175 14642038 12282071 11006153 11753505
40620A1753505J736502J91403j928979j394931J778685M109599L244454R37810
$$ 11753505 13490007 13681410 11752431 10357500 12136185 16245784 19490238 20428048
40612B0428048K36917J009920L79235k593587n070882m363525j703164j53170
$$ 20428048 20664965 21674885 22054120 19460533 14389651 10026126 8322962 8169792
40604H169792j50101K52449J297005Q32463j652092l275466j804700P38020Q17684
$$ 8169792 8019691 8272140 9569145 10401608 8749516 5474050 3669350 4407370 5225054
40595E225054j601347l262585k257760j7671J461921K129576K738532K914136
$$ 5225054 3623707 361122 -1896638 -1914309 -452388 1677188 4415720 7329856
40587G329856J818819l1369j051717o72306o0731l90424j211274j326705p95284
$$ 7329856 9148675 9117306 8065589 7393283 7332552 6942128 5730854 4404149 3608865
40578C608865q12064j461952j093783J033022K741600J442664j847784l190963
$$ 3608865 2796801 1334849 241066 1274088 4015688 5458352 3610568 419605
40570D19605q07681K547977L320185J578956J62609M69623R92112n5985k165657
$$ 419605 -388076 2159901 5480086 7059042 7221651 7691274 8683386 8627401 6461744
40561F461744l198921k001727K66075J501254J067879K75339K75641L94357n18242
$$ 6461744 3262823 1261096 1527171 3028425 4096304 4371643 4647284 5041641 4523399
40552D523399j834358j778992j10127J410871J390398K72437p18403q18047Q5806
$$ 4523399 2689041 910049 799922 2210793 3601191 3873628 3155225 2337178 2422984
40543B422984J160879Q17898j175257k387811q54685J205267J61606k776243k522920
$$ 2422984 3583863 4401761 3226504 838693 -15992 1189275 1350881 -1425362 -3948282
40534c948282J665083L894498K24489m968475n177387p62891K872227L470505
$$ -3948282 -2283199 1611299 1835788 -3132687 -8310074 -9072965 -6200738 -2730233
40526b730233L168528L103331J983875k26325j626973j574015j078639l50871
$$ -2730233 438295 3541626 5525501 5299176 3672203 2098188 1019549 668678
40518F68678O58006J63515k891630m990254j692147M852028P264627K802306l074224
$$ 668678 1326684 1490199 -1401431 -6391685 -8083832 -3231804 4032823 6835129 3760905
40509C760905m500510j866014J301062L508884M597567L742673J303848k05869
$$ 3760905 -739605 -2605619 -1304557 2204327 6801894 10544567 11848415 11642546
40501A1642546L91335J123633O01125L98831J402185J231935j703762m724820
$$ 11642546 12033881 13157514 13758639 14157470 15559655 16791590 15087828 10363008
40493A0363008m729823k752331j384016m57161J080569J740641J40638j252736
$$ 10363008 5633185 2880854 1496838 1039677 2120246 3860887 4001525 2748789
40485B748789L82187K797428J655270k241008l815120j432823J305436J824487
$$ 2748789 3130976 5928404 7583674 5342666 1527546 94723 1400159 3224646
40477C224646J731046K555369K758831R20952j493540k521139k265298j589165
$$ 3224646 4955692 7511061 10269892 11190844 9697304 7176165 4910867 3321702
40469C321702o92212k38401j323282k954103k236642J195067L517317J735541
$$ 3321702 2629490 2391089 1067807 -1886296 -4122938 -2927871 589446 2324987
40461B324987j793960k578006k83551J184559m87270k929166k579564O36943L484807
$$ 2324987 531027 -2046979 -2330530 -1145971 -1633241 -4562407 -7141971 -6505028 -3020221
40452c020221L510359J590127J70865M3835k2564q20652j495528j306568j008615
$$ -3020221 490138 2080265 2251130 2294965 2272401 1451749 -43779 -1350347 -2358962
40443b358962j326953j428449m75868M47676j33188j479947j609216k65817J149791
$$ -2358962 -3685915 -5114364 -5590232 -5142556 -5275744 -6755691 -8364907 -8630724 -7480933
40434g480933K068063K895926L153800K050478P22191J102828K444534J959952
$$ -7480933 -5412870 -2516944 636856 2687334 3409525 4512353 6956887 8916839
40426H916839n46516j852621k45222J749420J214357j228132l213149l942017
$$ 8916839 8370323 6517702 6272480 8021900 9236257 8008125 4794976 852959
40418H52959l613032j838548R04183K218392R57001j56673J879190N321428N631428
$$ 852959 -2760073 -4598621 -3694438 -1476046 -519045 -675718 1203472 6524900 12156328
40409A2156328J943484j893687k934136k315291j865405r88658Q92681J528875
$$ 12156328 14099812 12206125 9271989 6956698 5091293 4102635 4995316 6524191
40401F524191j273228n237487n567268j415980K721349L139316J564920J521147
$$ 6524191 5250963 13476 -5553792 -6969772 -4248423 -1109107 455813 1976960
40393A976960K462851J112528k352032l811296j761718j28131k044184m442037
$$ 1976960 4439811 5552339 3200307 -610989 -2372707 -2500838 -4545022 -8987059
40385h987059k762994J440748K598052j32317j599649J133083M474560M364642
$$ -8987059 -11750053 -10309305 -7711253 -7843570 -9443219 -8310136 -3835576 529066
40377E29066K199590J401064J506159j74498l028653l600815j028332J616394
$$ 529066 2728656 4129720 5635879 5461381 2432728 -1168087 -2196419 -580025
40369e80025J650321l15136k115576k403682r89111J187659K196810J093273j85042
$$ -580025 1070296 755160 -1360416 -3764098 -4753209 -3565550 -1368740 -275467 -460509
40360d60509J043699L976717M634022J238400k961307l749558j146593J284666
$$ -460509 583190 4559907 9193929 10432329 7471022 3721464 2574871 3859537
40352C859537J279623j5004n21445Q3330P74972R93180R43172N67392n85393k180924
$$ 3859537 5139160 5124156 4602711 4686041 5461013 6454193 7397365 7964757 7379364 5198440
40342E198440k767448j506246L12073P21492o1471K00664K211376L426215J337076
$$ 5198440 2430992 924746 1236819 1958311 1896840 2097504 4308880 7735095 9072171
40333I072171k666633m667408l095326l10737Q71116M00896L475N05121J376526
$$ 9072171 6405538 1738130 -1357196 -1667933 -796817 -395921 -392446 112675 1489201
40324A489201J993238K016845R93299j090823k887753k602355k99971J654814
$$ 1489201 3482439 5499284 6492583 5401760 2514007 -88348 -388319 1266495
40316A266495J252720o63251j538073m88044O80629J89265j137714j050626R40024
$$ 1266495 2519215 1855964 317891 -170153 510476 699741 -437973 -1488599 -548575
40307e48575K793137K452844K36084j651155j522437R3974R86438l79660k837640
$$ -548575 2244562 4697406 4933490 3282335 1759898 1853872 2840310 2460650 -376990
40298c76990l400694p37673K895197M165337K505378J70372r54462p90301M26071
$$ -376990 -3777684 -4515357 -1620160 2545177 5050555 5220927 4266465 3476164 3902235
40289C902235K685569M637560L811689j15681l950249m524644k377951l09034
$$ 3902235 6587804 11225364 15037053 14921372 10971123 6446479 4068528 3759494
40281C759494M84778P79058P26347n02967k277022k097600J044925M274594L530544
$$ 3759494 4244272 5023330 5749677 5246710 2969688 872088 1917013 6191607 9722151
40272I722151j398970n864501n198697l4842M401696M417263J689541k2100j90434
$$ 9722151 8323181 2458680 -2740017 -2774859 1626837 6044100 7733641 7711541 7521107
40263G521107j035873k714173k578989J09514K209310J252934q65125j122227
$$ 7521107 6485234 3771061 1192072 1301586 3510896 4763830 3898705 2776478
40255B776478J49836Q77138J249112K559131L396312J092524l202902m881318
$$ 2776478 2926314 3803452 5052564 7611695 11008007 12100531 8897629 4016311
40247D016311k166680J342173J823197M6263q17993R5616J098285J002397K32272
$$ 4016311 1849631 3191804 5015001 5061264 4243271 4338887 5437172 6439569 6671841
40238F671841n16030j021356j175212j058665j170372j699173j891454j003376
$$ 6671841 6155811 5134455 3959243 2900578 1730206 31033 -1860421 -2863797
40230b863797L62041P04662o14276k651214l887469l489778j624264R39740L287300
$$ -2863797 -2501756 -1797094 -2411370 -5062584 -8950053 -12439831 -14064095 -13124355 -9837055
40221i837055M688388M843146L924538K293627K02635j948461l114844k195074
$$ -9837055 -5148667 -305521 3619017 5912644 6115279 4166818 1051974 -1143100
40213a143100K63374J792975O99220j528579k122023r26095j57770l19201O48354
$$ -1143100 -879726 913249 1612469 83890 -2038133 -2964228 -3121998 -3441199 -2792845
40204b792845L144800M098017J602234j410523j209058J129936J728884P6738
$$ -2792845 351955 4449972 6052206 4641683 3432625 4562561 6291445 6368183
40196F368183q15173J59864P51557l06418j287460q30677q4464j72971k20504
$$ 6368183 5553010 5712874 6464431 6158013 4870553 4039876 3955412 3782441 3561937
40187C561937P01091J843929K136420J352658o22349l386449m568737j888117
$$ 3561937 4263028 6106957 8243377 9596035 8973686 5587237 1018500 -869617
40179h69617K550006L604183K57073k386866o08716K364188J884389n79518m47819
$$ -869617 1680389 5284572 5541645 3154779 2546063 4910251 6794640 6215122 5767303
40170E767303J695229Q54697l571403n724952j889800L682483M759332J593355
$$ 5767303 7462532 8317229 4745826 -979126 -2868926 813557 5572889 7166244
40162G166244n30079N75684J648778p8068k433393j797841J312752K986351J504670
$$ 7166244 6636165 7211849 8860627 8782559 6349166 4551325 5864077 8850428 10355098
40153A0355098o69876j044381o45425j717372l695011l872688j332154K028145
$$ 10355098 9685222 8640841 7995416 6278044 2583033 -1289655 -2621809 -593664
40145e93664M062697M009327K024677o43715j464567O39680K550909K68830m735667
$$ -593664 3469033 7478360 9503037 8859322 7394755 8034435 10585344 10854174 6118507
40136F118507o432145k754671J067964K54906k554917k039465J322923K629077
$$ 6118507 -313638 -3068309 -2000345 -1745439 -4300356 -6339821 -5016898 -2387821
40128b387821P36076m19715J301048L073035K125007j38090j041308o46936o23950
$$ -2387821 -1651745 -2071460 -770412 2302623 4427630 4289540 3248232 2601296 1977346
40119A977346j209575j438173j063107m85189K91883J225920J568692R02760K01220
$$ 1977346 767771 -670402 -1733509 -2218698 -1926815 -700895 867797 1770557 1971777
40110A971777O35931J679922J494481p36763l557492m599511l038305n13053O05694
$$ 1971777 2607708 4287630 5782111 5045348 1487856 -3111655 -6149960 -6663013 -6057319
40101f057319j68997j072517n35632P85792J091873j11053j568414j945422j149117
$$ -6057319 -6226316 -7298833 -7834465 -7048673 -5956800 -6067853 -7636267 -9581689 -10730806
40092a0730806k12048l14585j443537j820604K10015L317915M013624J468175
$$ -10730806 -10942854 -11257439 -12700976 -14521580 -14311565 -10993650 -6980026 -5511851
40084e511851o31089Q39982L528087K959158n28550k246550l82465J597911R66922
$$ -5511851 -6142940 -5302958 -1774871 1184287 655737 -1590813 -1973278 -375367 591555
40075E91555K3325J751969M311524L447489j044014m757245m485000j811381k09045
$$ 591555 614880 2366849 6678373 10125862 9081848 4324603 -160397 -1971778 -2180823
40066b180823n52431q44425M58698K271552K432284P70416m43768M99818K288640
$$ -2180823 -2733254 -3577679 -3118981 -847429 1584855 2355271 1911503 2411321 4699961
40057D699961K260247q077k238589k501987j282773k94769n27220j742682k795685
$$ 4699961 6960208 6952131 4713542 2211555 928782 634013 106793 -1635889 -4431574
40048d431574k393671p49204j79207k238486m477796k705887K891219O773299
$$ -4431574 -6825245 -7574449 -7753656 -9992142 -14469938 -17175825 -14284606 -7511307
40040g511307M835996k42033k667382o87595K485507L649859K729903J318539
$$ -7511307 -2675311 -2917344 -5584726 -6272321 -3786814 -136955 2592948 3911487
40032C911487N19170M43313L15839q08122k307456j877469J181403L696307K165281
$$ 3911487 4430657 4873970 5189809 4381687 2074231 196762 1378165 5074472 7239753
40023G239753k102160m418235l251377j883552k620198k975751p7588L878299
$$ 7239753 5137593 719358 -2532019 -4415571 -7035769 -10011520 -10089108 -6210809
40015f210809M124558K31172k914823j377507L152318N869418M293414J68767
$$ -6210809 -2086251 -1855079 -4769902 -6147409 -2995091 2874327 7167741 7336508
40007G336508k894676k675717O1000K413454K152327M9781j109811QJ705370J723479
$$ 7336508 4441832 1766115 1827115 4240569 6392896 6442677 5332866 5332874 7038244 8761723
39997H761723m299j815260k691868k719235j796265K63151K216261J843119j123558
$$ 8761723 8757424 6942164 4250296 1531061 -265204 -2053 2214208 4057327 2933769
39988B933769l808317l266516j30561K104804J271446j185396k341644j190545
$$ 2933769 -874548 -4141064 -4271625 -2166821 -895375 -2080771 -4422415 -5612960
39980e612960Q12077K001457K164061J731058M91544j625548l006035j608141
$$ -5612960 -4800883 -2799426 -635365 1095693 1587237 -38311 -3044346 -4652487
39972d652487J575236K420417j093052n165571m492389M82845L992642K790740
$$ -4652487 -3077251 -656834 -1749886 -6915457 -11407846 -10925001 -6932359 -4141619
39964d141619r7158o79257O60054J509890J821982K524517K243633m71898l167935
$$ -4141619 -4238777 -4918034 -4257980 -2748090 -926108 1598409 3842042 3370144 202209
39955B02209k167293J333515K358474l67490k517789r73480J671049J610904o11120
$$ 202209 -1965084 -631569 1726905 1359415 -1158374 -2131854 -460805 1150099 538979
39946E38979j826480j012802M90508J750006K552254K250845P30516m56234l0309
$$ 538979 -1287501 -2300303 -1809795 -59789 2492465 4743310 5473826 5017592 4987283
39937D987283Q77158M60826r65806j928058k340849k759252k237315J81273K541736
$$ 4987283 5864441 6325267 5359461 3431403 1090554 -1668698 -3906013 -3724740 -1183004
39928a183004J838112j166232k325150q9941K124643J090527j611472k414471
$$ -1183004 655108 -511124 -2836274 -2926215 -801572 288955 -1322517 -3736988
39920c736988r44629M97475J167669K283771L616299L051406L09418j789590j288372
$$ -3736988 -4681617 -4184142 -3016473 -732702 2883597 5935003 6244421 4454831 3166459
39911C166459J0915l47376j358045l11247K349109L129167O38343k297835k698820
$$ 3166459 3177374 2829998 1471953 1160706 3509815 6638982 7277325 4979490 2280670
39902B280670j186516k48221p04479j541475j710584n78454J859201L753711K384275
$$ 2280670 1094154 845933 141454 -1400021 -3110605 -3689059 -1829858 1923853 4308128
39893D308128j655176l491927j05674M544545M305148n74438m062925l124807
$$ 4308128 2652952 -838975 -944649 3599896 7905044 7330606 3267681 142874
39885A42874r95043r86052j937422j765567j189172j164037k16756K473278M249359
$$ 142874 -852169 -1838221 -3775643 -5541210 -6730382 -7894419 -8111175 -5637897 -1388538
39876a388538K659163k72679q69058Q13099J729756O34814j102688k426945l225099
$$ -1388538 1270625 997946 128888 941987 2671743 3306557 2203869 -223076 -3448175
39867c448175k811090p83283J133968Q83012p42866j244348r2518J348051K694622
$$ -3448175 -6259265 -7042548 -5908580 -5025568 -5768434 -7012782 -7105300 -5757249 -3062627
39858c062627M249273M510948J615612k676856m039752j355277J717368J871591
$$ -3062627 1186646 5697594 7313206 4636350 596598 -758679 958689 2830280
39850B830280k3584j247995o62330J316282L610857M193382J451841k853367m559748
$$ 2830280 2806696 1558701 896371 2212653 5823510 10016892 11468733 8615366 4055618
39841D055618k483739j49730l68341j061074P50977L418850K978305l87627k368986
$$ 4055618 1571879 1422149 1053808 -7266 743711 4162561 7140866 6753239 4384253
39832D384253r73639R09889L89171j357663j813513j310396j711793k354630n53447
$$ 4384253 3410614 4320503 4709674 3352011 1538498 228102 -1483691 -3838321 -4391768
39823d391768L719950O499334M534486m22469l717740l157027n75095J263375
$$ -4391768 -671818 5827516 10362002 9939533 6221793 3064766 2489671 3753046
39815C753046J380453L14920r50523j404922q48676n31641j406885j871981M07100
$$ 3753046 5133499 5448419 4497896 3092974 2244298 1712657 305772 -1566209 -1159109
39806a159109M143922M936747J360184k557648k982479j334075q65145j157715
$$ -1159109 2984813 7921560 9281744 6724096 3741617 2407542 1542397 384682
39798C84682j8074J373724R3134k733511k812551N03081L038363K252558L63468
$$ 384682 366608 1740332 1833466 -900045 -3712596 -3209515 -171152 2081406 2444874
39789B444874l32754q43492k055421j992506N36178K734712J573870j517783k884822
$$ 2444874 2112120 1268628 -786793 -2779299 -2243121 491591 2065461 547678 -2337144
39780b337144j855514o55426l48426R9951J221826K100284K039586J383998O43597
$$ -2337144 -4192658 -4848084 -5196510 -5096559 -3874733 -1774449 265137 1649135 2292732
39771B292732m4975p92392j886156l104181k861332K52069M392619N234170J410974
$$ 2292732 2247757 1455365 -430791 -3534972 -6396304 -6144235 -1751616 3482554 4893528
39762D893528k955396l313669m01839J628617J229159N13988J068892J809633
$$ 4893528 1938132 -1375537 -1777376 -148759 1080400 1594388 2663280 4472913
39754D472913J184710q43295l301763m918069m377422j616901J274389K154747
$$ 4472913 5657623 4814328 1512565 -3405504 -7782926 -9399827 -8125438 -5970691
39746e970691J544194J410592J715507O27487j757487k704881r20429J014703
$$ -5970691 -4426497 -3015905 -1300398 -672911 -2430398 -5135279 -6055708 -5041005
39738e041005J22365k529519l047626l5536L295008L122860l1711j851900K28954
$$ -5041005 -4918640 -7448159 -10495785 -10531321 -7236313 -4113453 -4145164 -5997064 -5768110
39729e768110L599563L870869O85486k048782j683955l7294J427j245481j359030
$$ -5768110 -2168547 1702322 2387808 339026 -1344929 -1382223 -1380796 -2626277 -3985307
39720c985307K89996K054011K660266K287004J360629R9145q68790r10164l22682
$$ -3985307 -3695311 -1641300 1018966 3305970 4666599 4765744 3896954 2986790 2664108
39711B664108K20886P02900J146390P88686o74898j837506j333297j84289m01342
$$ 2664108 2884994 3587894 4734284 5522970 4848072 3010566 1677269 1492980 1091638
39702A091638j649762j510860Q50096L340256L732509K122195K9468j529710k352206
$$ 1091638 -558124 -2068984 -1218888 2121368 5853877 7976072 8005540 6475830 4123624
39693D123624k407423j646700k31815J149097J286448m06668k467034k432989
$$ 4123624 1716201 69501 -162314 986783 2273231 1866563 -600471 -3033460
39685c033460j04564J816612J502762N26070Q59125J433224L20997j418737j387881
$$ -3033460 -3138024 -1321412 181350 707420 1566545 2999769 3320766 1902029 514148
39676E14148j54065k94116j818373k342618j548839j463394k099164j050739J735477
$$ 514148 360083 65967 -1752406 -4095024 -5643863 -7107257 -9206421 -10257160 -8521683
39667h521683L011993J488969Q467N81562J194770K8523q76168O49004K604022
$$ -8521683 -5509690 -4020721 -4012254 -3430692 -2235922 -2207399 -3083567 -2434563 169459
39658A69459J859933p90523k156286j457990k45954R56094K473454L086149J289032
$$ 169459 2029392 1238869 -917417 -2375407 -2621361 -1665267 808187 3894336 5183368
39649E183368j610773k715181j480859J80044J109820J532796J208357j18728
$$ 5183368 3572595 857414 -623445 -443401 666419 2199215 3407572 3288844
39641C288844j001022m8232J113514q6397k523478k538593J52439J750118M22176
$$ 3288844 2287822 2239590 3353104 3266707 743229 -1795364 -1642925 107193 529369
39632E29369j020232j72082J089585K88975j338451j298888j08498K10680J8817
$$ 529369 -490863 -662945 426640 715615 -622836 -1921724 -2030222 -1819542 -1800725
39623a800725Q96575J840340M06022k685593l766313j568930Q93691R18143k56902
$$ -1800725 -904150 936190 1342212 -1343381 -5109694 -6678624 -5784933 -4866790 -5123692
39614e123692j10534J140689J436685M36493j66534N22500J412073J223350R2873
$$ -5123692 -5234226 -4093537 -2656852 -2220359 -2386893 -1864393 -452320 771030 863903
39605H63903r01077q64198L63304J907097K148899L90155j692541j544759Q71100
$$ 863903 -37174 -901372 -538068 1369029 3517928 3908083 2215542 670783 1541883
39596A541883K519547J052681k003662l137908j181433J746098L211922K733837
$$ 1541883 4061430 5114111 3110449 -27459 -1208892 537206 3749128 6482965
39588F482965J068148j014247k659438l093585k703710k801594l467533k875911
$$ 6482965 7551113 6536866 3877428 783843 -1919867 -4721461 -8188994 -11064905
39580a1064905Q375L171306L685882J533025n10909o60079N7410Q7502l48509
$$ -11064905 -11056530 -7885224 -4199342 -2666317 -3177226 -3837305 -3779895 -3692393 -4040902
39571d040902j83758O14140J313813J722161K017779J847327P86796n93943j268045
$$ -4040902 -4224660 -3610520 -2296707 -574546 1443233 3290560 4077356 3483413 2215368
39562B215368j236064j377254j823798j693575p60492j87688q22466j621981p99041
$$ 2215368 979304 -397950 -2221748 -3915323 -4675815 -4863503 -5685969 -7307950 -8106991
39553h106991J812865M387085M970309L132870K3019k475025k779655p54291J820595
$$ -8106991 -6294126 -1907041 3063268 6196138 6219157 3744132 964477 210186 2030781
39544B030781K502134M71739k482369l565343j763024R46460J495254q08915l192322
$$ 2030781 4532915 5004654 2522285 -1043058 -2806082 -1859622 -364368 -1173283 -4365605
39535d365605k708276k03266P45970r61815k228159n43333K037834K263456R36327
$$ -4365605 -7073881 -7277147 -6531177 -7492992 -9721151 -10264484 -8226650 -5963194 -5026867
39526e026867J178046K700835K226161m87995j785169k99153P43905n66251j299596
$$ -5026867 -3848821 -1147986 1078175 590180 -1194989 -1494142 -750237 -1316488 -2616084
39517b616084P90535K554757N43218k721488k662502k50241m3807k213663k540009
$$ -2616084 -1825549 729208 1272426 -1449062 -4111564 -4361805 -4405612 -6619275 -9159284
39508i159284l041J593602L35078r72666k06175P73258K48565k71907N85013J392512
$$ -9159284 -9162325 -7568723 -7233645 -8206311 -8412486 -7639228 -7390663 -7662570 -7077557 -5685045
39498e685045R38325N03157R55952R05479j40939k41601J138910J447705k69735
$$ -5685045 -4746720 -4243563 -3287611 -2382132 -2523071 -2764672 -1625762 -178057 -447792
39489d47792r65827R87319K081746n37052l374467j738728K423490L535115J186836
$$ -447792 -1413619 -426300 1655446 1118394 -2256073 -3994801 -1571311 1963804 3150640
39480C150640j19516R78604J127883r82514k139788l85017J593593R61111j128888
$$ 3150640 3031124 4009728 5137611 4155097 2015309 1630292 3223885 4184996 3056108
39471C056108k076578j633762j130525r87047o39362L45861J754580K246611J5497
$$ 3056108 979530 -654232 -1784757 -2771804 -3411166 -3065305 -1310725 935886 951383
39462I51383m161838n809158j896746L867662N005518J129266j930627j111681
$$ 951383 -3210455 -9019613 -10916359 -7048697 -2043179 -913913 -2844540 -3956221
39454c956221L33185j87507j2296K992371N224971K760159j686158k549494Q2743
$$ -3956221 -3623036 -3810543 -3822839 -830468 4394503 7154662 5468504 2919010 3001753
39445C001753J159099j181847l372014k554533l70066O32961P58953J481304K446644
$$ 3001753 4160852 2979005 -393009 -2947542 -3317608 -2684647 -1925694 -444390 2002254
39436B002254K188115O27333p15452o86586J31764Q6984j536239l291238l028063
$$ 2002254 4190369 4817702 4102250 3415664 3547428 3634412 2098173 -1193065 -4221128
39427d221128p32435J209198J098627q5756o56551n94655n55921l248J717362
$$ -4221128 -4953563 -3744365 -2645738 -2731494 -3388045 -3982700 -4538621 -4541869 -2824507
39418b824507L420155L193691R03832k021459m481223n680564m357885m01244
$$ -2824507 595648 3789339 4693171 2671712 -1809511 -7490075 -11847960 -12249204
39410a2249204L451844M125566K242625J207072K293477L243968K124539k1722
$$ -12249204 -8797360 -4671794 -2429169 -1222097 1071380 4315348 6439887 6418165
39402F418165j295701j536493j646264j997220k514551k943928k379262j18000
$$ 6418165 5122464 3585971 1939707 -57513 -2572064 -5515992 -7895254 -8013254
39394h013254K434804K676958N24544r03525L24646K009832J243331j061045j678487
$$ -8013254 -5578450 -2901492 -2376948 -3280473 -2955827 -945995 297336 -763709 -2442196
39385b442196n6475J054915j97872k463334l476647k594556m37247K152152L859171
$$ -2442196 -2498671 -1443756 -1641628 -4104962 -7581609 -10176165 -10613412 -8461260 -4602089
39376d602089L131172m2290l368738m324713k606115L9903J808703K066464J291880
$$ -4602089 -1470917 -1513207 -4881945 -9206658 -11812773 -11772870 -9964167 -7897703 -6605823
39367f605823O57941J275319L046983M464955M128477K208122q1837j949960l182811
$$ -6605823 -5947882 -4672563 -1625580 2839375 6967852 9175974 9094137 7144177 3961366
39358C961366l344855k066932j75241O42127k33947j541460j706954n84039P87931
$$ 3961366 616511 -1450421 -1625662 -983535 -1217482 -2758942 -4465896 -5049935 -4262004
39349d262004J492271J253394K65140p12140m21893J774736M609663N334352K123766
$$ -4262004 -2769733 -1516339 -1251199 -1963339 -2385232 -610496 3999167 9333519 11457285
39340A1457285l667290p948840p344613k590733K059898L312772J950580P28623
$$ 11457285 7789995 -158845 -7503458 -10094191 -8034293 -4721521 -2770941 -2042318
39332b042318M30545q2177p77878l03038R19047O19091j182614j221310J742810
$$ -2042318 -1611773 -1693950 -2471828 -2774866 -1855819 -1236728 -2419342 -3640652 -1897842
39323a897842L787796J155784l670989n171027k591548k11527l54103p22090O97293
$$ -1897842 1889954 3045738 -625251 -5796278 -8387826 -8599353 -8953456 -9675546 -8978253
39314h978253K362400K392770J614760J536924J986282K381384K873964K839183
$$ -8978253 -6615853 -4223083 -2608323 -1071399 914883 3296267 6170231 9009414
39306I009414R01352k068946k873630o66282J264352M38628j250882j424929j237062
$$ 9009414 9910766 7841820 4968190 4301908 5566260 6004888 4754006 3329077 2092015
39297B092015k109249j805541J657146M799555K894443k053513l506250l67849
$$ 2092015 -17234 -1822775 -165629 4633926 7528369 5474856 1968606 1600757
39289A600757J401762j633100n154736m231437o24844J040128O82924J605554
$$ 1600757 3002519 1369419 -3785317 -8016754 -8641598 -7601470 -6918546 -5312992
39281e312992M033070M671362K299533l32548q36517k08882l79361j206026j456604
$$ -5312992 -1279922 3391440 5690973 5358425 4521908 4313026 3933665 2727639 1271035
39272A271035j112649j012100j139686q61445m13737o55825j396840j440148o04777
$$ 1271035 158386 -853714 -1993400 -2854845 -3268582 -3924407 -5321247 -6761395 -7366172
39263g366172j72062n15682J00651K750221N178616M325252R52383j038116q6726
$$ -7366172 -7538234 -8053916 -7953265 -5203044 -24428 4300824 5253207 4215091 4128365
39254D128365J197079N29300q34385j008885o25022p46806l61216J183867J715700
$$ 4128365 5325444 5854744 5020359 4011474 3386452 2639646 2278430 3462297 5177997
39245E177997l40120k251556p88659J957137J300999k421461m135828j909019
$$ 5177997 4837877 2586321 1797662 3754799 5055798 2634337 -1501491 -3410510
39237c410510P29384J135169Q93316J185122J20201k614643l295804O5487L544635
$$ -3410510 -2681126 -1545957 -652641 532481 652682 -1961961 -5257765 -5192278 -1647643
39228a647643K885644j64221j338974n89021n33842p10016J107872L258506J731868
$$ -1647643 1238001 1073780 -265194 -854215 -1388057 -2098073 -990201 2268305 4000173
39219D000173k688508m403604j240385K232555J588167j513835k948780k276180
$$ 4000173 1311665 -3091939 -4332324 -2099769 -511602 -2025437 -4974217 -7250397
39211g250397j899669k230842j284962J503273L978161M152503K527552R18050
$$ -7250397 -9150066 -11380908 -12665870 -11162597 -7184436 -3031933 -504381 413669
39203D13669J54192k39055n76003j57848J635907L776070M116965J953799q27805
$$ 413669 567861 328806 -247197 -405045 1230862 5006932 9123897 11077696 10249891
39194A0249891k013930j751115j821928k774556l280184k369729r14128l65457
$$ 10249891 8235961 6484846 4662918 1888362 -1391822 -3761551 -4675679 -5041136
39186e041136q71757j179144j10111K023480L467513K860519J066121L04795J191346
$$ -5041136 -5912893 -7092037 -7202148 -5178668 -1711155 1149364 2215485 2520280 3711626
39177C711626J931207J123480k54060q57550j196884j984565j969377j1132J937244
$$ 3711626 5642833 6766313 6512253 5654703 4457819 2473254 503877 492745 2429989
39168B429989J009865k037845l679267k769073j480356r73333J55183K244386
$$ 2429989 3439854 1402009 -2277258 -5046331 -6526687 -7500020 -7344837 -5100451
39160e100451L119748J857969O07115O95357K32459j935867l106432q32489K499407
$$ -5100451 -1980703 -122734 484381 1179738 1412197 -523670 -3630102 -4462591 -1963184
39151a963184L017876J275162O33553J199295J07538k562961l144416n13208J718466
$$ -1963184 1054692 2329854 2963407 4162702 4270240 1707279 -1437137 -1950345 -231879
39142b31879R88666k35132J106264L516246L504555J000437j280989k383867l396961
$$ -231879 756787 521655 1627919 5144165 8648720 9649157 8368168 5984301 2587340
39133B587340l941155k202348J148745K573808N55646j891718j447891Q93082
$$ 2587340 -1353815 -3556163 -2407418 166390 722036 -1169682 -2617573 -1724491
39125a724491J654974p3623j890689j817254m53262P26447J271270J389934J178451
$$ -1724491 -69517 -143140 -2033829 -3851083 -4304345 -3577898 -2306628 -916694 261757
39116B61757R14705J031942J220834N76376q05346j458742n14758R64539J492995
$$ 261757 1176462 2208404 3429238 4005614 3200268 1741526 1226768 2191307 3684302
39107C684302J072985N54087o6320j314173k636882k592104p90606J360028K139451
$$ 3684302 4757287 5311374 5245054 3930881 1293999 -1298105 -2088711 -728683 1410768
39098A410768J198755l11988r79028o25405o20664k036893l483724k230137J844091
$$ 1410768 2609523 2297535 1318507 693102 72438 -1964455 -5448179 -7678316 -5834225
39089e834225N191241M947832K629660J358646J035772o27497l207212l515647
$$ -5834225 -642984 4304848 6934508 8293154 9328926 8701429 5494217 1978570
39081A978570p54401J903422J962211O08307l11685j109849k138355j910294J25663
$$ 1978570 1224169 3127591 5089802 5698109 5386424 4276575 2138220 227926 353589
39072C53589J541321M85227j062783p10217j3415j549322l529869k164431J399591
$$ 353589 1894910 2380137 1317354 607137 593722 -955600 -4485469 -6649900 -5250309
39063e250309J868536j754537l760286m1415N534177O434050K142132k234937
$$ -5250309 -3381773 -5136310 -8896596 -8938011 -3403834 3030216 5172348 2937411
39055B937411l265987k256254j505874r99462L05335K052100K611161R92992j778500
$$ 2937411 -328576 -2584830 -4090704 -5090166 -4784831 -2732731 -121570 871422 -907078
39046i07078l114551j302479K048329L111283M24300k824507k690299L70833K398076
$$ -907078 -4021629 -5324108 -3275779 -164496 259804 -2564703 -5255002 -4884169 -2486093
39037b486093J423887n34749j209752j065031j340204j450948l41556J086860
$$ -2486093 -1062206 -1596955 -2806707 -3871738 -5211942 -6662890 -7004446 -5917586
39029e917586J153600J78594j72563P2489p28512k455634k492879M12924L649195
$$ -5917586 -4763986 -4585392 -4757955 -4685466 -5413978 -7869612 -10362491 -9949567 -6300372
39020f300372L943788J651052k59966n25998m61776q74851q16547L0954K02668
$$ -6300372 -2356584 -705532 -965498 -1491496 -1953272 -2828123 -3644670 -3613716 -3411048
39011c411048j016115j845269m90669J971260K959942J791371J01086n00210K77870
$$ -3411048 -4427163 -6272432 -6763101 -4791841 -1831899 -40528 60558 -439652 -161782
39002a61782J862307L108198K698449P44206o06057K15530J609975Q31363j832164
$$ -161782 1700525 4808723 7507172 8251378 7645321 7860851 9470826 10302189 8470025
38993H470025l217736j689482R29748K224506J741032P0140k305911m217582l990996
$$ 8470025 5252289 3562807 4492555 6717061 8458093 8528233 6222322 2004740 -1986256
38984a986256j769715J12089L16166K36144J222280K123674J464240K06234K5971
$$ -1986256 -3755971 -3643882 -3327716 -3091572 -1869292 254382 1718622 1924856 1950827
38975A950827K89433o77609k292022k355785n12892J405456K219137K244853J566721
$$ 1950827 2240260 1562651 -729371 -3085156 -3598048 -2192592 26545 2271398 3838119
38966C838119J4962j069253K44998L149060M158146J570154k192992l887269l267759
$$ 3838119 3853081 2783828 3028826 6177886 10336032 11906186 9713194 5825925 2558166
38957B558166k240715j774454j358852o31217M6955L32780J92144l49441j126651
$$ 2558166 317451 -1457003 -2815855 -3447072 -3400117 -3067337 -2875193 -3224634 -4351285
38948d351285j754729j938637j528165l36471J382920K462598J955491P09423
$$ -4351285 -6106014 -8044651 -9572816 -9909287 -8526367 -6063769 -4108278 -3398855
38940c398855M50947J189183J110631n91755k463689k927041k003436l13004J736467
$$ -3398855 -2947908 -1758725 -648094 -1239849 -3703538 -6630579 -8634015 -8947019 -7210552
38931g210552K947639J713377j270887k801708j340385P13268Q90633N03559J875762
$$ -7210552 -4262913 -2549536 -3820423 -6622131 -7962516 -7249248 -6358615 -5855056 -3979294
38922c979294L783101L273557Q01604m39378J20014j31346j818985k064378M72469
$$ -3979294 -196193 3077364 3878968 3439590 3559604 3428258 1609273 -455105 17364
38913A7364K772649J857568r22974k391854j959353j058147j70542Q96861J269394
$$ 17364 2790013 4647581 3724607 1332753 -626600 -1684747 -1855289 -958428 310966
38904C10966K68995n69884O67212L073894L928873K416499J23728j679045k910032
$$ 310966 579961 10077 677289 3751183 7680056 10096555 10220283 8541238 5631206
38895E631206l176748j939687k62767q433r72853j090677J17275P10255k98536
$$ 5631206 2454458 514771 252004 243571 -729282 -1819959 -1702684 -992429 -1290965
38886a290965j098024J37165K538395L963703L567642J804938n16726k001072
$$ -1290965 -2388989 -2251824 286571 4250274 7817916 9622854 9106128 7105056
38878G105056j207648J131849K084881K56215k135533k645038k125461k508318
$$ 7105056 5897408 7029257 9114138 9370353 7234820 4589782 2464321 -43997
38870d3997k934397j344801J224641J669257q6857p36801J145501L031827K733716
$$ -43997 -2978394 -4323195 -3098554 -1429297 -1516154 -2252955 -1107454 1924373 4658089
38861D658089J419549O90652k06736j932709k530781l33513K430891K066272j488139
$$ 4658089 6077638 6768290 6561554 4628845 2098064 1764551 4195442 6261714 4773575
38852D773575m702363n000262k859947J4922K136873K237180L50899j179221j49211
$$ 4773575 71212 -4929050 -7788997 -7774075 -5637202 -3400022 -3049123 -4228344 -4377555
38843d377555K110932K299969K22915n58648J991401N133732M953850J257226
$$ -4377555 -2266623 33346 256261 -302387 1689014 6822746 11776596 13033822
38835A3033822k808996m629718m046745k406671j115171o59958k88781Q30332
$$ 13033822 10224826 5595108 1548363 -858308 -1973479 -2633437 -2922218 -2091886
38827b091886K013206J836361O42855M27828J610151K043070M61109j185206o45869
$$ -2091886 -78680 1757681 2400536 2828364 4438515 6481585 6942694 5757488 5111619
38818E111619J136485J612623L79573r22697j449291j536153j022579L16609J087105
$$ 5111619 6248104 7860727 8240300 7317603 5868312 4332159 3309580 3626189 4713294
38809D713294m04521l139184m151545k629220r28502r44570j745628j759799j216596
$$ 4713294 4308773 1169589 -2981956 -5611176 -6539678 -7484248 -9229876 -10989675 -12206271
38800a2206271j024494q43536J32950J537766K434836K825976L222151L267140
$$ -12206271 -13230765 -14074301 -13941351 -12403585 -9968749 -7142773 -3920622 -653482
38792f53482K166743L12393q07000n67051r3309n94928j421965p36391J774328
$$ -653482 1513261 1825654 1018654 451603 358294 -236634 -1658599 -2394990 -620662
38783f20662L806732K959452j07179k302454j942792m85468O3599k15157k71896
$$ -620662 3186070 6145522 6038343 3735889 1793097 1307629 1371228 1156071 884175
38774H84175k51316p41872j022812j89278P00846j11440k029131k649603j350424
$$ 884175 632859 -109013 -1131825 -1321103 -620257 -731697 -2760828 -5410431 -6760855
38765f760855L1840L63056O54917J718401K649312K602148K080077J478530K86310
$$ -6760855 -6729015 -6365959 -5711042 -3992641 -1343329 1258819 3338896 4817426 5103736
38756E103736j190353j308077L29541J618191Q97353n15084n62559K46731n1103
$$ 5103736 3913383 2605306 2934847 4553038 5450391 4935307 4372748 4619479 4568376
38747D568376j452628k032547j146146m48315j305174k719134k654946q02990
$$ 4568376 3115748 1083201 -62945 -511260 -1816434 -4535568 -7190514 -7993504
38739g993504P30148j99112k790521l580452o35991L356874M047909J158561j167993
$$ -7993504 -7263356 -7462468 -10252989 -13833441 -14469432 -11112558 -7064649 -5906088 -7074081
38730g074081j59807K153512K572463J238907M87175J126488K163912K887458
$$ -7074081 -7233888 -5080376 -2507913 -1269006 -781831 344657 2508569 5396027
38722E396027L027391J860877p74034l309538m028404l085514j633967j79732
$$ 5396027 8423418 10284295 9510261 6200723 2172319 -913195 -2547162 -2726894
38714b726894P39311o6527k353976l409633j544351Q90787P51588j026888j021136
$$ -2726894 -1987583 -2054110 -4408086 -7817719 -9362070 -8471283 -7719695 -8746583 -9767719
38705i767719J240445K969065K737433J792446Q79274n04456j378894K80211L351787
$$ -9767719 -8527274 -5558209 -2820776 -1028330 -149056 -653512 -2032406 -1752195 1599592
$$ [...]
##END NTUPLES=NMR SPECTRUM
##END=
