##TITLE=31Pdec_DE-82_TFA
 CDCl3, 64 sc
 4.3.2025
##JCAMPDX= 6.0         $$ Bruker NMR JCAMP-DX V2.0
##DATA TYPE= NMR SPECTRUM
##DATA CLASS= NTUPLES
##ORIGIN= UXNMR, Bruker Analytische Messtechnik GmbH
##OWNER= root
$$ XWIN-NMR		Version 3.5
$$ Tue Mar  4 16:14:01 2025 Russian Standard Time (UT+4h)  she@DPX200
##.OBSERVE FREQUENCY= 81.013821
##.OBSERVE NUCLEUS= ^31P
##.ACQUISITION MODE= SIMULTANEOUS
##.ACQUISITION SCHEME= undefined
##.AVERAGES= 64
##.DIGITISER RES= 17
##SPECTROMETER/DATA SYSTEM= spect
##.PULSE SEQUENCE= zgpg30
##.SOLVENT NAME= D2O
##.SHIFT REFERENCE= (INTERNAL, D2O, 0, 198.062)
##AUDIT TRAIL= $$ (NUMBER, WHEN, WHO, WHERE, WHAT)
$$ ##TITLE= Audit trail, XWIN-NMR		Version 3.5
$$ ##JCAMPDX= 5.01
$$ ##ORIGIN= Bruker BioSpin GmbH
$$ ##OWNER= she
$$ F:/spectra/data/she/nmr/P31/2/pdata/1/auditp.txt
$$ ##AUDIT TRAIL=  $$ (NUMBER, WHEN, WHO, WHERE, WHAT)
(   1,<2025-03-04 16:12:52.46 +0400>,<she>,<DPX200>,
      <created by zg, POWCHK disabled, PULCHK disabled
       configuration hash MD5:
       00 E9 B6 7A A2 85 ED C7 34 08 36 98 17 FE 4E 26
       data hash MD5: 32K
       A2 51 BA F4 87 D9 88 FC FB DD 56 00 CE 31 7F 40>)
(   2,<2025-03-04 16:12:55.21 +0400>,<she>,<DPX200>,
      <Start of raw data processing
       efp BC_mod = 2 LB = 1.5 FT_mod = 6 PKNL = 1 PHC0 = 1858.167 PHC1 = -137.9056 SI = 64K 
       data hash MD5: 64K
       E9 B1 A5 32 0B 96 4B BC B7 73 EE D3 DD 91 F1 B8>)
(   3,<2025-03-04 16:13:17.06 +0400>,<she>,<DPX200>,
      <pk PHC0 = -2.128685 PHC1 = 0 
       data hash MD5: 64K
       46 E9 27 78 B6 94 82 92 42 0E F0 A8 D7 91 DD 8C>)
(   4,<2025-03-04 16:13:21.56 +0400>,<she>,<DPX200>,
      <abs ABSG = 5 
       data hash MD5: 64K
       14 17 A5 CC 41 C5 7A D8 66 21 F7 E7 C1 01 B3 B3>)
$$ ##END=
$$ 
$$ hash MD5
$$ A7 D3 AF 4F 3F 03 BF 82 67 DC C4 9B 40 77 F2 CF
##$RELAX= 
##$RELAX= 
##$RELAX= 
##$RELAX= 
##$RELAX= 
##$RELAX= 
##$RELAX= 
##$RELAX= 
$$ Bruker specific parameters
$$ --------------------------
##$DU= <F:/spectra>
##$EXPNO= 2
##$NAME= <P31>
##$PROCNO= 1
##$TYPE= <nmr>
##$USER= <she>
##$AMP= (0..31)
100 100 100 100 100 100 100 100 100 100 100 100 100 100 100 100 100 100 
100 100 100 100 100 100 100 100 100 100 100 100 100 100 
##$AQSEQ= 0
##$AQ_mod= 1
##$AUNM= <au_zg>
##$AUTOPOS= <>
##$BF1= 81.014009
##$BF2= 200.13
##$BF3= 200.13
##$BF4= 200.13
##$BF5= 200.13
##$BF6= 200.13
##$BF7= 200.13
##$BF8= 200.13
##$BYTORDA= 1
##$CFDGTYP= 0
##$CFRGTYP= 5
##$CHEMSTR= <none>
##$CNST= (0..31)
1 1 145 1 1 1 1 1 1 1 1 1 1 1 1 1 1 1 1 1 1 1 1 1 1 1 1 1 1 1 1 1 
##$CPDPRG= <waltz16>
##$CPDPRG1= <>
##$CPDPRG2= <waltz16>
##$CPDPRG3= <>
##$CPDPRG4= <mlev>
##$CPDPRG5= <mlev>
##$CPDPRG6= <mlev>
##$CPDPRG7= <mlev>
##$CPDPRG8= <mlev>
##$CPDPRGB= <>
##$CPDPRGT= <>
##$D= (0..31)
0 1 0 0 0 0 0 0 0 0.06 0 0.03 2e-05 3e-06 0 0 0.0002 0 0 0 0 0 0 0 0 0 
0 0 0 0 0 0 
##$DATE= 1741090371
##$DBL= (0..7)
120 120 120 11 120 120 24 19 
##$DBP= (0..7)
150 150 150 150 150 150 150 150 
##$DBP07= 0
##$DBPNAM0= <>
##$DBPNAM1= <>
##$DBPNAM2= <>
$$ [...]
##$SUBNAM3= <"">
##$SUBNAM4= <"">
##$SUBNAM5= <"">
##$SUBNAM6= <"">
##$SUBNAM7= <"">
##$SUBNAM8= <"">
##$SUBNAM9= <"">
##$SW= 400.765351723535
##$SWIBOX= (0..15)
0 1 3 0 0 0 0 0 0 0 0 0 0 0 0 0 
##$SW_h= 32467.5324675325
##$TD= 32768
##$TD0= 1
##$TE= 0
##$TE2= 300
##$TE3= 300
##$TEG= 300
##$TL= (0..7)
0 120 53 12 22 120 120 120 
##$TP= (0..7)
150 150 150 150 150 150 150 150 
##$TP07= 0
##$TPNAME0= <>
##$TPNAME1= <>
##$TPNAME2= <>
##$TPNAME3= <>
##$TPNAME4= <>
##$TPNAME5= <>
##$TPNAME6= <>
##$TPNAME7= <>
##$TPOAL= (0..7)
0.5 0.5 0.5 0.5 0.5 0.5 0.5 0.5 
##$TPOFFS= (0..7)
0 0 0 0 0 0 0 0 
##$TUNHIN= 0
##$TUNHOUT= 0
##$TUNXOUT= 0
##$USERA1= <user>
##$USERA2= <user>
##$USERA3= <user>
##$USERA4= <user>
##$USERA5= <user>
##$V9= 5
##$VALIST= <valist>
##$VCLIST= <CCCCCCCCCCCCCCC>
##$VD= 0
##$VDLIST= <DDDDDDDDDDDDDDD>
##$VPLIST= <PPPPPPPPPPPPPPP>
##$VTLIST= <TTTTTTTTTTTTTTT>
##$WBST= 1024
##$WBSW= 4
##$XGAIN= (0..3)
0 0 0 0 
##$XL= 0
##$YL= 0
##$YMAX_a= 7867
##$YMIN_a= -20205
##$ZGOPTNS= <>
##$ZL1= 120
##$ZL2= 120
##$ZL3= 120
##$ZL4= 120
##$ABSF1= 198.0616
##$ABSF2= -202.7028
##$ABSG= 5
##$ABSL= 3
##$ALPHA= 0
##$AQORDER= 0
##$ASSFAC= 0
##$ASSFACI= 0
##$ASSFACX= 0
##$ASSWID= 0
##$AUNMP= <proc_1d>
##$AZFE= 0.1
##$AZFW= 0.5
##$BCFW= 0
##$BC_mod= 2
##$BYTORDP= 0
##$COROFFS= 0
##$CY= -3
##$DATMOD= 1
##$DC= 0
##$DFILT= <>
##$DTYPP= 0
##$F1P= 0
##$F2P= 0
##$FCOR= 1
##$FTSIZE= 65536
##$FT_mod= 6
##$GAMMA= 0
##$GB= 0
##$INTBC= 1
##$INTSCL= 9.790993e-09
##$ISEN= 30
##$LB= 1.5
##$LEV0= 0
##$LPBIN= 0
##$MAXI= 10000
##$MC2= 0
##$MEAN= 0
##$ME_mod= 0
##$MI= 50
##$NCOEF= 0
##$NC_proc= -9
##$NLEV= 6
##$NOISF1= 182.463
##$NOISF2= 159.3651
##$NSP= 0
##$NTH_PI= 0
##$NZP= 0
##$OFFSET= 198.0616
##$PC= 4
##$PHC0= 1856.038
##$PHC1= -137.9056
##$PH_mod= 1
##$PKNL= yes
##$PPARMOD= 0
##$PSCAL= 0
##$PSIGN= 0
##$REVERSE= no
##$SF= 81.0140089999434
##$SI= 65536
##$SIGF1= 159.3651
##$SIGF2= -187.1042
##$SINO= 113.3802
##$SIOLD= 16384
##$SREGLST= <1H.CDCl3>
##$SSB= 0
##$STSI= 65536
##$STSR= 0
##$SW_p= 32467.5324675325
##$SYMM= 0
##$S_DEV= 0
##$TDeff= 32768
##$TDoff= 0
##$TI= <>
##$TILT= no
##$TM1= 0
##$TM2= 0
##$TOPLEV= 0
##$USERP1= <user>
##$USERP2= <user>
##$USERP3= <user>
##$USERP4= <user>
##$USERP5= <user>
##$WDW= 1
##$XDIM= 65536
##$YMAX_p= 490760336
##$YMIN_p= -218878102
$$ End of Bruker specific parameters
$$ ---------------------------------
##NTUPLES= NMR SPECTRUM
##VAR_NAME=  FREQUENCY,     SPECTRUM/REAL,   SPECTRUM/IMAG
##SYMBOL=    X,             R,               I
##VAR_TYPE=  INDEPENDENT,   DEPENDENT,       DEPENDENT
##VAR_FORM=  AFFN,          ASDF,            ASDF
##VAR_DIM=   65536,         65536,           65536
##UNITS=     HZ,            ARBITRARY UNITS, ARBITRARY UNITS
##FACTOR=    0.49542278885378, 1,            1
##FIRST=     16045.7642231865, 0,            0
##LAST=      -16421.768244346, 0,            0
##MIN=       -16421.768244346, -218878102,   0
##MAX=       16045.7642231865, 490760336,    0
$$ Real data points
##PAGE= N=1
##DATA TABLE= (X++(R..R)), XYDATA
$$ [...]
##PAGE= N=2
##DATA TABLE= (X++(I..I)), XYDATA
7396H158862J0415029P972489K538094k868052o870982q292555n165091J788311
7388G676105P366889O872072J385381m168723o415669n018992j227136K413571
7380H883498L022816Q21743l69520J358720K595819L2472l531439l200818J27001
7371I740292J412813k8840J91750L265792M202072o62678p770263j0644546o947864
7362g241472O15230P405475R373792N725119O21422q08984R08161P39817k370578
7353A4967982l453159Q2564L874441L861294K258023J703591n45499o191349r157069
7344G400819l715493M419980M787761j846810m499452Q36321N661995L365589
7336A6410710j004862o50572J768590K1019m536893n504280j851952J275002P08790
$$ plain form
7396 8158862 18573891 26546380 29084474 26216422 19345440 11052885 5887794 7676105
7388 7676105 15042994 21915066 23300447 19131724 12716055 7697063 6469927 8883498
7380 8883498 11906314 12728057 12358537 13717257 16313076 16345548 12814109 9613291 9740292
7371 9740292 11153105 11124265 11316015 14581807 18783879 18121201 10350938 -293608 -7241472
7362 -7241472 -6626242 779233 10153025 15878144 16499566 15690582 16598743 17338560 14967982
7353 14967982 11514823 11597387 15471828 19333122 21591145 23294736 22749237 16557888 7400819
7344 7400819 3685326 8105306 12893067 11046257 6546805 7383126 13045121 16410710
7336 16410710 15405848 14755276 16523866 16544885 12007992 6503712 4651760 5926762 6635552
7327F635552j448480k032267j55933K846009L778950k70088p073731r203847k781879
7318i705714O256422R121301M971193k58254l313071n418381n938366j864219
7310f149089N193677Q338401M540574q12875j756844K14533k59035l922446o194032
7301h07136l668221J834818N468424L995021j216152m976358l131962K769413
7293B67847P096342O806386M398823L379498L318556J406807k756110o278914
7285A7639235o430934l425796J35501J728672Q86022q88197k055662k333158j732939
7276C522744K39830K952684L715492J080557j846415o51205L917254O124389K607373
7267B1662703l481666o678293m874595K5865M287719M319849m14357n277829m415943
$$ plain form
7327 6635552 5187072 3154805 2998872 5844881 9623831 9353743 2280012 -6923835 -9705714
7318 -9705714 -3449292 5672009 10643202 10384948 7071877 1653496 -4284870 -6149089
7310 -6149089 -955412 7382989 11923563 11110688 9353844 9568377 9309342 5386896 -807136
7301 -807136 -4475357 -2640539 2827885 6822906 5606754 630396 -2501566 267847
7293 267847 7364189 14170575 18569398 21948896 25267452 26674259 23918149 17639235
7285 17639235 11208301 7782505 7918006 9646678 10532700 9644503 7588841 5255683 3522744
7276 3522744 3762574 6715258 10430750 11511307 9664892 9013687 12930941 19055330 21662703
7267 21662703 18181037 11502744 6628149 6654014 10941733 15261582 14847225 9569396 5153453
7258E153453J797481O573544N432011J228358j646173l576474o520007q502772
7250f0579o559906k826094k136655m375398m385555J84678N398397O444877L118415
7241e197820j246043l590918k852066r7791K057622J731146j48746j332449j301275
7232a1978340q98771K35632K892210N178286L730046j040153m134025k152100
7224h167215K157364L510280M66568l703691n153814k649340K196767N925940
7216e417141N294284M73061l992529l463985J152506L933828J189664l448137
7208d278449l339444K355767P096106N333966k44723k733083n69367J197553n99052
7199D219274k333776K01693M574800N107249J466225j176195m06924O417l250652
$$ plain form
7258 5153453 6950934 13524478 18956489 20184847 18538674 14962200 8442193 -60579
7250 -60579 -6620485 -9446579 -11583234 -15958632 -20344187 -20159509 -14761112 -8316235 -5197820
7241 -5197820 -6443863 -10034781 -12886847 -12984638 -10927016 -9195870 -9344616 -10677065 -11978340
7232 -11978340 -12877111 -12641479 -9749269 -4570983 -840937 -1881090 -6015115 -8167215
7224 -8167215 -6009851 -2499571 -2033003 -5736694 -10890508 -13539848 -11343081 -5417141
7216 -5417141 -122857 350204 -3642325 -7106310 -5953804 -2019976 -830312 -4278449
7208 -4278449 -7617893 -5262126 1833980 7167946 6923223 4190140 3620773 4818326 4219274
7199 4219274 1885498 2087191 6661991 11769240 13235465 12059270 11652346 11658763 8408111
7190H408111o996188n545040J169910O976421O793131J867046k892921m451944
7182E328526k993939L90110M450761O458004L535057k864677o353027k484724
7174E466091N081623Q535745N303656o0936l013206l689096l688711k840689j316122
7165I778355r52930j777569p82244K920853N317254L271629m50176j918764k208753
7156A3197655l866491m529397m47337N521842O348324J076874l618652k752495
7148A0930323J611619N031110N417867K294702l314666p138334n135974j6584
7140I680063J202809k451492m180631k40569M276121M234141K422929L300130
7132A8243501M434055J104379m445340n856129k725337n38013j182522o78453
$$ plain form
7190 8408111 1411923 -4133117 -2963207 4013214 10806345 12673391 9780470 5328526
7182 5328526 2334587 2724697 7175458 13633462 17168519 14303842 7950815 5466091
7174 5466091 10547714 19083459 24387115 24326179 21312973 17623877 13935166 11094477 9778355
7165 9778355 8825425 7047856 6265612 9186465 14503719 17775348 17325172 15406408 13197655
7156 13197655 9331164 4801767 4354430 9876272 16224596 17301470 13682818 10930323
7148 10930323 12541942 17573052 22990919 25285621 21970955 14832621 9696647 9680063
7140 9680063 10882872 8431380 4250749 4010180 8286301 12520442 14943371 18243501
7132 18243501 22677556 23781935 19336595 13480466 10755129 10217116 9034594 8356141
7124H356141K625387M114308P5119n818342o899320k017411L503277M403297N68073
7115H910529m260794o969214p359783o674013n315041k939351P2630K842484N355990
7106a6336563P797836Q836663P015114L903491K845807L876984L237134o59018
7098B0517448m239094l933039j146755N44338L16671n96247j714137k289568k67625
7089G191992M041632N765612J227387n878877q346611m181005K464386P369392
7081I653908Q691026M958746l544224j1420104j1836044m951068J655030K212656
7073d580074j416046m055639l216980O15936N683387Q897047P349386J979537
7065A1256554k668905l655802k143134j04854J975578L041370J130855k773194
$$ plain form
7124 8356141 10981528 15095836 15170955 9352613 2453293 435882 3939159 8342456 8910529
7115 8910529 4649735 -2319479 -9679262 -16353275 -21668316 -24607667 -24535037 -21692553 -16336563
7106 -16336563 -8538727 297936 7313050 11216541 14062348 17939332 21176466 20517448
7098 20517448 16278354 12345315 11198560 11742898 12059569 11463322 9749185 7459617 7191992
7089 7191992 11233624 16999236 18226623 12347746 4001135 -179870 2284516 9653908
7081 9653908 18344934 23303680 19759456 8339352 -3496692 -8447760 -6792730 -4580074
7073 -4580074 -5996120 -10051759 -13268739 -12652803 -6969416 1927631 9277017 11256554
7065 11256554 8587649 4931847 2788713 2683859 4659437 7700807 8831662 6058468
7057F058468m212477j194317K534620K916388J126406M28312N06794q27515k364178
7048D972501q28238K999506M103006J57896m841951n623992k126125R76148L16234
7039A04985k306069k548981P40197L766652K623508j316174l120756j148376Q88158
7030b316856l02720k919806l393257j695643k23249O82440K324860L695636K063044
7021b085551j990484l778671m23845M900711O611727L294515r99456j519312K091730
7012F101364N330954L419885l146682q196602o389314L17810M785796L275038
7004E498249p94890k500463j641922r63150q65915L24903K159653K428335J698247
6995E343047L083906O358663O759721K192139k488371k330250q2919j825567o817935
$$ plain form
7057 6058468 1845991 651674 3186294 6102682 7229088 7657400 8164194 7336679 4972501
7048 4972501 4144263 7143769 11246775 11404671 6562720 938728 -1187397 -211249 104985
7039 104985 -2201084 -4750065 -4009868 -243216 2380292 1064118 -2056638 -3205014 -2316856
7030 -2316856 -2619576 -5539382 -8932639 -10628282 -10851531 -10169091 -7844231 -4148595 -2085551
7021 -2085551 -4076035 -7854706 -8278551 -3377840 3233887 6528402 5528946 4009634 6101364
7012 6101364 11432318 14852203 11705521 3508919 -2880395 -2562585 2223211 5498249
7004 5498249 4703359 2202896 560974 -402176 -1268091 -943188 1216465 3644800 5343047
6995 5343047 8426953 14785616 21545337 23737476 21249105 18918855 18835936 17010369 10192434
6986A0192434q175630l721020N05418l01234k743595j448408K593581M694623
6978A596169L887407K349442n4844m709931q770298o852774Q99248P333850O637510
6969B315779P94945l704413k914294J788433N518216L854287k671292p931012
6961b949351o578869o58442L395925L589048L486941M529674L330220j229884
6953F915262m179550j837264J657420L26106m313259n453686r64611M112071M786986
6944A049475J482397k199345l513734j723969J941882M668572M393662K231455
6936H330395J017073J520249J797097K14303k486415m104213k801685J399869
6928D886673N672368N968351J475096l240033k696351L024855Q026805O884845
$$ plain form
6986 10192434 2016804 -1704216 -1198798 -1500032 -4243627 -5692035 -3098454 1596169
6978 1596169 5483576 7833018 7778174 3068243 -5702055 -12554829 -11655581 -4321731 2315779
6969 2315779 3110724 -593689 -3507983 -1719550 3798666 7652953 4981661 -2949351
6961 -2949351 -9528220 -10186662 -6790737 -3201689 285252 4814926 8145146 6915262
6953 6915262 2735712 898448 2555868 2881974 -1431285 -6884971 -7849582 -3737511 1049475
6944 1049475 2531872 332527 -3181207 -4905176 -2963294 1705278 6098940 8330395
6936 8330395 9347468 10867717 12664814 12879117 10392702 6288489 3486804 4886673
6928 4886673 10559041 16527392 18002488 14762455 12066104 15090959 23117764 30002609
6920C0002609Q0083o558902p156150j496080L959295K546038m264663p876232
6912I235998l792413J885011J105038m278492n376570L00265N321158L647222
6904H047217r12153j205238K735445M409990K17864o045095q117665m232791J548837
6895c553589M174376L233292K896116N621547P966593N514308L78056j029627
6887B5201072K142466L240470j698174p257059o423736p69880K748737K307676
6879A9491572J918630K620696J94428o603017j1707911r421026k364283K383849
6871c487062K461205J180806Q79824J97762j629936k130876O33180M447488N694129
6862H246520M147651K396841J295989j046615n258229q276402o656202j048696
$$ plain form
6920 30002609 30082692 23523790 16367640 14871560 18830855 21376893 17112230 9235998
6912 9235998 5443585 7328596 8433634 4155142 -1221428 -921163 4399995 8047217
6904 8047217 7135064 5929826 8665271 13075261 13293125 7248030 -869635 -5102426 -3553589
6895 -3553589 620787 3854079 6750195 12371742 20338335 25852643 26230699 25201072
6887 25201072 27343538 30584008 28885834 21628775 15205039 14435159 17183896 19491572
6879 19491572 21410202 24030898 24225326 17622309 5914398 -3506628 -5870911 -3487062
6871 -3487062 -1025857 154949 1034773 1232535 -397401 -2528277 -1895097 2552391 8246520
6862 8246520 12394171 14791012 16087001 15040386 9782157 1505755 -5150447 -6199143
6854f199143M302642O019924M171458P98786k410201m484331m564276k292405
6846d657546J199924L571306L235379J061708m43736P402J077889J012002M84464
6837F548792J520790L675541L668385K2449l970621m014373l55655K696314K224349
6828A2015971n64291k906289l530373k712119j183702J86124P97593R15156J029446
6819D047516Q03336m5593j46472K264828O248728Q297643O171978R53548m961388
6810B3634124r643902j0857268o587751J534384P653229P364840K793921n34574
6802A5357003q09035q80571k546892l524355j382908K264121L725906K019315
6794A4222584m47816j473110j401899j644231k435159k991341l018452k832971
$$ plain form
6854 -6199143 -1896501 4123423 8294881 9093667 6683466 2199135 -2365141 -4657546
6846 -4657546 -3457622 113684 3349063 4410771 3967035 3974437 5052326 6064328 6548792
6837 6548792 8069582 11745123 15413508 15435957 11465336 7450963 7095308 9791622 12015971
6828 12015971 11451680 8545391 5015018 2302899 1119197 1305321 2102914 3018070 4047516
6819 4047516 4850852 4805259 4658787 6923615 13172343 21469986 27641964 28595512 23634124
6810 23634124 13990222 3132954 -3454797 -1920413 5732816 13097656 15891577 15357003
6802 15357003 14547968 13667397 11120505 7596150 6213242 8477363 12203269 14222584
6794 14222584 13774768 12301658 10899759 9255528 6820369 3829028 810576 -2022395
6786b022395k101255K79367M269469P363422O508098J700571l273235m603718
6778H120324k659168j399719l296722n842026m358362J849386P753567Q092623
6770H259903L511009o19158j090039n2398n80253j831290j134457Q04934L46676
6761G614927l292697n892411l394017K764212P201995O367211J327192m264135
6753H432277p383382p247263n277628l729595l480220l002299j55145M930054
6745a6913201R342604R969403O266417M94473m261888o080027m784844j447067
6737g414130K270745M594216M266129J451195j729434k113547J823123P404520
6729A0552817Q890754L274193m938075p463554k283109K998300J037630m692969
$$ plain form
6786 -2022395 -4123650 -3844283 425186 7788608 14296706 15997277 12724042 8120324
6778 8120324 5461156 4061437 764715 -5077311 -9435673 -7586287 167280 8259903
6770 8259903 11770912 11151754 10061715 10009317 9429064 7597774 6463317 7268251 7614927
6761 7614927 4322230 -1570181 -4964198 -2199986 5002009 11369220 12696412 8432277
6753 8432277 1048895 -6198368 -11475996 -15205591 -18685811 -21688110 -21843255 -16913201
6745 -16913201 -7570597 2398806 8665223 9159696 4897808 -1182219 -5967063 -7414130
6737 -7414130 -5143385 -549169 3716960 5168155 3438721 1325174 3148297 10552817
6729 10552817 19443571 22717764 17779689 10316135 8033026 11031326 12068956 7375987
6721G375987m768766J709189M841000j515592j0030150j0123086k586610L150072
6713a1947956L129074K074273L368778M184242K379962J212247L834307Q147937
6705A6382864J0284947R139342M973877j966843q541721r178353l276893J903713
6697A9720933K47226m897710o323342l553514j768459k383259j705138J247827
6689E84564K412883k15764k854465j951145O03932J502234J597432L453327N581074
6680A0714072L708921k296139o650313m473210J798565N138416K461985j969059
6672H433238k502115O80127K639484R14806j694739k114679j300776j503476k018674
6663A533196q02942J252492J125616j509662l167115q90697L984790O903209M266412
$$ plain form
6721 7375987 2607221 4316410 9157410 7641818 -2388332 -12511418 -15098028 -11947956
6713 -11947956 -8818882 -6744609 -3375831 808411 3188373 4400620 8234927 16382864
6705 16382864 26667811 35807153 40781030 38814187 30272466 21094113 17817220 19720933
6697 19720933 19968159 15070449 8747107 5193593 3425134 1041875 -663263 584564
6689 584564 2997447 2781683 -72782 -2023927 -1419995 82239 1679671 5132998 10714072
6680 10714072 14422993 12126854 5476541 1003331 2801896 7940312 10402297 8433238
6672 8433238 5931123 6611250 9250734 10165540 8470801 6356122 5055346 3551870 1533196
6663 1533196 730254 1982746 3108362 1598700 -1568415 -2459112 1525678 8428887 12695299
6654A2695299k852577q538855p185194j68311M634947K092823l701376n259885
6646h283129j693162J668887K235351K886952N158972N624628J811243k940415
6638F469327m285247l187962l248680m077626k167639K366846M770034K458284
6630i02663r81392q42134K264729L915626K411122M14626J01m23590k437852l724813
6620c06240j189649L443480N161817K829331P69274J987683L715043K029886k333431
6611A6107194n693491o308753m616853j167183K414378K973790J24798j517520
6603B316360J266897M300385J869635l615078m622658k29557K704888O96004j768120
6594B918756q92629O79367L02198N71915L416697M984627K007961j746008j358172
$$ plain form
6654 12695299 9842722 1303867 -5881327 -6049638 -1414691 678132 -3023244 -8283129
6646 -8283129 -9976291 -8307404 -6072053 -3185101 1973871 7598499 9409742 6469327
6638 6469327 2184080 -1003882 -4252562 -8330188 -10497827 -8130981 -3360947 -902663
6630 -902663 -1884055 -2726189 -461460 3454166 5865288 6279914 6280015 5856425 3418573 -306240
6620 -306240 -1495889 1947591 7109408 9938739 10708013 12695696 16410739 18440625 16107194
6611 16107194 10413703 4104950 -511903 -1679086 735292 3709082 3833880 2316360
6603 2316360 3583257 7883642 9753277 6138199 1515541 1285984 3990872 4686876 2918756
6594 2918756 2026127 2705494 3007692 3579607 6996304 11980931 13988892 12242884 10884712
6585A0884712J214069J345822J31062J359382L097546M93193m399108m302747
6577I823931J145087L429490j893095p650298n131052L490665Q247571M136910
6569A5599209m105305q934064p727060l330666M19412K366857L660940M654794
6561B604117L833389R63492o78006J666285N017832L698456k135115n674341k929303
6552F366806J512782J406632k217241l452654n40497K442884K313562O80917M47298
6543H960489J952685L796350M783318L808154J89235m319690n841330k732494
6535A0596717J512362J793767k441969o320479n157628K35604M634575M301173
6527I154122R10931p74297J349791M309741L728979j037076o464245q935292p772284
$$ plain form
6585 10884712 12098781 13444603 13575665 14935047 18032593 18525786 14126678 9823931
6577 9823931 10969018 14398508 12505413 4855115 -275937 3214728 11462299 15599209
6569 15599209 11493904 2559840 -5167220 -8497886 -8078474 -5711617 -2050677 2604117
6561 2604117 6437506 7400998 6722992 8389277 13407109 17105565 14970450 9296109 6366806
6552 6366806 7879588 9286220 7068979 3616325 3075828 5518712 7832274 8513191 8960489
6543 8960489 10913174 14709524 19492842 23300996 23490231 19170541 13329211 10596717
6535 10596717 12109079 13902846 11460877 5140398 -17230 218374 4852949 9154122
6527 9154122 10065053 9290756 10640547 14950288 18679267 17642191 11177946 2242654 -5529630
6518e529630m363647j80438L515346N483039N368745M040259K168193n86295l990939
6509E924633o101350n303106k596831j77681J281841J986288J047750j716490
6501e654946k973646P94316O820278P833355K137633l093395j955112J541378
6493E449861J52996n002689o388471j879732K749201L485269L002076L889090
6485E457601L641244J68852l021292j890341J535090K284271m19263l436849n024009
6476g04696n618574m913623k320369N96777J796771J947370K587716K462088l91476
6467d558016l988645m224793q97840K421141M228369O046165P399044N301396
6459A1726821L44988j915542J412226N688452M951235j39098m092636l890586
$$ plain form
6518 -5529630 -9893277 -10073715 -6558369 -1075330 4293415 8333674 10501867 9915572 5924633
6509 5924633 -176717 -5479823 -8076654 -8254335 -6972494 -4986206 -3938456 -5654946
6501 -5654946 -8628592 -7834276 -1013998 6819357 8956990 5863595 3908483 5449861
6493 5449861 5602857 600168 -5788303 -7668035 -4918834 -1433565 1568511 5457601
6485 5457601 9098845 9267697 6246405 4356064 5891154 8175425 7756162 4319313 -704696
6476 -704696 -6323270 -11236893 -13557262 -12960485 -11163714 -9216344 -6628628 -4166540 -4558016
6467 -4558016 -8546661 -12771454 -13669294 -11248153 -7019784 -973619 6425425 11726821
6459 11726821 12071809 10156267 11568493 17256945 22208180 22069082 17976446 14085860
6451A4085860r99009J942497K864020K26755m946977p814030m295588L084428
6443D147956P376359N586797J557893l19796o50017k126253m064477l453144m18789
6434G636529J108042j008193l779441l343388n98650K94019j605530k502870Q1573
6425c717909L036828K285591n42080k20694L788078N829748K338649k527256k734345
6416G536610R98343K633697k84762l603565l021326J86170J805640N93453q15205
6407F029055J72282L206888N751246N588731K793092j86864r20844O9481k42231
6398B2260836l159494n655026l650332K522598P657952O971950P62318o344569
6390B1366233r615382p381630j386508M741116P536688N347980q50236p571754
$$ plain form
6451 14085860 13086851 15029348 17893368 18120123 13173146 5359116 1063528 4147956
6443 4147956 11524315 17111112 18669005 18349209 17699192 15572939 11508462 8055318 7636529
6434 7636529 8744571 7736378 3956937 613549 14899 308918 -1296612 -3799482 -3717909
6425 -3717909 -681081 1604510 1062430 841736 4629814 10459562 12798211 10270955 7536610
6416 7536610 8534953 11168650 10883888 7280323 4258997 4445167 6250807 6844260 6029055
6407 6029055 6201337 9408225 15159471 20748202 23541294 23354430 22433586 22503067 22260836
6398 22260836 19101342 13446316 9795984 12318582 19976534 26948484 27710802 21366233
6390 21366233 11750851 4369221 2982713 7723829 15260517 20608497 19758261 12186507
6382A2186507j0441450p574915j970466J158262L63190q37520r6709k29473l567975
6373a1010549n638637p11419P669573R464761K725541k637158O16874O385184
6365F864170N134514j856717n943160m260649r13783J882416M870160N837393
6357A1614344J949205k802826j930040K070237Q97610m406475l582687M732828
6349H542196Q139361N0729q285327m905104M191100N408361j169290m220620k37487
6340G513919L369257K425982P42382N75674m64873j865374L04541M649683M516124
6331B1767315j141924n649530n468666m511320n100315l535024J549181M673515
6323B583232K189892j477169j164484J465787K392523J761050J317114K96100
$$ plain form
6382 12186507 1745057 -5829858 -7800324 -6642062 -6278872 -7116392 -7213101 -7442574 -11010549
6373 -11010549 -16649186 -17360605 -9691032 -226271 2499270 -137888 478986 6864170
6365 6864170 11998684 10141967 4198807 -61842 -975625 906791 5776951 11614344
6357 11614344 13563549 10760723 8830683 10900920 11798530 7392055 3809368 8542196
6349 8542196 16681557 16732286 8446959 3541855 7732955 13141316 11972026 7751406 7513919
6340 7513919 10883176 13309158 14051540 14627214 14162341 12296967 12601508 17251191 21767315
6331 21767315 20625391 14975861 9507195 4995875 -104440 -3639464 -2090283 2583232
6323 2583232 4773124 3295955 2131471 3597258 5989781 7750831 9067945 9364045
6315I364045j732587k486462j307079j161902k776005k151208K035315M317926
6307D102043P34286m079326l655666J082338M962252O456295O522505L815856
6299A9940583k337630p475955p057529l473343k090685k961103k500534p62182
6291h718378m54693o62755J848867O183846Q066747O082545K110250k660769o892573
6282D903087o851043j347631L399077R96595m806555m753863K141783P708890
6274A390340P162317L887339J048063k605226o469170o255540j803095Q61609
6266b783363r69157k152950J257176N313207N373560L604323L635255L480986
6258A6759037L32626k378099j16721L827167K350690m013372p229534l614176
$$ plain form
6315 9364045 7631458 5144996 3837917 2676015 -99990 -2251198 -215883 4102043
6307 4102043 4836329 757003 -2898663 -1816325 3145927 9602222 16124727 19940583
6299 19940583 17602953 10126998 3069469 -403874 -2494559 -5455662 -7956196 -8718378
6291 -8718378 -9173071 -9835826 -7986959 -1803113 6263634 12346179 14456429 11795660 4903087
6282 4903087 -1947956 -3295587 103490 1100085 -3706470 -8460333 -6318550 1390340
6274 1390340 8552657 12439996 13488059 10882833 4413663 -1841877 -3644972 -2783363
6266 -2783363 -3752520 -5905470 -4648294 664913 6038473 9642796 13278051 16759037
6258 16759037 17091663 14713564 14596843 18424010 20774700 16761328 9531794 5917618
6250E917618J161452O56567m073757p338131o105669j716786L065072N962375
6242b471259N670479K993039R99015K037675M541641M498732O71643l233716l057529
6233A2649720K24919J711163p19830l653449l111543M18420L754405N173231M158899
6224B0605935l50007p506080j2102716r362099j789958L354875L671429L913526
6216D34905P531801J0816278Q361386R89972n145496n702016j796141K500663
6208A7991352M242350L341896J341779r64676l814809o169103n429694j438221
6200I100874J633490O33310j499666l05884K459209J291562l754145o740285n312383
6191b493918l731594m728633n107931k538425l56380j242620j504439L099264
$$ plain form
6250 5917618 7079070 7735637 3661880 -3676251 -9781920 -11498706 -8433634 -2471259
6242 -2471259 3199220 6192259 7191274 9228949 13770590 18269322 18940965 15707249 12649720
6233 12649720 12874639 14585802 13865972 10212523 7100980 7519400 11273805 16447036 20605935
6224 20605935 20255928 12749848 647132 -8714967 -10504925 -7150050 -3478621 434905
6216 434905 7966706 18782984 27144370 28134342 22988846 17286830 15490689 17991352
6208 17991352 22233702 25575598 26917377 25952701 22137892 15968789 10539095 9100874
6200 9100874 10734364 11367674 9868008 9562124 12021333 13312895 9558750 2818465 -2493918
6191 -2493918 -6225512 -10954145 -16062076 -18600501 -18956881 -20199501 -21703940 -18604676
6183a8604676R775935J2139219Q455956K080149l572862o257560m099090J554075
6175A471146M824992J930703k581288j334824N204187Q842106M567460l341355
6167A9583127p224027m523063J116095M863452N174394L945284L008718J259493
6159B7203473l238123q535938r252253l220223M930660Q805886O711792J519422
6151B4924696l180791m729916k143285K094251L464049J208547o418K991585O309331
6142C0932049M002065l651610j0666021j2442508r001761k895989K638237M750242
6134C664704L242664Q18044o54927j905392k767555p41002M154162P203497N490713
6125A8504908K606849K555522L096962L75229l815695n466995n434754o281438
$$ plain form
6183 -18604676 -8828741 3310478 11766434 13846583 10273721 4016161 -82929 1471146
6175 1471146 6296138 8226841 5645553 4310729 9514916 18357022 22924482 19583127
6167 19583127 12359100 7836037 8952132 13815584 18989978 22935262 25943980 27203473
6159 27203473 23965350 15429412 6177159 2956936 7887596 16693482 23405274 24924696
6151 24924696 21743905 17013989 14870704 16964955 20429004 21637551 21631133 24622718 30932049
6142 30932049 34934114 31282504 20616483 8173975 -827786 -3723775 -1085538 3664704
6134 3664704 6907368 7725412 7070485 5165093 2397538 1656536 5810698 13014195 18504908
6125 18504908 21111757 23667279 26764241 27139470 23323775 17856780 12422026 6140588
6117F140588n324725J180037Q922717R077405O76920q018583j0506634p493625
6109e345900j829637M428759P742591N601010K050491L211716O706834M035789
6101B6601653n008016r681611l792711M691650N026963j991348p169490n687622
6093B989468r70096J453760l50078l586812l443955R73502L846989J61010n165555
6084d091767k977977N295313Q076472J295484m882149k107825L723858L858708
6076H190117J121813K659839N478213J397551p525886j0725585n064038J878142
6068b589834M536684N197864N903692M298082M15510q94451J749371K653939j823112
6059A9447745o584339n417164o35652P56493k261563l928634j016979K419494
$$ plain form
6117 6140588 815863 1995900 10918617 19996022 20672942 12654359 2147725 -5345900
6109 -5345900 -7175537 -2746778 4995813 10596823 12647314 15859030 22565864 26601653
6101 26601653 21593637 11912026 8119315 12810965 17837928 15846580 8677090 2989468
6093 2989468 2019372 3473132 3123054 -463758 -3907713 -2934211 912778 1073788 -4091767
6084 -4091767 -7069744 -1774431 6302041 7597525 2715376 607551 4331409 8190117
6076 8190117 9311930 11971769 17449982 18847533 11321647 596062 -4467976 -2589834
6068 -2589834 1946850 7144714 13048406 17346488 17761998 16867547 18616918 21270857 19447745
6059 19447745 12863406 7446242 6810590 7567083 5305520 1376886 359907 2779401
6051B779401J336149k789851l913603J56743M733027M941970K550141K681572
6043A2475549N298846N078894M26424l043211r99944K612786J736916k462698
6035B1123562m134493k211853j073476k489093l012376k75263L131038L771383
6027A4829429J816612j90927o05038J93329K30417k283082n882881n938519n24757
6018A644583N455717N728588R09150k904822k676371o81153J103541L196133M767506
6009A6542872L362450n7314j168484N34292k00434o221199j2490627j2419478
6001a2117922o155353J020926N556499P235801O461068L833839J048231q62533
5993F020556k855576n011900m434561O49468O295212O385211O09838m519140l310595
$$ plain form
6051 2779401 4115550 1325699 -2587904 -2431161 2301866 7243836 9793977 12475549
6043 12475549 17774395 22853289 23279713 20236502 19236558 21849344 23586260 21123562
6035 21123562 16989069 14777216 13703740 11214647 8202271 7927008 11058046 14829429
6027 14829429 16646041 16455114 15850076 16043405 16273822 13990740 8107859 2169340 1644583
6018 1644583 7100300 12828888 13738038 10833216 8156845 7475692 8579233 11775366 16542872
6009 16542872 19905322 19848008 18679524 19213816 19013382 12792183 301556 -12117922
6001 -12117922 -18273275 -17252349 -11695850 -4460049 2001019 5834858 6883089 6020556
5993 6020556 3164980 -1846920 -6281481 -5632013 663199 7048410 7658248 3139108 -171487
5984a71487K878255P857539P293174K298954k575513l996113k498504p97483k68537
5975A0020285k36647k60595r59731k095612k154206j002642p11265k085801k642199
5966b128413l78735K386428J968612j121756k856463j408919J107578K620628
5958A88960L357965L388557J432355k018060l338317k63096M201111N317182K862246
5949A5128903O74090N30461O5986k564225n339885n515885l587006j847850q20268
5940c275679M35141J810949K587406L398588M945166N353952J953974m237818
5932A2971679q812002r223747o951280l936763j69618L871389N542212L148083
5924c560047j139385l441553k132222J245909L569220K426984j025558j750330
$$ plain form
5984 -171487 2706768 10564307 17857481 20156435 17580922 13584809 11086305 10288822 10020285
5975 10020285 9783638 9523043 8563312 6467700 4313494 3310852 2599587 513786 -2128413
5966 -2128413 -2507148 -120720 1847892 726136 -2130327 -3539246 -2431668 188960
5958 188960 3546925 6935482 8367837 6349777 3011460 2748364 6949475 12266657 15128903
5949 15128903 15802993 16333454 16399440 13835215 8495330 2979445 -607561 -2455411 -3275679
5940 -3275679 -2840538 -1029589 1557817 4956405 9901571 15255523 17209497 12971679
5932 12971679 4159677 -5064070 -12015350 -15952113 -16121731 -12250342 -6708130 -3560047
5924 -3560047 -4699432 -8140985 -10273207 -9027298 -5458078 -3031094 -4056652 -5806982
5916e806982L378574R729665R563565K949122k017543j512231j005898m138026
5908A1140246m912726J664409Q338528N323332l213549m278437L744488Q342066
5900B6148357K046095p207549r223869n045046j186041J296529M308340N337278
5892A6474094J073135m824000n442405r04559J746044j078778m984826m644434
5884b585729r79059R22448j274453m492167m098512P65446O354926Q565882O658546
5875I837328K273545k835694o162945m638279O50473K847639j825050o041140
5867e894123j61903J1793188J4977859M656796o248305n855473L54039K91824
5859A3913902n641066p115567j058843M994398N524250L103357J304119j49103
$$ plain form
5916 -5806982 -2428408 7301257 16864822 19813944 17796401 16284170 15278272 11140246
5908 11140246 6227520 7891929 16230457 21553789 18340240 14061803 17806291 26148357
5900 26148357 28194452 20986903 11763034 6717988 5531947 6828476 11136816 16474094
5892 16474094 17547229 12723229 7280824 6376265 8122309 7043531 2058705 -2585729
5884 -2585729 -3564788 -2642340 -3916793 -8408960 -12507472 -11742026 -5387100 3178782 9837328
5875 9837328 12110873 9275179 3112234 -1526045 -875572 1972067 147017 -5894123
5867 -5894123 -6056026 5737162 20715021 25371817 19123512 13268039 13622078 13913902
5859 13913902 8272836 1157269 98426 5092824 10617074 13720431 15024550 14875447
5851A4875447j770433k630978l497799n810318p087048l550210K284872L512471
5843c673996n97877l121796m67715K667674K462420K355198N118860N550667j435165
5834H858270j0058909r655820K27265Q827551Q754888M247846K513909L333879
5826A7048879K024176j477818k627969j82347J717504M11955j292239o04389M4478
5817A5062230k454555n228034l091269K363527L892756n14733m544297l616293
5809A869332j310820j715127j917187J644754M775557J582594m450200m441787
5801c962884K082329O388161M022973L38067M66559K046281J561201P44222J981327
5792A5668236L201990K352601K011125M354704N898455K894812j650086k476616
$$ plain form
5851 14875447 13105014 10474036 6976237 1165919 -5921129 -9471339 -7186467 -3673996
5843 -3673996 -4271873 -7393669 -7861384 -5193710 -2731290 -376092 4742768 10293435 8858270
5834 8858270 -1200639 -10856459 -10629194 -1801643 6953245 11201091 13715000 17048879
5826 17048879 19073055 17595237 14967268 14784921 16502425 16914380 15622141 15017752 15062230
5817 15062230 12607675 7379641 4288372 6651899 10544655 10029922 5485625 1869332
5809 1869332 558512 -1156615 -3073802 -1429048 3346509 4929103 478903 -3962884
5801 -3962884 -1880555 4507606 8530579 8868646 9335205 11381486 12942687 13686909 15668236
5792 15668236 18870226 21222827 23233952 27588656 33487111 36381923 34731837 32255221
5784C2255221q97784k524423p429227r231644m597020J895967M125466J735676
5776A5332232q56469k63556K618688L914107R09669m347795o661870m216464j319256
5767E109286j921736k962035J040380Q030523R212547J057752q891992j1034090
5759c59365m558391L676610P676455O252782J307125l573546m290203m8198M503910
5750A0587179M289578M53161j397355P72803L083104J996654j011687k664031
5742A6109406k479392k029638k128987k843334m042165m003784p9649O747315
5734E249772J0618217P427798N71696l534225l652077l211400l480183k651752
5726G337846j012977j176897k752468k479544n07312m28668j658850J133967P976213
$$ plain form
5784 32255221 31357437 28833014 21403787 12172143 7575123 9471090 13596556 15332232
5776 15332232 14475763 14212207 16830895 20745002 21654671 17306876 10645006 6428542 5109286
5767 5109286 3187550 225515 1265895 9296418 18508965 19566717 10674725 -359365
5759 -359365 -4917756 -1241146 6435309 12688091 13995216 10421670 6131467 6083269 10587179
5750 10587179 14876757 15329918 13932563 14705366 17788470 19785124 18773437 16109406
5742 16109406 13630014 11600376 9471389 6628055 2585890 -1417894 -1497543 5249772
5734 5249772 15867989 23295787 23867483 20333258 16681181 13469781 9989598 7337846
5726 7337846 6324869 5147972 2395504 -84040 -591352 -1020020 -2678870 -1544903 6431310
5717F431310J0463440L970563l670168k804650L896414O152026J365120l721006
5709B2083049m786988m169293l526779j336450R14510j362107p002263q043309
5701g229630j491696M847344L342251k407671l282324K768289R704256J2118236
5693A8369055R418439L212289m039657q348126o817091j440478K652963K828803
5685A5836197P38859q15862o03077P09491Q58266k470381q276393j1440434p750248
5676a3213582P05300P231814P333882K323673l065833m867365k327689J927572
5668c952228M283179L797821K914571L674748M626698L187464p4720j772414j12524
5659A6572595K795732L296630r7870n291825q268728o543343j610857K322287
$$ plain form
5717 6431310 16894750 20865313 17195145 14390495 18286909 24438935 25804055 22083049
5709 22083049 17296061 13126768 9599989 8263539 9178049 7815942 813679 -7229630
5701 -7229630 -8721326 -3873982 -531731 -2939402 -6221726 -3453437 6250819 18369055
5693 18369055 27787494 30999783 26960126 18612000 11794909 10354431 13007394 15836197
5685 15836197 16575056 15759194 15156117 15865608 16723874 14253493 5977100 -5463334 -13213582
5676 -13213582 -12508282 -5276468 2057414 4381087 1315254 -3552111 -5879800 -3952228
5668 -3952228 330951 4128772 7043343 10718091 15344789 18532253 18457533 16685119 16572595
5659 16572595 19368327 22664957 22567087 17275262 9006534 2463191 852334 3174621
5651C174621K400710l77594k575733j572059K218069N413869M616338N58289j824910
5642A2031600N15073M001863K933194k342576n815289m080858K09412L326275
5634A0778694M029019J649277l717598p734229m830501K792648N798654J004475
5626I770439l124203K51814M885278J547064o158828o705239J326325P314333
5618I106983M973381J14014n70921R54218L37878j061731l56741J60437k882121
5609A0775397o524816m854499J341120M253605o34881q113510r232186j653179
5601a4642949Q054124J1862328Q176959J621768l354280o030773o743112m507578
5593e563513K17610L355016J670872k130687k759176K36489K698056K854687K965099
$$ plain form
5651 3174621 5575331 5197737 2622004 1049945 3268014 8681883 13298221 13856510 12031600
5642 12031600 12546673 16548536 19481730 17139154 11323865 7243007 7452419 10778694
5634 10778694 14807713 16456990 12739392 5005163 174662 2967310 8765964 9770439
5626 9770439 6646236 6898050 11783328 13330392 7171564 466325 1792650 9106983
5618 9106983 14080364 14194378 13623457 14577675 14915553 13853822 13497081 13657518 10775397
5609 10775397 4250581 -603918 737202 4990807 4355926 -3757584 -12989770 -14642949
5601 -14642949 -6588825 5273503 13450462 15072230 11717950 5687177 -1055935 -5563513
5593 -5563513 -5345903 -1990887 -320015 -2450702 -5209878 -4973389 -2275333 579354 3544453
5584C544453L547918J655736k895032m809531o73110M880695N137959J047100
5576A1436188l89233L021848M921800l24487q626941j0623609l921693L659520
5568h46607M529121J044234Q07715M598898N229215o80049o369965m637349J098935
5559D774148J725366m176315q861280o981972j869396J244671K415478M434759
5551g294541P372688R087090Q524673N729230O74527n396374r160449q231152
5543A305692m210155j065939r77248k648612l049751l70160L955216O149117M054907
5534C143067j12173k255835j038378J499463K986417K405167p0760k434077j387581
5525B735310L396881O975481M842323l86455k495465p30969J70424j432588j939778
$$ plain form
5584 3544453 7092371 8748107 5853075 1043544 370434 5251129 10389088 11436188
5576 11436188 11046955 14068803 18990603 18666116 10039175 -584434 -4506127 -846607
5568 -846607 3682514 4726748 5534463 10133361 15362576 14682527 8312562 3675213 4774148
5559 4774148 6499514 2323199 -6538081 -13520053 -15389449 -14144778 -11729300 -7294541
5551 -7294541 78147 9165237 17689910 23419140 24093667 18697293 9536844 1305692
5543 1305692 -2904463 -3970402 -4947650 -7596262 -10646013 -11016173 -7060957 -911840 3143067
5534 3143067 3030894 775059 -263319 1236144 4222561 6627728 6556968 4122891 2735310
5525 2735310 6132191 13107672 17949995 17563540 15068075 14337106 14507530 13074942 11135164
5516A1135164P4114R15727j346877l087722j490083N51009l94877k737283l234043
5507C85129j920730k04910J966995L692491K241625j711438k704581J314393M360090
5498G419064J353664l238058k553914J066364N4193n257030o812631k177039J399494
5489h745893j248755n032526k556815N037078J0044676Q131219K130123k744305
5481E014802m198230l456583k585669k080739j106879L14903Q42454K97831P42032
5472f216078L317291N783469N545807L566924K557141K699770K220716R76498
5464B0451538J50876o56860k593424m562578m513502k949165j650829j2885L147852
5455F811023N206616K459161k895725m327862n50466K367210N65037j765628L67195
$$ plain form
5516 11135164 11209278 12125005 10778128 7690406 6200323 6751332 6356455 3619172 385129
5507 385129 -1535601 -1740511 226484 3918975 6160600 4449162 1744581 3058974 7419064
5498 7419064 8772728 5534670 2980756 4047120 4101313 -1155717 -7968348 -10145387 -8745893
5489 -8745893 -9994648 -15027174 -17583989 -12546911 -2502235 5628984 7759107 5014802
5481 5014802 816572 -2640011 -5225680 -7306419 -8413298 -8098395 -7255941 -6958110 -6216078
5472 -6216078 -2898787 2884682 8430489 11997413 14554554 17254324 19475040 20451538
5464 20451538 20602414 19945554 17352130 12789552 8276050 5326885 3676056 3663171 6811023
5455 6811023 12017639 14476800 11581075 7253213 6702747 9069957 9634994 7869366 8236561
5446H236561M708201N662363K685963j68838p77775l55963L1312m6531k103799
5437A7871494o362024q468945l683492N275391R608116N342306j591808l780798
5429A4210240j778561j186685l248895l734461o36000K280285J196747k359453
5421D743217m198868k799168N03192M304909P209088O884543K410441l223377
5413A5833977n877562m903864k471275M06101L647074N105304K449412k059405
5405A2129762l519639j679475j183525l417443l819743K22111M385154L964798
5397G082000N21436k147212m006295n900707n078758L95818O000898N870604J372955
5388D110739j493096j322421j470904k403235r29460K933119N021243L969749
$$ plain form
5446 8236561 12944762 18607125 21293088 21124250 20346475 19990512 20021824 19975293 17871494
5437 17871494 11509470 3040525 -642967 4632424 14240540 19582846 17991038 14210240
5429 14210240 12431679 11244994 7996099 4261638 3625638 5905923 7102670 4743217
5421 4743217 544349 -2254819 -1751627 2553282 9762370 16646913 19057354 15833977
5413 15833977 9956415 5052551 2581276 2987377 6634451 11739755 14189167 12129762
5405 12129762 8610123 6930648 5747123 2329680 -1490063 -1267952 3117202 7082000
5397 7082000 7603436 5456224 1449929 -4450778 -9529536 -9133718 -3132820 2737784 4110739
5388 4110739 2617643 1295222 -175682 -2578917 -3508377 -575258 4445985 8415734
5380H415734L280961N024060O492732M751313M54174l940548o256903m852784
5372A3368739o59410J626122j074620m691631l464109K51913j056077p356894
5364c055967r889976m661782J382365J494824j185651r8611M884099R398546J1158842
5355I426689R630473M195135k416802m065053Q0207K137727l005324q347779m742280
5346B892993M365339P536937K137389l342999l317200j682770k514777k870759
5338C204153J134350P250294J0339357Q671207L807453k279747p184331q318506
5330A6624230n916323l351742k486454j442105J014344K113078p14913m606960
5322A233155m085238J546803O859318O768250K109186k134761k754535j161586
$$ plain form
5380 8415734 11696695 16720755 23213487 27964800 28418974 24478426 18221523 13368739
5372 13368739 12709329 14335451 13260831 8569200 5105091 5357004 4300927 -3055967
5364 -3055967 -12945943 -17607725 -16225360 -14730536 -15916187 -16014798 -11130699 -1732153 9426689
5355 9426689 19057162 23252297 20835495 16770442 16850649 18988376 15983052 7635273 2892993
5346 2892993 7258332 14795269 16932658 13589659 10272459 8589689 6074912 3204153
5338 3204153 4338503 11588797 21928154 30599361 34406814 32127067 24942736 16624230
5330 16624230 10707907 7356165 4869711 3427606 4441950 6555028 5840115 1233155
5322 1233155 -2852083 -1305280 5554038 12322288 14431474 12296713 9542178 8380592
5314H380592n77119j626100j858019L97382L101612K580043k002012p312128q915313
5305g831062n157999J528627O683747P829781O806684P014711Q138636O010606
5297C1023731p52458o689245n457009J509950O307811M541032K791j847359j277707
5288B7361537k205244n080330n871769k260514K470745L573109J052615p91532
5280A8248617L23444J687699J53846k912957l980908l019557l015237m156519
5272C328428k991928J176993L346350n78847p142639r060725m087982L050476
5264a2959874O447751L846923k934585q993212q723532j051589P808777J0288025
5256f271316O197608K104714K049637L278242K321906N62985P31828J542128J9142
$$ plain form
5314 8380592 7803473 6177373 4319354 4716736 7818348 10398391 8396379 1084251 -7831062
5305 -7831062 -12989061 -11460434 -4776687 3053094 9859778 16874489 25013125 31023731
5297 31023731 30271273 23582028 18125019 19634969 25942780 30483812 30486603 28639244 27361537
5288 27361537 25156293 20075963 14204194 11943680 14414425 17987534 19040149 18248617
5280 18248617 18572061 20259760 20413606 17500649 13519741 10500184 7484947 3328428
5272 3328428 336500 1513493 4859843 4280996 -2861643 -11922368 -16010350 -12959874
5264 -12959874 -6512123 -2665200 -5599785 -14592997 -23316529 -24368118 -16559341 -6271316
5256 -6271316 -73708 2031006 4080643 7358885 9680791 10243776 10975604 12517732 12536874
5247A2536874k852060l256843p43574J004889K33202j31891K099748L587029j73135
5238A2304239p242881j0396703o391938j82103K022475N73386R5316J788680K408402
5229e021127L43234j689060r94084J518004L488261L960394K712990k97971l016091
5220A004550j710513M094179R269877Q408816K095775m394178p193820o335433
5212E239253l613525p37790R17458R17114R2310n91821n74198J134402M815914
5203G599117P171800L333626n637409j1024033o479021L037399P425705M566648
5195I993832J343491K365922M486405L983556K758329L642643M191607J83338
5187C2949123o825554j0261088o841651o02497K370842Q64606j345916r43135
$$ plain form
5247 12536874 9684814 6427971 5684397 6689286 6922488 6790597 8890345 12477374 12304239
5238 12304239 5061358 -5335345 -11727283 -11909386 -9886911 -9313525 -9218209 -7429529 -5021127
5229 -5021127 -4677893 -6366953 -7361037 -5843033 -2354772 1605622 4318612 4020641 1004550
5220 1004550 -705963 3388216 12658093 21066909 23162684 18768506 11574686 5239253
5212 5239253 1625728 887938 1805396 2722510 2814820 2222999 1648801 2783203 7599117
5203 7599117 14770917 18104543 12467134 1443101 -5035920 -1998521 5427184 9993832
5195 9993832 11337323 13703245 18189650 22173206 24931535 28574178 32765785 32949123
5187 32949123 26123569 15862481 9020830 8418333 10789175 11653781 10307865 9364730
5179I364730J409377K981932K513142P41323j169980j972836j78285L944390O676949
5170B4310742M121055k593117q236952r797899q431025n003334J248067P888036
5162C505573Q767907K268886m430567m055139J307633M250632K254432j448897
5154A2420460m223755n264660k858867L072105P212452M269114k690604n848089
5146F088156l865526k380031l373457k096757L586513Q330959P186386K445517
5138A5921760q98564j678716j273037j58275J014239N71422j119219j017675J908847
5129A3270782M675354M745848K962720N88426k376764m330973k331286K482867
5121A9686974M485545J336008k403830k342888l16552J2487q73439p22254p2725
$$ plain form
5179 9364730 10774107 13756039 16269181 17010504 15840524 13867688 13689403 17633793 24310742
5170 24310742 28431797 25838680 17601728 7803829 -627196 -5630530 -4382463 3505573
5162 3505573 12273480 14542366 10111799 6056660 7364293 11614925 13869357 12420460
5154 12420460 8196705 2932045 73178 3145283 10357735 14626849 11936245 6088156
5146 6088156 2222630 -157401 -3530858 -5627615 -2041102 6289857 13476243 15921760
5138 15921760 15023196 13344480 12071443 11913168 12927407 13498829 12379610 11361935 13270782
5129 13270782 17946136 22691984 25654704 26243130 23866366 19535393 17204107 19686974
5121 19686974 24172519 25508527 23104697 20761809 20445257 20457744 19584305 18862051 18789326
5112A8789326n29420j618269k551483l832649m581811k516440Q36433L78331l699697
5103F74321l859937K780000P352879J891908o822370o092931L482158Q760560
5095H166588L518671l742751l793725J035919L162304J223725m90820J57324J316149
5086A0553384J252568L82459k14166p5313N27133Q73687P21375P48749R69958
5077A5739834l21464l805154o211653l356681L719386Q639962O618269n29129
5069B0493370o760964p488205k939931K245395K931318j314961n535024n501768
5061c870770k826488j265608j67033L714031Q869912R310399L273442l545773
5053A3492112n720405m541600l760005k945017N55032N436665P045161L840361
$$ plain form
5112 18789326 18259906 16641637 14090154 10257505 5675694 3159254 3995687 4374018 674321
5103 674321 -3185616 -405616 6947263 8839171 2016801 -4076130 -593972 8166588
5095 8166588 11685259 7942508 4148783 5184702 8347006 9570731 9079911 9237235 10553384
5086 10553384 11805952 12188411 11974245 11898932 12426065 13299752 14021127 14769876 15739834
5077 15739834 15418370 11613216 5401563 2044882 5764268 14404230 21022499 20493370
5069 20493370 13732406 6244201 3304270 5549665 8480983 7166022 1630998 -3870770
5061 -3870770 -6697258 -7962866 -8129899 -4415868 4454044 13764443 17037885 13492112
5053 13492112 7771707 3230107 -529898 -3474915 -2919883 2516782 9561943 13402304
5045A3402304n52477k412289k131556k065569k311682p94686K945651O043507
5037A2123203N313701J058831l394488n632329n986471n150920k146498L540858
5029b74113R130602J0421241O635556J527601q98666m51469R9375j113002l050386
5020B2026739l455577j768521L13232J281027J824546L223166M478173L292669
5012C1215454J44477j322049N69386K486394P39027k787567k812445J618330N246934
5003C5097941L664722p00989k175141K34821J813758p79986m709937n340728l075759
4994B4028702k246900l930666m157122l50026M484271O293057N148496K944991
4986C2214803n22477n139293p293794m320446j0605p1058l379876l597409J150526
$$ plain form
5045 13402304 12849827 10437538 8305982 6240413 3928731 3134045 6079696 12123203
5037 12123203 17436904 18495735 15101247 9468918 3482447 -1668473 -3814971 -274113
5029 -274113 8856489 19277730 25913286 27440887 26542221 26090752 26190127 25077125 22026739
5020 22026739 18571162 16802641 17115873 18396900 20221446 23444612 27922785 31215454
5012 31215454 31359931 30037882 30607268 33093662 33832689 31045122 28232677 29851007 35097941
5003 35097941 38762663 38061674 35886533 36121354 37935112 37155126 32445189 27104461 24028702
4994 24028702 21781802 17851136 13694014 13343988 17828259 24121316 29269812 32214803
4986 32214803 31692326 26553033 19259239 14938793 14928188 14857130 11477254 7879845 9030371
4977I030371O153871P624450O448928M143039Q83428j834777k177058k034801
4969B8237451m547700p757498p031056l259695j174667q3260M580737J0296718
4961A9261030Q856095O77260l702130J7647L733726J877840J24034K471838K250017
4952C5567357m801591j0094415n765201J564315K412029L29414L160504P016516
4944B9388928L605075l118923k986723K327673K460002l536229o929353n073693
4936A6136757l206072j928393L018230R097942Q869729L643486K067914M769181
4928D2468774L563773l082919o852305l757835L77310P32641r25260k878962n573454
4919B4071763o576339l215496N13954l24451j511778L201648Q588900N447386
$$ plain form
4977 9030371 15184242 22808692 29257620 33400659 34284087 32449310 30272252 28237451
4969 28237451 23689751 15932253 8901197 5641502 4466835 4383575 8964312 19261030
4961 19261030 28117125 28794385 25092255 25109902 28843628 30721468 30845502 33317340 35567357
4952 35567357 30765766 20671351 14906150 16470465 18882494 19211908 22372412 29388928
4944 29388928 32994003 29875080 26888357 29216030 31676032 28139803 21210450 16136757
4936 16136757 12930685 11002292 14020522 23118464 31988193 35631679 37699593 42468774
4928 42468774 46032547 42949628 36097323 32339488 32716798 33449439 32524179 29645217 24071763
4919 24071763 17495424 14279928 14793882 14469431 12957653 16159301 24748201 30195587
4911C0195587k019266k312627K920685K524626k295581M5950Q037488P550892
4903D4647754j964093m394197N183628J1992050P565097K240780L360038K481210
4895G1112267n667609j1492914q186452k716807m13398K713468N320905m07464
4887E0261996q796299l787792J1177759J4124728L041545R79657J2838164J5311342
4879I5151100M094628O338710K5304449K5510139N295063K1720172Q7121373J02604679
4871C73140313j6890122j88379951k37037430j22224772J5235922M9315495J1868129
4864a14972416k688229J6686139J9682306K86392l352852J3602997J8435723M305596
4856d8014344j528268R144861J3960629M091791k423035L026966N853427j825610
$$ plain form
4911 30195587 28176321 25863694 28784379 31309005 29013424 29059374 37096862 44647754
4903 44647754 42683661 38289464 43473092 55465142 63030239 65271019 68631057 71112267
4895 71112267 65444658 53951744 45765292 43048485 42635087 45348555 50669460 50261996
4887 50261996 41465697 37677905 48855664 62980392 66021937 67001594 79839758 95151100
4879 95151100 99245728 105584438 130888887 156399026 161694089 183414261 270535634 373140313
4871 373140313 356250191 167870240 -69167190 -191391962 -176156040 -126840545 -114972416
4864 -114972416 -117660645 -100974506 -81292200 -81005808 -84358660 -70755663 -52319940 -48014344
4856 -48014344 -49542612 -40397751 -26437122 -22345331 -24768366 -21741400 -15887973 -17713583
4848a7713583p491045k479684M686356O231469N399173L430958m290002j4047073
4840b6273431j3692995k049779P291949O156805J495910J013524K627674K462181
4832b0968162J464596K38563k649897m873238k190037L040094M506763K722859
4824a8708459L128204M499387O09745o884857r081491m122033M43197P02902Q95101
4815b8518304L512567N466127N771591P065678P998670M001666k992718n624251
4807c318974l396781l588368p834853q389037j153802P284113R803641P497849
4799c096212M259565M75855l520744m553974j704475Q94375p2733k693786l576967
4790a3589096k022449P82991K945973K295904l85324k00869M679658P496471J727448
$$ plain form
4848 -17713583 -25204628 -27684312 -22997956 -16766487 -11367314 -7936356 -12226358 -26273431
4840 -26273431 -39966426 -42016205 -34724256 -28567451 -27071541 -26058017 -23430343 -20968162
4832 -20968162 -19503566 -19265003 -21914900 -26788138 -28978175 -25938081 -21431318 -18708459
4824 -18708459 -15580255 -11080868 -10471123 -17355980 -26437471 -30559504 -30116307 -29413405 -28518304
4815 -28518304 -25005737 -19539610 -13768019 -6702341 1296329 5297995 2305277 -3318974
4807 -3318974 -6715755 -10304123 -18138976 -26528013 -27681815 -20397702 -10594061 -3096212
4799 -3096212 1163353 1639208 -1881536 -6435510 -8139985 -7245610 -7318343 -10012129 -13589096
4790 -13589096 -15611545 -14828554 -11882581 -9586677 -9972001 -10172870 -5493212 2003259 3730707
4781C730707p230849q197397m97735N698258M823539J311322j001942l981648
4773e345745p514552p052996k194843J286307J072149J326816L453487L066846
4765a1902531n95519j667231J989160M595743K990865K200301N481119P724211
4757A0816118M503206n85730l388414n721753q410816o524794J072390N708200
4749b531593J122692n470909m072152K341772L147535k941301o904615l681114
4741a8989685K191792N038512M180497J197275k309232l556225o19664L770071
4733i096659M793855J998243n23523j8832K260674L654567K379212j697294n809096
4724b058853n459853J74808N714678N412930k18068o247930r325732q705516m107808
$$ plain form
4781 3730707 -3500142 -11697539 -12195274 -6497016 -1673477 -362155 -1364097 -5345745
4773 -5345745 -12860297 -19913293 -22108136 -20821829 -19749680 -18422864 -14969377 -11902531
4765 -11902531 -12498050 -14165281 -12176121 -7580378 -4589513 -2389212 3091907 10816118
4757 10816118 15319324 14733594 11345180 5623427 -2787389 -9312183 -8239793 -2531593
4749 -2531593 -1408901 -6879810 -10951962 -8610190 -5462655 -8403956 -15308571 -18989685
4741 -18989685 -16797893 -11759381 -7578884 -6381609 -8690841 -12247066 -12866730 -9096659
4733 -9096659 -4302804 -2304561 -2828084 -2846916 -586242 3068325 5447537 3750243 -2058853
4724 -2058853 -7518706 -7343898 -1629220 3783710 3565642 -2682288 -12008020 -20713536 -24821344
4715b4821344L135693Q530036Q282819M068009P98735N36240J273423N80688k092165
4706B92134n565348p233092m701493R27000N127461N090149K874092J954248K939161
4697A704312M072455L425385k61170n628414p325288j559734O243719O048569
4689F719834k270451o811044m48869Q279302P909439M57478l845866k730422k349154
4680D910247m605001m807450j494038J189876J839858L822554P341164P521575
4672A5718785K888836j429364j968310j915801m278718n898865k858907K449051
4664B706707M543671K567715M20860N52650J452884J229979P16271J719216L331620
4655A9241573J864620m302855j0789580j1053488m892075L95837l71058l119844
$$ plain form
4715 -24821344 -21685651 -13155615 -4872796 -804787 -6052 530188 1803611 2384299 292134
4706 292134 -5273214 -12506306 -17207799 -16280799 -11153338 -6063189 -3189097 -1234849 1704312
4697 1704312 5776767 9202152 8940982 3312568 -4012720 -5572454 671265 6719834
4689 6719834 4449383 -2361661 -2810530 5468772 13378211 13835689 9989823 7259401 4910247
4680 4910247 305246 -4502204 -5996242 -4806366 -2966508 856046 8197210 15718785
4672 15718785 18607621 17178257 15209947 13294146 9015428 3116563 257656 2706707
4664 2706707 7250378 9818093 10238953 10791603 12244487 13474466 14190737 15909953 19241573
4655 19241573 21106193 16803338 6013758 -5039730 -9931805 -9535968 -9907026 -13026870
4647a3026870j089923M396896N640937L81051m207863j218828O645268J0424907
4639G945575N558211l358309q132354n840150j210907m5970k022458k543610m87097
4630a0137069N51104q02058j105724J397005L431844L110771L641243O196872
4622F283988N648007l71772m665595r64657M579017K443456m339868n038448R38988
4613D513116M098829J888543J666789N068121L885756l813812p286075k53653
4605I767614P571725N331001k722001o042286m258541l421934k741979K214142
4597E697741P424607M619017l969861p320242k427388J969316K41163k380075
4589C854278o44939J749150k35547l716303k838723J837511N193447N612020N279305
$$ plain form
4647 -13026870 -14116793 -9719897 -4078960 -3697909 -7905772 -9124600 -2479332 7945575
4639 7945575 13503786 10145477 2013123 -3827027 -5037934 -5083904 -7106362 -9649972 -10137069
4630 -10137069 -9585965 -10388023 -11493747 -10096742 -6664898 -3554127 87116 6283988
4622 6283988 11931995 11560223 6894628 5929971 10508988 12952444 8612576 3574128 4513116
4613 4513116 8611945 10500488 12167277 17235398 21121154 17307342 10021267 9767614
4605 9767614 17339339 22670340 19948339 13906053 9647512 6225578 3483599 5697741
4597 5697741 13122348 17741365 13771504 6451262 4023874 5993190 6234353 3854278
4589 3854278 3209339 4958489 4722942 1006639 -1832084 5427 5198874 10810894 16090199
4580A6090199M349708O02449n258172q872483p990891n477429m811781n027718
4572a6396118k475314L393561Q426081Q502506M362451N11498l074J660593K501843
4563A0484027J290474p66208j878649j361536k2482N89982k79963j656176j941580
4554D457889q15918P49573J929670K241869Q60311k341583n251552n237283k531459
4545e938483L68578K661927N621258Q588824Q291442L824768r72874k403820j426204
4536A8615416j023574j863878l214642n377157p915944p859720l468954J875004
4528a0233449L367370J220904k32168J069911L121969L816383L041417J150526
4520F322863j135169j550567J351831M723669M129419P0655k143830M0307K886344
$$ plain form
4580 16090199 20439907 21042356 15784184 6911701 -1079190 -6556619 -11368400 -16396118
4572 -16396118 -18871432 -15477871 -7051790 1450716 5813167 6324665 6321591 7982184 10484027
4563 10484027 11774501 11008293 9129644 7768108 7745626 8335608 8055645 6399469 4457889
4554 4457889 3641971 4391544 6321214 8563083 9423394 7081811 1830259 -3407024 -5938483
4545 -5938483 -5569905 -2907978 2713280 11302104 19593546 23418314 22445440 20041620 18615416
4536 18615416 17591842 15727964 12513322 7136165 -779779 -8639499 -12108453 -10233449
4528 -10233449 -6866079 -5645175 -5877343 -4807432 -1685463 2130920 5172337 6322863
4520 6322863 5187694 3637127 4988958 9712627 13842046 13912701 11768871 11809178 14695522
4511A4695522K026826j785220m776857n271258m254720k741760r53923Q60968
4503b200422K407409L418702L041389N02958k870050m037965j840730J253215
4495c25494K200157Q94436n40158p49210j20954M26039N09326N53425J464078
4486D311645L427192M996959M465895K204389L03506k60328o86806k396024n323550
4477A1042878q053276q322268m283750K495784O462614M019250o76901n10560
4469B173771L951025M610561j525346o548651k984925M764251O782170J613967
4461A2836823l444479l966508k586788j829643l31105K167674K625678K21810
4453E693462j270246L26347J636289o12695l926171l940716j066186P48252J6360
$$ plain form
4511 14695522 16722348 14937128 10160271 4889013 634293 -2107467 -3061390 -2200422
4503 -2200422 206987 3625689 6667078 7170036 4299986 262021 -1578709 -325494
4495 -325494 1874663 2769099 2228941 1479731 1358777 1784816 2294142 2847567 4311645
4486 4311645 7738837 12735796 17201691 19406080 19709586 19449258 18762452 16366428 11042878
4477 11042878 2989602 -5332666 -9616416 -7120632 -658018 3361232 2684331 2173771
4469 2173771 6124796 10735357 9210011 2661360 -323565 4440686 11222856 12836823
4461 12836823 9392344 5425836 2839048 1009405 678300 2845974 5471652 5693462
4453 5693462 4423216 4749563 6385852 5773157 1846986 -2093730 -3159916 -2411664 -2395304
4444b395304j152959r14926K97991J233851J315648R16452R14547J192320j04947
4435A302673l618144n656160j932239N331535R040147P231239N477747O681298
4427B3858096N506331j777951q615940p241193j581492j620624p497678r472284
4419h442735l576605K746289K696657j061221k959011k279754m11222K970933
4411a0316669O572228O116300R23593l139985j806691J170183M11906k686357
4403b755492l150676l80951K433407M073444N424241O008298M884607L172311
4395A9709189J996883K10901k516816l492013j663049q83445l977917p228838
4387B154895o039790k508058j318915j485834P43681L430239J446534l804604
$$ plain form
4444 -2395304 -3548263 -4463189 -4165198 -2931347 -1615699 -699247 215300 1407620 1302673
4435 1302673 -2315471 -7971631 -9903870 -4572335 4467812 11699051 17176798 23858096
4427 23858096 29364427 27586476 18970536 11729343 10147851 8527227 1029549 -8442735
4419 -8442735 -12019340 -9273051 -6576394 -7637615 -10596626 -12876380 -13287602 -10316669
4411 -10316669 -3744441 2371859 3295452 155467 -1651224 -481041 -69135 -2755492
4403 -2755492 -5906168 -6287119 -3853712 219732 5643973 11652271 16536878 19709189
4395 19709189 21706072 21916973 19400157 15908144 14245095 13361650 9383733 2154895
4387 2154895 -3884895 -6392953 -7711868 -9197702 -8454021 -5023782 -3577248 -7381852
4379g381852n313633j115154L621841N617908O863704P745062M778754j903427
4371A2913203n866808l175436J616455K363124k14899j091933J356070M155930
4363A2055706M354636J912302j075814k669704l235449m764700o698028m821861
4355d942912K217128Q109802O145036q27359m429538l066096j984534j991850
4347g70323J622537P586479P324130o61492n769079j072386N470954L667975l330015
4338A4068780n619678k216733J87729m81833j070901j715860m571510n927903
4330g347909r6493R218218J1617714N096816j115458q48051J115587r63578m284501
4321A2392345l492208J1875Q32770k125836n468280o925201o571339m176568L56047
$$ plain form
4379 -7381852 -12695485 -13810639 -10188798 -4570890 2292814 10037876 14816630 12913203
4371 12913203 7046395 3870959 5487414 7850538 7635639 6543706 7899776 12055706
4363 12055706 16410342 18322644 17246830 14577126 11341677 6576977 -121051 -4942912
4355 -4942912 -2725784 5384018 11529054 10701695 6272157 3206061 1221527 -770323
4347 -770323 852214 8438693 15762823 15101331 9332252 8259866 13730820 17398795 14068780
4338 14068780 8449102 6232369 6420098 5938265 4867364 3151504 -1420006 -7347909
4330 -7347909 -7444402 1773816 13391530 18488346 17372888 16524837 17640424 16676846 12392345
4321 12392345 8900137 8912012 9744782 7618946 2150666 -4774535 -11345874 -15522442 -15166395
4312a5166395M591512N228245K378422l62736n28313N29204L05183j035353r95312
4303e055543J511608M488319N713450N737720O188624O217640L524128j310573
4295B7015373m892012n935480o381037o437648k999529M230362R221039O543906
4287B0364974p80361m748264k221484K424620L380080r87656p377930r849799
4279B04180m790718L791951O697805O65145o049763l847223N216826J0365474
4271A2253677O418131j076901m846254m024563j985840p69010K25108K453307
4263H647655O043081Q107588M706443l196961q323301n546261O77126K309546
4255A3424916j060103l193089j969795j811634m792729o525881l356608J971254
$$ plain form
4312 -15166395 -10574883 -5346638 -2968216 -3330952 -3859265 -3330061 -3024878 -4060231 -5055543
4303 -5055543 -3543935 944384 6657834 12395554 18584178 24801818 28325946 27015373
4295 27015373 22123361 16187881 9806844 3369196 369667 4600029 13821068 20364974
4287 20364974 19584613 14836349 12614865 15039485 18419565 17431909 10053979 204180
4279 204180 -4586538 -794587 5903218 6568363 518600 -3328623 1888203 12253677
4271 12253677 18671808 17594907 12748653 8724090 6738250 5969240 6194348 8647655
4263 8647655 14690736 22798324 27504767 24307806 15984505 10438244 11115370 13424916
4255 13424916 12364813 9171724 7201929 5390295 597566 -5928315 -9284923 -7313669
4247g313669M754677M259876K728422J829039K015470K540197R98148m104914
4239G707246r680654j0423362n647431l85233J083132m00419j375746N61462N584100
4230a2976905J0754902J0816961L805036m762522p693739n233119l190417l028028
4222a1507831n89937M977138Q375908O321730K212235R6574m11939p43356l36139
4213H394383M13131o73484k927850k501299R74244K819666R64739o70930L46564
4204G139164J96502m050615p887717n378607K008431P582106P817792M528813
4196A1955869J062016j93487J385852L616911L292506N93128j071786o11085o57969
4187A9371955k154405k280929K07346K327717J801926j7694k119238n423122q182295
$$ plain form
4247 -7313669 -2558992 1700884 4429306 6258345 8273815 10814012 11812160 7707246
4239 7707246 -1973408 -12396770 -18044201 -18429434 -17346302 -17746721 -19122467 -18561005 -12976905
4230 -12976905 -2222003 8594958 12399994 7637472 -56267 -5289386 -8479803 -11507831
4222 -11507831 -12097768 -7120630 1255278 7577008 9789243 9885817 9473878 8730522 8394383
4213 8394383 8807514 8134030 5206180 2704881 3679125 6498791 7463530 6792600 7139164
4204 7139164 7335666 3285051 -4602666 -9981273 -7972842 -390736 7427056 11955869
4196 11955869 13017885 12824398 14210250 17827161 21119667 21712795 20641009 20029924 19371955
4187 19371955 17217550 14936621 15143967 17471684 19273610 19255916 17136678 11713556 3531261
4178C531261n850490J164918N505578K649370k609734l662800j062159M74698
4170A40642l93603j607622j756201n68480J494768K006620j039551m340896k312378
4161h376701L594477N376256M25031m378844l383350M81795K199185J074521k124386
4152e112016o523392p472448p07285P877965P418780r67007n184121k356811k428523
4143a5454858p957320q790699k948619k042958p552048n579884L713417J090029
4135d5522940r326711J1673812P4227550J16269336P4464135k0158505p3527781
4128A28098896n0563174q326810j021933j2378114o644488P261246K532879j2458901
4120D6499601j2026875p05692j539110j1872545r743313M123293P136262m982496
$$ plain form
4178 3531261 -2319229 -1154311 4351267 7000637 4390903 728103 -334056 140642
4170 140642 -252961 -1860583 -3616784 -4185264 -2690496 -683876 -1723427 -6064323 -8376701
4161 -8376701 -4782224 594032 1019063 -3359781 -6743131 -6261336 -4062151 -2987630 -5112016
4152 -5112016 -11635408 -19107856 -19815141 -11937176 -4518396 -5485403 -10669524 -13026335 -15454858
4143 -15454858 -23412178 -32202877 -35151496 -37194454 -44746502 -50326386 -46612969 -45522940
4135 -45522940 -54849651 -43175839 31051711 147321047 221785182 201626677 128098896
4128 128098896 77535722 69208912 68186979 55808865 49164377 56425623 58958502 46499601
4120 46499601 34472726 33767034 32227924 20355379 10612066 14735359 21871621 16889125
4112A6889125j1587154k577800P853105P638552K935061J554069M17975l446792
4104A9676141n521219l643335k321262l052569j994894L84317q94598m350203
4096a717622k942316K724194M491829J396790J441745O395282P836238J846253
4088B1472393m629876o189969o130266o806009m270363K079130N115728J371074
4080B011842k647491j729845n53726m079358p567963m321258K775671N722456
4072a0389672L397690J519520K820836L787456R64477l813285n368792j080323
4064h162093N383375P342048L470602K22535K641325O471133N213254J298183
4056B3880362J665974M593326J658941p068213j1398934p270606l249156n748768
$$ plain form
4112 16889125 5301971 2724171 10577276 18215828 21150889 22704958 23122933 19676141
4104 19676141 14154922 10511587 8190325 5137756 3142862 3527179 2632581 -1717622
4096 -1717622 -4659938 -1935744 2556085 3952875 5394620 11789902 19626140 21472393
4088 21472393 16842517 10652548 4522282 -2283727 -6554090 -4474960 640768 2011842
4080 2011842 -635649 -2365494 -2919220 -6998578 -14566541 -18887799 -16112128 -10389672
4072 -10389672 -6991982 -5472462 -2651626 1135830 2100307 -1712978 -7081770 -8162093
4064 -8162093 -2778718 4563330 8033932 8256467 10897792 17368925 22582179 23880362
4056 23880362 25546336 30139662 31798603 24730390 13331456 6060850 2811694 -2937074
4048b937074q228953k446962P883450J3023457J0768856O018252J401282l680441
4040B1801867p578495p267207l484188K30013K327693L209834K566016N36945
4032A2342478p74743l97552m96075k133667k342726Q68830L983646K827688q16661
4023A3061218j891616Q11426M249551N820818M704911O49358m686452p012555
4015A5706659l931130J053995K318254j150470n263814n653773j089832N759125
4007G749014R136138M618439m996510j1132324q993430k522082K094142L475428
3999e71185K852037J0700m042237m817591j15971N292402N853888K837041O63654
3990G962738o39405l165730m636040j435445L862523N347119L084778K393603
$$ plain form
4048 -2937074 -11166027 -13612989 -5729539 7293918 18062774 24081026 25482308 21801867
4040 21801867 14223372 6956165 3471977 3701990 6029683 9239517 11805533 12342478
4032 12342478 11567735 11170183 10674108 8540441 6197715 7066545 11050191 13877879 13061218
4023 13061218 11169602 11981028 16230579 22051397 26756308 27405666 22719214 15706659
4015 15706659 11775529 12829524 15147778 13997308 8733494 3079721 1989889 7749014
4007 7749014 16885152 21503591 16507081 5374757 -3618673 -6140755 -4046613 -571185
3999 -571185 2280852 2291552 -1750685 -6568276 -6684247 -1391845 4462043 7299084 7962738
3990 7962738 7323333 4157603 -478437 -1913882 1948641 7295760 10380538 12774141
3982A2774141M293398M095829J51383l146154k872900j882004l246024n513879
3974D653790n877754l892394k45253M214770O836185M738327m20925l219115j429688
3965E357943J689227L071187L199915K459812m92369m125448l123224L866881
3957A1903924R751865P078159j985896q269787o659809n95974L520817K862843
3949A7606142o84837l276021k817661j167822j897431n103887o449833k979317
3941f770667K285902L991069J091532k689432l855037k109019P79771K769863
3933d506018K778687J845354K106427L231584J951671k547123n351145j948739
3925b439302M146167N160791K17379l119691j25143L973046K088479l807282n448266
$$ plain form
3982 12774141 17067539 21163368 21314751 18168597 15295697 13413693 10167669 4653790
3974 4653790 -1223964 -5116358 -5361611 -1146841 5689344 10427671 10006746 6787631 5357943
3965 5357943 7047170 10118357 13318272 15778084 15285715 11160267 8037043 11903924
3957 11903924 21655789 28733948 26748052 18478265 11818456 11222482 14743299 17606142
3949 17606142 16921305 13645284 10827623 9659801 7762370 2658483 -3791350 -6770667
3941 -6770667 -4484765 -493696 597836 -2091596 -5946633 -8055652 -7275881 -4506018
3933 -4506018 -1727331 118023 2224450 5456034 7407705 4860582 -490563 -2439302
3925 -2439302 1706865 6867656 7085035 3965344 3840201 7813247 9901726 6094444 646178
3916F46178j16665O024877O784618L107400n08122k662588m680628n909021l722167
3907a036118J494804M817981K362785l142247m888471k03846O020316P498262
3899A2923466M324712J741120J803376N82165m403568q188678m626396L415688
3891G571885O265650L47004p134929q686793n878399l947092k300938K762542
3883a1001070Q733443Q488941J592819l569385j663241J932547j52171n637292
3875a275409n878823J055133O965479M464762l288646o936223k755572L616860
3867d032439N427337L158922K002586L197029K540695j980648n953201m766996
3859d06715k66291K753820L585221M372949M465729J884871j188208r67364O21080
$$ plain form
3916 646178 529513 6554390 13339008 16446408 15938286 13275698 8595070 2686049 -1036118
3907 -1036118 458686 5276667 7639452 4497205 -391266 -595112 5425204 12923466
3899 12923466 17248178 18989298 20792674 21374839 16971271 8782593 4156197 7571885
3891 7571885 13837535 14184539 7049610 -1637183 -7515582 -11462674 -13763612 -11001070
3883 -11001070 -2267627 6221314 7814133 4244748 2581507 4514054 4361883 -1275409
3875 -1275409 -7154232 -6099099 866380 5331142 2042496 -4893727 -7649299 -4032439
3867 -4032439 1394898 4553820 6556406 9753435 12294130 10313482 4360281 -406715
3859 -406715 -673006 2080814 5666035 10038984 14504713 16389584 15201376 14234012 14855092
3850A4855092j617140o254864n980932P9873L528353j40719m139713j837597K314992
3841H07345R57622l560063l829152q2573J548246O99440K483273O393658N805401
3832A1223197n0944l106801J224051O658036N455718r02720n323773m834499j910916
3823H431349O36014J498814k79470m060254o131493k898543M385760J0113357
3815A1695534R663337L353391m374841q738044p924056l528905J627255N411175
3807G184846O440279M316448Q51499r28957m62240j52720o82417Q66413N337071
3798B2770222P658183L399039l604545n857249k791953p95278l430999p593096
3790I754324r243350p189831j204100P449631J3178600J0271606J269557m918453
$$ plain form
3850 14855092 13237952 6983088 1002156 1082029 4610382 4469663 329950 -1507647 807345
3841 807345 1764967 -1795096 -5624248 -5706821 -4158575 -3459135 -975862 5417796 11223197
3832 11223197 11172253 8065452 9289503 15947539 21403257 20500537 15176764 10342265 8431349
3823 8431349 9067363 10566177 10286707 6226453 94960 -2803583 1582177 11695534
3815 11695534 21358871 24712262 20337421 11599377 3675321 146416 1773671 7184846
3807 7184846 13625125 17941573 18793072 17864115 17401875 17249155 16566738 17433151 22770222
3798 22770222 30428405 33827444 30222899 24365650 21573697 20778419 17347420 9754324
3790 9754324 510974 -6678857 -7882957 -433326 12745274 23016880 24286437 19367984
3782A9367984m571364k561905k818478k595579Q40264M611913N286239L904177
3774B1463251K236653o23461m312547n271254k565499l21169p40380n40754J754245
3765A1079085J672774k960038o405904l965613k15268j097187l732848k310173
3757g935172J234302J604781P00369L672214P739766N740845q68322l340916M38105
3748H985972L678703K605270M79727j065283m248269p039343l597151M290479
3740D090105O891585J719642j630348K713801O915882K827827m272440m919357
3732A4336697p52414J27345k534486k747029n55665j207079l601409r81166O214262
3723H299056Q812839K785353m583187o145624m499234n271896p366133n814008
$$ plain form
3782 19367984 14796620 12234715 9416237 6820658 7660922 12272835 17559074 21463251
3774 21463251 23699904 23076443 18763896 13492642 10927143 10605974 9865594 9324840 11079085
3765 11079085 12751859 9791821 3385917 -579696 -794964 -1892151 -5624999 -7935172
3757 -7935172 -6700870 -5096089 -4395720 -723506 7016260 12757105 11888783 8547867 8985972
3748 8985972 12664675 15269945 15749672 14684389 10436120 3396777 -200374 4090105
3740 4090105 10981690 12701332 11070984 13784785 20700667 23528494 19256054 14336697
3732 14336697 13584283 13711628 11177142 8430113 7874448 6667369 3065960 2084794 8299056
3723 8299056 17111895 19897248 15314061 9168437 4669203 -602693 -7968826 -13782834
3715a3782834j19471N707603Q708111Q210556M175019j387459l677471l34035
3707G500019M222250M056425k9878k222443p98470o1111k560196m768345k853431
3698B484820J466995L991451L963859L643843M047478M341534M036947K832926
3690C0809853l78731n251774p986839n289462J89868K177558j284306n775778
3682G210389o756661m235617n51729K479040K869139q96524o212483p131713j783496
3673a5009655M118812M365984O2252l020629k285592L08655K560160L573420K432274
3664b894319o51228k757480j409260J537421K388431Q57558m56442m27192K75509
3655c537002J628307L245106K795548l28433j986449R75889M382438K501492j999158
$$ plain form
3715 -13782834 -13902305 -8194702 513409 8723965 12898984 11511525 7834054 7500019
3707 7500019 11722269 15778694 15748816 13526373 12727903 12666792 10106596 5338251 2484820
3698 2484820 3951815 7943266 11907125 15550968 19598446 23939980 27976927 30809853
3690 30809853 30431122 25179348 17192509 11903047 12092915 14270473 12986167 7210389
3682 7210389 453728 -3781889 -4333618 -1854578 1014561 118037 -6094446 -13226159 -15009655
3673 -15009655 -10890843 -6524859 -6462607 -9483236 -11768828 -11460173 -8900013 -5326593 -2894319
3664 -2894319 -3545547 -6303027 -7712287 -6174866 -3786435 -2928877 -3385319 -3812511 -3537002
3655 -3537002 -1908695 1336411 4131959 3803526 1817077 2792966 7175404 9676896 7677738
3646G677738j894584J910764J194769n023436p154398j73432P560976O806405
3638A0904802P86907j400146J511132L952723L671798K567829L13543m810625
3630A7497963j0151946j0863290p103466l024095K86291M595680Q264169P113828
3622F615134J934629j267618K19488K537905J954097j55327q91931k20094K56317
3613A0982600k76428k068235m688213n900677l563968Q09288L373362L125299
3605A793028K517140K688931J848039p97694l125444l391165k415982j354224
3597b237371L7285K002310M006776N692848O358433M156586r92055m642023k361146
3588A2021643L343860N609806K878868M06949J165391J367152k423052p212965
$$ plain form
3646 7677738 5783154 7693918 8888687 3865251 -3289147 -3462579 4098397 10904802
3638 10904802 11691709 10291563 11802695 15755418 19427216 21995045 22308588 17497963
3630 17497963 7346017 -3517273 -10620739 -13644834 -13358543 -8762863 -498694 6615134
3622 6615134 8549763 7282145 7501633 10039538 11993635 11838308 10946377 10726283 10982600
3613 10982600 10706172 8637937 3949724 -1950953 -5514921 -4705633 -1332271 1793028
3605 1793028 4310168 6999099 8847138 8049444 4924000 1532835 -883147 -2237371
3597 -2237371 -2200086 -197776 3809000 9501848 15860281 20016867 19024812 14382789 12021643
3588 12021643 15365503 20975309 23854177 24261126 25426517 26793669 24370617 17157652
3580A7157652q104091m725544o2479L407974L890111P35560k642656q05383N820837
3571A4671981R778898O527725M26102k969712m709619p339406p946787l506000
3563D933182J523747J208838j560243L81551N719095N975272p00225o515271o194828
3554D771118l274292j655887N53084M465332N232272m75029p030789o414305O48173
3545c180323N801523M004033j226535l232629K79694N401457O319199J746943
3537A5913362l049136k436834J983022L546046L05202k430453r51263J101135
3529A3981081n24225l193973j915906K109365L463352J314623L77198L232277
3521A8843792O719023O811840L260282j646642n872923p965445o807102k523882
$$ plain form
3580 17157652 9053561 4328017 4265538 7673512 11563623 12299183 9656527 8851144 14671981
3571 14671981 24450879 30978604 31404706 28434994 23725375 16385969 8439182 4933182
3563 4933182 6456929 7665767 6105524 6487075 12206170 18181442 17481217 10965946 4771118
3554 4771118 1496826 -159061 394023 4859355 10091627 9616598 2585809 -3828496 -3180323
3545 -3180323 2621200 6625233 5398698 2166069 2445763 7847220 14166419 15913362
3537 15913362 12864226 10427392 12410414 15956460 16261662 13831209 12879946 13981081
3529 13981081 13456856 10262883 8346977 10456342 13919694 15234317 15611515 18843792
3521 18843792 25562815 32374655 35634937 33988295 28115372 20149927 13342825 10818943
3513A0818943K878512O078924M115294k618167q638885p690956n66161M564139
3505H941643K214129l435821n120221k337006M03332J837479L688166M035986
3497A0227687j088921r050120j1207588m509643L851051O189310L120234l97681
3489b865671k184048k022967J203698O533036Q759151M462719k197304m350310
3481G338304j155456K552724L514531K515269Q99733r14592j817726o88123J208555
3472A3453219J265433j167733m427177o396978n048597N44029P185355Q465530
3464A3873081K421501m386791m845971o23554J775570J486063K646195M835312
3456A7181406K837223l120405n577544j386783K768040R88079k583535j182688
$$ plain form
3513 10818943 13697455 19776379 23891673 21273506 12634621 4943665 4377504 8941643
3505 8941643 11155772 7719951 2599730 262724 666056 2503535 6191701 10227687
3497 10227687 9138766 88646 -11118942 -15628585 -11777534 -5588224 -2467990 -2865671
3489 -2865671 -5049719 -7072686 -5868988 664048 9423199 13885918 11688614 7338304
3481 7338304 6182848 8735572 12250103 14765372 15665105 14750513 12932787 12244664 13453219
3472 13453219 14718652 13550919 9123742 2726764 -2321833 -1777804 5407551 13873081
3464 13873081 16294582 11907791 7061820 6438266 8213836 9699899 12346094 17181406
3456 17181406 20018629 16898224 11320680 9933897 12701937 13690016 11106481 9923793
3448I923793L269035L416516k147276p681195q951200o957398l702334J57979
3440a2672080L232504L630040J887613K58390p11381j565889r07121K661137O130940
3431A944153M679440r36900m620287l624309j860049k619267l265614n33454L355034
3422g481253M279083K708745J837723J491533q42290l850080k752176L255466
3414a353249Q418110P297664J171107m393123n863984l635834J24478K853284
3406D618453K294971j175288l441202p78735M624388O115561P51968o369619p982863
3397a342366l184622K427600M169379K709318R75887N0243r0882J548643N277916
3388A2541116Q027763N695083j386161p831774r072558n971726k462359m12928
$$ plain form
3448 9923793 13192828 16609344 14462068 6780873 -2170327 -9127725 -12830059 -12672080
3440 -12672080 -9439576 -5809536 -3921923 -3663533 -4374914 -5940803 -6847924 -4186787 1944153
3431 1944153 6623593 5686693 1066406 -2557903 -4417952 -7037219 -10302833 -10836287 -7481253
3422 -7481253 -3202170 -493425 1344298 2835831 1993541 -1856539 -4608715 -1353249
3414 -1353249 7064861 14362525 15533632 11140509 5276525 1640691 1765169 4618453
3406 4618453 6913424 5738136 2296934 1518199 6142587 12258148 13010116 6640497 -1342366
3397 -1342366 -4526988 -2099388 2069991 4779309 5755196 5805439 5714557 7263200 12541116
3388 12541116 20568879 26263962 24877801 17046027 7973469 2001743 -460616 -873544
3380h73544J159057K757334K911448P15479j871992j863383R25255L181816J792877
3371H834347k396140n305648m038670J16832L311783L163548P20686j157806p13436
3362B535496J455422L597635M802700N330733M919306J937367m240452j0434259
3354I903948j1586558o491383K50320L432879K729379J185477J18215j445637
3346a903360l169014k889998j82233K676691M248119N587835P056360O380639
3338A7805039K130942k986551m830246k609529R22701K698735J007949m119959
3330A0019081r668538j0595120n351986Q28813J903865p05220m14346M121688
3322i861763O656355L275884j068201j46489L831960L843890j069613m946949
$$ plain form
3380 -873544 285513 3042847 5954295 6669774 4797782 2934399 3859654 7041470 8834347
3371 8834347 6438207 1132559 -2906111 -2789279 522504 3686052 4406738 3248932 2535496
3362 2535496 3990918 7588553 12391253 17721986 22641292 24578659 20338207 9903948
3354 9903948 -1682610 -8173993 -7923673 -4490794 -1761415 -575938 -457723 -1903360
3346 -1903360 -5072374 -7962372 -8144605 -5467914 -1219795 4368040 11424400 17805039
3338 17805039 19935981 16949430 12119184 9509655 10432356 13131091 14139040 10019081
3330 10019081 350543 -10244577 -15596563 -14767750 -12863885 -13569105 -13983451 -9861763
3322 -9861763 -3205408 70476 -997725 -1144214 2687746 6531636 5462023 515074
3314E15074m408637k572324k166465q88281L037608N700355K940315k081524k438958
3305b362837K445708N806169L337980j076296j738696Q11754J731319m87892k422622
3296F044587j361768R41629J105468j464236m141862l909219j0798N113769P185714
3287I503284L842958k217799n409012l750513j486812l060147n948660l326751
3279a1853452N639683J2353891Q704633k173323r268846o982432n02448K731787
3271a350507K068179J328371J468359L86156j627926j440041J447999L272753
3263E553343J556330q76222L54128N342823R738798R209131K922292n822026j1179414
3254A6799183q849616o29515O116375N312885j977352r435461j1955479r071307
$$ plain form
3314 515074 -3893563 -6465887 -8632352 -9520633 -6483025 -782670 2157645 76121 -2362837
3305 -2362837 82871 5889040 9227020 8150724 6412028 7223782 8955101 8467209 6044587
3296 6044587 4682819 5624448 6729916 5265680 1123818 -2785401 -2796199 2317570 9503284
3287 9503284 13346242 11128443 5719431 1968918 482106 -2578041 -8526701 -11853452
3279 -11853452 -6213769 6140122 14844755 12671432 3402586 -3579846 -4082294 -1350507
3271 -1350507 717672 2046043 3514402 3900558 2272632 832591 2280590 5553343
3263 5553343 7109673 6233451 6587579 11930402 21669200 30878331 33800623 27978597 16799183
3254 16799183 7949567 7320052 13436427 18749312 16771960 7336499 -4618980 -13690287
3246a3690287l597359J035269K885642K841699L489574N454591N869281K096096
3238F384506l965407p288660n204916j01783L090114J358320l515333n940464
3230a5183623k123085M496467O170317R77561l483159q6754P282388Q479290Q18622
3221G348024p803920r549284m886878Q19593L926485L857626J985438J107933
3213c194983K734984L900530O24940m714820m786628J967219P729177N899450
3205A0159869l500k610759j197122k12878q17507l12127J679578K438791J110091
3196A0234436l35230p43738m92815N07870J795677R93266k252550l094924K296155
3187H908147R132127R188946K773938j651396J9917L030506K990809J506468j64413
$$ plain form
3246 -13690287 -17287646 -16252377 -13366735 -10525036 -7035462 -1580871 4288410 6384506
3238 6384506 2419099 -4869561 -10074477 -10176260 -7086146 -5727826 -9243159 -15183623
3230 -15183623 -17306708 -12810241 -6639924 -5662363 -9145522 -9232276 -1949888 6529402 7348024
3221 7348024 -455896 -10005180 -14892058 -14072465 -10145980 -6288354 -4302916 -3194983
3213 -3194983 -459999 3440531 4065471 -649349 -5435977 -3468758 4260419 10159869
3205 10159869 10156369 7545610 6348488 6135610 5318103 5005976 6685554 9124345 10234436
3196 10234436 9899206 9155468 8662653 9170523 10966200 11959466 9706916 6611992 8908147
3187 8908147 18040274 27229220 30003158 28351762 28371679 31402185 34392994 35899462 35735049
3178C5735049m771245j1644252j3241370n750090K956187L614072q98597q68956
3170E130798M704000P534780M153332P46312K061597M210480K417106j088358
3162B9870047j976007j312156k502276m452578l711956j208473q75334k446127
3154A1385140j601651K111251L341653o44926m535935k181857L896591N486016
3146A7256282K70597m972925m108903J87861J355947j273224k537875k49186J488986
3137G417560o59413l368593j390250M325532P484192M848113r0151k503902j899994
3128A4163094o92152O7253P04610L27543k255704n080468m015024J253806N051997
3119I524955K377973l843200n727500n38783N860449O907885L226210L5154n01529
$$ plain form
3178 35735049 30963804 19319552 6078182 328092 3284279 6898351 5999754 5130798
3170 5130798 9834798 17369578 21522910 22269222 24330819 28541299 30958405 29870047
3162 29870047 27894040 26581884 24079608 19627030 15915074 14706601 13831267 11385140
3154 11385140 9783489 11894740 15236393 14591467 10055532 7873675 11770266 17256282
3146 17256282 17526879 12553954 8445051 8632912 9988859 8715635 6177760 5928574 7417560
3137 7417560 6758147 3389554 1999304 6324836 13809028 18657141 18566990 16063088 14163094
3128 14163094 13470942 13538195 14242805 14570348 12314644 7234176 3219152 4472958 9524955
3119 9524955 11902928 8059728 2332228 1793445 7653894 14561779 17787989 17823143 17321614
3110A7321614n22656j577684k831625l981095n705263o527672l571378J878531
3102e517228L932245K32739l304541k42415O608878Q554416L094474l082024l940526
3093F336018j494646p45142j605738j82468M005545O698345N031147J524434L62264
3084A9929759J697485J901282q76874l638840k528609J150204J631528l554053
3076A5711882r036012p722344k52865N505746M738419J194683K69757O70079k373461
3067H705884p621421p602492Q13387J0442700J1715250L905811n081763q612314
3059F665042p078836m050950j023189K011128L780435K750416o3419j983564k199242
3050a192179k182489k491206j487589J856222N702818P261798N924288L403178
$$ plain form
3110 17321614 16798958 15221274 12389649 8408554 2703291 -3824381 -7395759 -5517228
3102 -5517228 -1584983 -1352244 -4656785 -4899200 1709678 10264094 13358568 10276544 6336018
3093 6336018 4841372 4096230 2490492 2308024 6313569 13011914 18043061 19567495 19929759
3084 19929759 21627244 23528526 22651652 19012812 16484203 17634407 19265935 15711882
3076 15711882 6675870 -1046474 -1299339 4206407 8944826 10139509 10409266 11079345 8705884
3067 8705884 1084463 -6518029 -5704642 4738058 16453308 20359119 15277356 6665042
3059 6665042 -413794 -4464744 -5487933 -3476805 303630 3054046 2990627 1007063 -1192179
3050 -1192179 -3374668 -5865874 -7353463 -5497241 205577 7467375 13391663 16794841
3042A6794841J587626J184587J635617J420515p31395l949914n402808l446799
3034I092270K43998K764700L069355J613278j551550n833054q172106n377620
3026d150729J066971N362820L874069p75610l369859k066869P70214K189557J351824
3017D252388n40708j608479j058907k18498p94785j747441K4497M570626O853537
3008I732230K518239n707446j0446821q013276j515497M005274O316149N583872
3000B472724K807702K72629P01965L700856N114967K371847j197292l05503M869828
2991B0809723Q458325O421239J347856j665410j633274j766142l862150n412732
2983B2697435l313670J212728L373685M84851m635934o801904m128112M89315
$$ plain form
3042 16794841 18382467 19567054 21202671 22623186 21891791 17941877 12539069 9092270
3034 9092270 9336268 12100968 15170323 16783601 15232051 9398997 1226891 -4150729
3026 -4150729 -3083758 2279062 6153131 5377521 2007662 -59207 711007 2900564 4252388
3017 4252388 3711680 2103201 1044294 825796 31011 -1716430 -1691933 2878693 9732230
3008 9732230 12250469 6543023 -3903798 -11917074 -13432571 -9427297 -3111148 2472724
3000 2472724 5280426 5553055 6255020 9955876 15070843 17442690 16245398 15939895 20809723
2991 20809723 29268048 35689287 37037143 35371733 33738459 31972317 28110167 22697435
2983 22697435 19383765 20596493 23970178 24455029 19819095 13017191 8889079 9378394
2975I378394L061672K396429L92106j94144K035672N837407P626181M260425l400947
2966C1393195j0348148j1728108p062553l5498M892496N273759J737109k344881
2958A1777371l394229j369439j944j753095l954323k558491J253848J911353k561862
2949f50811p057877n899002j18309M473506M723232K600920J087764Q14535J121214
2940A095172J681542J868974N46624j858777k477917O90901N085890N552183P56622
2931A2941214m301379l963333R98386M388741K609612j150021j966701K66082
2923I822601J932498J486874O10783J48999j311784m040717n584584m033294m42842
2914a411466L106497N298239M480639o74248p328269r007650l458469L024775
$$ plain form
2975 9378394 12440066 14836495 15228601 15034457 17070129 22907536 30533717 34794142 31393195
2966 31393195 21045047 9316939 2254386 2218888 7111384 12385143 14122252 11777371
2958 11777371 8383142 7013703 7011759 5258664 1304341 -1254150 -302 1911051 -650811
2949 -650811 -7708688 -13607690 -13725999 -9252493 -4529261 -1928341 -840577 -26042 1095172
2940 1095172 2776714 4645688 5192312 3333535 855618 1546519 6632409 12184592 12941214
2931 12941214 8639835 4676502 5674888 10063629 12673241 11523220 9556519 9822601
2923 9822601 11755099 13241973 13852756 14001755 12689971 8649254 3064670 -968624 -1411466
2914 -1411466 1695031 6993270 11473909 10799661 3471392 -5536258 -8994727 -5969952
2906e969952L391439m53220r70707L367208O060940K951632j498018j212080K745675
2897H412917M450295J596209k300016l367405j892107r32899k077884l360320
2889E28790j565981L170719O268848M109453m55941j395753J700351K552008k333869
2880A2578625p677998o680130q40996K515865Q43331j045817P62049L570803K706003
2871F731735j741549n552157n674742k410325K256900N932110O116880K014107
2863G672959l417740n354353k358338J610952J996922n71025j508128J058129
2855h70622L802506L412142J298664O30697R77912n19473l823239n806884n215368
2846f113665l893744k709448m42871K139741J589064k443533m686297r37892N568747
$$ plain form
2906 -5969952 -2578513 -3031733 -4002440 -635232 5425708 8377340 6879322 5667242 8412917
2897 8412917 12863212 14459421 12159405 8792000 6899893 5966994 3889110 528790
2889 528790 -1037191 2133528 8402376 12511829 12055888 10660135 12360486 14912494 12578625
2880 12578625 4900627 -1779503 -2620499 -104634 738697 -307120 454929 4025732 6731735
2871 6731735 4990186 -561971 -6236713 -8647038 -6390138 -458028 5658852 7672959
2863 7672959 4255219 -1099134 -3457472 -1846520 150402 -420623 -1928751 -870622
2855 -870622 2931884 6344026 7642690 8273387 9251299 8731826 4908587 -898297 -6113665
2846 -6113665 -10007409 -12716857 -13159728 -11019987 -9430923 -11874456 -16560753 -17498645 -11929898
2837a1929898Q118042M933411L75991q22234K317394P214639R416818N655735
2829B5279898k195706p851437p620902m465483k633361j622279O30837K100838
2821A622405l9160k874324j234264L223144L547509j391769m517050j388353L144866
2812I3004K766748j042806k110412J312952M823583L816608j638931p064468p608739
2803f652461l142408P82205n47029m385815m479894p82698Q54617p73125M45932
2794a8680676P062878J1995967Q617970P53528l739444m214388m813014n023556
2786h040735j193550M688564O365439L246290J270337L229861N386556N033324
2778A9986086M553954N612557N375454J639948l118017n870208p102218p962420
$$ plain form
2837 -11929898 -3811856 1121555 1497546 675312 2992706 10207345 19624163 25279898
2829 25279898 23084192 15232755 7611853 3146370 513009 -1109270 -478433 1622405
2821 1622405 1583245 -1291079 -2525343 697801 4245310 2853541 -1663509 -3051862 93004
2812 93004 2859752 1816946 -293466 1019486 5843069 9659677 8020746 956278 -6652461
2803 -6652461 -9794869 -9012664 -9559693 -13945508 -18425402 -19208100 -18353483 -19126608 -18680676
2794 -18680676 -11617798 378169 8996139 9749667 6010223 1795835 -3017179 -8040735
2786 -8040735 -9234285 -4545721 1819718 5066008 6336345 9566206 14952762 19986086
2778 19986086 24540040 30152597 35528051 37167999 34049982 28179774 21077556 13115136
2770A3115136p235972m152216q77238O40150J344881K173283J779017j50717p89396
2761E846928J289176K715850M24750k646017j578219K705506M611915K012870
2753A5382759j713990l788593n164497o254069m223995K267940Q532737Q035544
2745A3073836O85357o150505n958609o16112K204845j259151o104710n293709
2737i418758P26248M344340J100007m164453m094347J092485M511627K531683
2729c371168j013098j565932m92296j951025n616498o369237j115226O937871
2721a4556609J1796674J0895837O691894K925146P39160j049581k712855k308359
2713A2421307J291729N061584M027634k208635p366201n415646J396493M731222
$$ plain form
2770 13115136 5879164 1726948 849710 1489860 2834741 5008024 6787041 6636324 5846928
2761 5846928 7136104 9851954 10276704 7630687 6052468 8757974 13369889 15382759
2753 15382759 13668769 9880176 4715679 -1538390 -5762385 -3494445 5038292 13073836
2745 13073836 13759193 7608688 1650079 1033967 3238812 1979661 -4125049 -9418758
2737 -9418758 -8692510 -4348170 -3248163 -7412616 -11506963 -10414478 -5902851 -3371168
2729 -3371168 -4384266 -5950198 -6442494 -8393519 -14010017 -20379254 -21494480 -14556609
2721 -14556609 -2759935 8135902 14827796 17752942 18492102 17442521 14729666 12421307
2713 12421307 13713036 18774620 22802254 20593619 13227418 7811772 9208265 13939487
2705A3939487Q06932m673366m500250R3663J629288k529965o386479m189243J315490
2696d494443L240031M86980j553826K88448K643876J684732p46566o62506J018039
2687A904765l49406n173920p436769k423313O481486J1647953J0130750N587052
2679B0368598K108343j24255k279284l512641k584527p26519j58526q38544j180678
2670A1071967j122776j724253k265719r38226J478215K019823L72092k61628J389961
2661A0019456K127419j69879k119607j69275K309188j101371r422502j3592963
2653a2119534q042221J732409O349561M065089J094409K056323M675209M712952
2645D524197K330813P74124O65739o24289l573161m207106J16797N156865M345617
$$ plain form
2705 13939487 14746419 10073053 5572803 5666466 7295754 4765789 -1620690 -5809933 -4494443
2696 -4494443 -1254412 -767432 -2321258 -2032810 611066 2295798 1549232 886726 1904765
2687 1904765 1555359 -3618561 -11055330 -13478643 -6997157 4650796 14781546 20368598
2679 20368598 22476941 22352686 20073402 16560761 13976234 13249715 13091189 12252645 11071967
2670 11071967 9949191 8224938 5959219 5020993 6499208 8519031 8891123 8629495 10019456
2661 10019456 12146875 11976996 9857389 9688114 11997302 10895931 1473429 -12119534
2653 -12119534 -20161755 -18429346 -12079785 -8014696 -6920287 -4863964 -188755 4524197
2645 4524197 6855010 7629134 8294873 7670584 4097423 -109683 7114 5163979 9509596
2636I509596j723306n354517k509761J663421J237562j348873P9098M841145O225312
2627A2619677K073942k222787k294084j61674J096117K305241M390037M495436
2619B2301905M73958m192620m800691k455952j847549l473247l203006O12372
2611C415170M510969N471551M917448N093369M638776P86986n487019r457464
2603A3889786p967941k947407J029753J504223n44756l196456n328636n514525
2595i075959j795751N138162J0279104R197811L980686N32424J62798j259749
2587A7159526m760224m968880R30224O554303M738702j278918k612457J397027
2579A7159303K725963j610562m639870j607528J419210k538113r139570q670072
$$ plain form
2636 9509596 7786290 2431773 -77988 1585433 2822995 1474122 1553220 6394365 12619677
2627 12619677 14693619 12470832 10176748 10015074 11111191 13416432 17806469 22301905
2619 22301905 22775863 18583243 13782552 11326600 9479051 6005804 2802798 3415170
2611 3415170 7926139 13397690 18315138 23408507 28047283 28834269 23347250 13889786
2603 13889786 5921845 2974438 4004191 5508414 4963658 1767202 -3561434 -9075959
2595 -9075959 -10871710 -5733548 4545556 13743367 17724053 18256477 18419275 17159526
2587 17159526 12399302 7430422 8360646 14914949 19653651 18374733 15762276 17159303
2579 17159303 19885266 18274704 13634834 12027306 13446516 10908403 1768833 -6901239
2571f901239r12717M656655L041390j33357J502325N995606P392575L998767j601251
2562A7038754o803290r225227o223941J039965N667421K450717m376497o328935
2554f761033k549524j16018k324937m036517j243442J866589M12940k316734k32752
2545a7301428M977959O173303K134978r31009L72607J978753q0062l494839m101980
2536a0271718j746516J467809M720681O885779N130839q31159n844880m847925
2528e337090N63273M922097O468618P635183R027498P804361K842201k361225
2520C1564916l789142j711091K29968m47009k646400l454051j786464j8706j240103
2511A6701918m770505n989474j819906M906514Q256790N717102L64252l174119
$$ plain form
2571 -6901239 -7813956 -3157301 -115911 -249268 1253057 7248663 14641238 18640005 17038754
2562 17038754 10235464 1010237 -5213704 -4173739 1493682 3944399 -432098 -6761033
2554 -6761033 -9310557 -9426575 -11751512 -15788029 -17031471 -15164882 -14751942 -17068676 -17301428
2545 -17301428 -12323469 -6150166 -4015188 -4946197 -4573590 -2594837 -2674899 -6169738 -10271718
2536 -10271718 -12018234 -10550425 -5829744 1056035 6186874 5355715 -489165 -5337090
2528 -5337090 -4773817 148280 6616898 14252081 23279579 31083940 33926141 31564916
2520 31564916 27775774 26064683 26294651 25847642 23201242 19747191 17960727 17942021 16701918
2511 16701918 11931413 5941939 4122033 9028547 17285337 23002439 23366691 20192572
2503B0192572l583065l430050n320325p836348o463253K34940O908701O973805
2495G676977J269042k896749j759106O41041r2460k198366k131978q88436j282534
2486a662569k263729r28590K166721M353929N310737N625392L367095k707724
2478A3261262q578553r065145m833715k2441M770458J0676941J3997410R564169
2470B9770386Q4860o058347o615995o786748q140003n752023J099714M992538
2462B594382J673675k984578k548230R61247L012075M070025N099494K997482
2454A4875572k460370m459529r2639J944314n228606j2317330n810869R938326
2446c611131J7079718R672716n5153k614842l348410q089292j0668778m396039
$$ plain form
2503 20192572 16609507 13179457 7859132 22784 -6440469 -6205529 703172 7676977
2495 7676977 8946019 6049270 4290164 4931205 4838745 2640379 508401 -380035 -1662569
2486 -1662569 -3926298 -4854888 -2688167 1665762 6976499 12601891 15968986 13261262
2478 13261262 4682709 -4382436 -9216151 -9238592 -4468134 6208807 20206217 29770386
2470 29770386 29855246 23796899 17180904 10394156 2254153 -3497870 -2398156 2594382
2462 2594382 4268057 1283479 -1264751 -303504 2708571 6778596 11878090 14875572
2454 14875572 12415202 7955673 7863034 9807348 4578742 -7738588 -13549457 -3611131
2446 -3611131 13468587 23141303 23086150 20471308 17122898 9033606 -1635172 -6031211
2438f031211M187019M426216j846706m021397N69005M418910L140428Q72587J247958
2429F962809J648014n28194k586644j458726Q21984N82744j721150k925392k197263
2420a401818j198002n58378N03101J562602J060494o37242p62113K191022N996953
2411F756619P168609M842659R84110k415482m704018n391868l561320N61355M494313
2402H734977N270088K343755j787159l877694k797640m66899K1836k299285m978868
2393A63111m909021j989803J429906M355490P640215J0005737P227804j778017
2385B2145422j0764560j2323096p135750k630716k613382l174105j63612M252567
2377a2407232N682990M442797M181440N563477N528771K297820k305317n441502
$$ plain form
2438 -6031211 -1844192 2582024 735318 -3286079 -2717074 1701836 4842264 5714851 6962809
2429 6962809 8610823 8082629 5495985 4037259 4859243 5441987 3720837 795445 -1401818
2420 -1401818 -2599820 -3158198 -2655097 -1092495 -32001 -669243 -1431356 759666 6756619
2411 6756619 13925228 18767887 19751997 17336515 12632497 7240629 3679309 4240664 8734977
2402 8734977 14005065 16348820 14561661 10683967 7886327 7419428 7441264 5141979 163111
2393 163111 -4745910 -6735713 -5305807 -950317 6689898 16695635 23923439 22145422
2385 22145422 11380862 -942234 -8077984 -10708700 -13322082 -16496187 -16659799 -12407232
2377 -12407232 -6724242 -2281445 1899995 7463472 12992243 15290063 12984746 7543244
2369G543244n432859j771707L933884P132448M036767k958492o871351m590167
2361A021767o04758k64713k464796k327926J107447M118267M434868L774293L538880
2352A2333329J984166k108772n680718m388450J481361O572461O234732J323212
2344A7751321l355453m658408m118660m786111o028593l973536J998879O399307
$$ plain form
2369 7543244 2110385 338678 4272562 11405010 15441777 12483285 5611934 1021767
2361 1021767 417009 152296 -2312500 -4640426 -3532979 585288 5020156 8794449 12333329
2352 12333329 14317495 12208723 6528005 2139555 3620916 10193377 16428109 17751321
2344 17751321 14395868 9737460 5618800 832689 -5195904 -9169440 -7170561 -771254
$$ [...]
##END NTUPLES=NMR SPECTRUM
##END=
