##TITLE=31Pdec_DE-80rm_3h
 , 64 sc
 16.1.2025
##JCAMPDX= 6.0         $$ Bruker NMR JCAMP-DX V2.0
##DATA TYPE= NMR SPECTRUM
##DATA CLASS= NTUPLES
##ORIGIN= UXNMR, Bruker Analytische Messtechnik GmbH
##OWNER= root
$$ XWIN-NMR		Version 3.5
$$ Thu Jan 16 15:05:45 2025 Russian Standard Time (UT+4h)  she@DPX200
##.OBSERVE FREQUENCY= 81.013821
##.OBSERVE NUCLEUS= ^31P
##.ACQUISITION MODE= SIMULTANEOUS
##.ACQUISITION SCHEME= undefined
##.AVERAGES= 64
##.DIGITISER RES= 17
##SPECTROMETER/DATA SYSTEM= spect
##.PULSE SEQUENCE= zgpg30
##.SOLVENT NAME= CDCl3
##.SHIFT REFERENCE= (INTERNAL, CDCl3, 0, 198.062)
##AUDIT TRAIL= $$ (NUMBER, WHEN, WHO, WHERE, WHAT)
$$ ##TITLE= Audit trail, XWIN-NMR		Version 3.5
$$ ##JCAMPDX= 5.01
$$ ##ORIGIN= Bruker BioSpin GmbH
$$ ##OWNER= she
$$ F:/spectra/data/she/nmr/P31/2/pdata/1/auditp.txt
$$ ##AUDIT TRAIL=  $$ (NUMBER, WHEN, WHO, WHERE, WHAT)
(   1,<2025-01-16 15:05:01.21 +0400>,<she>,<DPX200>,
      <continue with go, POWCHK disabled, PULCHK disabled
       configuration hash MD5:
       00 E9 B6 7A A2 85 ED C7 34 08 36 98 17 FE 4E 26
       data hash MD5: 32K
       F6 C3 92 D9 E3 C6 2E 61 0D 17 BB FB C4 4F F7 09>)
(   2,<2025-01-16 15:05:04.03 +0400>,<she>,<DPX200>,
      <Start of raw data processing
       efp BC_mod = 2 LB = 1.5 FT_mod = 6 PKNL = 1 PHC0 = 1631.408 PHC1 = 448.0856 SI = 64K 
       data hash MD5: 64K
       FB 86 95 A8 56 9B AB 93 17 37 81 FC B4 73 37 2F>)
(   3,<2025-01-16 15:05:19.85 +0400>,<she>,<DPX200>,
      <pk PHC0 = -1.331303 PHC1 = 0 
       data hash MD5: 64K
       DE 91 F9 94 F6 02 48 87 39 12 4E 2E F5 7D 78 53>)
$$ ##END=
$$ 
$$ hash MD5
$$ D0 4D F5 1A B1 10 A0 BC 30 EE B7 12 53 2A AB FF
##$RELAX= 
##$RELAX= 
##$RELAX= 
##$RELAX= 
##$RELAX= 
##$RELAX= 
##$RELAX= 
##$RELAX= 
$$ Bruker specific parameters
$$ --------------------------
##$DU= <F:/spectra>
##$EXPNO= 2
##$NAME= <P31>
##$PROCNO= 1
##$TYPE= <nmr>
##$USER= <she>
##$AMP= (0..31)
100 100 100 100 100 100 100 100 100 100 100 100 100 100 100 100 100 100 
100 100 100 100 100 100 100 100 100 100 100 100 100 100 
##$AQSEQ= 0
##$AQ_mod= 1
##$AUNM= <au_zg>
##$AUTOPOS= <>
##$BF1= 81.014009
##$BF2= 200.13
##$BF3= 200.13
##$BF4= 200.13
##$BF5= 200.13
##$BF6= 200.13
##$BF7= 200.13
##$BF8= 200.13
##$BYTORDA= 1
##$CFDGTYP= 0
##$CFRGTYP= 5
##$CHEMSTR= <none>
##$CNST= (0..31)
1 1 145 1 1 1 1 1 1 1 1 1 1 1 1 1 1 1 1 1 1 1 1 1 1 1 1 1 1 1 1 1 
##$CPDPRG= <waltz16>
##$CPDPRG1= <>
##$CPDPRG2= <waltz16>
##$CPDPRG3= <>
##$CPDPRG4= <mlev>
##$CPDPRG5= <mlev>
##$CPDPRG6= <mlev>
##$CPDPRG7= <mlev>
##$CPDPRG8= <mlev>
##$CPDPRGB= <>
##$CPDPRGT= <>
##$D= (0..31)
0 1 0 0 0 0 0 0 0 0.06 0 0.03 2e-05 3e-06 0 0 0.0002 0 0 0 0 0 0 0 0 0 
0 0 0 0 0 0 
##$DATE= 1737025411
##$DBL= (0..7)
120 120 120 11 120 120 24 19 
##$DBP= (0..7)
150 150 150 150 150 150 150 150 
##$DBP07= 0
##$DBPNAM0= <>
##$DBPNAM1= <>
##$DBPNAM2= <>
##$DBPNAM3= <>
##$DBPNAM4= <>
##$DBPNAM5= <>
##$DBPNAM6= <>
##$DBPNAM7= <>
##$DBPOAL= (0..7)
0.5 0.5 0.5 0.5 0.5 0.5 0.5 0.5 
##$DBPOFFS= (0..7)
$$ [...]
##$SUBNAM3= <"">
##$SUBNAM4= <"">
##$SUBNAM5= <"">
##$SUBNAM6= <"">
##$SUBNAM7= <"">
##$SUBNAM8= <"">
##$SUBNAM9= <"">
##$SW= 400.765351723535
##$SWIBOX= (0..15)
0 1 3 0 0 0 0 0 0 0 0 0 0 0 0 0 
##$SW_h= 32467.5324675325
##$TD= 32768
##$TD0= 1
##$TE= 0
##$TE2= 300
##$TE3= 300
##$TEG= 300
##$TL= (0..7)
0 120 53 12 22 120 120 120 
##$TP= (0..7)
150 150 150 150 150 150 150 150 
##$TP07= 0
##$TPNAME0= <>
##$TPNAME1= <>
##$TPNAME2= <>
##$TPNAME3= <>
##$TPNAME4= <>
##$TPNAME5= <>
##$TPNAME6= <>
##$TPNAME7= <>
##$TPOAL= (0..7)
0.5 0.5 0.5 0.5 0.5 0.5 0.5 0.5 
##$TPOFFS= (0..7)
0 0 0 0 0 0 0 0 
##$TUNHIN= 0
##$TUNHOUT= 0
##$TUNXOUT= 0
##$USERA1= <user>
##$USERA2= <user>
##$USERA3= <user>
##$USERA4= <user>
##$USERA5= <user>
##$V9= 5
##$VALIST= <valist>
##$VCLIST= <CCCCCCCCCCCCCCC>
##$VD= 0
##$VDLIST= <DDDDDDDDDDDDDDD>
##$VPLIST= <PPPPPPPPPPPPPPP>
##$VTLIST= <TTTTTTTTTTTTTTT>
##$WBST= 1024
##$WBSW= 4
##$XGAIN= (0..3)
0 0 0 0 
##$XL= 0
##$YL= 0
##$YMAX_a= 12922
##$YMIN_a= -17850
##$ZGOPTNS= <>
##$ZL1= 120
##$ZL2= 120
##$ZL3= 120
##$ZL4= 120
##$ABSF1= 0
##$ABSF2= 0
##$ABSG= 0
##$ABSL= 0
##$ALPHA= 0
##$AQORDER= 0
##$ASSFAC= 0
##$ASSFACI= 0
##$ASSFACX= 0
##$ASSWID= 0
##$AUNMP= <proc_1d>
##$AZFE= 0.1
##$AZFW= 0.5
##$BCFW= 0
##$BC_mod= 2
##$BYTORDP= 0
##$COROFFS= 0
##$CY= -3
##$DATMOD= 1
##$DC= 0
##$DFILT= <>
##$DTYPP= 0
##$F1P= 0
##$F2P= 0
##$FCOR= 1
##$FTSIZE= 65536
##$FT_mod= 6
##$GAMMA= 0
##$GB= 0
##$INTBC= 1
##$INTSCL= 9.790993e-09
##$ISEN= 30
##$LB= 1.5
##$LEV0= 0
##$LPBIN= 0
##$MAXI= 10000
##$MC2= 0
##$MEAN= 0
##$ME_mod= 0
##$MI= 50
##$NCOEF= 0
##$NC_proc= -8
##$NLEV= 6
##$NOISF1= 182.463
##$NOISF2= 159.3651
##$NSP= 0
##$NTH_PI= 0
##$NZP= 0
##$OFFSET= 198.0616
##$PC= 4
##$PHC0= 1630.077
##$PHC1= 448.0856
##$PH_mod= 1
##$PKNL= yes
##$PPARMOD= 0
##$PSCAL= 0
##$PSIGN= 0
##$REVERSE= no
##$SF= 81.0140089999434
##$SI= 65536
##$SIGF1= 159.3651
##$SIGF2= -187.1042
##$SINO= 113.3802
##$SIOLD= 16384
##$SREGLST= <1H.CDCl3>
##$SSB= 0
##$STSI= 65536
##$STSR= 0
##$SW_p= 32467.5324675325
##$SYMM= 0
##$S_DEV= 0
##$TDeff= 32768
##$TDoff= 0
##$TI= <>
##$TILT= no
##$TM1= 0
##$TM2= 0
##$TOPLEV= 0
##$USERP1= <user>
##$USERP2= <user>
##$USERP3= <user>
##$USERP4= <user>
##$USERP5= <user>
##$WDW= 1
##$XDIM= 65536
##$YMAX_p= 276346467
##$YMIN_p= -139835791
$$ End of Bruker specific parameters
$$ ---------------------------------
##NTUPLES= NMR SPECTRUM
##VAR_NAME=  FREQUENCY,     SPECTRUM/REAL,   SPECTRUM/IMAG
##SYMBOL=    X,             R,               I
##VAR_TYPE=  INDEPENDENT,   DEPENDENT,       DEPENDENT
##VAR_FORM=  AFFN,          ASDF,            ASDF
##VAR_DIM=   65536,         65536,           65536
##UNITS=     HZ,            ARBITRARY UNITS, ARBITRARY UNITS
##FACTOR=    0.49542278885378, 1,            1
##FIRST=     16045.7642231865, 0,            0
##LAST=      -16421.768244346, 0,            0
##MIN=       -16421.768244346, -139835791,   0
##MAX=       16045.7642231865, 276346467,    0
$$ Real data points
##PAGE= N=1
##DATA TABLE= (X++(R..R)), XYDATA
$$ [...]
47449 2929404 5447073 7262357 5765132 2171929 -461212 -1570468 -2534705 -2969040
47441 -2969040 -1158837 1989723 3117553 1255729 -817683 -1151874 -1232235 -2351288 -2693570
47432 -2693570 -645759 1748481 1881660 1025342 1932424 3338005 1146511 -4908707 -9894243
47423 -9894243 -10079968 -7312695 -5346557 -4801129 -4118900 -3165569 -2800475 -2111838 670781
47414 670781 4595026 6161841 3736350 -477680 -3703070 -5599502 -6698491 -6149829
47406 -6149829 -3495757 -1163474 -1919411 -4116869 -2905594 2926098 8516674 9239721
47398 9239721 6698682 5586919 6629875 6447708 3723698 1429768 2080129 4141703
47390 4141703 4813744 3848731 2698028 1785238 676922 -426808 -1410121 -3447595 -7405095
47381 -7405095 -11445060 -12043767 -7563711 74806 6974393 9863766 8074593 4162494
47373 4162494 1946792 2830620 4691678 5248837 5180221 6313785 8069107 8170079 6364710
47364 6364710 4824567 4682767 4613476 3494834 2261077 1994529 1988943 1155282 124574
47355 124574 454346 2341635 4248802 4457665 2322399 -1433876 -4879554 -5825503 -3536439
47346 -3536439 520576 4012119 5584639 5175475 3154251 -82707 -3873236 -7371750
47338 -7371750 -10079949 -12013239 -13208953 -13265689 -11673043 -8729351 -5794900 -4043131
47330 -4043131 -3013058 -1250098 1343049 2847566 1796792 -626602 -1994554 -1535549
47322 -1535549 -318076 905794 2421477 4252524 5709471 6353959 6021998 3895790
47314 3895790 -688363 -6062572 -8629602 -6511013 -1720540 2153797 3555051 3596525
47306 3596525 4038982 5401167 6504647 5543706 2263179 -1007173 -1677263 -178825 765219
47297 765219 248262 170933 1221603 556700 -4240022 -10613326 -13128016 -9469718 -2256119
47288 -2256119 4574375 9065965 11241626 11957117 12102176 11597039 9262433 4910813 932452
47279 932452 -98427 967188 905284 -1116470 -2272078 -335153 3051751 4698073 3721594
47270 3721594 1588259 -312884 -1445460 -1422759 -281187 953347 1398539 1654491 2577780
47261 2577780 3013138 586455 -4720285 -9322639 -9531982 -5559159 -892847 1922510
47253 1922510 3559736 5774302 8402036 9632786 8583277 6087630 2941779 -929310
47245 -929310 -4712434 -5671686 -1779594 4970128 9645803 9162167 4858078 148096 -2936897
47236 -2936897 -4204018 -3794014 -1859046 596389 1956921 1536573 382065 311306 2257642
47227 2257642 5311153 7098546 5565921 1122992 -3144103 -4262136 -2535082 -1109644
47219 -1109644 -2060185 -3913762 -3981752 -2272711 -1359355 -2392161 -3300357 -2025123 216720
47210 216720 878137 194883 704334 2779815 3616800 1766508 4099 1544761 5280005
47201 5280005 7415209 6737031 5348560 4539297 3058426 218485 -1989812 -1444104 1177058
47192 1177058 3525259 4407244 4081327 2786489 548210 -2069366 -4318172 -6068590
47184 -6068590 -7312627 -7418165 -6044527 -4381662 -4125203 -5257709 -6074390 -5567541 -4635225
47175 -4635225 -4545708 -5240751 -5804978 -5816720 -5388102 -4366291 -2520692 -510496 270102
47166 270102 -765932 -2611452 -3961168 -4836704 -6149212 -7869974 -8676196 -7697657 -5669747
47157 -5669747 -3736902 -1917402 327674 2560031 3559716 2986738 1931043 1759290 3087078
47148 3087078 5689715 8502700 9799158 8474742 5439904 2935057 2293805 3115421
47140 3115421 4549797 6239961 7776319 8439135 8044814 7122491 5784292 3375150 -207253
47131 -207253 -3733939 -5791959 -6051834 -5129807 -4104683 -4331566 -6365013 -8563304 -8279411
47122 -8279411 -5295350 -2563075 -2392816 -3423938 -2926983 -760694 927541 1009052 212354
47113 212354 -893895 -2544088 -4246032 -4469198 -2412362 1078712 4575458 7021370
47105 7021370 7689228 6440807 4206290 2250769 1002532 472557 1347738 4258640 8181532
47096 8181532 11056997 11962242 11353280 9516957 6587433 3924956 3269537 4120491 4001359
47087 4001359 1886914 -685848 -2544262 -4486221 -6714397 -7095586 -4068229 435280
47079 435280 3231674 3849361 4035315 4290181 3370696 881057 -1927305 -3955944 -4915803
47070 -4915803 -4263036 -1657054 1201473 1426248 -1405759 -4239036 -4322725 -2493901 -1305264
47061 -1305264 -1213370 -591865 1013789 1808718 470871 -1601775 -1931621 -159741 1651795
47052 1651795 1955778 1838426 3427735 6733208 9263934 9123510 7518506 7221319 8906222
47043 8906222 10215730 8829450 5466221 2840958 2008514 1030941 -2219294 -6946934
47035 -6946934 -10306086 -10987617 -10390657 -9879039 -8613524 -5545967 -2353942 -2123724 -5169022
47026 -5169022 -8286744 -8762091 -7205707 -5432311 -3473182 -530748 2463865 3654794
47018 3654794 3239236 3347616 4656655 5212451 3599607 1683350 2670247 7081777 11976990
47009 11976990 14091435 12796220 9863726 7256650 5858828 5972466 7852318 10928941
47001 10928941 13101208 12260449 8910922 5968684 5037371 4130223 707804 -3910804
46993 -3910804 -5565702 -2847567 778670 1623023 514668 888800 3334754 4555253
46985 4555253 1831173 -3481971 -7599312 -8102223 -5423927 -1784231 351394 -367854
46977 -367854 -3079680 -5179204 -4780713 -2571594 -542168 681277 2098474 4121546
46969 4121546 5620701 5711550 5192595 5225214 5517531 4979152 3517207 1893643 253800
46960 253800 -1706284 -3227742 -2820743 -598559 1098211 249238 -2529203 -4861298 -5056638
46951 -5056638 -3190707 -641617 797513 126036 -1901679 -3681570 -4903209 -6569107
46943 -6569107 -8351425 -7700894 -3093925 3173287 7327836 8338655 7788699 6377734
46935 6377734 3232329 -1249007 -4571389 -5150418 -4131759 -3076387 -1585787 1300581
46927 1300581 4691847 6638292 6786097 6663150 7330556 7960995 7141028 4874127 2619676
46918 2619676 1322632 26070 -2707112 -6090711 -7332841 -5431857 -3149496 -3329740
46910 -3329740 -4603730 -3637943 -1013059 -1088681 -5282995 -9386208 -9682134 -8322976 -9319699
46901 -9319699 -11649117 -10496318 -4442754 2528580 6405637 7305314 7674933 9075799
46893 9075799 11601777 14258449 15114829 13029523 9774061 8288020 8255452 6049810 345127
46884 345127 -4843492 -4840828 -86635 5148175 8334337 10218084 11533265 11184909 8288700
46875 8288700 3999288 430781 -1154023 -713237 919369 2338267 2379087 984523 -1221494
46866 -1221494 -3975397 -7072463 -9299251 -9045776 -6222749 -2398885 1196144 4484749
46858 4484749 6982592 7062596 3902094 -971109 -5295702 -8303495 -10067900 -9767437 -6736630
46849 -6736630 -2928143 -1914230 -4670022 -8177189 -9335672 -8776453 -9330328 -11810058
46841 -11810058 -14107286 -14027858 -11340785 -7136858 -2840484 -130359 -212601 -2325313 -3979833
46832 -3979833 -3457926 -1394141 530790 1554747 1999535 2490275 3652959 5557453 6775958
46823 6775958 5314815 1612842 -751398 936726 4843147 6975264 6554572 6472227 8423676
46814 8423676 10381466 9883023 7450156 5095173 3172058 735484 -1949931 -3347795
46806 -3347795 -2957445 -2057645 -1817157 -1692450 -186853 3205280 7113624 9406385 9274891
46797 9274891 7913748 6669407 5104703 2152309 -1178753 -2275623 -574412 1352993
46789 1352993 1440642 812096 1222785 1797109 620077 -1884374 -3780629 -4794919 -5911394
46780 -5911394 -6598658 -5516568 -3558427 -2785126 -2314559 882999 6274225 8922883 6306018
46771 6306018 2295043 1568687 3219446 3400257 1791731 1213113 2263113 2838139 2655850
46762 2655850 3936037 6922344 8574805 7132238 4838183 4329999 4753485 3418771
46754 3418771 -350939 -4627704 -6820269 -5162535 93213 5864686 8401949 7481031
46746 7481031 6537267 7371138 7294819 3819198 -337562 -497844 3039171 5221492 3296203
46737 3296203 42388 -733603 1179744 3504527 4680303 4502633 3491793 3020357 4512692
46728 4512692 7341088 8998827 8370975 7146460 6849557 6426629 4493697 2227141 1807677
46719 1807677 3188181 4673067 5811459 7281045 8378273 7209726 3641201 -55382
46711 -55382 -1983751 -2359710 -2099158 -1413756 -531731 -443601 -2036616 -5105702 -8385040
46702 -8385040 -9886680 -7764694 -2398118 2700403 4096321 2685268 2514604 4920503
46694 4920503 6471992 4037141 -637067 -3543273 -3686196 -3115239 -2877608 -1854148 513123
46685 513123 2879101 3980666 4200963 4405799 4354782 2960862 -332113 -4542038 -7231614
46676 -7231614 -6198351 -1901095 2370851 3744636 2631261 1371888 953366 676091
46668 676091 361254 758353 1822959 2615601 3174825 4584017 6684218 7501713 5664676
46659 5664676 1920593 -2284482 -6151154 -8900137 -9668346 -9049672 -9049186 -10232654 -10427732
46650 -10427732 -7748846 -3641404 -1223260 -1486640 -2845345 -3870858 -4733684 -5946516
46642 -5946516 -7022106 -6770625 -4501265 -1042092 1335977 759376 -2151746 -4873618
46634 -4873618 -5816883 -5244006 -3246988 840025 5850491 8120967 5727554 1611316
46626 1611316 -88037 645046 914084 193496 872618 3865898 7148073 8956925 9340537
46617 9340537 8184635 5033080 1622251 1147911 3652749 5343338 4103244 2453909
46609 2453909 3027357 4477946 4688898 4797678 6240904 6402850 1905452 -5132039 -8989957
46600 -8989957 -8183535 -6653308 -6705905 -5728717 -1767574 2044503 1788907 -1452090 -3429018
46591 -3429018 -2449047 -128444 2251060 4917744 7616624 9287198 9815424 9878426 9091776
46582 9091776 6613977 3731604 3337339 6101196 9430748 11259686 12565191 14493700
46574 14493700 15208588 12317292 7288341 4374723 5053788 6208502 4611411 974503
46566 974503 -1705290 -2006817 -672583 1295480 3160727 3683520 1659707 -2736735 -8190998
46557 -8190998 -13375199 -16736769 -16176219 -11127359 -4725507 -1476935 -2239173 -3653000
46549 -3653000 -3215478 -2411525 -3310225 -4462344 -2833386 1437688 4998855 5696312 4608601
46540 4608601 3520086 2548565 987659 -1096118 -2986260 -4118038 -4308059 -3967156 -4163998
46531 -4163998 -5487463 -6852831 -6634912 -4989035 -3589054 -2924294 -1677343 550684
46523 550684 1754087 71445 -3530378 -6590865 -8222852 -9401447 -10905885 -12406658
46515 -12406658 -13116498 -12060220 -8244900 -2034409 4051172 7570829 9089943 11146159
46507 11146159 14127222 15097973 11581993 4962637 -1069789 -4328548 -5124772 -4464438
46499 -4464438 -3032615 -1788651 -1938369 -3756675 -6203918 -7908600 -7872429 -5414492 -762292
46490 -762292 3905946 5449042 2991486 -599396 -1719335 -106593 1331827 536684
46482 536684 -1362002 -2032101 -874660 840114 1794188 1598504 554430 -572263 -816130
46473 -816130 125671 1408582 1998897 1906404 1922695 2446625 3202403 3800296 3855776 2904562
46463 2904562 1143768 60878 1200180 4147197 6750506 7680306 7862571 8908376
46455 8908376 10955657 12761407 13334236 12649433 11038078 8752012 6299154 4569224
46447 4569224 4104782 4345592 4007723 2409295 219423 -1330490 -1777559 -1683625 -1890336
46438 -1890336 -3039157 -5374438 -7992861 -8572332 -5419712 -105961 3543002 3696701
46430 3696701 2057357 438539 -1740241 -4720613 -5694359 -2134042 3504409 6094931
46422 6094931 4487842 2226471 1514658 469719 -2352605 -4404322 -2519312 2607135
46414 2607135 7629843 10489685 11172884 10118710 7815037 4910021 1471338 -2529902
46406 -2529902 -5270047 -4000663 658658 4047861 3234337 852759 558767 1392270 317987
46397 317987 -1900141 -2053716 -676799 -1873706 -6575408 -10474479 -10057756 -7024214 -4887451
46388 -4887451 -4162305 -3108955 -1199503 336008 411720 -837150 -2139556 -1589316 1976389
46379 1976389 7577602 12812499 15892192 16059844 12876885 7132910 1991527 694983
46371 694983 2913954 5517165 6839120 7640590 8041446 6892644 4797389 4238100 5427482
46362 5427482 5423485 3088650 1543783 3284043 5904760 5699393 3098368 1233286 864719
46353 864719 161591 -1522239 -2893180 -3301266 -3325530 -2940362 -1382876 1220933 3889704
46344 3889704 6151783 7884682 8545029 8238730 8612763 10659667 12451020 11298892 7669189
46335 7669189 4758353 4480912 5898326 7328641 7978466 7627349 6590524 5958051 6309552
46326 6309552 6492076 5143559 2768657 657708 -1287047 -3562455 -4916745 -3775127
46318 -3775127 -1103470 928349 2588684 5822793 10179392 12956320 13601557 14314562
46310 14314562 15480011 14268954 9437004 4178609 1982822 2339480 2906081 3524453
46302 3524453 5285739 7316043 7484265 5634892 3787451 3467473 4545019 6187444
46294 6187444 7321704 6615774 3646891 13840 -1919972 -1432543 28080 435521 -1044108
46285 -1044108 -3229779 -3649799 -1141656 1995989 1911577 -2185726 -6983486 -9399571 -9972102
46276 -9972102 -10647799 -11279452 -10337073 -7534386 -3625129 1043698 5542726 7354416 5193395
46267 5193395 1951155 1758296 4431612 5942758 4470002 2608886 2680238 3115457 1370833
46258 1370833 -2094400 -5047449 -6873811 -8247236 -8562937 -6358070 -2069424 1833311
46250 1833311 3637603 3519266 1785825 -1848549 -6308554 -8363093 -5589316 583866
46242 583866 6217589 8775113 8479570 6556286 4130804 2727914 3453436 4874325 3929677
46233 3929677 339156 -2018741 -203546 3237355 3773071 1625783 1212502 4034815
46225 4034815 6241441 4424120 72592 -3777807 -6914612 -10012964 -11158799 -8245049
46217 -8245049 -3369702 -824019 -1094403 -590942 2436042 5413148 6011185 5860981 7491545
46208 7491545 9739025 8834584 3317637 -4135013 -9671991 -11739846 -11583556 -11322522 -11981319
46199 -11981319 -13173503 -14332287 -15583688 -16831651 -16621756 -13390633 -8130824 -4457473
46191 -4457473 -5084091 -8891029 -12257217 -12811560 -11140271 -9152955 -7639507 -5644856
46183 -5644856 -1918246 3214620 7523996 8647076 6236739 2123740 -1615488 -4299690
46175 -4299690 -6201935 -7036029 -5633955 -1390093 4308392 8689423 9998951 9094911
46167 9094911 8235647 8429896 8568197 7170105 4309927 1665227 1272606 4194729 9380820
46158 9380820 13600225 13773697 10134718 6103079 4288606 3709985 1915030 -1335467
46150 -1335467 -3926644 -4149236 -2175812 686137 2930795 3534662 2870042 2391508 2440031
46141 2440031 1417975 -1476405 -4016713 -3548173 -818022 1277294 2097466 3549696
46133 3549696 6129022 7734899 7014987 5131617 3337173 1362665 -747131 -1755524
46125 -1755524 -1571109 -2066668 -3861959 -4436925 -1491287 3457986 6861889 7289971 6069433
46116 6069433 5025992 5291672 7124683 9132465 8805567 5590763 2295439 1642701 2721299
46107 2721299 2951838 2204542 2183588 2581024 1115615 -2442917 -5302904 -5600701 -4908164
46098 -4908164 -5534107 -7124603 -7387276 -5130582 -1422685 1613044 2371436 724156 -1887139
46089 -1887139 -3556106 -3408256 -1915513 -101944 974199 455928 -1495323 -3292697
46081 -3292697 -3471462 -2633346 -2741435 -4449989 -6341879 -7051702 -6959794 -7244730 -8084422
46072 -8084422 -8336404 -6615617 -2628822 2115267 5208655 5687652 5116182 5443612 6366143
46063 6366143 6208966 4999203 4799100 6835338 10040744 12804541 14486597 14765566 13341618
46054 13341618 11079130 9688472 9277704 7910130 4729470 1706252 685240 431864
46046 431864 -1173426 -3243478 -2866786 356885 3338291 3549560 2076668 1741393 3424017
46037 3424017 5082150 3826365 -1264276 -7751631 -11372107 -9933268 -5674186 -2799544
46029 -2799544 -2890302 -4041752 -4250263 -3607954 -2669571 -885051 1858407 3806200 3464263
46020 3464263 2235096 2788545 5058337 5948525 3453815 -612650 -2815518 -1845733 756645
46011 756645 2693662 2785234 1410971 109134 493926 2732007 5096852 5542081 3614932
46002 3614932 475234 -2508044 -4440837 -4622645 -2891152 -596556 -116938 -2440561
45994 -2440561 -5632400 -6565706 -4121888 14922 3741461 6795121 10030908 13065119
45986 13065119 13852401 11043928 6056603 2021636 841437 1859290 3188249 3436785
45978 3436785 2064901 -750846 -3781954 -5053691 -3601230 -725076 1336624 1800313
45970 1800313 1607087 1621725 1760580 1992253 2873067 4382001 5115224 3544675 -267111
45961 -267111 -4750021 -8205753 -9617141 -8735055 -6413281 -4755544 -5743167 -8970339 -11266109
45952 -11266109 -9570155 -4376742 490338 2050774 1255080 838606 1054031 -119950
45944 -119950 -2529639 -2917259 -313648 719547 -4043648 -11133251 -12605140 -6565555
45936 -6565555 308239 1970599 -40354 -1395241 -2147988 -4718660 -7774031 -7498931
45928 -7498931 -3976909 -1453576 -2185356 -4193619 -5414601 -5805253 -4389069 1344910
45920 1344910 10798410 18523377 20037529 17006202 13973844 12195036 9944564 7329132
45912 7329132 6841609 9082365 11162460 10332543 7080587 3686105 1348304 -213515
45904 -213515 -1531183 -2950062 -4846613 -7333698 -9853921 -11558400 -12086448 -11808301 -11316224
45895 -11316224 -10582064 -8533404 -3911208 2853155 8839705 10607122 7348107 1704432
45887 1704432 -2757354 -4507058 -4412894 -3889057 -3397934 -2552386 -933806 1371537 3552111
45878 3552111 4253287 2626132 -411022 -2606078 -2750603 -2063547 -2266390 -2840697 -1737089
45869 -1737089 1218376 3465753 3008797 1037879 155329 1210204 3083966 4427682
45861 4427682 4199072 1674765 -2161282 -4038479 -1382964 4246198 8439171 8480576 5078595
45852 5078595 235587 -4300224 -6710730 -5989445 -3790093 -3125593 -4489775 -5388045 -4350138
45843 -4350138 -2872059 -2201956 -868512 2508935 5969194 6267616 3105795 -809309
45835 -809309 -3158584 -3635669 -2908336 -1793884 -1092751 -813826 -32888 1316463 1438682
45826 1438682 -950265 -4038543 -4582966 -1839192 1778717 3663173 3111831 859261
45818 859261 -1701616 -2856293 -1816336 35002 333852 -1681742 -4748317 -7476034
45810 -7476034 -9375222 -10183385 -9733118 -8698209 -8077650 -7563054 -5629624 -1721094 2645002
45801 2645002 5416775 5897185 4831892 3438234 2719598 3056055 3992772 4716947 4922945
45792 4922945 5042401 5717314 7165425 8671962 8600660 5815744 1678047 -397222 1495846
45783 1495846 5274306 7106079 5647806 2921854 1441236 1746992 2624659 2646879 1501242
45774 1501242 457816 1209009 3774898 6353702 7781396 8765293 9704743 9126686 6152088
45765 6152088 2851345 1614459 1417495 -378854 -3348759 -4351978 -2247936 1024116
45757 1024116 4047255 7082882 9233304 8317866 4879072 2707302 3460999 3992139 1352596
45748 1352596 -2457698 -3546205 -1552113 1014440 2965689 4754440 5973118 5893043
45740 5893043 5814214 7695090 10595410 11338607 8865663 5385472 2937513 1286811 -238326
45731 -238326 -1212163 -1401183 -1638864 -2293095 -2471320 -1901552 -2083416 -4055838 -6169973
45722 -6169973 -5972759 -3873340 -2930197 -4469263 -5552453 -2304277 4723608 10128693
45714 10128693 9252995 3296406 -2102016 -2925458 -334671 1720651 1145353 -719058
45706 -719058 -1452857 -559503 172239 -851604 -2740080 -3216611 -2026692 -1608918 -3228654
45697 -3228654 -4146088 -1041938 4634248 7791756 6319115 3552426 3293523 5311731
45689 5311731 7291044 8456125 9003761 8148745 5494022 2999206 2918069 4461973 4696125
45680 4696125 2171801 -2179031 -6895980 -10613159 -11571254 -8967941 -4817606 -2581946
45672 -2581946 -3790425 -7145713 -10333171 -11314698 -8899848 -4141250 -473009 -304972
45664 -304972 -2079638 -2860452 -2891571 -4665785 -8032483 -9786663 -8487502 -6209059 -4524560
45655 -4524560 -2187478 1426517 3663104 2022713 -1758834 -3777010 -2977865 -1715575
45647 -1715575 -1902952 -2712642 -2060144 1059958 5688472 9414536 10083594 7868285 5338253
45638 5338253 4819075 6112488 7296951 7008984 5293768 3098721 1821071 2573840 4865554
45629 4865554 6527994 5814427 3067048 -331543 -3722523 -6793796 -8341328 -7144794
45621 -7144794 -4080963 -1952431 -2696765 -5449717 -7634583 -7447976 -5139209 -2360362
45613 -2360362 -534836 330778 1346877 3276488 5581616 7059067 7144054 6334126 5542992
45604 5542992 5293142 5374791 5065804 3816847 1927921 473508 345080 1242815 1682882
45595 1682882 411505 -1751561 -1878230 2147642 8493213 12471669 11511579 7838487
45587 7838487 5282873 4889087 5230201 5550162 6102367 6197579 4784494 2868118 2500606
45578 2500606 3052392 1453970 -2956997 -6698638 -6665190 -3828232 -813152 1626088 3533204
45569 3533204 3553903 804070 -2492884 -3247241 -1743997 -1066608 -2707792 -5170643 -6705315
45560 -6705315 -7029756 -6195550 -4024979 -1318607 119009 -513632 -2019174 -2670599 -1901974
45551 -1901974 -424009 576844 332711 -871697 -2222787 -3763562 -6123087 -8208052
45543 -8208052 -7062401 -1962515 2888297 2580814 -2179343 -5820009 -4878910 -1329896
45535 -1329896 1426116 2810705 4021346 5292418 6070990 6319371 6026505 4616135 2130634
45526 2130634 -131312 -1281419 -1962682 -2762625 -2915470 -1913702 -999243 -1311949 -1657426
45517 -1657426 -106892 2837810 4693848 4361819 3143631 2364247 1823455 1079910 720041
45508 720041 1567525 3656682 6593263 9994414 12983488 14241171 13474965 12198744 12093457
45499 12093457 12919532 12894743 10930001 7675789 4501569 2390663 1928656 3294620 5674273
45490 5674273 7486947 7982032 8052472 8659612 9083127 7987170 5918358 5132046 6565218
45481 6565218 8442125 8681107 7464144 6359569 5940418 5691356 5644901 6473638 7936038
45472 7936038 8589371 7481423 5330479 3692905 3446572 4178525 4607200 3611252 1231874
45463 1231874 -1441342 -3608171 -5513902 -7471272 -8846844 -8815185 -7544016 -5760519
45455 -5760519 -3742868 -1741390 -703996 -1201233 -2044536 -1452789 549822 2248000 2590941
45446 2590941 2042414 1201592 102377 -990547 -1467362 -1226803 -502400 993189 3383410
45437 3383410 5379316 5422567 3954300 2769693 2285512 1476181 334242 -96941 -226608
45428 -226608 -1605639 -3631493 -3677774 -1507694 -277074 -1508470 -2327903 -31404 3567205
45419 3567205 5231619 5222860 5850879 7084397 7110515 5969715 5314708 5490608 5853066
45410 5853066 6947862 9309442 11170377 10621059 8985977 8581781 8337664 5808727 2528309
45401 2528309 2230296 3814697 1776469 -5033320 -10549322 -9855468 -5613369 -3064268
45393 -3064268 -2939425 -3096054 -3432905 -4580138 -4307494 -86434 6081345 9650476 9555294
45384 9555294 8516317 8126695 7509278 6518207 6365462 6741336 5828144 3818379 3200408
45375 3200408 4633948 5502054 3819919 1086760 -114522 724909 2576742 4680818
45367 4680818 6396487 6739782 5460321 3626610 2269624 1382961 722279 314080 -299101
45358 -299101 -1860191 -3885184 -4862383 -4518268 -4183498 -4237474 -3210123 -615288 1279976
45349 1279976 274995 -2543330 -4138209 -3089605 -311723 2802922 5342060 6663144
45341 6663144 6629286 5571839 3248460 -944834 -5688208 -7407786 -4155523 1471145
45333 1471145 5368199 6730583 7568177 8678622 9118817 9097604 10077242 11776097 12152025
45324 12152025 10941565 10200234 10431953 9330601 5951200 3191809 3821994 6320680
45316 6320680 7221266 5867624 4221374 3347816 2936255 3365932 5197663 6867509 5811456
45307 5811456 2240248 -704050 -1098766 -252736 116161 393291 1572940 3230384 4461801
45298 4461801 5273400 5517234 3954944 343261 -2628176 -1812582 2268240 5929227 7117351
45289 7117351 7609019 9690972 12583102 13671469 12066612 9068485 5600835 1299449
45281 1299449 -3305317 -5506881 -2930586 3216974 8830612 10930841 9985345 8150358
45273 8150358 6563921 5159471 3976587 3116476 1786213 -893880 -3730137 -3652525 743872
45264 743872 6696170 9743523 8573858 6163092 5871299 7652301 8928932 8274742 6851858
45255 6851858 6347258 6837545 7218488 6785265 5603325 4001055 2673657 2827276 4953083
45246 4953083 7441844 7690239 5030085 1489908 -938572 -2637748 -4918077 -7196102
45238 -7196102 -7252478 -4164332 475531 4545613 7405568 9447404 10691549 10635762 8979109
45229 8979109 5959076 2475348 265482 1083410 4702161 8161833 8176226 4457103 -106190
45220 -106190 -2679999 -3104882 -3071899 -3679580 -4659417 -5493618 -6157234 -6584938 -6266221 -4884114
45210 -4884114 -2912577 -1131742 124713 820413 657782 -759361 -3344280 -6551721
45202 -6551721 -9730670 -11920339 -11725122 -8459760 -3514531 380889 1636608 1003663
45194 1003663 354028 1150119 4016958 8388501 12158642 13196564 12068233 11915337 14649741
45185 14649741 18636842 21242644 21952695 21283950 18518979 13318151 8388979 7156864
45177 7156864 8981969 10038940 9280058 9931227 13778490 17402930 16514949 11656018 7002544
45168 7002544 5142686 5489547 6538432 7093410 6009610 3141417 260225 -857289
45160 -857289 -799834 -1207226 -1816497 -1027574 1017406 2355827 2267632 2077521 2443032 1995047
45150 1995047 -440803 -3898951 -6426131 -6970483 -5568339 -2929921 -472241 359460
45142 359460 -536866 -1960695 -2965923 -3455640 -3353249 -2485022 -1249337 -35755 1750610
45133 1750610 4312522 5546957 3162338 -1147062 -2821960 -701343 1180615 -181653
45125 -181653 -2245547 -1574852 97427 -1284439 -5010197 -6144217 -2806388 1569250
45117 1569250 3847016 4950372 6633067 8093523 7905001 6649667 5528564 4472456
45109 4472456 3521914 3977147 6071703 7405535 5953757 2912438 220114 -2800848
45101 -2800848 -7194663 -10352811 -8356692 -2155762 2538823 2304730 -496770 -2392519
45093 -2392519 -3411989 -4876356 -5587130 -3401799 967501 4732586 6831539 8318564
45085 8318564 9425176 8923357 6641161 4283725 3056429 2255161 995905 -134780
45077 -134780 -59523 1251587 3040616 4700510 5766371 5790908 4988679 4376167 4556283
45068 4556283 4857625 4326128 3126967 2277429 2273302 2645631 2796805 2709300 2671891 2608870
45058 2608870 2008054 707961 -362247 202667 2532701 4854808 5398581 4720975 5222769
45049 5222769 8196929 12060859 13803784 11844194 7484168 3893316 3374538 5132002
45041 5132002 6183328 5052542 3630333 4129562 5233133 3557296 -1217261 -5223486
45033 -5223486 -5147642 -1937077 1252003 2775963 2719830 1146129 -1893408 -5362333 -7684957
45024 -7684957 -7766361 -5115911 -316974 3896943 3920762 -851522 -6849342 -10320481 -10823924
45015 -10823924 -9449875 -6147858 -1465546 1286404 -648587 -4964875 -6688869 -4616301
45007 -4616301 -1856217 -255524 1663694 4521840 5835971 3784395 220867 -2089834
44999 -2089834 -2961648 -3640985 -4172786 -3913495 -3283835 -3323686 -4475707 -6750468 -9682410
44990 -9682410 -11342141 -9411958 -4551764 -690524 -335255 -1531057 -1387477 -551131 -1396185
44981 -1396185 -3180080 -2398563 2049878 6884342 8376146 6316630 3198621 893249
44973 893249 -728824 -2527630 -4534319 -5955247 -6378335 -6285017 -5962610 -4697799 -2193459
44964 -2193459 -132791 -413555 -1906785 -1324460 2065184 5044631 5044232 3803095 4535591
44955 4535591 7325185 9549796 9505671 7421680 4037491 435522 -1596058 -1280115 -393153
44946 -393153 -1229953 -3702552 -6152918 -7922960 -8986399 -8228101 -4871137 -976231 364693
44937 364693 -829790 -1734585 -1013844 -45368 173616 336307 508103 -566786 -2810421
44928 -2810421 -4049604 -3181060 -1861196 -1702983 -1842780 -796808 1062007 2536094 3679391
44919 3679391 5153846 6497199 6556316 5083264 2836432 609045 -1117067 -2141112
44911 -2141112 -2681608 -2960553 -2593782 -1440596 -1001516 -3267694 -7658495 -10782253 -10148787
44902 -10148787 -6792065 -3456455 -1619494 -1151348 -1355457 -1147826 487716 2945343
44894 2945343 3965971 2358819 -188261 -1122834 40454 1820947 2879891 2940115 2336461
44885 2336461 1579556 803607 -724472 -3467328 -5731299 -4742102 -492538 3430393 4278020
44876 4278020 3545396 4127264 5872427 6513463 5900573 6443390 9456163 13395956 15980298
44867 15980298 16284503 14597705 11828452 9299128 7829836 6913952 5821510 5122987
44859 5122987 5732519 6888904 6871584 5577437 4493081 4022622 2917517 912023 -128806
44850 -128806 1157846 3461976 4724617 5123507 6508297 9408685 12262770 13682341
44842 13682341 13978641 13764971 12264305 8461315 3592052 689824 859749 1412802 -850928
44833 -850928 -5495426 -9432786 -11249387 -11946262 -11567966 -8504024 -3289799 272498 136103
44824 136103 -623912 1512999 4793804 4968879 2266641 1162793 3549859 6637567 8300459
44815 8300459 10085418 13106627 14830760 12754570 8570824 5711425 4628162 3409865
44807 3409865 1712193 1022735 1568366 1739908 725459 -469138 -974172 -1248237 -1790568
44798 -1790568 -2020145 -1090145 943525 3116986 4270307 3901864 2903165 3063277 4950187
44789 4950187 6618317 5565985 1924460 -1435012 -2141181 -694926 586457 47866
44781 47866 -2135467 -4312245 -4492173 -2057071 1125845 2173853 497248 -1117411 352418
44772 352418 4512632 8109502 8872310 7538723 6069526 5236459 4508468 3189344 839050
44763 839050 -2612563 -6296839 -8620083 -8895857 -8039066 -6741629 -4103153 275791 3915659
44754 3915659 3853211 1284152 745317 3744200 6257558 4544596 749729 -320176 1766673
44745 1766673 2908868 831339 -2014060 -2546746 -1078257 67653 -137344 -835281 -601021
44736 -601021 1521377 4965828 7093433 5432818 1263081 -932666 1189148 4813572
44728 4813572 5878517 4430365 4002157 6590826 10430128 12548064 11775908 9163850
44720 9163850 6837373 6613684 8572981 10668733 10479250 7490998 3232048 -471696
44712 -471696 -2576330 -2532605 -150298 3855635 7796667 9957665 9728135 8005868 6427968
44703 6427968 5687491 4677625 2218812 -379846 -115935 3583322 7303602 7850979 6643582
44694 6643582 7665517 11782163 15636566 16204986 13946174 10825471 7650653 4778296
44686 4778296 3559956 4990886 7616107 8515210 6403234 2860851 646600 1395723
44678 1395723 4531487 7681947 8552301 7139211 5723559 5961059 6576866 5085390 1442442
44669 1442442 -1477306 -1277500 1352879 3923154 4870147 4222001 2614120 970627 673146
44660 673146 2544017 5433894 6962843 6177175 4655381 4389162 5200606 4962450 2033209
44651 2033209 -3076833 -8081565 -10357074 -8461114 -3231074 2468961 5703282 5429173
44643 5429173 2498877 -1689745 -5816590 -8462694 -8716647 -7271195 -5912527 -5513713
44635 -5513713 -5360972 -4738267 -4048529 -3712581 -3089434 -1607680 -169470 -59883 -817246
44626 -817246 -569130 1493422 4218981 6277039 7609017 8586292 8870637 8096784 6988312
44617 6988312 6626674 6811089 6236673 4434500 2498523 1376494 338451 -1870883 -4774519
44608 -4774519 -6222651 -4847249 -1500400 2052217 4832837 6378216 5845697 2837733
44600 2837733 -1168476 -3694540 -3951430 -3625277 -4481478 -6076941 -6591782 -5296386 -3211165
44591 -3211165 -1445951 171509 2354054 4728787 5758276 4603906 2565336 1895817
44583 1895817 3205682 4878135 5287092 4568558 3567774 2198726 184477 -1355881
44575 -1355881 -894309 918742 1332878 -1226288 -5042583 -6895542 -5364967 -2100219
44567 -2100219 -278824 -1678192 -4721334 -5959931 -4336101 -2954357 -4962450 -8696312
44559 -8696312 -9576080 -6477234 -2971288 -1693693 -981991 1320744 4099016 5599357
44551 5599357 7046340 10265793 13596929 13903866 11667855 10261612 10316747 8639828 3648102
44542 3648102 -1434525 -2692262 -671293 710801 -535413 -2016185 126022 6490618
44534 6490618 12794635 13333967 6651644 -2583862 -8121230 -8097656 -5567698 -3910973 -3540928
44525 -3540928 -3051159 -1591295 713169 3438612 6096955 8324147 10211839 11877746
44517 11877746 12679323 11667224 8900658 5534907 2603435 514288 -370103 262778
44509 262778 1821845 2717572 1487757 -2071716 -6521971 -9320937 -8672232 -5521798 -2781960
44500 -2781960 -1865151 -1340943 -41012 468521 -1399057 -3756281 -3348634 -225324 2667526
44491 2667526 3936352 4591543 4816827 3554608 1692539 1901985 4094914 4470572 895366
44482 895366 -3610641 -4774218 -2178264 1350752 3292883 2501092 -1182332 -6153584
44474 -6153584 -9326299 -9050847 -6644581 -3908392 -927229 2350747 4555885 4869453
44466 4869453 4696107 5319505 5540615 3708380 595411 -1726867 -2403782 -1387293 1672385
44457 1672385 6026929 9127523 9544741 8744682 7801124 4915150 -677754 -5012379 -4056628
44448 -4056628 -351107 80123 -3169696 -4167087 421111 6702051 9506825 8607949 6669244
44439 6669244 4611012 1949694 -740921 -2660089 -4625447 -7666066 -10639147 -11101016
44431 -11101016 -8041702 -2636891 3041815 7304086 9671568 10991477 11920329 11398097
44423 11398097 8193782 3897934 2062532 3718796 6023324 6308264 5174828 4331897
44415 4331897 3797559 3094881 3109464 4491340 5770357 5336775 4115764 4133310 5457475
44406 5457475 6648880 7273168 7824128 8048630 7576583 7364787 8126292 8224834 6055625
44397 6055625 3908674 5805901 11093833 14007054 11152919 6016545 3685045 4184617
44389 4184617 4422939 4287279 6083621 8619265 7102823 536341 -5120234 -4226610 1046138
44380 1046138 4127208 2952726 1186562 1401246 1938366 1455632 1897219 4365372 5755754
44371 5755754 3116856 -1159378 -2548720 -1252708 -1468470 -4267843 -5684524 -2700377
44363 -2700377 2779110 7398705 10364008 12017890 11519786 8705620 6104910 6151882 7657563
44354 7657563 7719135 6190524 5519679 6524209 7009300 5006485 1412365 -1201099 -1049873
44345 -1049873 1931765 6314882 9813522 10669356 8990139 6365163 4184097 2768341
44337 2768341 1742373 420379 -1854001 -4766218 -6652371 -6125015 -3941393 -2115561
44329 -2115561 -1250450 -120330 1885460 3496396 3651029 3605000 5444481 8878324 10967736
44320 10967736 9417502 5209782 1432274 179920 1334084 3770097 6368815 7641335
44312 7641335 5910014 1209913 -3585923 -4977609 -2365757 1394808 2899871 965240
44304 965240 -3059824 -6519464 -7160113 -5023238 -2767947 -2811240 -4139534 -3591993 -443510
44295 -443510 2382306 2335761 250223 -1852763 -3671403 -5446033 -5939698 -4252723 -2363284
44286 -2363284 -2994799 -5565923 -7032451 -6496845 -6118419 -7213426 -8346058 -8166167 -7479150
44277 -7479150 -7047158 -5598937 -2003047 2163081 4383665 4623161 4822486 5336902 4065061
44268 4065061 -307921 -5751841 -8605058 -7182644 -2928116 1536049 4599975 6030760
44260 6030760 6269701 6111297 6514335 7661447 8223820 6659710 3589747 1734061 2714831
44251 2714831 4969366 5953782 5405986 4726490 3810565 957496 -3571284 -6242515 -4195061
44242 -4195061 732621 3813201 2950637 708646 522068 2334018 3087370 890887 -2735528
44233 -2735528 -5115960 -5731980 -6086108 -6753978 -6330871 -3992204 -1653895 -1998362 -4792304
44224 -4792304 -6708267 -5069230 -735817 3095332 4243434 3388618 3109414 5248456
44216 5248456 8785098 10433332 8096959 3690659 1514019 3529642 7298764 9205824
44208 9205824 8624333 7597094 7032836 5250864 1113028 -2947416 -3029368 1181268 5421440
44199 5421440 5907845 3835908 3072989 4426958 4856257 2530998 -81796 423885 3936561
44190 3936561 7456709 8713029 7353671 3869273 -423118 -3091515 -2631202 -662795
44182 -662795 -197856 -1877494 -3736703 -4391997 -4316961 -3972513 -2979071 -1580067 -782508
44173 -782508 -366718 1275155 4515717 7534049 8821068 8861172 8449970 7298483 5558382
44164 5558382 4838586 5983969 7295737 6826670 5412991 5571013 8043833 11172057 13309707
44155 13309707 14272608 14465046 13925979 12585329 10887083 10047990 11605272 15891522 20735303
44146 20735303 22865282 21279421 18212800 16293428 16175211 17608954 20775616 24982488
44138 24982488 27887427 28206448 27860071 29135865 30941707 30594804 28443418 27514689 28737228
44129 28737228 29785501 29118782 27883889 26690761 23737596 18234313 13128690 11719440
44121 11719440 13148026 13965990 13150682 12659409 13228415 12570032 8765911 3509408 562463
44112 562463 1818317 5746648 9031992 9029234 5362133 233968 -2955369 -2272645 1033587
44103 1033587 3801675 4137487 3033486 2653185 3536005 4251966 3709833 2701617 2490407
44094 2490407 2799437 2594705 2511877 4585466 8874719 12147733 11590701 8745227 7592340
44085 7592340 9007380 9516339 6235658 913792 -2377328 -2101557 -220513 580906 -1025684
44076 -1025684 -4656854 -7923341 -7319345 -1915257 4077323 5102531 903919 -3302359
44068 -3302359 -3822146 -2540624 -2705920 -4018887 -4460284 -4252139 -4670342 -4821715 -3233192
44059 -3233192 -1401267 -1913350 -3644650 -2820298 1032697 4126481 4159906 3349685 4446427
44050 4446427 7016365 9246442 10501405 10460770 8546516 5928477 5237414 6372121 5604068
44041 5604068 1216499 -3048363 -3242161 -1080198 -714699 -1787166 -156947 5391238
44033 5391238 11418654 14682984 15067815 13664116 11481598 10402738 11987655 14578822
44025 14578822 14651323 11842734 9619974 9930025 10305150 7974265 4166564 2122905 2706479
44016 2706479 4195052 5211415 5851344 6569964 7557064 8915893 10414853 11344506 11222722
44007 11222722 10197368 8473047 6159782 4034931 3456624 4927956 7461774 9702036
43999 9702036 10910870 10770164 9353609 7596099 6631645 6257924 5137470 2872020 730976
43990 730976 -71965 319456 1192988 2133351 2638152 2076231 615607 -744976 -1371526
43981 -1371526 -1261960 -228300 1688598 3004093 1967765 -598000 -1701088 -221082
43973 -221082 1537963 1514892 1078050 2809111 6562594 9535864 9373335 5876294 650716
43964 650716 -3662418 -4914463 -3634659 -2784724 -4122972 -5913521 -5516261 -2892737 127212
43955 127212 2711044 4975197 6084276 5052602 3284051 3803584 7392992 11418598
43947 11418598 13292316 13584254 14706728 17539788 20469084 21383673 19757555 16696113
43939 16696113 13520068 10826482 8857923 7922334 7664538 6510238 3164871 -1369369
43931 -1369369 -4599235 -5470078 -5035619 -4056354 -1899078 1365218 3745955 3712108 2401190
43922 2401190 1934918 2577076 2943310 2118351 330716 -1578238 -2287843 -646656 2776108
43913 2776108 5905739 7742974 9166786 10327455 9533499 6290778 2964699 1184647
43905 1184647 -890617 -4795719 -7768778 -6548526 -3339278 -3182373 -6112515 -7068976
43897 -7068976 -4054938 -1261911 -2299630 -4712056 -3928851 536276 5606635 8922769
43889 8922769 9907623 8416140 5018091 1631823 -157293 -739483 -1298467 -2218794 -3686487
43880 -3686487 -6110210 -8536730 -8551743 -5626687 -2795135 -2744538 -3747817 -2102298 2453131
43871 2453131 6621747 8326256 8621150 8670953 7750911 5320505 2773017 1535090 968752
43862 968752 -103409 -743059 1250550 5826329 9760298 10190454 8142200 7217236 8944483
43853 8944483 10908249 10159932 7158470 4775233 4051539 3043241 287413 -2491714
43845 -2491714 -2449931 646056 4168603 5758635 5553308 5226897 5637506 5916504 4865080
43836 4865080 2956518 2263874 3885257 6171224 6786568 6224617 7482108 11773643 16357651
43827 16357651 17845839 16360172 14777562 14585390 14344720 12359876 9282558 7222040
43819 7222040 7043659 7542483 7281441 6418848 6026836 5936136 4505907 1172704 -1864827
43810 -1864827 -1941794 484584 2128041 928632 -1611987 -2630835 -1193633 1316561
43802 1316561 3106257 3446865 2901730 2822816 4292222 7148748 10242059 12499597 13191447
43793 13191447 11608676 7828874 3897058 2770297 5360108 9483831 12238153 12675263
43785 12675263 11899538 11442338 11912289 12590502 12290301 11149914 10894339 12128696 12403594
43776 12403594 9268004 4707216 3454646 6403279 8867171 6806565 2006930 -892378
43768 -892378 -227365 2118120 4209485 5677181 6823603 8094861 9749065 10779566
43760 10779566 9396687 5895143 3425211 4160048 6227280 6437375 4651674 3242614
43752 3242614 3395457 4241320 4788378 4591264 3323811 1663731 1661878 4257656 7496370
43743 7496370 9175162 9762527 10281640 9163142 4776612 -116317 -778789 2559158 4319116
43734 4319116 1145703 -3734660 -5294142 -2830670 664046 2945692 4065522 4802139
43726 4802139 5546892 6347799 6955980 7039837 6671144 6121088 5241513 3774335 1988672
43717 1988672 152871 -2010431 -4201995 -4827890 -3133557 -1168658 -1394497 -2925912
43709 -2925912 -2676064 13539 2572645 3163615 2804324 3060400 3983683 4866332 4921926
43700 4921926 3003788 -978425 -4195955 -3225998 1240799 4817141 5199529 4525532 5000280
43691 5000280 5498900 4395316 2934448 3347297 5472713 7388520 8033374 7578604 6560400
43682 6560400 6018326 7091493 9221912 10083508 8259873 4623733 579624 -3096816
43674 -3096816 -5190792 -4443323 -2097377 -1464986 -3578037 -5697598 -5453219 -3782646 -2259441
43665 -2259441 -457641 2012860 3688915 3817626 4164811 5890388 7118810 5964443
43657 5964443 3311232 213072 -4206513 -9120252 -9757405 -3257203 5739512 10150167
43649 10150167 9415326 8693565 10529322 12547548 12986942 13286125 14440410 15138916 14623754
43640 14623754 13903944 13223361 11462651 8869731 7521993 8279205 9657709 10128659 9418734
43631 9418734 7796026 6390991 7371411 10832807 12619656 9083447 3174052 1230310
43623 1230310 4017210 6144123 4901280 3979975 6530441 9916332 10507745 9367181
43615 9367181 9563766 11065431 11768620 11124039 9699449 7333258 4432591 2989467 3825919
43606 3825919 4989361 5136230 5895392 8266528 9560411 7351674 4048032 3652486 5801985
43597 5801985 7040969 6650787 6940543 8394370 8821956 7566973 6772869 7720303 9053154
43588 9053154 9465513 9358681 8970611 7526838 5389034 4648023 6090428 7416822 6039173
43579 6039173 2368466 -1045546 -2642933 -2853341 -2756189 -3086451 -4273693 -6235338 -7820975
43570 -7820975 -7181458 -3342692 2560696 8016885 11359422 12959443 13878812 13973923 12374071
43561 12374071 9500035 7100442 6062766 5692826 5621023 6697765 8959893 10235521
43553 10235521 8301714 3617319 -1216333 -3851782 -3102296 1214251 7633162 12961198
43545 12961198 14636102 13263744 11835065 12494231 14659888 15988604 14763760 11815731
43537 11815731 10159724 11805399 15036775 16394780 15236712 13966120 13476732 11658447
43529 11658447 7839618 5208310 6187875 8460032 8892311 8628167 10136877 11594228
43521 11594228 9505825 5800131 6405478 12185099 16823191 15603988 11534325 10051087
43513 10051087 11659492 13288398 13974202 15168432 16858148 17112566 15290929 12943913
43505 12943913 11336615 10192222 9322972 9799886 12496285 16128071 17743700 15693778
43497 15693778 11959007 10498127 12520900 14490270 12423525 7311301 3840234 3997413
43489 3997413 5029735 4545343 4353902 7034948 11202688 13313920 13014684 13494215 16466570
43480 16466570 19488385 19266702 15947298 12814533 12441187 14296470 16235763 17521074
43472 17521074 19506627 23268800 27536883 29851242 29205517 26524404 23228166 20968152
43464 20968152 22224629 28501087 37157310 42433351 41212308 36114901 31438293 28011479
43456 28011479 24406512 21581877 22676474 27907320 32817297 33197439 29888244 26940846
43448 26940846 26203003 25757510 23384160 19462653 15720212 12678164 9782708 7308812
43440 7308812 6473225 7666532 9992331 12725848 15709602 17958015 17844834 15830051
43432 15830051 15131048 17800284 21498233 22332306 19902223 17148659 15916914 15386694
43424 15386694 14746420 14654646 15528191 16600666 17219789 17291537 16421491 14678054 13947852
43415 13947852 15876337 18573014 18512975 15858263 14175384 14239220 12500585 7423587 2863753
43406 2863753 2275726 3569232 3310492 2417062 3292848 4321366 2420337 -823236 -1018313
43397 -1018313 1909635 3791777 3229933 3141762 4585327 4445819 1322119 -963178 1145414
43388 1145414 5268138 6293686 3137782 -868197 -3057649 -3839222 -4245660 -3606062 -656230
43379 -656230 3967165 7396017 7346655 5302163 5657330 10467740 16036418 16678786 11432440
43370 11432440 4907012 1732450 2598847 5768311 9449353 11638901 10370342 5997178
43362 5997178 1571112 -524811 -948131 -1372867 -1816655 -1370949 -124308 1135015 2065148
43353 2065148 2440392 1724300 -32761 -1899723 -3340077 -4478124 -4661374 -2749361 303936
43344 303936 1494115 -84108 -1330161 662203 4440643 6429781 5598772 3540402
43336 3540402 1564045 431714 1537644 5160965 8351330 7711304 3925094 688646
43328 688646 -268194 148419 2103954 6933023 12839088 14842790 11134711 6084340 4341579
43319 4341579 4719334 2993713 -1281421 -4301029 -3533651 -565844 1590912 1607097 53523
43310 53523 -1460508 -1043575 1930090 5737307 8119859 9131626 10592560 12834100 14140989
43301 14140989 13889836 13892009 15336435 16497057 15527736 14046441 15273932 19054849 21441743
43292 21441743 19780477 15900482 13042382 11518607 9364305 6209718 4118773 4458290
43284 4458290 5952765 6741912 6913063 7614413 8504016 7889281 5579527 3982452 5228026
43275 5228026 7977432 8557758 5430469 1331006 187747 2603977 5460982 5873483
43267 5873483 4439248 4086585 6428867 10065648 12315716 11892123 9625593 7078395
43259 7078395 5121879 3973791 3959954 5433744 7989349 10609051 12890555 15232502
43251 15232502 17214532 16898161 13086555 7629222 3786919 2423596 1489554 -643963
43243 -643963 -3227965 -4970872 -5822077 -5899023 -4416261 -1096126 2683787 5436278 6952906
43234 6952906 7013804 4566068 72617 -3040902 -1884457 1964996 4638844 5331598 6612367
43225 6612367 9615718 11901963 10753969 6442344 1701472 -324909 2257134 8263186
43217 8263186 13279719 13806428 11704777 11918403 15590601 18542189 17273851 13179874
43209 13179874 9498452 7322412 6497220 7410857 9427210 10077491 8493508 7550255 9863529
43200 9863529 13528202 14793235 13480132 12588068 13437916 14345669 13873509 12671629 11831191
43191 11831191 11359768 10563333 8800468 6140530 3987360 3938451 5211532 5042869 2863730
43182 2863730 1617580 2976630 4151963 2549362 831411 3068738 7784644 9751505
43174 9751505 7746150 5395803 4494631 2831199 -432478 -2271622 -528863 3002767
43166 3002767 6085410 8822007 11082920 11041571 8674245 7232066 8617676 10454491
43158 10454491 10368884 9935017 11282268 12903270 12581847 11935549 13847762 17152792 18219924
43149 18219924 16862056 16469562 18561860 21088890 22279444 22501309 21729504 18721783
43141 18721783 14067003 11186326 12457324 16135954 18631161 18457614 16610830 14188831
43133 14188831 11236138 7755899 4865568 4478670 7593893 12831742 17337951 19713076
43125 19713076 21345676 24084961 27575331 30231920 31990513 34136743 36587154 37346116
43117 37346116 35219507 31638522 29071227 28490356 28857902 28394887 26057065 22389939
43109 22389939 19196711 17970522 18598125 19772157 20221392 19164648 16348375 12481015
43101 12481015 9025476 6710426 4871505 3027998 2079397 2746371 3926085 4270318
43093 4270318 4514356 6237393 8866038 10095500 9130895 7387000 5950758 4544538
43085 4544538 3294543 3258385 4416129 5076554 4254663 3060054 2830519 3391802 4146084
43076 4146084 5487123 7919752 10670305 12145453 11206507 7636918 2340046 -2492999
43068 -2492999 -4517183 -3202846 -60750 3092949 5156290 5484811 4390674 3768819
43060 3768819 5096176 6720645 5702674 2778788 2362666 6337693 11090069 12823669
43052 12823669 12656125 13345377 13697778 10442507 4243457 -538301 -1794705 -1392856 -711380
43043 -711380 1578474 6119450 10661368 12999170 13572957 13488806 12239293 9225605 5613565
43034 5613565 2721697 112473 -2799566 -4669394 -3964472 -1856695 -1080764 -2193889
43026 -2193889 -2973530 -1658879 850291 2439287 2250610 1182983 535170 576258 497781
43017 497781 -65926 96510 2196386 4789421 4788343 2143498 1183976 5003263 10320443
43008 10320443 11178816 6901056 2654436 1990569 2839150 2301791 1584657 3315797 6625079
42999 6625079 8327610 7601221 6276346 5269595 3850354 2164722 1422327 1312957 80077
42990 80077 -2208055 -3127419 -1568470 591734 1704949 2706369 4487464 5268884 3137798
42981 3137798 -316372 -1590078 314464 3423606 5954225 7295063 6403384 2550578
42973 2550578 -1819603 -2291172 1815608 5597822 4722073 1328081 799344 3948143 6214559
42964 6214559 4878508 3136671 4893790 8515703 9349393 7129810 6662630 10506681
42956 10506681 14881918 15207972 12888310 13169061 17701447 23040945 26337244 28604302
42948 28604302 31177809 32355505 29897893 24679021 19450512 15458818 12496728 10973200
42940 10973200 11435769 12848072 13778436 14808501 17384110 20606089 21764003 20266644
42932 20266644 18539467 18323672 18358920 16972535 15268797 16160489 20869961 27394075 32327731
42923 32327731 34104559 34676637 37389902 42543770 46341844 45916570 44007006 45714560
42915 45714560 51228283 55491364 55655643 54941315 57225276 61284928 63388551 63128143
42907 63128143 63189551 64608637 65597207 64731958 62521066 59684766 56091703 51699530 46907757
42898 46907757 41845460 36666594 32470235 30639364 31370432 33783840 36798260 38755632
42890 38755632 37476290 32873037 28714430 29085415 33047036 35303923 32573070 26915588
42882 26915588 22127695 19361511 17631391 16386209 15515112 14176545 11794158 9713945
42874 9713945 10131713 13461132 17974173 21849182 24382691 25307105 24314715 21765290 18938717
42865 18938717 16896914 15541887 14305909 13343948 13341012 14305328 15374465 16022141 16695411
42856 16695411 17773993 18587860 18219652 16735542 14737064 12320437 9812255 9052076
42848 9052076 11985657 17679445 22565466 24358219 24128314 23783558 23359792 22044304 20226468
42839 20226468 18971063 18652409 19369640 21355864 23793780 25005383 25277573 27310716
42831 27310716 31830407 35290365 34986253 34024923 36916874 41815750 42409112 37464938
42823 37464938 33156244 34511909 39261243 42462876 43360204 44823228 48939506 56005179
42815 56005179 65622735 76111270 84580658 89967260 94598499 101005904 108991682 117589074
42807 117589074 127734725 140729653 155951323 172392466 190617722 210785418 230515167
42800 230515167 247189354 260590335 270873712 276319563 276346467 274450998 273984664 272654507
42792 272654507 265896105 254772067 245396042 240373197 235783263 227590305 216396911 204418099
42784 204418099 192281816 180960605 172681529 167103432 160098792 149349542 138037076
42777 138037076 129778654 122972042 114144168 104399640 97715582 94089242 89416870 82264129
42769 82264129 76088843 73597678 72958210 71603120 70497003 71872813 74782672 75735629
42761 75735629 72924693 67740584 62737641 59904534 60258278 62978592 64976786 63360606
42753 63360606 58858621 55216945 54623651 55333348 54698455 52796819 51326988 50192705
42745 50192705 47692446 43957351 41714354 42755679 45494489 47267809 47736495 48626271
42737 48626271 50982297 53966659 55773649 54749591 50409510 44438949 39825124 37779061
42729 37779061 36448751 33994757 31648177 31710619 33647588 34833778 34613246 34643082 35230265
42720 35230265 34566477 32328031 30899906 31685585 33035983 33475992 34169134 35971942 36665154
42711 36665154 34078712 30102328 28355538 28974469 28835116 26325013 22898908 20192524
42703 20192524 18511036 18191356 19571140 21193440 20757217 18562667 17505914 18759695
42695 18759695 19901130 18553274 15622498 13357622 12206032 11545836 11964081 14465023
42687 14465023 18085996 20380092 20287634 19171879 18956841 20126626 21444986 21030782 18098685
42678 18098685 14179191 11924000 12043746 12417914 11271294 10057345 11381155 14783929
42670 14783929 17032459 16922595 17370755 21218204 26565128 28543951 25505421 21405979
42662 21405979 21281595 25779081 31471918 35590308 38301674 40182017 39974310 36818800
42654 36818800 33324036 33680485 38572161 44193874 46971564 47240391 47210502 47370121 46934155
42645 46934155 46645248 48685670 53684042 59384427 62761854 62896597 61900213 63311473
42637 63311473 68771200 75792224 80189790 81639241 84830391 93120505 103105210 108837321
42629 108837321 110117389 112169579 117134953 121081324 121440383 122563787 129847892 141390780
42621 141390780 150093903 152521922 151216443 148946362 145459317 140663027 136640112 134389948
42613 134389948 131642097 126310129 119988804 115636179 113268191 110305465 105316483 99263236
42605 99263236 93471939 88314815 83856004 80129676 76469659 71803020 66093321 60806112
42597 60806112 57630969 57018800 57805817 57887626 55634293 51247657 46500445 42751089 39756586
42588 39756586 36962730 35091937 35308064 37284699 39321119 40139237 39446780 37108385
42580 37108385 33367832 30006539 29553486 32484116 36277401 38053208 37339135 35601089
42572 35601089 34001006 32605942 31200689 29847325 28854741 28870526 30631280 33840352
42564 33840352 36578595 36709929 33888566 29596752 25405651 21999024 19776250 19208119
42556 19208119 19944455 20317238 18755096 15745094 13707468 14503790 17311025 19459638
42548 19459638 19499036 18950376 20461088 24400850 28120740 28908113 26915984 24490342 23245064
42539 23245064 22915130 22819040 22945040 23071326 22125166 19592397 16899719 16141823 17651644
42530 17651644 19967560 22107130 24532937 27537479 30033062 30866921 30445054 30002616
42522 30002616 29843242 29398415 28693848 28575575 29383986 30270888 30060222 28353469 25904158
42513 25904158 24275906 24570776 25775053 25145824 21489620 17338974 16082053 17358136
42505 17358136 17596430 15243718 12815877 12844211 14372769 15124427 14895163 14624237 13875048
42496 13875048 11762751 9213605 7825618 7279653 6140780 4410754 3007837 1697934
42488 1697934 166560 79374 2745702 5416038 3930441 -737138 -2828183 164472
42480 164472 3940458 3891536 1385706 701539 2706846 4925905 5832198 5844084 5482105
42471 5482105 5385389 6873315 9850002 11531608 9979437 7418089 7003241 7807228 6718381
42462 6718381 4221491 3902530 6293349 7706413 6187328 4563260 5793212 8666627
42454 8666627 10327988 10394400 10194017 9993080 9425995 9234409 10253187 11519747 11334102
42445 11334102 9681190 8095150 7559247 7749866 7925224 7491366 5956857 3125015 -679780
42436 -679780 -4614703 -7206864 -6914174 -4163559 -2275803 -4178776 -8225260 -9869826
42428 -9869826 -7899560 -5867230 -6164539 -6223928 -3101736 1342098 3475364 3862148 5883590
42419 5883590 9436567 10588062 7937906 5346997 6904244 12034375 17065186 19393781
42411 19393781 18741021 16307367 14223879 14284074 15785457 15846809 12999550 9152328 6837604
42402 6837604 5985524 5036338 4017232 4395306 6315106 8067520 8653795 9268393 11381057
42393 11381057 14301677 15758624 14781774 13133125 13316374 15463042 17054244 16126312
42385 16126312 13988213 13768773 16548179 20063178 21341866 19502972 15631236 11170912
42377 11170912 7432679 5858272 7341249 11064278 14752724 16517939 16403010 16113508
42369 16113508 17281043 19881314 22253071 22642488 20610106 16980772 12975634 9772594
42361 9772594 8284034 8521867 9472134 10315261 11252574 12183598 11491147 8119969 4464190
42352 4464190 4392535 7597374 8785055 4586679 -985555 -1068141 5193353 11771441 13780540
42343 13780540 12884623 13386044 15975493 18055241 18627154 19660173 22532719 25661809
42335 25661809 26731083 25737531 24517906 24039577 23496545 21949522 19668228 17375450
42327 17375450 14923074 11594677 7620146 4519514 3470611 3942460 4798270 6380165
42319 6380165 10028367 15049630 17793216 15408875 9690008 5096566 3201492 1624166
42311 1624166 -1041451 -2382803 -332924 2513050 2261773 6923 639369 5464944
42303 5464944 10220762 11515022 11167782 12007089 13120807 12606981 12099600 14356586 18025478
42294 18025478 19144289 17157956 15288838 15039805 14506409 12753562 11818151 12978607
42286 12978607 14557983 15140122 15779797 17056950 16942403 14020104 10361896 8718636
42278 8718636 9007319 9961668 11894818 14837750 16006568 12768078 7072742 3607484
42270 3607484 4183864 6884822 9870946 12654649 14189222 13507155 12486040 14332951
42262 14332951 18514466 20540444 18009758 13864137 12096594 12880480 13776215 13552638
42254 13552638 12756953 12015680 11598238 11672572 11775400 11053172 9780656 9226563 9376102
42245 9376102 8701350 7129039 6991704 9443070 11931662 11204064 7306647 2832609 -221211
42236 -221211 -967855 1268315 5969583 10753944 13894993 16294540 18832590 19554616 16595007
42227 16595007 12459490 11461559 13362566 13694127 10788336 8282047 9244221 11727144
42219 11727144 12510514 12009033 12313026 12633786 10355092 5700284 1961344 924783 768014
42210 768014 -744025 -2963717 -3377084 -779245 3574579 7454227 9538610 9971499 9542037
42201 9542037 8598072 6979806 5017502 4040177 5233322 7951549 9703003 8355249
42193 8355249 4538847 1526484 2099143 5438021 7873568 7086497 4622615 3480230
42185 3480230 4350609 5718351 6704508 7578822 7797883 6231948 3952852 4233378 8366577
42176 8366577 13430286 15751977 14959941 13052920 11188366 9465743 8541787 9021936 9865326
42167 9865326 9534066 8364372 7978813 8856250 10353452 12484858 15408787 17561197 16950648
42158 16950648 14541555 13813632 16192769 18990573 18729378 14800109 9234416 4725591
42150 4725591 3543574 6349855 10979814 14075864 14837054 15364783 16539182 16091617 12501133
42141 12501133 8456001 7800226 10383123 12522983 11839075 9326978 7182925 6789516
42133 6789516 8582195 11838795 14619176 15628204 16007623 17689786 20330897 21699423
42125 21699423 20822212 18745452 16290447 13225052 9906403 7640998 6812639 6337182
42117 6337182 5394683 4059819 2005471 -1399952 -5140764 -6641637 -4594472 -167281
42109 -167281 4861542 9201732 11220675 9906863 7472920 7838025 11016531 12282746
42101 12282746 9086829 5346197 5565317 7814425 7061235 3373871 1557608 3423628
42093 3423628 5799858 6559665 7320440 8791513 8613413 6417593 6471087 11561232 17630718
42084 17630718 18704706 14928866 11484590 10926906 10916149 9144956 6481236 4725019
42076 4725019 4486748 5943536 8881653 11362436 11170459 9497863 10420069 15372169 20666814
42067 20666814 22152819 20033407 17073454 14242964 10981120 8453885 9252191 13698373
42059 13698373 18910144 22199118 23755830 25375388 27832158 30189082 30887675 29104218
42051 29104218 25619522 22453454 21061161 21047157 21303369 21819050 23085967 24219252 23647310
42042 23647310 21887417 21543501 23646692 25906598 26015851 25016881 25384329 26938419 27162854
42033 27162854 25245257 23208318 22513804 21943034 20215425 18865020 20381947 24176034
42025 24176034 26511176 24886195 21134662 19388477 21608578 25838181 28599849 28331886
42017 28331886 26333244 24896700 25179785 26917014 29366276 31666543 32526111 30759167
42009 30759167 26739654 22651442 20536194 20363555 20613633 20466272 20644399 22059696 24234467
42000 24234467 25324697 23611811 19209437 14535434 12548391 13841652 15962309 16535524
41992 16535524 16507086 18707061 23318268 26933831 27009361 25205568 24570296 25077217 24507793
41983 24507793 22795253 22274695 23414965 23639081 21832945 21098811 24464155 29791919
41975 29791919 32022947 29569171 25437485 22325715 19869541 17337947 15866277 16353280
41967 16353280 17521796 18047568 18790375 20776783 22462995 21516839 18526448 16482853
41959 16482853 16842196 18290807 19365297 20232729 21701606 24255831 28078035 32159520
41951 32159520 33588788 30242781 24515328 21629666 23325346 25924627 25974049 24861279
41943 24861279 25591103 27619309 28112177 26757488 25918112 26641386 27584055 27720579 27375999
41934 27375999 26569374 24887586 23075277 22265893 21600667 19302014 16266546 15514097 17386434
41925 17386434 18505649 16827923 14659986 14757060 16211105 16645043 16194066 16506610 17413395
41916 17413395 17392891 16314715 15296336 14775090 14891100 16548015 19613546 21306866 19302525
41907 19302525 15543527 13880297 14673114 15225439 15070274 16538162 19450048 19702253 15260541
41898 15260541 10141574 9763654 14675402 21302923 26891043 31188759 34748906 37955608
41890 37955608 40758175 41705677 38776547 33011922 29412528 31615604 37134921 40623244
41882 40623244 40455876 38921541 37273405 34903147 33270517 35917668 42962050 49333112
41874 49333112 50844099 49253628 48826826 50205875 50675941 49049312 47062133 46186505
41866 46186505 45751232 44737612 43596235 43544497 45066522 47531042 49689883 50537486 50253295
41857 50253295 50120950 50985039 52211886 52802550 52825907 52692435 51643389 48502211 43905390
41848 43905390 40385782 39841990 41800619 44311295 45622301 44907005 42553118 40254658
41840 40254658 39875129 41513518 43164880 42665195 39531693 34840299 30172278 27040396
41832 27040396 26396921 27851628 29730839 30484247 29871692 28661728 27755132 27841905 29103911
41823 29103911 30638606 30784354 28743748 25578979 23155408 22551298 23872015 26802341
41815 26802341 30473060 33377368 34512209 34418910 34230424 33892782 32207828 28495472 23382283
41806 23382283 18157264 14284768 13238502 15378162 18740503 20305554 19130527 17244987
41798 17244987 16860724 17825945 18793100 19847320 22358215 26402991 29812679 30303958 27771976
41789 27771976 23990932 20595061 17926529 15649228 13913754 13643780 15694252 19737541
41781 19737541 23979696 26170600 25284319 22425057 19814799 18522516 17462877 15257760
41773 15257760 12711619 11987441 12944718 12189179 7475908 1780875 455968 4571933
41765 4571933 9725473 11939169 12005438 12641174 13997060 14509427 14492585 15790413 18295390
41756 18295390 19577893 18315220 15955502 14453152 14100367 14145096 13982220 13131627 11494505
41747 11494505 10321787 11562255 15346698 19129298 20171149 18235437 15453904 14342506
41739 14342506 16067016 19455237 21482905 20115168 16890014 14988534 14613264 12957831
41731 12957831 9750762 9406959 14777614 21422099 22391737 17650191 14030171 15365275
41723 15365275 17405542 14805956 9287791 7003624 9755514 13055658 12870865 10670602
41715 10670602 10387475 12819243 15258477 15775013 15750303 17700209 21751166 25212482 25428970
41706 25428970 22357833 18202360 15175198 14156570 14994357 16999065 18940474 19479030
41698 19479030 18213356 15928319 13567856 11524865 10151731 10077594 11404426 13356743
41690 13356743 15431628 18010667 20818727 21755472 18983993 13857213 10019532 9555424
41682 9555424 11636975 14849450 18513653 21166179 20569140 17145659 15203653 18098421
41674 18098421 23560585 26650214 26348051 25892360 26894895 26965049 24179962 20464920 18587405
41665 18587405 18394365 18159425 17511882 16795221 15421813 13260401 11952079 12294883 11986082
41656 11986082 8928795 5298978 4799055 6860261 7550371 5949057 5375079 7677645
41648 7677645 10412367 11046941 10316769 9704786 8966416 8125991 8725224 10784438 11461608
41639 11461608 9213880 6492120 5673178 5256259 3281333 1638922 2966649 5518849
41631 5518849 5619543 3730897 3455267 5377416 6606704 6160844 6067223 6740181 5867684
41622 5867684 2922881 620735 561816 1200379 1456281 2536328 4621217 5657819 5492051
41613 5492051 7380994 12760203 17953699 19131006 17522621 16425859 15807565 13749645
41605 13749645 11186577 10968307 13152654 14989291 15166351 14777369 14302619 12775558 10142774
41596 10142774 7760355 6204344 4858291 3895604 4396541 5956453 6143079 3247286
41588 3247286 -1522362 -5140712 -5513369 -3227344 -1035674 -1087719 -2384187 -2176217 -210332
41579 -210332 647293 -785919 -1325389 1968531 6836005 8831334 7682136 6911501 8066546
41570 8066546 9261602 9250233 9123533 9558281 9729406 9463817 9426571 8870835 6420295
41561 6420295 3389255 2802217 4597208 5640851 5361438 7032748 11669858 14946008
41553 14946008 13040033 8052205 4425444 2974279 1949085 1454691 2739213 4576911
41545 4576911 4302388 1951685 229245 672646 2514623 4990704 8190777 11637982
41537 11637982 14109174 14912211 13977054 11319202 7789843 5208836 4081724 2637649
41529 2637649 143173 -702343 2409156 6843297 8078286 6429701 6571117 10408964
41521 10408964 14697072 16454713 16468290 15770000 12719751 6436316 155565 -2142902
41513 -2142902 -779132 766438 726078 72041 -371096 -1009529 -1835471 -2033625 -1421190
41504 -1421190 -518990 817185 3065990 5306475 5826789 5003927 5623039 9156868 13233391
41495 13233391 14387714 12422621 10310868 10186836 11308292 12148825 12524114 12655235 11817877
41486 11817877 9650543 7740221 7761012 8410318 6558832 1861436 -1997773 -1681603 2027648
41477 2027648 6035222 8640886 9690765 8720015 5542463 2105976 1325296 3822834
41469 3822834 7370819 9486431 9204918 6815097 3772448 2627340 4845674 8443526
41461 8443526 9730607 7653139 4403610 1567446 -1652995 -5397949 -7109234 -4659371
41453 -4659371 256914 4151926 6104080 7929702 10674766 13154780 13990494 13265719
41445 13265719 11803366 10181971 8925711 8558690 8864489 8813367 7787688 6437435 5848492
41436 5848492 6151814 6475639 6299377 6400512 8025696 11185857 14280617 15618987 14835275
41427 14835275 12571348 9589528 6922079 5991956 7149307 8429345 7338246 3999476
41419 3999476 1136094 735920 2174774 3919117 5378805 6315995 6033131 4389017 2568014
41410 2568014 1758240 1936277 2779452 4604993 7273634 9274178 9329791 8174130 7413168
41401 7413168 7299522 6966538 6238077 5764447 5807383 6263774 7427921 9210689 9982714
41392 9982714 7997000 4049966 1032725 418737 681889 -164715 -1759686 -2048282 74968
41383 74968 3654000 6749796 7988560 7387172 6240425 6094879 7453795 9407823 10511900
41374 10511900 9937819 8008575 6032687 5534080 7081406 9619857 11247498 10980902
41366 10980902 9838398 10062651 12904517 16831453 18291201 15120223 9283799 5282116
41358 5282116 5386487 7245897 6728000 2367607 -3503574 -7100069 -5983412 -702020
41350 -702020 5164254 7460894 5287559 1787519 96004 -324262 -1625453 -3205780
41342 -3205780 -2356964 931726 3149590 2371923 1311686 3215025 6861417 8358787
41334 8358787 6734175 4752046 4304220 3928384 1963623 -88193 748557 4911700 9743340
41325 9743340 12589613 12996814 11965538 10567204 9614973 9266549 8276091 4959718 -98048
41316 -98048 -3542093 -2898170 196903 2106947 1802348 1303358 1992328 3073246 3974664
41307 3974664 5561590 7899767 9253621 8808520 8229125 8769827 8944299 7261096 5362999
41298 5362999 5737839 7769343 9079956 9755888 11842840 14973965 15997677 13499358
41290 13499358 9700022 7003450 5302100 3721865 2535611 1975929 1246097 209141
41282 209141 363691 2664009 5696649 7303800 6934704 5503838 4220910 4424457 7084299
41273 7084299 11341669 14793535 16195519 16587949 16940003 16423444 14301832 11832555 10570849
41264 10570849 10050601 8856478 6948209 5277508 4075591 3156466 2926415 3316138 2715797
41255 2715797 181403 -1882533 235605 6512802 12282983 13291320 10366613 8074161
41247 8074161 9374524 12567676 13654430 11183074 7882264 7066431 8521642 9512760
41239 9512760 9122564 9029900 9866240 9959822 8946750 9371500 12288168 14136933 11373934
41230 11373934 6158470 3622830 4831394 6468519 6614186 6333299 5703183 3226489
41222 3226489 243789 1095336 6637668 11692614 11786402 8904539 7308062 6966657 5442416
41213 5442416 3891255 6021424 11800782 17125748 20147844 23303503 27634069 29393868
41205 29393868 25153834 17363884 11594398 9926627 10069802 9806249 9040781 7855707
41197 7855707 5880044 4139809 4580890 6690892 7403775 6036604 6517445 11840227 18359679
41188 18359679 19513068 14667002 10223005 11144977 15096182 16847011 15326696 13408729
41180 13408729 12832196 12795051 12811664 13781105 16019868 18625975 21114179 23667636 25506966
41171 25506966 25064145 22348196 19362998 17606172 16883434 17136164 19278338 22874489
41163 22874489 24844161 22607409 17786630 14861735 16132345 19371828 20747649 19095976
41155 19095976 16745839 16473238 18249400 19476202 18444339 16671962 16844405 18963675
41147 18963675 20162075 18628688 16108804 15495233 17083499 18592133 18416728 17561195
41139 17561195 18217313 21203435 25061938 27437426 27372129 26346975 26823936 29695028 33556648
41130 33556648 36508585 37963999 38405705 38139461 36965988 34733566 31765567 29063922
41122 29063922 28249791 30441316 34473880 36982223 35473394 31199312 27856983 27247958
41114 27247958 27370589 25517961 22282524 21019885 23415380 27144760 28728660 27494974
41106 27494974 25397760 23865845 22837282 22587582 23932398 25812629 25105691 20598526
41098 20598526 15478280 13954500 16642645 21043431 25045074 27582511 27266781 23597213
41090 23597213 19041585 16710706 15982301 13614841 9442896 7389575 9690443 13467840
41082 13467840 14933291 14247576 13956496 14705547 14896825 13285456 9987951 5926760 2658364
41073 2658364 1600533 2331483 2975342 3007310 3795309 5691298 7283968 8707299 12291436
41064 12291436 17680188 19841500 15501874 8755712 5991187 7217756 7137403 3700080
41056 3700080 601880 1241726 4718632 8496372 11077606 11233814 8435940 5264516
41048 5264516 5888075 10696810 15512316 17354639 17713613 18634715 19175090 18164599 17370483
41039 17370483 18796085 20895035 20480722 17066387 12750732 8965176 5787228 3544534
41031 3544534 2692396 2612853 2516148 2994951 4891482 7320893 8806602 9841402 12152666
41022 12152666 15539632 17573325 16848481 14772822 13403673 12855069 11861475 10184263
41014 10184263 9323082 10638054 13336843 15004505 14256528 12103994 10108737 8242262
41006 8242262 6092590 5323191 8226295 13406304 15722167 12214764 6116375 3000334
40998 3000334 4396245 7278029 8712544 8615561 8306839 8527674 9174297 9647232 9343685
40989 9343685 8624807 8833434 10413658 11801243 11464117 10236915 10031564 10869653 11010919
40980 11010919 9679608 7802488 6131633 4494241 3129580 3069622 4675537 7068429
40972 7068429 9410802 11639337 13615208 14598871 13954642 11707178 8418235 5172190
40964 5172190 3215924 2559338 1503647 -1004480 -3086586 -1898158 2267180 5910899
40956 5910899 6612889 5305445 3755305 2034170 -278044 -2229485 -2511863 -1232827
40948 -1232827 745881 3322229 6619502 9680653 11192644 11262290 11288421 12124028 13240704
40939 13240704 13703372 13317471 12744739 12748918 13173268 12661707 10046662 6273674 4107639
40930 4107639 5251992 8326341 10418659 10259314 9178668 9162829 10584255 11821501 10763110
40921 10763110 6732827 1136157 -3756477 -6480198 -6690398 -4477584 -369625 4160215
40913 4160215 7408693 9065684 10375087 12503798 15472589 18556210 20590970 19993771
40905 19993771 16139081 11127248 8495559 9378087 11386483 11927287 10787458 8552352
40897 8552352 4903796 470141 -1779743 152315 3917478 5819471 6299164 8885415
40889 8885415 13816849 16725328 14946873 11570544 10841198 12257094 12335607 10585189 10156970
40880 10156970 12720069 15795757 16078347 13193179 8954776 4668099 951386 -753831
40872 -753831 1195902 5986617 9878515 9723808 6489626 4098617 4808741 6976991 7801768
40863 7801768 6908728 6001539 5916665 5872364 5513577 5765877 6995552 7925020 7516048 6755961
40853 6755961 7179238 8373765 8503878 7044196 5537160 5535871 7021733 9076715 10946823
40844 10946823 12019573 11826381 10720305 9743148 9223327 8330425 6708034 5615868 6380288
40835 6380288 8453995 10348298 11918917 13980192 15807379 15218363 11934627 8897343
40827 8897343 8740037 10407827 11086317 10277486 9619975 9420334 8365955 6936475 7869049
40818 7869049 11678968 14398315 12216598 6602212 2149389 669337 577077 1392781 4822543
40809 4822543 10383225 13614643 11228675 5940716 3387766 5219559 7840625 7756981
40801 7756981 5714183 4850953 6476696 8890538 9768116 8803841 7837143 8504164 10060862
40792 10060862 10163061 7913061 5119624 3873846 3931806 3670720 2762346 2332303 3005536
40783 3005536 4499239 6756773 9454759 10521336 7688255 2199593 -1533457 -1360689
40775 -1360689 -242031 -1781689 -4947151 -5893582 -3671972 -897325 878463 3072519
40767 3072519 6602928 9465715 9435699 7186682 4917270 3268616 1443702 -560440
40759 -560440 -1717089 -1517224 -95556 2905384 7799826 12923885 14934985 12165940
40751 12165940 7034862 4153449 5924323 10220906 12447483 10015969 4950420 1855561
40743 1855561 3127460 6666897 8802583 8774537 9150829 12000108 16112789 18626431 18405552
40734 18405552 16934155 16372380 17522034 19474362 20614647 20013294 18177072 16289967
40726 16289967 14595306 12164688 8789639 6267138 6457324 8235903 8027988 4129114
40718 4129114 -751490 -2507705 -433837 2524336 3997747 4754356 6460726 8696526
40710 8696526 9716129 9147268 8141706 7264541 6092001 4930539 4919972 5747702 5191718
40701 5191718 2326452 -335868 155679 2903018 4061373 1927318 -1024022 -1811316
40693 -1811316 -813356 -654894 -2334510 -4056569 -3758199 -1557686 741638 1935299 2529807
40684 2529807 3561099 4930127 5669243 5816907 6915607 9847631 12992929 13833054 12085635
40675 12085635 9884097 8849233 8433081 7515279 6193748 5198755 4632391 4193876 3862180
40666 3862180 3577729 2966550 2044068 1398075 1060353 242598 -965137 -861320 1554550
40657 1554550 4531689 5509099 4486938 3670536 4102374 4654651 4537434 4790357 6426936
40648 6426936 8584739 9627685 9182456 8100279 6982983 5621456 3688128 1514329
40640 1514329 304761 1524493 5405493 9877803 11749983 9493542 4632178 379219
40632 379219 -668094 2082886 6826492 10181072 9860482 7314324 6616459 9842675 14546618
40623 14546618 16861971 16110868 14853249 15025933 15941233 16257867 16133356 16480131 17252626
40614 17252626 17760596 18230976 19739516 22312973 24072824 23068309 19653097 16294001
40606 16294001 15009278 15627839 16613596 16751656 15720308 14039502 13190522 14739172 18165292
40597 18165292 20521450 19888338 18384056 19496200 22702516 23512606 19544967 13923123
40589 13923123 11263852 12634766 16260570 20903257 25869685 29261330 29412067 27670113
40581 27670113 27118143 28614761 30315508 30835888 30443483 29222367 26795418 24301918
40573 24301918 23976811 25854630 27264949 26708631 26020654 27332043 29859383 31218855
40565 31218855 30243351 27110018 22514249 18429644 17911592 21913869 27388462 30493185
40557 30493185 30681800 29858213 28900704 27478616 26281496 26562127 27767856 28253386 28217399
40548 28217399 29246192 30867664 30551295 27860851 25676397 25926288 26776096 25992370 24770971
40539 24770971 25578619 27705959 28020118 25773274 23878573 24893969 27908656 30355494
40531 30355494 31229201 31183298 30588631 29270248 27991726 28472905 31057647 33378163 32763257
40522 32763257 29863325 28415523 30737467 34611266 35782132 32736045 27561863 22687488
40514 22687488 18808518 16229584 15980243 18184533 20677977 20947431 19011955 17151825
40506 17151825 17070089 18403876 19875185 20825654 21400499 21928587 22440342 22562087 21879424
40497 21879424 20512835 19020770 17512657 15370938 12346206 9461206 8083086 8247286
40489 8247286 8571833 7899083 6555959 5831674 6420914 7537445 7709866 6580358 5560169
40480 5560169 6107637 7627802 8130650 7097965 6430033 7836449 10288155 11070982 8849676
40471 8849676 4906687 1783129 1269534 3172220 5537574 6734370 7552525 9949349
40463 9949349 13241423 13699158 9707222 5395997 6178881 11556797 15679104 15086986 12415100
40454 12415100 11389215 11630984 10799521 9256091 9282325 10902764 11879511 11711261 12389316
40445 12389316 14323498 14476543 10631108 5616682 4590382 8707923 14029333 16808438
40437 16808438 17247366 17036273 15888198 12993441 10220650 10554465 13604273 15814753
40429 15814753 15647239 15480867 17247702 19387404 20262318 21646713 25598008 29952735
40421 29952735 30848847 28821910 28478750 32085531 37012821 39960933 40282119 38278379
40413 38278379 33711441 27725781 23423037 22485976 23280249 23884477 24735813 26464679 27494208
40404 27494208 26280128 24131912 23168168 22850737 21312541 19164682 19027694 21474494
40396 21474494 24098324 25002466 25104293 26246022 28436865 29760579 28467295 24937664
40388 24937664 21676753 20739558 20938932 18945010 13934494 9474487 9286709 12652179
40380 12652179 15935036 17297634 17572763 17617194 17679905 18883883 22270305 26106383 26895924
40371 26895924 23813127 19916868 18215511 18505686 18827349 18093098 16341231 14080225
40363 14080225 12398310 12400076 13771561 15109165 16042826 17441509 19082897 19121355 16838638
40354 16838638 13999589 12079441 9862704 5732066 1317253 730114 6040762 14649171
40346 14649171 21325845 22481433 18818054 14314265 12433894 13261016 14680233 15749733
40338 15749733 17444203 20131843 22293386 22624883 21850948 21271722 20742729 19447681 17789743
40329 17789743 17040859 17410709 17592607 16311632 13893238 12386380 13972921 18465912
40321 18465912 22490700 22489958 18867034 15666457 15502797 16442419 15117817 11498062 8762024
40312 8762024 9051407 11084015 12145280 11334081 10270247 10782462 12358594 12728551 11343644
40303 11343644 10792639 13021731 15463801 14055735 9830596 8605645 12955084 18337140
40295 18337140 19499707 17241273 15543202 14990572 13422083 11325269 11658322 14451992
40287 14451992 15897935 13563479 9152148 5363188 3127703 2773850 4812655 8275128
40279 8275128 10923399 12382758 14516279 17441297 18105691 14865130 10799107 9642115
40271 9642115 10356547 9093691 5607766 4139372 7442205 12806413 15410482 13867011
40263 13867011 10897805 9475229 9899431 10552140 10146167 8615599 6621601 5184422
40255 5184422 5532697 8140828 11645852 13838086 14312116 14972392 16975943 18477969 17063677
40246 17063677 13494705 10950073 10936946 12144828 13268850 14522787 15905121 16439148
40238 16439148 16109839 16284798 16996068 16127988 13000729 10482309 11161889 13292021 13432134
40229 13432134 11770260 11425479 13118988 14425476 14812951 17424662 23764956 29650440
40221 29650440 29536689 23417586 16590839 13296767 13290530 14497223 16134547 18252408 20393476
40212 20393476 22191412 23908835 25062561 23818109 19396713 14085619 10859096 9526127
40204 9526127 7507751 4470740 3560408 6853445 11802047 14312335 14108036 14592059 17636005
40195 17636005 20874200 20918899 17578818 13668213 11544889 11133689 11137536 11006657 11161731
40186 11161731 11756270 11989283 10959055 8880319 6981171 6239950 6672969 7861430 9604134
40177 9604134 11881971 14682837 17982678 21337544 23490424 23273211 21128041 18772455
40169 18772455 17048482 15254963 13072327 11669642 11844270 12312122 11189904 8301613
40161 8301613 4886436 2091228 982697 2617265 6178767 8258662 6482150 3289462
40153 3289462 3561702 8549135 14540449 17715658 17944643 17296967 17076834 17258059 17090309
40144 17090309 15404115 11718335 7537001 5069567 4388533 3583946 1967578 1032751
40136 1032751 1757200 3249287 4866062 7242052 9983140 10781164 8677532 6256400
40128 6256400 6526236 9079960 11301742 12056494 12088142 11778658 10721952 9070678 7447894
40119 7447894 5737386 3467767 1251020 587323 2209503 5262597 7828951 8041443
40111 8041443 5695078 3237642 3836526 7714898 11850014 14115556 15805662 18615128
40103 18615128 21091348 20344363 16055726 10583011 5997849 3136750 2698902 4809014
40095 4809014 7724680 9157464 9009573 9183280 10736348 12693687 13534064 12518009 9807365
40086 9807365 6553207 4540710 4579723 5666069 6601872 7428655 8163843 7672723 5634770
40077 5634770 4198256 5371734 7910339 9246977 9366893 9876579 10227959 8422530 5197770
40068 5197770 3757522 4830835 5606028 4681391 4618245 7656418 11678503 12860884 10570744
40059 10570744 7361538 5182543 3634031 1666368 -393879 -796872 1734150 5799086
40051 5799086 7675112 5119583 323214 -2562509 -2318273 -934328 515746 3232047
40043 3232047 7446773 10949795 12251080 12739765 14177138 16201942 17808805 19139439
40035 19139439 20133068 19525315 17172545 15439062 15999258 16880894 15193535 11578703 9262857
40026 9262857 9344621 9695872 8518307 6574939 5309408 4654630 3830494 3345449 4981455
40017 4981455 9571136 15208176 18360589 17233213 13474929 9775456 6647141 3223410
40009 3223410 451885 685482 3734779 6260861 6383039 6258131 8235032 10805388 10874330
40000 10874330 8481687 6717159 7819578 11420546 15788776 18869876 18958298 16345647
39992 16345647 13695286 13093574 13520703 12869464 11335601 10734401 11411241 12127875 12349427
39983 12349427 12358286 11650885 9608812 7424044 6942034 7705494 7532259 6112709 5657136
39974 5657136 7566574 10594231 12854463 13772963 13500871 12161482 10358364 9044876
39966 9044876 8435889 8241311 8970215 11425715 14818804 17111441 17530384 17158455 16831758
39957 16831758 16139796 14796036 13327921 12091330 11170405 11314721 13099357 15051520
39949 15051520 14753729 12078075 9059428 6381788 2951794 -305488 189078 5402748
39941 5402748 10826756 11834382 9757734 9408600 12069508 14527637 14503527 13484336 13663678
39932 13663678 14906972 15739975 15339157 13698643 11470288 10275287 11511479 14131481
39924 14131481 15235330 13732906 11835108 11910927 13577659 15380129 17649212 21323830
39916 21323830 24834448 24958503 21045383 16073491 12847002 11279470 10416519 10804897
39908 10804897 12889549 14869098 14798492 13842011 14566909 16418832 16160257 13294355 11617146
39899 11617146 13656309 16478798 15719956 11905173 9749667 11979151 16503668 19413104
39891 19413104 18494394 14025310 8402744 5062172 5573772 7458687 6772630 3085987
39883 3085987 -101084 -173330 1695919 3199397 4014387 4727328 4647229 2925779 908981
39874 908981 1213419 4440934 8185863 9494854 7507370 3668317 114753 -1832722
39866 -1832722 -1903933 -141659 3331766 7373003 9514829 8140736 5044978 4275362 7631611
39857 7631611 12342338 14133928 11964714 8842326 8281150 10716669 13483728 13965412
39849 13965412 12420805 11288816 11725647 11922319 9762162 6166175 4148240 4931814
39841 4931814 6822770 7985228 8484324 9120136 9942049 10705266 11519142 12398084 13250249
39832 13250249 14527299 16395991 17066369 14031096 7860028 2797909 2240881 5154131
39824 5154131 8232297 9999730 11252493 12935988 15382644 18496193 20939098 20264125
39816 20264125 15846421 10852042 9194372 10967466 12810319 12449958 10906361 10264866
39808 10264866 11197631 12974024 14256470 13429215 9581859 3870846 -980048 -2979075
39800 -2979075 -2068621 857324 4985675 9311737 12419084 13406190 12820010 12222570 12725818
39791 12725818 13919570 14360422 13452620 12644469 13913959 17011186 19368089 19114857 16811456
39782 16811456 13559406 9233050 4095525 499145 598427 3188257 5264600 6375422
39774 6375422 8806188 13178901 16509394 15799707 11671558 7197011 4662317 4707502 7026335
39765 7026335 10012651 10746791 7635853 3011604 1082346 2824424 4779496 4018929
39757 4018929 2569603 4702714 10482964 14774879 13596090 9295041 7538163 10367574
39749 10367574 14362849 15214158 12103035 7595693 5042052 6228464 9850676 12049469
39741 12049469 10115700 5836490 3426296 4223798 5816024 6552659 7728932 10061637
39733 10061637 11162949 8810612 4484401 1363256 595902 1487573 3264537 4424021
39725 4424021 2626239 -1911336 -4847944 -2626624 2705059 6644590 8310755 9695766
39717 9695766 10670474 9419022 7016729 6582116 7692767 6481520 2243679 -585327
39709 -585327 1306799 5755237 8876322 9749174 9436106 8540675 7899315 8946774 11265668
39700 11265668 12193353 10742913 9406948 10122576 11054375 9709906 6923003 5210372
39692 5210372 5075807 5404776 5916773 6938528 8150256 9472284 11561173 13624469 12857729
39683 12857729 8386900 3750341 2747138 4549175 5783824 5799657 6522199 8216803
39675 8216803 9025847 8504448 8418814 9682675 10952676 10644322 8573689 5685377 3700954
39666 3700954 4415940 7570579 10258703 10426006 9873124 11394800 14117992 14758533 12780187
39657 12780187 10851174 10264453 9379428 7094840 4620220 2970225 1706463 1151963
39649 1151963 2838592 6310578 8244908 6658378 3841902 3182957 4825565 6461004
39641 6461004 7105323 8071621 10737564 14713341 17951096 18176565 14979431 10729962 8279292
39632 8279292 7700724 6999481 6050575 7136028 10592426 12870743 11130248 7501431 6019756
39623 6019756 6905911 7047120 5404591 4583827 6632948 10120693 12553073 13628617 14568417
39614 14568417 15534303 15473360 14184226 13058235 13303718 14204443 13879290 11616167 8698155
39605 8698155 6625748 5268546 3537302 1284827 -661357 -2076406 -3448756 -4393172
39597 -4393172 -3633725 -1217147 860257 1315369 1470780 3066506 5314516 5949205 4699214
39588 4699214 3907154 5574322 9081879 12040701 12445310 9945784 5980576 2890474
39580 2890474 2192268 3476386 5245470 6473657 6863113 6307451 5234065 5020082 6601612
39571 6601612 8642143 8543620 5722768 2605984 1606832 2119275 1563183 -1095302 -3957470
39562 -3957470 -4395544 -1947945 1307103 3019754 2907013 2747873 4228420 7120477 9608351
39553 9608351 9904590 7292802 2320705 -3133183 -6310520 -5309283 -890854 3914218
39545 3914218 6315202 5756616 3772304 2622977 3967466 7789044 12115909 14447400
39537 14447400 13927909 11712697 9157848 6633871 4538234 4156841 6114570 8522655
39529 8522655 8301242 4725447 656548 -281908 2742924 7243229 9830534 8914117 5676325
39520 5676325 2977778 3008686 5437157 7772540 7748746 5433053 3063779 2926330 5273323
39511 5273323 8125413 9253724 8541611 7988084 8953287 10104768 9257552 6850000 5787962
39502 5787962 7406204 9462321 9397640 8053178 8250327 10567463 12696320 12815310 11511435
39493 11511435 9990689 8275124 6052600 3922808 2754005 2637880 3236883 4438285
39485 4438285 6046986 7491261 8320489 8431150 7713665 6431440 5961080 7642621 10449114
39476 10449114 11484462 9661370 7178177 6132099 5510498 3514312 1411533 2379502
39468 2379502 6801423 11073729 11523110 7993317 3325117 588221 955938 3095146
39460 3095146 4462109 4050236 3618485 5247749 8245732 9856415 8622955 5577223
39452 5577223 2539927 910022 1684337 4630877 7537470 8291627 7663568 7956051 9124683
39443 9124683 8960721 7330118 7003864 9151042 11082051 10279140 7991659 6680112 6366936
39434 6366936 6134483 7018062 10087603 13066736 12485194 8803798 6116197 6622951 8444658
39425 8444658 9485584 10486604 12794416 15312863 15621968 13163525 9920726 8386156
39417 8386156 9572600 12408973 14441114 13685178 10458485 7159399 5960984 6957614
39409 6957614 8525674 8962742 7761807 5901641 5002550 5694256 6817448 6741522 5305581
39400 5305581 3757401 2934081 2445454 1764654 1163528 1111311 1387532 1330524 712664 7765
39390 7765 -243725 -311012 -1315911 -3876917 -6689089 -7388357 -5322375 -2455256 -689985
39381 -689985 568527 2791185 5271841 5767137 3965957 2263717 2695443 4732142 6537064
39372 6537064 6877815 5377018 2516931 61569 -116398 1529009 2452827 1554994 755850
39363 755850 1749129 2986870 2017303 -316127 -510144 2960526 7781080 10804679 11126231
39354 11126231 9750905 7887553 6380230 5597205 5005284 3696438 1973658 1491091
39346 1491091 3060696 5220523 6002365 5465499 5298812 6253863 7235443 7021142 5791428
39337 5791428 4581994 4009623 3953211 3896645 3244091 1883868 770138 1260023 3400306
39328 3400306 5585569 6548254 6909831 7817218 8781641 8285919 6220032 4112825 2813865
39319 2813865 1548450 -214083 -1506657 -1405934 -544674 50689 574757 1613731 2600233
39310 2600233 2632901 2317531 3201187 5498983 7790121 8992855 9308121 9024832 7691697
39301 7691697 5017154 1768178 -643197 -997070 1160192 4876028 7797991 7993685
39293 7993685 6082869 4621516 5106571 6575390 7471869 7713665 8133559 8711680 8363557
39284 8363557 6316573 3182289 685400 323908 1986663 4031072 5139606 5643007
39276 5643007 6204790 5923319 3469910 -6908 -1291278 767839 3409243 3540769 1588890
39267 1588890 110522 -95726 -230412 -484655 550763 2852714 3504384 -112394 -6538937
39258 -6538937 -11193982 -11110065 -7634636 -4057451 -1532905 1493937 6019023 10176870
39250 10176870 11196173 8808724 5402611 3148978 2334717 2344934 2620527 2363616 1013301
39241 1013301 -280990 716949 4197229 7264872 7344679 5335246 3847677 3532475 3186204
39232 3186204 2741808 3713935 6453252 8945536 9045751 6610303 2925512 -705619 -3160626
39223 -3160626 -3474254 -1710690 617239 1886521 2094957 2772438 5053023 8066537 9619074
39214 9619074 8798977 7603940 9029692 13258002 16810628 16341781 12500658 9018414
39206 9018414 8557978 10570879 12773866 13454106 12431258 10820057 9855790 9291837 7401132
39197 7401132 3354727 -1197470 -4130526 -5559371 -6876259 -7851421 -6968023 -4458774
39189 -4458774 -2568886 -2377894 -2545989 -1787022 -407410 1325754 3941557 6660398 6888751
39180 6888751 3681690 -140676 -1416319 -724802 -867629 -2463397 -3539964 -2942193 -1698253
39171 -1698253 -908746 -258636 990881 2955369 5360932 7762456 9485055 10252000 10649471
39162 10649471 11111281 11052367 10153010 9647849 10603663 11525326 9837571 5708767 2264890
39153 2264890 1643861 2831639 4041862 5333534 7783720 11443250 15242312 18123485
39145 18123485 19636243 20198970 21053852 22943284 24665296 24168954 21176692 17246983
39137 17246983 13260014 8916101 5074186 4026267 6232530 9036775 10134746 10197335
39129 10197335 10379591 9638272 7084296 5040136 6521749 10644020 13579607 13593622 12295552
39120 12295552 11239312 10242166 9212644 8887542 9278311 9651354 10177352 11128320 10461087
39111 10461087 5425284 -2575326 -7846757 -6701071 -1477892 3136491 5387809 6462838
39103 6462838 7645714 9497527 11932687 13233264 10977714 5950445 2996358 5508658
39095 5508658 10963511 14655220 15957068 17419852 19073830 17935117 13301127 8713479
39087 8713479 7507051 9080690 10620178 10311371 7919635 4212211 904302 -323826
39079 -323826 368440 1247655 1320754 1051375 793109 296231 -11389 872110 2691187 3869968
39069 3869968 3607153 2465912 979621 -290068 459073 4604466 9950641 12464575
39061 12464575 11972968 12519765 15419623 15933915 10092645 1702719 -1764831 1258477
39053 1258477 5214936 5284339 2514481 622366 1069394 2611270 3419759 2314157 -574436
39044 -574436 -3302943 -3406070 -517471 3052874 4765135 4141756 2509337 1424414 1659834
39035 1659834 2982765 4588215 6072146 7786501 9784632 10957566 10105120 7542609
39027 7542609 4802555 3068337 2655711 3445847 4745961 5187886 4008820 2262691 1739535
39018 1739535 2874552 4572070 5679519 5722124 4748634 3536030 3393465 4627832 5782733
39009 5782733 5518327 4472724 4010358 4152474 4373754 5306847 7467889 9232716 8767723
39000 8767723 7467771 8443263 11475477 12590923 9455992 4405165 988370 98636
38992 98636 935176 3304434 6888610 9942949 10800248 9671054 7519072 4456268 912344
38983 912344 -881724 1143971 5707918 8821763 8053565 5139629 3899005 5968001
38975 5968001 9044166 9656802 7506229 5918163 7277129 9559436 9369603 7204875
38967 7204875 6660026 8690175 10239566 9401449 8379539 9441755 10978581 10182257 7444927
38958 7444927 5389442 5078582 5658172 6443357 6985279 6245012 4057652 2430093 3181493
38949 3181493 5289929 6686675 7425621 8628056 9542535 8583174 6444262 5106232 4258244
38940 4258244 1894320 -1720151 -4001107 -4243312 -4581106 -6009650 -6610185 -5019000 -2850381
38931 -2850381 -1971915 -1656944 -319611 1669728 2753857 2517742 1660704 655508 -190051
38922 -190051 -212818 817732 2061424 2677495 2807887 2821989 2639337 2690648 4412205 8442944
38912 8442944 12925827 14828480 12836524 8335527 3895099 1281189 480568 121456
38904 121456 -914706 -2196211 -2528109 -1850308 -1297032 -1243393 -541568 1772303 5021379
38895 5021379 7673559 8733429 8033929 6180940 4579685 4397859 5072209 4974628 3901371
38886 3901371 3522570 4884537 7017589 8716168 10077049 11390416 12197322 12519333 13235926
38877 13235926 13953425 12509252 8404846 4717822 4136858 4803451 3144744 -342747
38869 -342747 -1678798 595095 3622840 4843326 4865279 4681396 3440291 906389 -799025
38860 -799025 -488202 -686521 -4118470 -8887913 -10396309 -7430805 -3165603 -123009 2565592
38851 2565592 5929454 8267329 7655439 5476982 4985270 7114729 9855357 11484224
38843 11484224 12321479 12966828 12678987 10529923 7068709 3830444 1845429 1431585 2781637
38834 2781637 5640744 8593709 9730548 8369630 5669880 3359480 2152270 1487510
38826 1487510 549831 -635159 -1154452 -302011 1478532 3169211 4560613 6224319 7870232
38817 7870232 7811713 5000463 944469 -1532744 -1258826 436372 1604935 1464836 440472
38808 440472 -495218 -295517 1505648 4206552 6331386 6678037 4908851 1741344 -934150
38799 -934150 -1083351 1109184 2571142 524798 -4081783 -7874093 -9235106 -9084462 -7794753
38790 -7794753 -4253723 1136792 5291276 6080392 5138682 5058553 5503528 4544604 2674111
38781 2674111 2580377 4987954 7266004 6902362 4569301 2776846 2681072 3310199 3406808
38772 3406808 3033101 3156447 4136932 5328970 6504695 8838176 13119087 17248924 17554867
38763 17554867 13390104 8538375 6633984 6879771 6235021 4313149 3369325 4164691 4910106
38754 4910106 4522414 4073244 4198368 3695588 2034176 927253 1578991 2324360 1321543
38745 1321543 105969 1546859 4813981 5546214 1701634 -3473335 -5749958 -4981163
38737 -4981163 -3810043 -3062354 -1365222 1252728 2680399 2347719 2548096 4498740 5646959
38728 5646959 3410333 -303688 -1458296 337456 1917890 2046357 2867103 5144662
38720 5144662 6049140 3750627 955066 1027298 2943880 3191611 1054995 -1150713 -2063181
38711 -2063181 -2291899 -1898338 69802 3302727 5997171 7278163 7786936 7668084 6120048
38702 6120048 3370156 1089687 178103 -230765 -937697 -1298073 -362312 1597381 3162682
38693 3162682 2866755 525765 -1905712 -1794114 780150 2572734 1861693 1645404 5164949
38684 5164949 9890800 10246648 5819489 2099164 2427464 4093781 4132448 4160621 6405549
38675 6405549 8967059 8987878 7682731 8092992 9813496 10051917 8645604 7941350 8199312
38666 8199312 6943553 3119969 -1246878 -3999038 -4862669 -4176136 -2042572 687066
38658 687066 2598786 3423768 4071586 5011332 6289035 8728474 12770927 16178526 15607303
38649 15607303 11146548 6827086 5549281 5802442 4997135 4048026 6145217 11518888
38641 11518888 15716678 14052868 7061882 547066 -247115 3889599 7424232 6769141
38633 6769141 3957651 2783892 3417759 3241750 1688344 1005223 2296590 3902362 4380102
38624 4380102 4329990 4243663 3254686 1601890 1853346 5448202 9802454 11241766 9572609
38615 9572609 7385333 5862189 4057969 2022000 1690158 3888260 6685504 7921280
38607 7921280 7733314 7264695 6242084 3660703 281942 -1455241 -288548 2479426
38599 2479426 4875450 6200879 6306389 4405209 440658 -2995523 -2426975 2239182
38591 2239182 7033347 8571604 7906269 8371241 10877830 13277968 13749958 12667192 10955976
38582 10955976 8508301 5086089 1679815 8961 927076 3585307 5984967 6574803
38574 6574803 5727562 5315802 6426583 8147100 9143328 9333161 8942776 7226657 3947491
38565 3947491 1120554 972471 2677579 3572924 3335565 4124617 6300115 7036129 4338717
38556 4338717 -49423 -3115111 -3889000 -3149714 -2009349 -2088101 -4771910 -8609479 -9647599
38547 -9647599 -6306607 -1869469 -53460 -313015 -106408 432335 -373343 -1466037 -79431
38538 -79431 3216765 4435183 1828571 -1653710 -2645472 -1307113 333096 1564709 2844324
38529 2844324 4165879 5182332 5882586 6083554 5299741 3900350 3200752 3686852 4464003
38520 4464003 5106973 6317536 7711827 7019270 3509404 680023 2769371 8981591
38512 8981591 13849000 13814392 11137143 10107552 11284207 11459623 8485206 3961012 921921
38503 921921 654919 2677288 6388003 11062252 14761426 15139930 11880173 7243916 3719419
38494 3719419 1942902 1150263 456911 -878035 -3155728 -5223730 -4884918 -1559064 2325269
38485 2325269 3864760 2843409 1147112 98462 191016 2562511 8109935 14950760
38477 14950760 19142974 18855169 16173659 13909132 12110949 8884257 3619163 -1825866
38469 -1825866 -4862225 -4531557 -2364597 -889862 -832843 -255011 2544710 5982986 6956432
38460 6956432 5525743 5461822 9310679 14996771 18646732 19101582 18019730 16739678 14859602
38451 14859602 11518182 6862417 2399725 249520 1220356 3335903 3584176 1556996
38443 1556996 -373248 -1071119 -2377016 -5431366 -8023737 -8174492 -7912542 -9839799 -11592721
38434 -11592721 -8283450 -229623 6393955 7706723 6739727 7898793 10517013 10994760
38426 10994760 8779829 6676224 6481575 7523533 8952651 10623747 11831428 11732084
38418 11732084 11194797 11958054 13676670 14072585 12570668 11523951 12778371 14937676
38410 14937676 15351276 13295565 9912978 6477719 4149831 3948714 5127392 4836012
38402 4836012 1577968 -1990483 -2264577 -89342 90615 -3279779 -6358851 -5113928
38394 -5113928 -438941 3616936 4679087 3333654 1435794 1090899 3631278 7395018
38386 7395018 8055820 3705862 -1700163 -2876207 -135620 1618947 335828 -735724
38378 -735724 1289237 4643134 6096844 5504703 4929429 5252380 5760876 5712407 4659992
38369 4659992 2506224 518456 758205 3214956 5216255 5032441 4065585 3828586 3110439
38360 3110439 559286 -2098940 -2545987 -1896381 -2609106 -3402389 -347831 6851722 13511275
38351 13511275 15818800 14788905 13129351 11245298 8390009 5505356 4424402 5228464
38343 5228464 6252086 6219200 5145080 3645274 2440524 2252674 3369265 5333016 7303969
38334 7303969 8566003 8868683 8800539 9501582 11202037 12436960 11750514 9706817 7840214
38325 7840214 6091910 3164087 -678082 -3299320 -3659749 -3141997 -3170641 -3261116 -2387172
38316 -2387172 -807525 461893 821469 22338 -1806749 -3425027 -3156519 -1006469 1266576
38307 1266576 2756489 4378598 6440588 7212366 5339631 2150156 89372 96480 1679387
38298 1679387 3967444 5208232 3001576 -2768038 -8368947 -9773669 -7053031 -3368328
38290 -3368328 -549981 2013395 4709779 6600163 7214333 7228210 6757156 4750024 838693
38281 838693 -3531971 -6525264 -7508234 -6816807 -4980298 -2758911 -1073105 -135497 889506
38272 889506 2713222 4602172 4856399 2905972 625539 828820 4097742 7795191 8972192
38263 8972192 7554481 5531678 3876521 2228689 1092355 1618254 2893952 2365804
38255 2365804 -45126 -1175982 483111 2089810 883686 -1449593 -1725573 -183403
38247 -183403 895097 1494680 2943278 4080050 2572387 -469541 -1278894 1099270 3828603
38238 3828603 4903583 4930404 3858712 95716 -5628246 -9036186 -7012245 -1185779
38230 -1185779 4542461 7698470 7439661 3936084 -756555 -3550874 -3737932 -3660920 -4882563
38221 -4882563 -5951859 -5111095 -2647425 802343 5471541 10204846 11834026 9184048
38213 9184048 5340341 3552131 3148459 1999599 631202 787183 1827277 1979404 1930259
38204 1930259 3843965 7519526 10473397 11310730 10421713 8041722 4309365 653443
38196 653443 -1517416 -2923140 -4633331 -5069549 -2009770 2815165 4686324 1972258
38188 1972258 -1792570 -2712702 -840997 1181108 1551296 456097 -481376 638096 3931676
38179 3931676 7021937 8187479 9401642 13278770 17550700 16752540 10259685 4369410
38171 4369410 4159432 6876585 6502603 2179132 -1557960 -1433052 1252761 3567362 4318381
$$ [...]
##END NTUPLES=NMR SPECTRUM
##END=
