##TITLE=31Pdec_DE-80rm4h
 , 24 sc
 16.1.2025
##JCAMPDX= 6.0         $$ Bruker NMR JCAMP-DX V2.0
##DATA TYPE= NMR SPECTRUM
##DATA CLASS= NTUPLES
##ORIGIN= UXNMR, Bruker Analytische Messtechnik GmbH
##OWNER= root
$$ XWIN-NMR		Version 3.5
$$ Thu Jan 16 16:05:05 2025 Russian Standard Time (UT+4h)  she@DPX200
##.OBSERVE FREQUENCY= 81.013821
##.OBSERVE NUCLEUS= ^31P
##.ACQUISITION MODE= SIMULTANEOUS
##.ACQUISITION SCHEME= undefined
##.AVERAGES= 24
##.DIGITISER RES= 17
##SPECTROMETER/DATA SYSTEM= spect
##.PULSE SEQUENCE= zgpg30
##.SOLVENT NAME= CDCl3
##.SHIFT REFERENCE= (INTERNAL, CDCl3, 0, 198.062)
##AUDIT TRAIL= $$ (NUMBER, WHEN, WHO, WHERE, WHAT)
$$ ##TITLE= Audit trail, XWIN-NMR		Version 3.5
$$ ##JCAMPDX= 5.01
$$ ##ORIGIN= Bruker BioSpin GmbH
$$ ##OWNER= she
$$ F:/spectra/data/she/nmr/P31/2/pdata/1/auditp.txt
$$ ##AUDIT TRAIL=  $$ (NUMBER, WHEN, WHO, WHERE, WHAT)
(   1,<2025-01-16 16:04:32.51 +0400>,<she>,<DPX200>,
      <created by zg, POWCHK disabled, PULCHK disabled
       configuration hash MD5:
       00 E9 B6 7A A2 85 ED C7 34 08 36 98 17 FE 4E 26
       data hash MD5: 32K
       49 43 0F C0 80 58 58 D9 31 00 F9 BB 13 D1 69 23>)
(   2,<2025-01-16 16:04:35.40 +0400>,<she>,<DPX200>,
      <Start of raw data processing
       efp BC_mod = 2 LB = 1.5 FT_mod = 6 PKNL = 1 PHC0 = 1630.077 PHC1 = 448.0856 SI = 64K 
       data hash MD5: 64K
       F1 4D F1 9C 25 EA 7D 0E 91 CE 2D 5A D7 4A 29 E4>)
$$ ##END=
$$ 
$$ hash MD5
$$ 65 3D 25 BB CE DC A8 20 CD CD 13 61 4F D6 12 D7
##$RELAX= 
##$RELAX= 
##$RELAX= 
##$RELAX= 
##$RELAX= 
##$RELAX= 
##$RELAX= 
##$RELAX= 
$$ Bruker specific parameters
$$ --------------------------
##$DU= <F:/spectra>
##$EXPNO= 2
##$NAME= <P31>
##$PROCNO= 1
##$TYPE= <nmr>
##$USER= <she>
##$AMP= (0..31)
100 100 100 100 100 100 100 100 100 100 100 100 100 100 100 100 100 100 
100 100 100 100 100 100 100 100 100 100 100 100 100 100 
##$AQSEQ= 0
##$AQ_mod= 1
##$AUNM= <au_zg>
##$AUTOPOS= <>
##$BF1= 81.014009
##$BF2= 200.13
##$BF3= 200.13
##$BF4= 200.13
##$BF5= 200.13
##$BF6= 200.13
##$BF7= 200.13
##$BF8= 200.13
##$BYTORDA= 1
##$CFDGTYP= 0
##$CFRGTYP= 5
##$CHEMSTR= <none>
##$CNST= (0..31)
1 1 145 1 1 1 1 1 1 1 1 1 1 1 1 1 1 1 1 1 1 1 1 1 1 1 1 1 1 1 1 1 
##$CPDPRG= <waltz16>
##$CPDPRG1= <>
##$CPDPRG2= <waltz16>
##$CPDPRG3= <>
##$CPDPRG4= <mlev>
##$CPDPRG5= <mlev>
##$CPDPRG6= <mlev>
##$CPDPRG7= <mlev>
##$CPDPRG8= <mlev>
##$CPDPRGB= <>
##$CPDPRGT= <>
##$D= (0..31)
0 1 0 0 0 0 0 0 0 0.06 0 0.03 2e-05 3e-06 0 0 0.0002 0 0 0 0 0 0 0 0 0 
0 0 0 0 0 0 
##$DATE= 1737029072
##$DBL= (0..7)
120 120 120 11 120 120 24 19 
##$DBP= (0..7)
150 150 150 150 150 150 150 150 
##$DBP07= 0
##$DBPNAM0= <>
##$DBPNAM1= <>
##$DBPNAM2= <>
##$DBPNAM3= <>
##$DBPNAM4= <>
##$DBPNAM5= <>
##$DBPNAM6= <>
##$DBPNAM7= <>
##$DBPOAL= (0..7)
0.5 0.5 0.5 0.5 0.5 0.5 0.5 0.5 
##$DBPOFFS= (0..7)
0 0 0 0 0 0 0 0 
##$DE= 6
##$DECBNUC= <off>
##$DECIM= 4
##$DECNUC= <off>
##$DECSTAT= 4
##$DIGMOD= 1
##$DIGTYP= 9
##$DL= (0..7)
0 0 52 120 120 21 21 25 
##$DP= (0..7)
$$ [...]
##$SUBNAM3= <"">
##$SUBNAM4= <"">
##$SUBNAM5= <"">
##$SUBNAM6= <"">
##$SUBNAM7= <"">
##$SUBNAM8= <"">
##$SUBNAM9= <"">
##$SW= 400.765351723535
##$SWIBOX= (0..15)
0 1 3 0 0 0 0 0 0 0 0 0 0 0 0 0 
##$SW_h= 32467.5324675325
##$TD= 32768
##$TD0= 1
##$TE= 0
##$TE2= 300
##$TE3= 300
##$TEG= 300
##$TL= (0..7)
0 120 53 12 22 120 120 120 
##$TP= (0..7)
150 150 150 150 150 150 150 150 
##$TP07= 0
##$TPNAME0= <>
##$TPNAME1= <>
##$TPNAME2= <>
##$TPNAME3= <>
##$TPNAME4= <>
##$TPNAME5= <>
##$TPNAME6= <>
##$TPNAME7= <>
##$TPOAL= (0..7)
0.5 0.5 0.5 0.5 0.5 0.5 0.5 0.5 
##$TPOFFS= (0..7)
0 0 0 0 0 0 0 0 
##$TUNHIN= 0
##$TUNHOUT= 0
##$TUNXOUT= 0
##$USERA1= <user>
##$USERA2= <user>
##$USERA3= <user>
##$USERA4= <user>
##$USERA5= <user>
##$V9= 5
##$VALIST= <valist>
##$VCLIST= <CCCCCCCCCCCCCCC>
##$VD= 0
##$VDLIST= <DDDDDDDDDDDDDDD>
##$VPLIST= <PPPPPPPPPPPPPPP>
##$VTLIST= <TTTTTTTTTTTTTTT>
##$WBST= 1024
##$WBSW= 4
##$XGAIN= (0..3)
0 0 0 0 
##$XL= 0
##$YL= 0
##$YMAX_a= 5240
##$YMIN_a= -7214
##$ZGOPTNS= <>
##$ZL1= 120
##$ZL2= 120
##$ZL3= 120
##$ZL4= 120
##$ABSF1= 0
##$ABSF2= 0
##$ABSG= 0
##$ABSL= 0
##$ALPHA= 0
##$AQORDER= 0
##$ASSFAC= 0
##$ASSFACI= 0
##$ASSFACX= 0
##$ASSWID= 0
##$AUNMP= <proc_1d>
##$AZFE= 0.1
##$AZFW= 0.5
##$BCFW= 0
##$BC_mod= 2
##$BYTORDP= 0
##$COROFFS= 0
##$CY= -3
##$DATMOD= 1
##$DC= 0
##$DFILT= <>
##$DTYPP= 0
##$F1P= 0
##$F2P= 0
##$FCOR= 1
##$FTSIZE= 65536
##$FT_mod= 6
##$GAMMA= 0
##$GB= 0
##$INTBC= 1
##$INTSCL= 9.790993e-09
##$ISEN= 30
##$LB= 1.5
##$LEV0= 0
##$LPBIN= 0
##$MAXI= 10000
##$MC2= 0
##$MEAN= 0
##$ME_mod= 0
##$MI= 50
##$NCOEF= 0
##$NC_proc= -10
##$NLEV= 6
##$NOISF1= 182.463
##$NOISF2= 159.3651
##$NSP= 0
##$NTH_PI= 0
##$NZP= 0
##$OFFSET= 198.0616
##$PC= 4
##$PHC0= 1630.077
##$PHC1= 448.0856
##$PH_mod= 1
##$PKNL= yes
##$PPARMOD= 0
##$PSCAL= 0
##$PSIGN= 0
##$REVERSE= no
##$SF= 81.0140089999434
##$SI= 65536
##$SIGF1= 159.3651
##$SIGF2= -187.1042
##$SINO= 113.3802
##$SIOLD= 16384
##$SREGLST= <1H.CDCl3>
##$SSB= 0
##$STSI= 65536
##$STSR= 0
##$SW_p= 32467.5324675325
##$SYMM= 0
##$S_DEV= 0
##$TDeff= 32768
##$TDoff= 0
##$TI= <>
##$TILT= no
##$TM1= 0
##$TM2= 0
##$TOPLEV= 0
##$USERP1= <user>
##$USERP2= <user>
##$USERP3= <user>
##$USERP4= <user>
##$USERP5= <user>
##$WDW= 1
##$XDIM= 65536
##$YMAX_p= 423916433
##$YMIN_p= -170825968
$$ End of Bruker specific parameters
$$ ---------------------------------
##NTUPLES= NMR SPECTRUM
##VAR_NAME=  FREQUENCY,     SPECTRUM/REAL,   SPECTRUM/IMAG
##SYMBOL=    X,             R,               I
##VAR_TYPE=  INDEPENDENT,   DEPENDENT,       DEPENDENT
##VAR_FORM=  AFFN,          ASDF,            ASDF
##VAR_DIM=   65536,         65536,           65536
##UNITS=     HZ,            ARBITRARY UNITS, ARBITRARY UNITS
##FACTOR=    0.49542278885378, 1,            1
##FIRST=     16045.7642231865, 0,            0
##LAST=      -16421.768244346, 0,            0
##MIN=       -16421.768244346, -170825968,   0
##MAX=       16045.7642231865, 423916433,    0
$$ Real data points
##PAGE= N=1
##DATA TABLE= (X++(R..R)), XYDATA
$$ [...]
45220a2719741j78460j0326360j1868509o398327n31013M956179J0283481J0679457
$$ -12719741 -12898201 -23224561 -35093070 -41491397 -42022410 -37066231 -26782750 -16103293
45212a6103293M901821J670449P077155J2467362O612786n455289q988144j852306
$$ -16103293 -11201472 -9531023 -2453868 10013494 16626280 11170991 2182847 330541
45204C30541L707559J386288j334145J363567L667425j25188m722608k896209
$$ 330541 4038100 5424388 4090243 5453810 9121235 8996047 4273439 1377230
45196A377230K249846K589111k452481o432961n773011k423837R92480L065276
$$ 1377230 3627076 6216187 3763706 -2669255 -8442266 -10866103 -9873623 -6808347
45188f808347K683083J032547K100156O658549Q895628M390833j799589j760900
$$ -6808347 -4125264 -3092717 -992561 5665988 14561616 18952449 17152860 15391960
45180A5391960K838118K750614m661320j0995058q394923O97043P992172Q668323
$$ 15391960 18230078 20980692 16319372 5324314 -3070609 -2373566 5618606 14286929
45172A4286929L603789l502644q174265p228200j724576L453519M242140M67680
$$ 14286929 17890718 14388074 6213809 -1014391 -2738967 714552 4956692 5424372
45164E424372n306817r447847q291008j196595P087645J0592576Q969058O739242
$$ 5424372 117555 -9330292 -17621300 -18817895 -11730250 -1137674 7831384 14570626
45156A4570626O099358N095384K979942J751949J314007j018317m450002m373601
$$ 14570626 20669984 25765368 28745310 30497259 31811266 30792949 26342947 21969346
45148B1969346n79330Q01290k931060o080820l993859p10157j338945l322534
$$ 21969346 21390016 22191306 19260246 13179426 9185567 8475410 7136465 3813931
45140C813931k426178j260156l322741m250047P28162N296942L10007r084146
$$ 3813931 1387753 127597 -3195144 -7445191 -6717029 -1420087 -1110080 -10194226
45132a0194226q440503L389802J0886275M800128m924355n761239l89987J195643
$$ -10194226 -18634729 -15244927 -4358652 441476 -4482879 -10244118 -10634105 -9438462
45124i438462j683264k095878J772856N298786N566166L132821j239785m999262
$$ -9438462 -11121726 -13217604 -11444748 -6145962 -579796 2553025 1313240 -3686022
45116c686022k968147M703534Q106262k71613j2438103j3721429k753901P604843
$$ -3686022 -6654169 -1950635 6155627 5884014 -6554089 -20275518 -23029419 -15424576
45108a5424576Q815121N329080L160214P40988m072724o773815k724346M605457
$$ -15424576 -6609455 -1280375 1879839 2620827 -1451897 -8225712 -10950058 -6344601
45100f344601Q036665N761352J215361k843605n386962m797592l42449N042042
$$ -6344601 1692064 7453416 8668777 5825172 438210 -4359382 -4701831 340211
45092C40211P074573M849142J027456j785827l075394l867569n487083p693241
$$ 340211 7414784 12263926 13291382 11505555 8430161 4562592 -924491 -8617732
45084h617732p517229k200574N876366J0140637P388525J664519j409188j411959
$$ -8617732 -16134961 -18335535 -12459169 -2318532 5069993 6734512 5325324 3913365
45076C913365j649713l372876m797327m574839l114529q95449K006762M611116
$$ 3913365 2263652 -1109224 -5906551 -10481390 -13595919 -14491368 -12484606 -7873490
45068g873490N052419K499264j445023l553873j932041J165320J052099k772602
$$ -7873490 -2821071 -321807 -1766830 -5320703 -7252744 -6087424 -5035325 -7807927
45060g807927l803605L363143J3195079J3695243K056945j0412998j2321293n579223
$$ -7807927 -11611532 -8248389 4946690 18641933 20698878 10285880 -2035413 -7614636
45052g614636j61276l29867k219834k008217K34661L592152P043941P496907K799996
$$ -7614636 -7775912 -8105779 -10325613 -12333830 -12099169 -8507017 -1463076 6033831 8833827
45043H833827l006859l111049K284097N113285O37651n674641o178449j886827
$$ 8833827 5826968 2715919 5000016 10113301 10750952 5076311 -1102138 -2988965
45035b988965r8457l221902n874332l787126j87189r5432k158910j356324J832619
$$ -2988965 -3087422 -6309324 -12183656 -15970782 -16157971 -16253403 -18412313 -19768637 -17936018
45026a7936018J474865l451995n505599L33847Q118277R646298O931775P270042
$$ -17936018 -16461153 -19913148 -25418747 -25084900 -16966623 -7320325 -388550 6881492
45018F881492Q913134K917083j0111575j6913479r707632K570547P476490M954877
$$ 6881492 15794626 18711709 8600134 -8313345 -18020977 -15450430 -7973940 -3019063
45010c019063K414955J245645k424884q051610j0672284q174595j948470O475105
$$ -3019063 -604108 641537 -1783347 -9834957 -20507241 -28681836 -30630306 -24155201
45002b4155201J3478976J2848551M325683k480396p79714K622180j023350o380744
$$ -24155201 -10676225 2172326 6498009 4017613 3237899 5860079 4836729 -1544015
44994a544015k719445O130158O401505k413380n914134J532185Q048487M368992
$$ -1544015 -4263460 1866698 8268203 5854823 -59311 1472874 9521361 13890353
44986A3890353k620716l894364k031604j900784l2723N939401P799891j097885
$$ 13890353 11269637 7375273 5343669 3442885 3410162 9349563 17149454 16051569
44978A6051569j2143757j2327459l151644L101865J843037n30323P69281L719104
$$ 16051569 3907812 -8419647 -11571291 -8469426 -6626389 -7156712 -6387431 -2668327
44970b668327N911118P203837O474106K984338j92983m59451r64442m979852q367130
$$ -2668327 3242791 10446628 16920734 19905072 19712089 19252638 18288196 13308344 4941214
44961D941214n520385K94411J378401j976684k848604R7522J520048m4337m92843
$$ 4941214 -579171 -284760 1093641 -883043 -3731647 -3634125 -2114077 -2158414 -2651257
44952b651257M83235j670472o361511o493599k75006M390018J557883m062779
$$ -2651257 -2168022 -3838494 -10200005 -16693604 -16968610 -12578592 -11020709 -15083488
44944a5083488m731127n3549M761609O262187M348229M10932k789874k631519
$$ -15083488 -19814615 -19868164 -15106555 -8844368 -4496139 -4085207 -6875081 -9506600
44936i506600k73203M32628j197715k034678j125269j036147j889840j27274M378514
$$ -9506600 -9779803 -9347175 -10544890 -12579568 -13704837 -14740984 -16630824 -16758098 -12379584
44927a2379584O202432K949891J63069K994764P805952P368723R15516o198705
$$ -12379584 -6177152 -3227261 -3064192 -69428 7736524 15105247 16020763 9822058
44919I822058j0161597j0926264q772203l940279Q66054K188092N43713J86899
$$ 9822058 -339539 -11265803 -20038006 -23978285 -23112231 -20924139 -20380426 -20193527
44911b0193527L412263P509141Q308896N108962Q77129j676442k709458l363579
$$ -20193527 -16781264 -9272123 -963227 4145735 5022864 3346422 636964 -2726615
44903b726615k776410N75471M802542N411521J563529k076892j963991j50583
$$ -2726615 -5503025 -4927554 -125012 5286509 6850038 4773146 2809155 2658572
44895B658572R25335L307458Q265009J0970424P263205J836131J631373M158456
$$ 2658572 3583907 6891365 15156374 26126798 33390003 35226134 36857507 41015963
44887D1015963J534278o061983j1139279j1735895j2269192j2030981n770672
$$ 41015963 42550241 36488258 25348979 13613084 1343892 -10687089 -16457761
44880a6457761K766384K170306p405275j0770931o36119R822435P180877k055297
$$ -16457761 -13691377 -11521071 -18926346 -29697277 -30333396 -20510961 -13330084 -15385381
44872a5385381l790956J861362N347695N804786Q705448J0982459M911394n600719
$$ -15385381 -19176337 -17314975 -11967280 -6162494 2542954 13525413 18436807 12836088
44864A2836088q317206j986700K306958k7630j487382J669601K392974l020179
$$ 12836088 4518882 2532182 4839140 4811510 3324128 4993729 7386703 4366524
44856D366524o561320j662752N535285O071858J161079k780593n415579j0172208
$$ 4366524 -2194796 -3857548 1677737 7749595 8910674 6130081 714502 -9457706
44848i457706j5082730j4322303p212745M96548L612165J921901r33637k69693
$$ -9457706 -24540436 -38862739 -46075484 -45578936 -41966771 -40044870 -40978507 -41248200
44840d1248200N758822J2863257J4096086Q405251J801587j653119m244354o947884
$$ -41248200 -35489378 -22626121 -8530035 -124784 1676803 23684 -4220670 -11168554
44832a1168554m642779M689700J2195357Q486114j910401o211597j927141P72753
$$ -11168554 -15811333 -11121633 1073724 9559838 7649437 1437840 -489301 283452
44824B83452l839412q558075o237086j345342q80801j389468M518804J2864190
$$ 283452 -3555960 -12114035 -18351121 -19696463 -20577264 -21966732 -17447928 -4583738
44816d583738J1641403j67903q678017m552743L772946L849487j929057j909949
$$ -4583738 7057665 6889762 -1788255 -6340998 -2568052 1281435 -647622 -2557571
44808b557571N001321P835088J965070l361312j59807N893473N102991j764796
$$ -2557571 2443750 10278838 12243908 8882596 8722789 14616262 19719253 17954457
44800A7954457o679688o846268n607820m051255j51459M770445O189437L286654
$$ 17954457 11274769 4428501 -1179319 -5230574 -5382033 -611588 5577849 8864503
44792H864503j2165r71964j01245K008199M560492M098579j810048q643348q954291
$$ 8864503 8852338 7880374 7779129 9787328 14347820 18446399 16636351 7993003 -961288
44783i61288k780550K233897J964333L98584J311184K183454q3508l088510k980446
$$ -961288 -3741838 -1507941 456392 854976 2166160 4349614 4266106 1177596 -1802850
44774a802850n84686O54936j00500j510754l242213n374296o375915m531449m15673
$$ -1802850 -2387536 -1732600 -1833100 -3343854 -6586067 -11960363 -18336278 -22867727 -23283400
44765b3283400L706564N921630N500729L352664J833054K124789K313154P01062
$$ -23283400 -19576836 -13655206 -8154477 -4801813 -2968759 -843970 1469184 2170246
44757B170246l36306J934096M390706J741603l703437l509562L676721Q270700
$$ 2170246 1833940 3768036 8158742 9900345 6196908 2687346 6364067 14634767
44749A4634767L314709n147678p195156k878484J53173r89105k170458p29299
$$ 14634767 17949476 12801798 5606642 2728158 2881331 1892226 -278232 -1007531
44741a007531R50663P15242j92341m92554j213046l032150l987542j521066M124432
$$ -1007531 -56868 658374 466033 -26521 -1239567 -4271717 -8259259 -9780325 -5655893
44732e655893R248904R645581N030262J85335j74351K711459L703350J164597
$$ -5655893 3593011 13238592 18268854 18454189 18279838 20991297 24694647 25859244
44724B5859244j995730m607753q447080j1518880p462422L765530J1132986N352949
$$ 25859244 23863514 19255761 10808681 -710199 -8172621 -4407091 6725895 12078844
44716A2078844p768869j4081847q577418R52833O017957N714703K892203r67065
$$ 12078844 4309975 -9771872 -18349290 -17396457 -11378500 -5663797 -2771594 -3738659
44708c738659m855027o687584m914802N0137N841035Q142130L317321n643271
$$ -3738659 -8593686 -15281270 -20196072 -20145935 -14304900 -6162770 -2845449 -8488720
44700h488720r014586j483564R037034J0327078K330742k828571K112417J0230416
$$ -8488720 -17503306 -18986870 -9949836 377242 2707984 -120587 1991830 12222246
44692A2222246J1095846M427893j569338j671534J299002J498832l144195r178717
$$ 12222246 23318092 27745985 26176647 24505113 25804115 27302947 24158752 14980035
44684A4980035j1402248q238297k808053J801245O069822J0656580J2437740Q513601
$$ 14980035 3577787 -4660510 -7468563 -5667318 402504 11059084 23496824 32010425
44676C2010425K344333P2133J101865j324192r030204j4750259j2003746l965946
$$ 32010425 34354758 34426891 35528756 34204564 25174360 10424101 -1579645 -5545591
44668e545591J364990J160790r69918j148126J017535L479010L860642J382295
$$ -5545591 -4180601 -3019811 -3989729 -5137855 -4120320 -641310 3219332 4601627
44660D601627j853983k769982j275129k58387q97302q37290J511537L747539K660413
$$ 4601627 2747644 -22338 -1297467 -1555854 -2453156 -3290446 -1778909 1968630 4629043
44651D629043j488087n635761o946173m035494K114738O970058N353809j979690
$$ 4629043 3140956 -2494805 -9440978 -13476472 -11361734 -4391676 962133 -1017557
44643a017557p351862m585131L604372R269790Q317488L148911j938975m719538
$$ -1017557 -8369419 -12954550 -9350178 -80388 8237100 11386011 9447036 4727498
44635D727498n255256m890745m777304m089839j155668K449327J985385l364997
$$ 4727498 -527758 -5418503 -10195807 -14285646 -15441314 -12991987 -11006602 -14371599
44627a4371599o661781j387876Q226009J1048733L671342m644154m049857L639505
$$ -14371599 -21033380 -22421256 -14195247 -3146514 524828 -4119326 -8169183 -4529678
44619d529678Q626948N826350p98552n205364n747310l989315j000523K792472
$$ -4529678 4097270 9923620 9125068 3919704 -1827606 -5816921 -6817444 -4024972
44611d024972N916618O368072L631423p20802m043945m030163m98265L373660
$$ -4024972 1891646 8259718 11891141 11170339 7126394 3096231 2597966 5971626
44603E971626L222125j461426n716646m509944J236794O115514O619078L446748
$$ 5971626 9193751 7732325 2015679 -2494265 -1257471 4858043 11477121 14923869
44595A4923869j240575m973773m091137L059754J0971454J0454213O9933j0484686
$$ 14923869 13683294 8709521 4618384 7678138 18649592 29103805 29173738 18689052
44587A8689052j1842125n545977P46679L900133N246349L764738k643385j0003694
$$ 18689052 6846927 1300950 2047629 5947762 11194111 14958849 12315464 2311770
44579B311770j0331403k455867N418332O332023K774075J572468M635298P951590
$$ 2311770 -8019633 -10475500 -5057168 1274855 4048930 5621398 10256696 18208286
44571A8208286P343319K609974k741254m560352j952724J643442K545733J072424
$$ 18208286 25551605 28161579 25420325 20859973 18907249 20550691 23096424 24168848
44563B4168848m36383k098924n184542p547223n320412O77264M879779L957226
$$ 24168848 23732465 21633541 16448999 8901776 3581364 4258628 9138407 13095633
44555A3095633j89491m389867o517072m201084K747741Q117927M417196n781914
$$ 13095633 12906142 8516275 1999203 -2201881 545860 8663787 13080983 7299069
44547G299069j0458454l273290Q237183J3279782J0348686M637002r07911n899300
$$ 7299069 -3159385 -6432675 1804508 15084290 25432976 30069978 29162067 23262767
44539B3262767q571289p861313o289320n598778l005185L190715Q377520P927867
$$ 23262767 14691478 6830165 540845 -5057933 -8063118 -4872403 3505117 11432984
44531A1432984M711447L647685K721239k423384q016929o193344J123816K631549
$$ 11432984 16144431 19792116 22513355 20089971 12073042 5879698 7003514 9635063
44523I635063n695877j3290761q929021M386549J3684644J1287239J372615o235818
$$ 9635063 3939186 -9351575 -18280596 -13894047 -209403 11077836 12450451 6214633
44515F214633n227181K715019R836094R472998K737822k826055j801297L385515
$$ 6214633 987452 3702471 13538565 23011563 25749385 22923330 21122033 24507548
44507B4507548N832402J650282o574015j2594358j2297707p214502j971298J557478
$$ 24507548 30339950 31990232 25416217 12821859 524152 -6690350 -8661648 -7104170
44499g104170N220837Q974319Q377433J172287o995712q468398l303202J911039
$$ -7104170 -1883333 7090986 15468419 16640706 9644994 1176596 -2126606 -215567
44491b15567L349536K496792P21888k035638l217027O77103O999197Q244489K712265
$$ -215567 3133969 5630761 6352649 4317011 1099984 1777087 8776284 17020773 19733038
44482A9733038k451514j860957O43640p46115m576140n383477k264207R70884
$$ 19733038 17281524 15420567 16064207 15318092 10741952 5358475 3094268 4065152
44474D065152J494763r89314n661581r405138p206486J495497R370154R173054
$$ 4065152 5559915 4570601 -1090980 -10496118 -17702604 -16207107 -6836953 2336101
44466B336101L190985m31260J015773L033118K391652Q68843p327j672613m030944
$$ 2336101 5527086 5095826 6111599 9144717 11536369 12405212 12397885 10725272 6694328
44457F694328l617045Q77589N435605O182016M713897M825153O582058O889158
$$ 6694328 3077283 3954872 9390477 15572493 20286390 25111543 31693601 38582759
44449C8582759M030925j245905p460264j2375515j2904879q235964k046318J315219
$$ 38582759 42613684 41367779 33907515 21532000 8627121 391157 -1655161 -339942
44441c39942J889560K445595L122179J743035j137267k322265j821341l596118
$$ -339942 1549618 3995213 7117392 8860427 7723160 5400895 3579554 -16564
44433a6564q308054j0152472m867969K723779M356532k74960l164547R28523P951063
$$ -16564 -8324618 -18477090 -23345059 -20621280 -16264748 -16539708 -19704255 -18775732 -10824669
44424a0824669J0562959O895591J123505k120016j481512J463890L948198L678246
$$ -10824669 -261710 6633881 7757386 5637370 4155858 5619748 9567946 13246192
44416A3246192M26957l449576m590131j543456L308453N407820L020811r8341
$$ 13246192 13673149 10223573 5633442 4089986 7398439 12806259 15827070 15728729
44408A5728729L27368K061543q66367p272680p513944K365258J1812052Q976845
$$ 15728729 16056097 18117640 17251273 9978593 2464649 4829907 16641959 25618804
44400B5618804k158667p897326m964569k393941l841079k083171N194797Q077836
$$ 25618804 23460137 15562811 10598242 8204301 4363222 2280051 7474848 15552684
44392A5552684O39451p335842n098136K061747K322931l532862n682426l010689
$$ 15552684 16192135 8856293 3758157 5819904 8142835 4609973 -1072453 -4083142
44384d083142l043405o034025l598888N145133R257133K328869p339875q769136
$$ -4083142 -7126547 -13160572 -16759460 -11614327 -2357194 -28325 -7368200 -16137336
44376a6137336k542181L213315N209436O632844R206161R363917K884629q587352
$$ -16137336 -18679517 -15466202 -10256766 -3623922 5582239 14946156 17830785 9243433
44368I243433j6533378j2896950O7845J0186921Q849013P80490m036166l796293
$$ 9243433 -7289945 -20186895 -20119050 -9932129 -1083116 -302626 -4338792 -8135085
44360h135085l277448k900661Q78458O006284O254787K498255K122025N796397
$$ -8135085 -11412533 -14313194 -13434736 -7428452 -1173665 1324590 3446615 9243012
44352I243012N659380m35985l842271Q61210O844612O304107J970115K10719J07116
$$ 9243012 14902392 14466407 10624136 11485346 18329958 24634065 26604180 26814899 26922015
44343B6922015k836791p763925j0545532j0438523q650952m607988R98760M060253
$$ 26922015 24085224 16321299 5775767 -4662756 -13313708 -17921696 -16922936 -12862683
44335a2862683L019248K105077L886872M352895O13714k856088j777251N93645
$$ -12862683 -9843435 -7738358 -3851486 501409 1115123 -1740965 -3518216 -2924571
44327b924571N01951J350463O226092R238842L976366m520055o455265j990571
$$ -2924571 -2422620 -1072157 5153935 14392777 18369143 13849088 7393823 5403252
44319E403252J033221O21170R15715J531657j603263n641469l008113M878812
$$ 5403252 6436473 7057643 7973358 9505015 7901752 2260283 -747830 4130982
44311D130982P488157J129044n642728o117754m851115p666767j0831115p312383
$$ 4130982 11619139 12748183 7105455 987701 -3863414 -11530181 -22361296 -29673679
44303b9673679J644896Q204752Q515949N986377M849254M616468K003586l110505
$$ -29673679 -28028783 -19824031 -11308082 -5321705 -472451 4144017 6147603 3037098
44295C037098n608448j157060O259868P489708P07628n048180k936704J585136
$$ 3037098 -2571350 -3728410 2531458 10021166 10728794 5680614 2743910 4329046
44287D329046M95853l311866k106104J825857m00125p763110r244545j454592
$$ 4329046 4824899 1513033 -593071 1232786 832661 -6930449 -16174994 -17629586
44279a7629586N911955N439612J565321K64156m07689l340278m731581n73929
$$ -17629586 -11717631 -6278019 -4712698 -4448542 -4856231 -8196509 -12928090 -13502019
44271a3502019N559704P679411N505929K336303n68758l004542l688213k935474
$$ -13502019 -7942315 -262904 5243025 7579328 7010570 4006028 317815 -2617659
44263b617659l137136l771592j142748M352149O815820L645995p03401k570112
$$ -2617659 -5754795 -9526387 -10669135 -6316986 498834 4144829 3441428 871316
44255H71316l317362k732929K722862J0367320R945193j026722j0067086p050921
$$ 871316 -2446046 -5178975 -2456113 7911207 17856400 16829678 6762592 -288329
44247b88329l9771k439209j1346404j2318864k220478O659708N526775j09815
$$ -288329 -328100 -2767309 -14113713 -26432577 -28653055 -21993347 -16466572 -16576387
44239a6576387j266609K417185N310043M149032M89846j493725J316949O587586
$$ -16576387 -17842996 -15425811 -10115768 -5966736 -5476890 -6970615 -5653666 933920
44231I33920P334092J088661m707727k332377M238958M691208k142063o887423
$$ 933920 8268012 9356673 4648946 2316569 6555527 11246735 9104672 2217249
44223B217249l713774K644994N296913L162664j281783n619361o942279l567474
$$ 2217249 -1496525 1148469 6445382 9608046 8326263 2706902 -4235377 -7802851
44215g802851J092736J751688q57797j067545K393611M794159L769272K026919
$$ -7802851 -6710115 -4958427 -5816224 -6883769 -4490158 304001 4073273 6100192
44207F100192O57880k241512m543079o75236P412017R051788p1180r903811r493020
$$ 6100192 6758072 4516560 -26519 -701755 6710262 15762050 15690870 5787059 -3705961
44198c705961j155896N869005Q887122J0229304Q162261k85658j0415314j3738525
$$ -3705961 -4861857 1007148 9894270 20123574 28285835 28000177 17584863 3846338
44190C846338r736715n201047k918852M5822L157942J426854m375654n699314
$$ 3846338 -5890377 -11091424 -14010276 -13964454 -10806512 -9379658 -13755312 -19454626
44182a9454626J673503J0955641J4076839J1395169P024774J208077o160625r894712
$$ -19454626 -17781123 -6825482 7251357 18646526 25671300 26879377 20718752 10824040
44174A0824040n562539J730998K721749k871005o204860k560301K711494L307375
$$ 10824040 5261501 6992499 9714248 6843243 638383 -1921918 789576 4096951
44166D096951L39803j543799r12792J205478M139106N751166K306625n187074
$$ 4096951 4436754 2892955 1980163 3185641 7324747 13075913 15382538 10195464
44158A0195464q660487k779614O196666P998992K469799j577112o88483j038414
$$ 10195464 1534977 -1244637 4952029 12951021 15420820 13843708 13155225 12116811
44150A2116811o416681j0442622n716945N064582J2658304J2310962O571203R5806
$$ 12116811 5700130 -4742492 -10459437 -5394855 7263449 19574411 26145614 26241420
44142B6241420l791803l637354j187982n82780k966752m153473j000084K771079
$$ 26241420 22449617 18812263 17624281 17041501 14074749 9921276 8921192 11692271
44134A1692271J645334l031178m758375j345261K460425K201753n72431j036562
$$ 11692271 13337605 10306427 5548052 4202791 6663216 8864969 8292538 7255976
44126G255976K871440P958824Q592499K915234l541644l524993J757160L211742
$$ 7255976 10127416 18086240 26678739 29593973 26052329 22527336 24284496 27496238
44118B7496238k568482o767332j336496P446303P346142j716065q438044p600904
$$ 27496238 24927756 18160424 16823928 24270231 31616373 29900308 21462264 13861360
44110A3861360n426194o290500n572963q3413M378673K502535j026819J031569
$$ 13861360 8435166 2144666 -3428297 -3511710 866963 3369498 2342679 3374248
44102C374248O725833Q141513L375658j530077j411229K620819O279434O732986
$$ 3374248 10100081 18241594 21617252 20087175 18675946 21296765 27576199 34309185
44094C4309185M093082O54713j317148j624101r62139J434030N826832Q410075
$$ 34309185 38402267 39056980 37739832 36115731 35153592 36587622 42414454 50824529
44086E0824529M705435l054466p589813o732783n558108o603395n624552q47509
$$ 50824529 55529964 52475498 44885685 38152902 32594794 25991399 20366847 19519338
44078A9519338J359253m008864j1807319j3974952j0085970m328681K100050Q108646
$$ 19519338 20878591 16869727 5062408 -8912544 -18998514 -23327195 -21227145 -13118499
44070a3118499Q342920J226055l535641L437920J5115106J5577204K803896q338245
$$ -13118499 -4775579 -3549524 -7085165 -3647245 11467861 27045065 29848961 21510716
44062B1510716p397555o87246J652762K19789J488742O140520R354718Q258712
$$ 21510716 14113161 13425915 15078677 15298466 16787208 22927728 32282446 40541158
44054D0541158L742215j777972m838884k998956O16271q34600q530512j5042224
$$ 40541158 44283373 42505401 37666517 34667561 35283832 34449232 25918720 10876496
44046A0876496j3936910p612352k112865R04572K857699L621219L126139L725917
$$ 10876496 -3060414 -10672766 -12785631 -11881059 -9023360 -5402141 -2276002 1449915
44038A449915O150429O588461K528214k016058k169887K86366N58617j126342
$$ 1449915 7600344 14188805 16717019 14700961 12531074 12817440 13376057 12249715
44030A2249715j257118l37788j776113m810102n090721j923380J012303J964275
$$ 12249715 10992597 10654809 8878696 4068594 -1022127 -2945507 -1933204 31071
44022C1071K392266K130090o62377m288979m394192j144404M32774j147832j110986
$$ 31071 2423337 4553427 3891050 -397929 -4792121 -5936525 -5503751 -6651583 -7762569
44013g762569L500115Q756644J0014200P950312M804454m05482q153230j3842430
$$ -7762569 -4262454 4494190 14508390 22458702 27263156 26857674 18704444 4862014
44005D862014j2516784o075105j014916k52493j228828j053023L87456K049737
$$ 4862014 -7654770 -13729875 -14744791 -14997284 -16226112 -17279135 -16891679 -14841942
43997a4841942L362112M382075O132464R486658J2076880R017121l24019r038242
$$ -14841942 -11479830 -7097755 -965291 8521367 20598247 29615368 29291349 20253107
43989B0253107j0260339n925502l399340n053369o365148l595155J853809O618878
$$ 20253107 9992768 4067266 667926 -4385443 -10750591 -14345746 -12491937 -5873059
43981e873059Q166468M789521k091827o174990k804575K991142K065180m831499
$$ -5873059 2293409 7082930 4991103 -1183887 -3988462 -997320 1067860 -3763639
43973c763639p178626r69146M915233L562797J390678O260009J2410473Q513635
$$ -3763639 -10942265 -11911411 -6996178 -3433381 -2042703 4217306 16627779 25141414
43965B5141414l996660j2451587j0750577m399700J364951O654370R056175K979323
$$ 25141414 21144754 8693167 -2057410 -6457110 -5092159 1562211 10618386 13597709
43957A3597709r016363j5008452r486299j004569K000074L412620R175911J3785107
$$ 13597709 4581346 -10427106 -19913405 -20917974 -18917900 -15505280 -6329369 7455738
43949G455738Q448738l099544r382186q628745q639381j0213148m752679Q576097
$$ 7455738 15904476 12804932 3422746 -5205999 -13845380 -24058528 -28811207 -20235110
43941b0235110J6764912J1327607K047775K375736Q740194O846521m736310j1007135
$$ -20235110 -3470198 7857409 9905184 12280920 21021114 27867635 23131325 12124190
43933A2124190l043713P767085N475748p931570j5706975r488403R33390L130676
$$ 12124190 9080477 16847562 22323310 14391740 -1315235 -10803638 -9870248 -6739572
43925f739572j448967k690929J976762N287070L054064P91384M346057J0089904
$$ -6739572 -8188539 -10879468 -8902706 -3615636 -561572 229812 4575869 14665773
43917A4665773R490893L67426j0927183j6869152j4684189o544074K257135O160636
$$ 14665773 24156666 24524092 13596909 -3272243 -17956432 -24500506 -22243371 -16082735
43909a6082735L949602K14059m28902O78309n61515l275125k118230M235409J0119477
$$ -16082735 -12133133 -11919074 -12347976 -11669667 -12231182 -15506307 -17624537 -13389128 -3269651
43900c269651J0208463N814974J489136j249677l561825m940939l119328J723131
$$ -3269651 6938812 12753786 14242922 12993245 9431420 4490481 1371153 3094284
43892C094284N445906L976216j926002p006292p012154l228603l85060n02821
$$ 3094284 8540190 12516406 10590404 3584112 -3428042 -6656645 -7041705 -7544526
43884g544526j248735q20855q09658j966583j144206L203443N900267J728874
$$ -7544526 -8793261 -9614116 -10423774 -12390357 -13534563 -10331120 -4430853 -2701979
43876b701979m778448m106940L440411O352394j545946j1161107j0575257j403965
$$ -2701979 -7480427 -11587367 -8146956 -1794562 -3340508 -14501615 -25076872 -26480837
43868b6480837M820588L243230M73794L024982Q205140R104695M146092j765528
$$ -26480837 -21660249 -18417019 -17943225 -14918243 -6713103 2391592 6537684 4772156
43860D772156l916663k900931k711450m826725n713665j418645O321744J1151781
$$ 4772156 855493 -2045438 -4756888 -9583613 -15297278 -16715923 -10394179 757602
43852G57602R512101M250526J41160j167285n92040O50438R78812o89334k177851
$$ 757602 10269703 14520229 14661389 13494104 12902064 13552502 14531314 13841980 11664129
43843A1664129K93717N689830P751312L861532p02958j576351k778155q745659
$$ 11664129 11957846 17647676 25398988 29260520 28557562 26981211 24203056 15457397
43835A5457397j3594498p664902O634718J5062987R298088l180539r660079o476239
$$ 15457397 1862899 -5802003 832715 15895702 25193790 22013251 12353172 5876933
43827E876933L31454L553476N74934n866408r946827q152999l412338j055959
$$ 5876933 6208387 9761863 10336797 4470389 -5476438 -13629437 -17041775 -18097734
43819a8097734j132986O15008M458677N738740L187316J070630P89554j899375
$$ -18097734 -19230720 -18615712 -14157035 -8418295 -5230979 -4160349 -3370795 -5270170
43811e270170p381553q027141J69169Q974567R145336M524232N147883J0247433
$$ -5270170 -12651723 -20678864 -20509695 -11535128 -2389792 2134440 7282323 17529756
43803A7529756R600610J048320n058843j602727N242131O625824L465132J630328
$$ 17529756 27130366 28178686 23119843 21517116 26759247 33385071 36850203 38480531
43795C8480531P43153m033180j1595396j4241671q308045Q1593K282221k842983
$$ 38480531 39223684 35190504 23595108 9353437 1045392 1126985 3409206 566223
43787E66223q441154p827338j229810N349904O642420K943991q08824J14764N961873
$$ 566223 -7874931 -15702269 -16932079 -11582175 -4939755 -1995764 -2804588 -2689824 3272049
43778C272049J1856484J1697136M542644k929353l156242K490722M598718j438941
$$ 3272049 15128533 26825669 31368313 28438960 25282718 27773440 32372158 30933217
43770C0933217q251390o741994P57532M432939J321297k794659m972212q704711
$$ 30933217 22681827 15939833 16697365 21130304 22451601 19656942 14684730 5980019
43762E980019j3913049j3388906m350259N004967P185421O161159Q392222J0038978
$$ 5980019 -7933030 -21321936 -25672195 -20667228 -13481807 -7320648 1071574 11110552
43754A1110552L774260o277894q869378l491427j097371n429866o444209K529614
$$ 11110552 14884812 8606918 -262460 -3753887 -4851258 -10281124 -16725333 -14195719
43746a4195719J2419676J1480716K410427l324879k849474l042343o598244p374911
$$ -14195719 -1776043 9704673 12115100 8790221 5940747 2898404 -3699840 -11074751
43738a1074751j164255O927553R311753N194058j77765k400205j313102O45834
$$ -11074751 -12239006 -5311453 4000300 9194358 9016593 6616388 5303286 5949120
43730E949120J262105J64594j496943k825805l839953m036632k182439J139112
$$ 5949120 7211225 7375819 5878876 3053071 -786882 -4823514 -7005953 -5866841
43722e866841K918694J666711k19278l48378K6278p50450q85605J398673L547897
$$ -5866841 -2948147 -1281436 -1500714 -1849092 -1822814 -2573264 -3458869 -2060196 1487701
43713A487701K925673K506298N997647R845196P999914K967010K502771N432343
$$ 1487701 4413374 6919672 12917319 22762515 30762429 33729439 36232210 41664553
43705D1664553K127231q153978j2553807l739017P124983N985734l951996q764197
$$ 41664553 43791784 35637806 23083999 19344982 26469965 32455699 28503703 19739506
43697A9739506m456567Q73400J858754O63114j527599n854238q278353k219664
$$ 19739506 15282939 16156339 18015093 18678207 17150608 11296370 3018017 798353
43689G98353R124104J3416738N405337o379845j2175927j1417134p364173p72538
$$ 798353 9922457 23339195 28744532 22364687 10188760 -1228374 -8592547 -9365085
43681i365085O161968Q219131N306382M433050P858122P606757j212585j0086829
$$ -9365085 -3203117 5016014 10322396 14755446 22613568 30220325 29007740 18920911
43673A8920911r132252k148445Q00790k22734J938852O267889M614304l125455
$$ 18920911 9788659 7640214 8441004 8218270 10157122 16425011 21039315 17913860
43665A7913860p731927n638015l253744l947568k379644L823275P543321L745427
$$ 17913860 10181933 4543918 1290174 -2657394 -5037038 -1213763 6329558 10074985
43657A0074985j308135L4006M624590M414391m70349l079347j289977O7186j845170
$$ 10074985 8766850 8800856 13425446 17839837 17369488 14290141 13000164 13067350 11222180
43648A1222180l819620k732918n54377q26606k877561k101490L954962J0838609
$$ 11222180 7402560 4669642 4115265 3288659 411098 -1690392 2264570 13103179
43640A3103179J0381043K46470j1377142j4005875o915848J284340M593157N355360
$$ 13103179 23484222 23730692 12353550 -1652325 -8568173 -7283833 -2690676 2664684
43632B664684P174308Q651038P197816L551429r44168o399100j0345711p543739
$$ 2664684 9838992 18490030 25687846 29239275 28295107 21896007 11550296 4006557
43624D006557J596628Q176509O036027M70214n84500J389695J40508l340695l029438
$$ 4006557 5603185 13779694 19815721 20285935 19701435 21091130 21231638 17890943 14861505
43615A4861505N77836J074687k530677m659948l581369l567295n234877l059424
$$ 14861505 15439341 16514028 13983351 9323403 5742034 2174739 -3060138 -6119562
43607f119562M280481R231546N503879l184885q653574p796265l247942J207229
$$ -6119562 -1839081 7392465 12896344 9711459 1057885 -6738380 -9986322 -8779093
43599h779093L008572K143882J817476M395928O802239M896373J432720K260000
$$ -8779093 -5770521 -3626639 -1809163 2586765 9389004 14285377 15718097 17978097
43591A7978097N057184J755608o246751p016588K854524R936815L157555q870653
$$ 17978097 23035281 24790889 18544138 11527550 14382074 24318889 27476444 18605791
43583A8605791j0738608k658143K776826J322579P74572N109688P979155M365668
$$ 18605791 7867183 5209040 7985866 9308445 10083017 15192705 23171860 27537528
43575B7537528j470767l424885j732884m10345j626744m799689p367472n909557
$$ 27537528 26066761 22641876 20908992 20498647 18871903 14072214 6704742 795185
43567G95185m12484L336218L50452n759033p030475j821669M751575R218694J1339901
$$ 795185 382701 3718919 4069371 -1689662 -8720137 -10541806 -5790231 3428463 14768364
43558A4768364R002429N40117q036838p774444p6723M205533R93048j829804J151029
$$ 14768364 23770793 24310910 16274072 8499628 8422905 12628438 13621486 11791682 12942711
43549A2942711L905251L43601m817768m280933K00061K387299J645367N89933
$$ 12942711 16847962 17191563 12373795 8092862 8292923 10680222 12325589 12915522
43541A2915522j828290o601836q672505l296243N001675P981638N143741J715638
$$ 12915522 11087232 4485396 -4187109 -7483352 -2481677 5499961 10643702 12359340
43533A2359340j315992n949023q630570l576738N843445R484373N345273K061875
$$ 12359340 11043348 5094325 -3536245 -7112983 -1269538 8214835 13560108 15621983
43525A5621983M004750M043917l708675j2548602j1992866k751606M468403K798300
$$ 15621983 19626733 23670650 19961975 7413373 -4579493 -7331099 -2862696 -64396
43517f4396l997651p638033l903033M655145J1623058J2271867P520503J858870
$$ -64396 -4062047 -11700080 -15603113 -10947968 675090 12946957 20467460 22326330
43509B2326330k486339o615138r784173p731952N87088Q095402O536257k520586
$$ 22326330 19839991 13224853 3440680 -4291272 -3704184 4391218 10927475 8406889
43501H406889q431213m427715L870648N673304j106718p035120l246109O810869
$$ 8406889 -24324 -4452039 -581391 5091913 3985195 -3049925 -6296034 514835
43493E14835J1383846N424578l076607l755302L175482Q753723P630942L374725
$$ 514835 11898681 17323259 14246652 10491350 13666832 22420555 30051497 33426222
43485C3426222J641386K965980L942121K231292j533475m903871n473972l053056
$$ 33426222 35067608 38033588 41975709 44207001 42673526 37769655 32295683 29242627
43477B9242627m80802p81589l425328m972700l150642J305862O011029Q220767
$$ 29242627 28761825 27980236 24554908 19582208 16431566 17737428 23748457 31969224
43469C1969224O225090J971329M01601K908879L932778j246134p943629p972474
$$ 31969224 38194314 40165643 40567244 43476123 47408901 46162767 38219138 30246664
43461C0246664k440629k43390l654364n035058m66430L292669P13908k820794
$$ 30246664 27806035 27562645 23908281 18873223 18406793 21699462 22413370 19592576
43453A9592576p71347K944399J464735j998494K75756N698345M437279l286403
$$ 19592576 18821229 21765628 23230363 21231869 21507625 27205970 31643249 28356846
43445B8356846n461353L133378J1597582Q135348l579443j0702142q568136l727289
$$ 28356846 22895493 26028871 37626453 45761801 42182358 31480216 22912080 19184791
43437A9184791k014828j541145J158820L730025O37216q314519j5329049j2126781
$$ 19184791 17169963 15628818 16787638 20517663 21154879 12840360 -2488689 -14615470
43429a4615470L77966J1804155J2862169M793136l370488n265837k007065K203210
$$ -14615470 -14237504 -2433349 10428820 15221956 11851468 6585631 4578566 6781776
43421F781776M923420N297121L092329j4511q84942J391872M277411N600183O055548
$$ 6781776 11705196 17002317 20094646 20080135 19195193 20587065 24864476 30464659 36520207
43412C6520207O106973L254775m441999j3732922j8437630j6012690r374864k625016
$$ 36520207 42627180 45881955 41439956 27707034 9269404 -6743286 -16118150 -18743166
43404a8743166K280752M555879L562555N52552o52777K673797Q201161J0400434
$$ -18743166 -16462414 -11906535 -8343980 -7791428 -8444205 -5770408 2430753 12831187
43396A2831187O925167J539283m35204J513948K930393L17094m536924o828551
$$ 12831187 19756354 21295637 20860433 22374381 25304774 25621868 21084944 14256393
43388A4256393m307686K66004K017258q62891m828001m673020l691L720427K299560
$$ 14256393 9948707 10214711 12231969 11369078 6541077 1868057 1864366 5584793 7884353
43379G884353j279198j537329P49459R0567l739776m399172R9905K637324j889973
$$ 7884353 6605155 5067826 5817285 5907852 2168076 -2231096 -2131191 506133 -1383840
43370a383840p367364n652093J63246P71042l939806m633668K355473R433212
$$ -1383840 -8751204 -14403297 -14240051 -13469009 -17408815 -22042483 -19687010 -10253798
43362a0253798R596563N478832K934216K547641J813120L00113j440938l616938
$$ -10253798 -657235 4821597 7755813 10303454 12116574 12416687 10975749 7358811
43354G358811m500808o96175O562094J0249218O493613J05957k634971j989694
$$ 7358811 2858003 2161828 8723922 18973140 25466753 25572710 22937739 20948045
43346B0948045j450752j466392j407772k962337n887007m893969K794888J0768244
$$ 20948045 19497293 18030901 16623129 13660792 7773785 2879816 5674704 16442948
43338A6442948J1307152O456498L606470L208498l0750n409064n869727l57254
$$ 16442948 27750100 34206598 37813068 41021566 40990816 35581752 29712025 29354771
43330B9354771K979592r82444o820073p415640m024328k715652n111107p182225
$$ 29354771 32334363 31351919 24531846 17116206 13091878 10376226 5265119 -1917106
43322a917106m841923K172685J0019608J2960920Q432221O73274l727188l934078
$$ -1917106 -6759029 -4586344 5433264 18394184 26826405 27499679 23772491 19838413
43314A9838413m369085o262872n574524p21657L795111M332082L218159L692578
$$ 19838413 15469328 9206456 3631932 2910275 6705386 11037468 14255627 17948205
43306A7948205M830759M951203M882479L965228j555002j0966855j5436518q927006
$$ 17948205 22778964 27730167 32612646 36577874 35022872 24056017 8619499 -307507
43298c07507J307136L346004k424693l901596M617557J3472371J0701440j708610
$$ -307507 999629 4345633 1920940 -1980656 2636901 16109272 26810712 25102102
43290B5102102j0238465o630882K610199M848380l172256j1722643j0539569j314092
$$ 25102102 14863637 8232755 10842954 15691334 12519078 796435 -9743134 -11057226
43282a1057226N939224O599801N337168O297944O827388L984589N92150m0346
$$ -11057226 -5118002 1481799 6818967 13116911 19944299 23928888 24521038 24480692
43274B4480692P3883j602288k673636j091800o30974l889074m961854J754758
$$ 24480692 24554575 22952287 20278651 19186851 18555877 14666803 9704949 11459707
43266A1459707R494800O939346l578199p628112M17835R555971Q821137J614093
$$ 11459707 20954507 27893853 24315654 16687542 17105377 26661348 35482485 37096578
43258C7096578k136992j38987K241184P48185m213725q991030q546565j322878
$$ 37096578 34959586 34820599 37061783 37809968 33596243 24605213 16058648 14735770
43250A4735770N962719M512982l597374o524366k7363N386692N26504q226049
$$ 14735770 20698489 25211471 21614097 15089731 15062368 20449060 20975564 12749515
43242A2749515r163632k476842K739925L424470L743945M523105K351624j650365
$$ 12749515 3585883 1109041 3848966 7273436 11017381 15540486 17892110 16241745
43234A6241745k052611J427975L220905J451971L23784J762999K075923j205729
$$ 16241745 14189134 15617109 18838014 20289985 20613769 22376768 24452691 23246962
43226B3246962n421456p446247o933649m172078k30766P42964m064924r238054
$$ 23246962 17825506 10379259 3445610 -726468 -957234 -214270 -4279194 -13517248
43218a3517248o288303L186178P960616L414525j491462J802741Q556103Q662634
$$ -13517248 -19805551 -16619373 -8658757 -5244232 -6735694 -4932953 3623150 12285784
43210A2285784J576564m442478m618700j939705o26715j419936l122587m256317
$$ 12285784 13862348 9419870 4801170 2861465 2234750 814814 -2307773 -6564090
43202f564090l059583Q49706M757577N111308J346869l795231o894995o089053
$$ -6564090 -9623673 -8773967 -4016390 1094918 2441787 -1353444 -8248439 -14337492
43194a4337492k331374J068796K178215L371401P221526J0310765O884304q35171
$$ -14337492 -16668866 -15600070 -13421855 -10050454 -2828928 7481837 14366141 13530970
43186A3530970l482986J385631M058287k880198j2137995j1975047l602971J555844
$$ 13530970 10047984 11433615 15491902 12611704 473709 -11501338 -15104309 -13548465
43178a3548465m99690j863958L454698J0493769J1356443N602693j314597n631543
$$ -13548465 -14048155 -15912113 -12457415 -1963646 9392797 14995490 13680893 8049350
43170H049350p580819q477295q150023m622312L684971J3987388J8807122J3037924
$$ 8049350 468531 -8008764 -16158787 -20781099 -17096128 -3108740 15698382 28736306
43162B8736306Q65156p879987q121359l018166K280657O029021Q557971R545963
$$ 28736306 29601462 21721475 13600116 10581950 12862607 18891628 27449599 36995562
43154C6995562Q075148L377786m260441j1272624j1512228l323921N726713O596200
$$ 36995562 45070710 48448496 44188055 32915431 21403203 18079282 23805995 30402195
43146C0402195N01997l054589P3319L861865K341650k269390m669125l807963
$$ 30402195 30904192 27849603 27922922 31784787 34126437 31857047 27187922 23379959
43138B3379959j540366J003028K132948m35459m603387l881608L282372R248685
$$ 23379959 21839593 22842621 24975569 24540110 19936723 16055115 19337487 28586172
43130B8586172P617461K977974L343952O987625N683197p05161k817653L376725
$$ 28586172 36203633 39181607 42525559 49513184 55196381 54491220 51673567 55050292
43122E5050292R393544O471351j802598n480906k698554p85434m064985p769560
$$ 55050292 64443836 70915187 69112589 63631683 60933129 60147695 56082710 48313150
43114D8313150o230943j600305r0559k582148m168777k399648p46064k268103
$$ 48313150 42082207 40481902 40391343 37809195 33640418 31240770 30494706 28226603
43106B8226603m131404j693161M368941Q275766N466464l174813j1771370j2908535
$$ 28226603 24095199 22402038 26770979 35046745 40513209 37338396 25567026 12658491
43098A2658491m037227P222746Q631069j756983j1108789q139483J482700M929308
$$ 12658491 8621264 15844010 24475079 22718096 11609307 3469824 4952524 9881832
43090I881832K480446M903818J2135086J0769433k846297j2804710o502819N569963
$$ 9881832 12362278 17266096 29401182 40170615 37324318 24519608 18016789 23586752
43082B3586752N740101m654144r811055m328771K302885L981487N063029P555133
$$ 23586752 29326853 24672709 14861654 10532883 12835768 16817255 21880284 29435417
43074B9435417N638303k215621p542817m887068j123138m272608j0211264r073805
$$ 29435417 35073720 32858099 25315282 20428214 19305076 15032468 4821204 -4252601
43066d252601p44552M490854k7250r111929j2882482q418312k020649n26774k281422
$$ -4252601 -4997153 -506299 -533549 -9645478 -22527960 -30946272 -32966921 -33493695 -35775117
43057c5775117O71428J0826038J9757698J8258040Q492879J33034l229850o049236
$$ -35775117 -35103689 -24277651 -4519953 13738087 22230966 22364000 19134150 13084914
43049A3084914r833686r269857j881685O180364Q058756M215018p22599l638441
$$ 13084914 3251228 -6018629 -7900314 -1719950 6338806 10553824 9831225 6192784
43041F192784k694953K372713O635479L551490m083599m719559M980995J2322449
$$ 6192784 3497831 5870544 12506023 16057513 11973914 7254355 12235350 24557799
43033B4557799N881675p084882j1313842n903414l056922o933417p801348O93446
$$ 24557799 30439474 23354592 12040750 6137336 3080414 -3853003 -11654351 -10960905
43025a0960905J0835481J2540788O427836o65971n869221r571904j0173873o523110
$$ -10960905 -125424 12415364 18843200 18177229 12308008 2736104 -7437769 -13960879
43017a3960879k346250j997004l552481j470459M825099R756089Q943389L902586
$$ -13960879 -16307129 -18304133 -21856614 -23327073 -18501974 -8745885 197504 4100090
43009D100090j052249l424911l106922q46886K106684L898095L316615J483624
$$ 4100090 3047841 -377070 -3483992 -4330878 -2224194 1673901 4990516 6474140
43001F474140J287327L972067O541904M473178k053121o761419m434097K049033
$$ 6474140 7761467 11733534 18275438 22748616 20695495 13934076 9499979 11549012
42993A1549012M935201J150573m861797p776583o865644l826379P28347N901344
$$ 11549012 16484213 17634786 12772989 4996406 -1869238 -5695617 -4967270 934074
42985I34074Q484718N753556o11920n753063o376394k964712J769545N117576
$$ 934074 9418792 15172348 14560428 8807365 2430971 -533741 1235804 6353380
42977F353380N725433M049125J389713j545892m131686m434211j058643L070898
$$ 6353380 12078813 16127938 17517651 15971759 11840073 7405862 6347219 9418117
42969I418117K268139m340786r799362p297530Q16518O008849M607467J459041
$$ 9418117 11686256 7345470 -2453892 -9751422 -8934904 -2926055 1681412 3140453
42961C140453K050996N232963N975261K528142j940360l475323p97943M419843
$$ 3140453 5191449 10424412 16399673 18927815 16987455 13512132 12714189 17134032
42953A7134032Q421369P031786p11530r742521j2164026n376086M030339O798891
$$ 17134032 25555401 32587187 31875657 22133136 9969110 4593024 8623363 15422254
42945A5422254J319100m892773m666260L92617L026178J44413l694364k638608
$$ 15422254 16741354 11848581 7182321 7574938 10601116 10745529 7051165 4412557
42937D412557L504590R793454J1552902P814204J025525m676897n674478j452436
$$ 4412557 7917147 17710601 29263503 37077707 38103232 33426335 27751857 26299421
42929B6299421M551729P717599O363751K805974L52785j68602n07488j844175
$$ 26299421 30851150 38568749 44932500 47738474 48091259 47922657 47415169 45570994
42921D5570994k430138N06341O458376J0902927J0175657N899503K704255K459286
$$ 45570994 43140856 43647197 50105573 61008500 71184157 77083660 79787915 82247201
42913H2247201L266454L678470M543296N864182N180052J144265l672414n855271
$$ 82247201 85513655 89192125 93735421 99599603 104779655 105923920 102251506 96396235
42905I6396235n246464l831523k410474j106327j701899o033310j2228729j5455388
$$ 96396235 91149771 87318248 84907774 83801447 82099548 76066238 63837509 48382121
42897D8382121j2966781o610626l38866L015972K800145M51559j668798k967802
$$ 48382121 35415340 28804714 28465848 31481820 34281965 34733524 33064726 30096924
42889C0096924n393840r477812j1146932o337241J838024N542066K843321N62601
$$ 30096924 24703084 15225272 4078340 -2258901 -420877 5121189 7964510 8527111
42881H527111L809095P964627N999184k91531l038240l34496J967488Q02275M99129
$$ 8527111 12336206 20300833 26300017 26008486 22970246 22635750 24603238 25405513 25904642
42872B5904642M004643O588417L595068j029815r97174J189134k160698j0390669
$$ 25904642 29909285 36497702 40092770 39062955 38065781 39254915 37094217 26703548
42864B6703548j3849526q329185r98295K015405M795791J1311072J4287020N571652
$$ 26703548 12854022 4524837 3526542 5541947 10337738 21648810 35935830 41507482
42856D1507482p403211r221088K06894M536627l352325r581491j939410Q956346
$$ 41507482 34104271 24883183 25090077 29626704 26274379 16692888 14753478 23709824
42848B3709824N486486q457599j2340819o3122J1661255R310754P01199q88686
$$ 23709824 29196310 20738711 8397892 8334770 19996025 29306779 30007978 29119292
42840B9119292K553310O92572o209833q528517l559762J575443K337903J432553
$$ 29119292 31672602 32365174 26155341 17626824 14067062 15642505 17980408 19412961
42832A9412961N52849k584599o704784n419889K876101J0707797J1435030P428680
$$ 19412961 19965810 17381211 10676427 5256538 8132639 18840436 30275466 37704146
42824C7704146L974920J058943l071656n363646k197382L063362M268900K525911
$$ 37704146 41679066 42738009 39666353 34302707 32105325 35168687 39437587 41963498
42816D1963498M379633J0286908J2931620Q734552L398963K412707K953784P95366
$$ 41963498 46343131 56630039 69561659 78296211 81695174 84107881 87061665 87857031
42808H7857031m05578N572408J5848751K0551982J6683488J2232259J4416159
$$ 87857031 87451453 93023861 108872612 129424594 146108082 158340341 172756500
42801A72756500K0549136K4304784K5454214K8011249L2142277L3642206L0118129
$$ 172756500 193305636 217610420 243064634 271075883 303218160 336860366 366978495
42794C66978495K3098318J4920463P582655L598871L609637L845395K82599n623880
$$ 366978495 390076813 404997276 412579931 416178802 419788439 423633834 423916433 418292553
42786D18292553j0172611j4763397k2932434l0455335k7796345j5446524p395436
$$ 418292553 408119942 393356545 370424111 339968776 312172431 296725907 289330471
42779B89330471j3013512k3295834k3478200j3259645m579431l476747n475215
$$ 289330471 276316959 253021125 229542925 216283280 211703849 208227102 202751887
42772B02751887p342989j1312991j5966847j4192836m607208L901945L992079
$$ 202751887 195408898 184095907 168129060 153936224 149329016 153230961 157223040
42765A57223040j151412n206057p521744r114577p394001j959560O89070l829704
$$ 157223040 156071628 150865571 143343827 134229250 126835249 124875689 125564759 121735055
42757A21735055r236182p376820r82748J473118k52142J16464K093540j195818
$$ 121735055 112498873 105122053 104139305 105612423 105360281 105476745 107570285 106374467
42749A06374467q972099j1056940l436696M812742M867230o00170m931910p741389
$$ 106374467 97402368 86345428 82908732 87721474 92588704 91988534 87056624 79315235
42741G9315235j0761670j0828778n480889k98799j729206o006053m170008L804638
$$ 79315235 68553565 57724787 52243898 51945099 50215893 44209840 40039832 43844470
42733D3844470Q893212O703056K516624J297656Q72723j674800l691193j795591
$$ 43844470 52737682 59440738 61957362 63255018 64127741 62452941 58761748 56966157
42725E6966157J590911J445407k834504p555601r781125q854958m897190N90453
$$ 56966157 58557068 60002475 57167971 49612370 39831245 30976287 26079097 26669550
42717B6669550M070468L642248K537582N182079R928647R647177O99328j1696527
$$ 26669550 30740018 34382266 36919848 42101927 52030574 61677751 62377079 50680552
42709E0680552j8611504j5738746n537822O021780J2615491J0203188N58782q351913
$$ 50680552 32069048 16330302 10792480 16814260 29429751 39632939 40191721 31839808
42701C1839808r124147k759966K733360J936819k663265n635963n337014l626661
$$ 31839808 22715661 19955695 22689055 24625874 21962609 16326646 10989632 7362971
42693G362971k052073j457084l022741n959291n847227L32306Q153421R462160
$$ 7362971 5310898 3853814 831073 -5128218 -10975445 -10643139 -2489718 6972442
42685F972442K878584l708494k899125L431557P380775M565658j828928m993896
$$ 6972442 9851026 6142532 3243407 6674964 14055739 18621397 16792469 11798573
42677A1798573j000393P231879J1785753P570325j257718n415589j562425M388585
$$ 11798573 10798180 18030059 29815812 37386137 36128419 30712830 29150405 33538990
42669C3538990O153455M626913L746315L389721J065126k438426m342170m997853
$$ 33538990 39692445 44319358 48065673 51455394 52520520 50082094 45739924 40742071
42661D0742071o519354p348886l626581L802950Q759524P408583K705919k46840
$$ 40742071 34222717 26873831 23247250 27050200 35809724 43218307 45924226 45677386
42653D5677386l6348J390070K173889J977106J712820K859550N553962P087100
$$ 45677386 45641038 47031108 49204997 51182103 52894923 55754473 61308435 68395535
42645F8395535M364674j587816n692867m414876K32608L320873K782629J614851
$$ 68395535 72760209 71172393 65479526 61064650 61297258 64618131 67400760 69015611
42637F9015611M069524R712719J2727604R354810M715834P290200J5985327J9470678
$$ 69015611 73085135 82797854 95525458 104880268 109596102 116886302 132871629 152342307
42629A52342307J1989750K635262K096440O659560N359205j395892k889609L361852
$$ 152342307 164332057 166967319 169063759 175723319 181082524 179686632 176797023 180158875
42621A80158875P721710N439433M157790Q834278J1456216M412675n714684p881827
$$ 180158875 187880585 193320018 197477808 206312086 217768302 222180977 216466293 208584466
42613B08584466k880845L25534j127702l736869o941733j1843282j3986786q675349
$$ 208584466 205703621 206029155 204901453 201164584 194222851 182379569 168392783 159717434
42605A59717434j575753k716031j0559972j3463869p638628k075202l229137o186681
$$ 159717434 158141681 155425650 144865678 131401809 123763181 121687979 118458842 112272161
42597A12272161n464480m276228o957614j0655204j1252948j0637078j1368763
$$ 112272161 106807681 102531453 95573839 84918635 73665687 63028609 51659846
42590E1659846j0232402m149274K577347M174795K458403K761777M242343J919304
$$ 51659846 41427444 37278170 39855517 44030312 46488715 49250492 53492835 55412139
42582E5412139l683173o494316l937358M62297L395521M842994M643959J649393
$$ 55412139 51728966 45234650 41297292 41759589 45155110 49998104 54642063 56291456
42574E6291456k573605l848238p74246L235437M283360J812809k094857m779738
$$ 56291456 53717851 49869613 49095367 52330804 56614164 58426973 56332116 51552378
42566E1552378m522839k221206q30139j243546p83780J568095J687409l381236
$$ 51552378 47029539 44808333 43978194 42734648 41950868 43518963 45206372 41825136
42558D1825136q698495p383445j368350J217616j270457k256192J094395K966305
$$ 41825136 33126641 25743196 24374846 25592462 24322005 22065813 23160208 26126513
42550B6126513p46256n167758m491543p15268J326337K132767M599730P418501
$$ 26126513 25380257 20212499 15720956 15005688 16332025 18464792 23064522 30483023
42542C0483023P679605O323070M996217J556737m470871o283581J451304J1169700
$$ 30483023 38162628 44485698 49481915 51038652 46567781 40284200 41735504 52905204
42534E2905204J0197372p31758p870114m857009r05718l945834p159925j158490
$$ 52905204 63102576 62370818 54500704 49643695 48737977 44792143 37632218 36473728
42526C6473728R174987J1539973N232522J241548M415167P076477K589073m759928
$$ 36473728 45648715 57188688 62421210 63662758 68077925 75154402 77743475 72983547
42518G2983547q013081p701016p720499p088149l005042J642452J611013j361350
$$ 72983547 64970466 57269450 49548951 42460802 39455760 41098212 42709225 41347875
42510D1347875k26802N738012Q224889J712070p847002j0567740m912425K369943
$$ 41347875 41121073 46859085 55083974 56796044 48949042 38381302 33468877 35838820
42502C5838820N750685M998923J398861m005107q039739o953851k060903R90763
$$ 35838820 41589505 46588428 47987289 43982182 35942443 28988592 26927689 27918452
42494B7918452O03293J680172O440320Q390939J475949q594234r973315q31034
$$ 27918452 28521745 30201917 36642237 45033176 46509125 37914891 27941576 27110542
42486B7110542P662573N917466k953564r219293q264118k667156L076759N655878
$$ 27110542 34773115 40690581 37737017 28517724 20253606 17586450 20663209 26319087
42478B6319087L643561q73720l168208j437695M95455j099598m007394l699870
$$ 26319087 29962648 29088928 25920720 24483025 24978480 23878882 19871488 16171618
42470A6171618p65138j99231l972461q322418q645925m277636J445150L764512
$$ 16171618 15406480 15207249 11234788 2912370 -5733555 -10011191 -8566041 -4801529
42462d801529K77845n499833o200687O76151Q338205R062318M624396K867167
$$ -4801529 -4523684 -10023517 -16224204 -15548053 -7209848 1852470 6476866 9344033
42454I344033N610800P061616M246589J215192O08476j545891q229641j4359518
$$ 9344033 14954833 22016449 26263038 27478230 28086706 26540815 18311174 3951656
42446C951656j2802054m093532M504605P334704M296028q52280k996987M87900
$$ 3951656 -8850398 -12943930 -8439325 -1104621 3191407 2339127 -657860 -169960
42438a69960N316083L390420o081045j3007579r011058P10548M779321J455141
$$ -169960 5146123 8536543 2455498 -10552081 -19563139 -18852591 -14073270 -12618129
42430a2618129j140174J097592L351013J748262n11190J43218J942016K487064
$$ -12618129 -13758303 -12660711 -9309698 -7561436 -8072626 -7929408 -5987392 -3500328
42422c500328L186211M920297M597955N62938l196803l101838k005850l644659
$$ -3500328 -314117 4606180 9204135 9767073 6570270 3468432 1462582 -2182077
42414b182077m794192K62852R479338J4279325J0739119L185685l716446r894447
$$ -2182077 -6976269 -6713417 2765921 17045246 27784365 30970050 27253604 17359157
42406A7359157j5050597j5252557q407906Q89262O199577O549005N497390N090763
$$ 17359157 2308560 -12943997 -21351903 -20462641 -14263064 -7714059 -2216669 2874094
42398B874094M418139K816262Q70793j323416l923007n600434m629599j555432
$$ 2874094 7292233 10108495 10979288 9655872 5732865 132431 -4497168 -6052600
42390f052600J382873K989140L102319R60154l333771o560857n489942k048290
$$ -6052600 -4669727 -1680587 1421732 2381886 -951885 -7512742 -13002684 -15050974
42382a5050974j079253k589164j330125M330906Q632850O716886J732701o31861
$$ -15050974 -16130227 -18719391 -20049516 -15718610 -7085760 -368874 1363827 731966
42374G31966k32141K24040J811144O378034R643598N473357l389937o797928o09625
$$ 731966 499825 723865 2535009 8913043 18556641 24029998 20640061 13842133 13232508
42365A3232508Q357128J2427195J1189723P210003Q85445o410083j0306226r388174
$$ 13232508 21589636 34016831 45206554 52416557 53302002 46891919 36585693 27197519
42357B7197519q117288r331669r130126m359240L38775l10486k608286N81802
$$ 27197519 19080231 9748562 618436 -3740804 -3402029 -3712515 -6320801 -5738999
42349e738999P673385J0193730N499268o06179l939802o477018r281637q450770
$$ -5738999 1934386 12128116 17627384 17021205 13081403 6604385 -2677252 -11128022
42341a1128022j585914O993869J1134512R629278N694307K541744J389930J523501
$$ -11128022 -12713936 -5720067 5414445 15043723 20738030 23279774 24669704 26193205
42333B6193205R85263j089030k854376k558511j787645k646369l202190l65689
$$ 26193205 27178468 26089438 23235062 20676551 18888906 16242537 13040347 12674658
42325A2674658L664209L367173j654092n754186n347043k518905M0899J931692
$$ 12674658 16338867 19706040 18051948 12297762 6950719 4431814 4472713 6404405
42317F404405K016681j250402n114976m625780j109341j426576o423500q004093
$$ 6404405 8421086 7170684 2055708 -2570072 -3679413 -5105989 -11529489 -19533582
42309a9533582j491848P013952J0632020J1161147J2167920J0401032K682885
$$ -19533582 -21025430 -14011478 -3379458 7781689 19949609 30350641 33033526
42302C3033526m877482m551605K18925j45292o122463r183861o020805k311263
$$ 33033526 28156044 23604439 23823364 23678072 17555609 8371748 2350943 39680
42294C9680j648852o84134K287967K862575j426410n764585n161458j353985J453345
$$ 39680 -1609172 -2293306 -5339 2857236 1430826 -4333759 -9495217 -10849202 -9395857
42285i395857K931189M554879N200240L222369L81675n1661K375463N305280O445397
$$ -9395857 -6464668 -1909789 3290451 6512820 6894495 6842834 9218297 14523577 20968974
42276B0968974M914851J517883j262256j566975r07264j918274l373541j534993
$$ 20968974 25883825 27401708 26139452 24572477 23665213 21746939 18373398 16838405
42268A6838405K768896L512546j656211o715764n186641J024958M934901L704504
$$ 16838405 19607301 23119847 21463636 14747872 9561231 10586189 15521090 19225594
42260A9225594R1046l031151m756523m130970j025369J305093p62178n229968
$$ 19225594 19316640 16285489 11528966 7397996 6372627 7677720 6915542 1685574
42252A685574o054196j953887Q13946k820457q807601q850224j560070N684312
$$ 1685574 -4368622 -6322509 -5508563 -8329020 -17136621 -25986845 -27546915 -21862603
42244b1862603O449546L002708K217781O152327R890501Q362284K464699k591258
$$ -21862603 -15413057 -12410349 -10192568 -4040241 5850260 14212544 16677243 14085985
42236A4085985l272833p63109J096647j75726l432697n267622l994448j762494
$$ 14085985 10813152 10050043 11146690 10970964 7538267 2270645 -1723803 -3486297
42228c486297j399454j862311M09737N299707P652862L971772k485004n825122
$$ -3486297 -4885751 -6748062 -6338325 -1038618 6614244 10586016 8101012 2275890
42220B275890m239772J06485N105652Q855853Q210944K170453m303090m922809
$$ 2275890 -1963882 -1857397 3248255 12104108 20315052 22485505 18182415 13259606
42212A3259606n04010K053954l86412l460678k815206l35591n8217j807368k442751
$$ 13259606 12755596 14809550 14423138 10962460 8147254 7811663 7753446 5946078 3503327
42203C503327r14967J292627L151196M440955M021376N89089m683237q140681
$$ 3503327 2588360 3880987 7032183 11473138 15494514 16083603 11400366 3259685
42195C259685p035840k502891J192120Q00482k291906l527423q47824K758495
$$ 3259685 -3776155 -6279046 -5086926 -4286444 -6578350 -10105773 -10953597 -8195102
42187h195102L711230K516571J457241K17632k059703k525305J864022P486168
$$ -8195102 -4483872 -1967301 -510060 -292428 -2352131 -4877436 -3013414 4472754
42179D472754P317908J602826j788187M66696K239801q34926k889459K602711
$$ 4472754 11790662 13393488 11605301 12071997 14311798 13476872 10587413 13190124
42171A3190124J0513506J0152068J050866o293379n526725k091407l369542p766918
$$ 13190124 23703630 33855698 34906564 28613185 23086460 20995053 17625511 9858593
42163I858593p941706j238506P289914J0905681P514877P57138l413357j855651
$$ 9858593 1916887 678381 7968295 18873976 26388853 27145991 23732634 21876983
42155B1876983K679070M045165p11108p719724j0271294o243525m32915R67950
$$ 21876983 24556053 28601218 27890110 20170386 9899092 3655567 3222652 4190602
42147D190602k679189o214515n125494m36192L688522N346190N803134O130436
$$ 4190602 1511413 -4703102 -9828596 -10264788 -6576266 -1230076 4573058 10703494
42139A0703494N678807L857168J094113k050405m581280m226777J99253N593192
$$ 10703494 16382301 20239469 21333582 19283177 14701897 10475120 10674373 16267565
42131A6267565P137818M654803K656582K944402J527555m402296j0364053r754137
$$ 16267565 23405383 28060186 30716768 33661170 35188725 30786429 20422376 10668239
42123A0668239l099578K232343J280787l053031m554035j323509K663906K904808
$$ 10668239 7568661 9801004 11081791 8028760 3474725 2151216 4815122 7719930
42115G719930l24526l136335l694375l820274m033408j102914N801692J0293360
$$ 7719930 7395404 4259069 564694 -3255580 -7288988 -8391902 -2590210 7703150
42107G703150O229632k155230m924145n64608K739752O70994j490538N09582K683455
$$ 7703150 13932782 11777552 6853407 6288799 9028551 9699545 8209007 8718589 11402044
42098A1402044J117324o48480J347134M188709M340659M393641O316739M699093
$$ 11402044 12519368 11870888 13218022 17406731 21747390 26141031 32457770 37156863
42090C7156863m507193j4105123j4242032o821721j661428j581931j324008J095887
$$ 37156863 32649670 18544547 4302515 -2519206 -4180634 -5762565 -7086573 -5990686
42082e990686K251535J447028J462086J854423K98257p07820K412324N710428
$$ -5990686 -3739151 -2292123 -830037 1024386 1322643 614823 3027147 8737575
42074H737575L093357j543309O04119P067862O538369j761240n806529j069508
$$ 8737575 11830932 10287623 10891742 17959604 24497973 22736733 16930204 15860696
42066A5860696J938187l663048r266705o016518Q31542K739604K032573M344812
$$ 15860696 17798883 14135835 4869130 -1147388 -315846 2423758 4456331 8801143
42058H801143O585614M148323J879047N467010Q776516K856070p644679j0513415
$$ 8801143 15386757 19535080 21414127 26881137 35657653 38513723 30869044 20355629
42050B0355629m916644q72304j777705j023794L850668O552143L713897K3999
$$ 20355629 15438985 14566681 12788976 11765182 15615850 22167993 25881890 25905889
42042B5905889j154234k431004m642487l764486O67670K494132j199219m304380
$$ 25905889 24751655 22320651 17678164 13913678 14581348 17075480 15876261 11571881
42034A1571881o95439O601295R893707O314192p64403o125815n758896Q78094
$$ 11571881 10876442 17477737 27371444 33685636 32921233 26795418 21036522 21914616
42026B1914616R126393J2555505R546824L799856j316067m759680n202204k381921
$$ 21914616 31041009 43596514 53143338 56943194 55627127 50867447 45665243 43283322
42018D3283322o13788l918235p706805l806575N301663P421657j054657q669994
$$ 43283322 42669534 38751299 31044494 27237919 32539582 39961239 38906582 30236588
42010C0236588o446821j015667j585133l906420O77313P643046N395259m415405
$$ 30236588 23789767 22774100 21188967 17282547 17959860 25602906 30998165 26582760
42002B6582760p835104l68920O525223M315452l25265J231618N010943K510859
$$ 26582760 18747656 18378736 24903959 29219411 28894146 30125764 35136707 37647566
41994C7647566m085327n304163M63392M861604K088200m264932p796436o668316
$$ 37647566 33562239 28258076 28721468 33583072 35671272 31406340 23609904 16941588
41986A6941588k880894J053918K818212J218184j716921k113734Q39627L552340
$$ 16941588 14060694 15114612 17932824 19151008 17434087 15320353 16159980 19712320
41978A9712320K837746Q1017p84121J884319N722176O729810L098346k524409
$$ 19712320 22550066 22631083 21846962 23731281 29453457 36183267 39281613 36757204
41970C6757204n163456l294098j247682l297059o768492n368738R32150M814258
$$ 36757204 31593748 28299650 27051968 23754909 16986417 11617679 12549829 17364087
41962A7364087J853761l761434o630678p505470q598125o972235L42831Q133584
$$ 17364087 19217848 15456414 8825736 1320266 -7277859 -14250094 -13907263 -5773679
41954e773679Q107145J086665l782830k152163R86464J077404M05505J874869
$$ -5773679 2333466 3420131 -362699 -2514862 -1528398 -450994 -45489 1829380
41946A829380L590138L668381M345218O891193P865530M941614J279290m90044
$$ 1829380 5419518 9087899 13433117 20324310 28189840 33131454 34410744 33920700
41938C3920700l010398p511589q440407k096633M615743K966414l836943n473850
$$ 33920700 30910302 23398713 14958306 12861673 17477416 20443830 16606887 11133037
41930A1133037p75809J568494j787544m144803j335592J656913R02202Q84149
$$ 11133037 10357228 11925722 10138178 5993375 4657783 6314696 7216898 8101047
41922H101047N660108J0337701Q435343K185925j518648j338988q72266r65345
$$ 8101047 13761155 24098856 32534199 34720124 33201476 31862488 30990222 30024877
41914C0024877N36355L030005L250883N39583k726047n231180p151109p599881
$$ 30024877 30561232 33591237 36842120 37381703 34655656 29424476 22273367 14673486
41906A4673486n765549l411905k134197L70982O429789J1991880J0053587R49670
$$ 14673486 8907937 5496032 3361835 3732817 10162606 22154486 32208073 33157743
41898C3157743o442988n691474m53726J358987k376239o534305n197233K521587
$$ 33157743 26714755 21023281 20569555 21928542 19552303 13017998 7820765 10342352
41890A0342352J1599263J4855930R356516J5239n094128l603265m32628J55238
$$ 10342352 21941615 36797545 46154061 46169300 41075172 37471907 37039279 37194517
41882C7194517J41291K747182N494939L178736l398866o793530k259203N976608
$$ 37194517 37335808 40082990 45577929 48756665 45357799 38564269 36305066 42281674
41874D2281674R887484O579980k97883o012121q267546o080995O73788Q825126
$$ 42281674 52169158 58749138 58451255 52439134 44171588 38090593 38764381 47589507
41866D7589507J2032432O860502j893511n208235j87668N949312M203583n082991
$$ 47589507 59621939 66482441 64588930 59380695 59193027 65142339 69345922 64262931
41858F4262931j1984711q332760K787718J0768792R781044M331331J442445P66190
$$ 64262931 52278220 43945460 46733178 57501970 67283014 71614345 73056790 73822980
41850G3822980l113223r895256j1693799m536548M171572N186191L65182j125241
$$ 73822980 70709757 60814501 49120702 44584154 48755726 53941917 54307099 53181858
41842E3181858K660556M393327L46369l871944l705419l136611o042607p409811
$$ 53181858 55842414 60235741 60582110 56710166 53004747 49868136 43825529 36415718
41834C6415718j125169Q451515J1418816N934154j540418p334435j2564537j4937862
$$ 36415718 35290549 43742064 55160880 61095034 59554616 52220181 39655644 24717782
41826B4717782r143488K464082R280050O542459J599732J420560K312774j198304
$$ 24717782 15574294 18038376 27318426 33860885 35460617 36881177 39193951 37995647
41818C7995647m970448k096099L912973L454692l488811o497675o05392O236081
$$ 37995647 33025199 30929100 34842073 38296765 34807954 28310279 27704887 33940968
41810C3940968M944949k673993q251952q036674m754095j504652J162926L034385
$$ 33940968 38885917 36211924 27959972 19923298 15169203 13664551 14827477 17861862
41802A7861862K988535P54915j696144j425968K324813O069526M867892j050537
$$ 17861862 20850397 21605312 19909168 18483200 20808013 26877539 31745431 30694894
41794C0694894m596002k99487P186222Q150183R05504o171888o545262k959604
$$ 30694894 26098892 25799405 32985627 41135810 42041314 35869426 29324164 26364560
41786B6364560o68005J5945K55781j912809o857770r063341m393022K079231K688193
$$ 26364560 25696555 25712500 25968281 24055472 17197702 8134361 3741339 5820570 8508763
41777H508763j168450j594263L437689Q224908R050030P750192N494976J066587
$$ 8508763 7340313 5746050 9183739 17408647 26458677 34208869 39703845 40770432
41769D0770432l628087m161513j263878k53052j330517Q50738N589158M215075
$$ 40770432 37142345 32980832 31716954 31463902 30133385 30984123 36573281 40788356
41761D0788356n375405j2244946p795038J158953L676665J331027K516668N873203
$$ 40788356 35412951 23168005 15372967 16531920 20208585 21539612 24056280 29929483
41753B9929483K399405p884382j4030911j0092454k340233J874202L286362N224405
$$ 29929483 32328888 24444506 10413595 321141 -2019092 -144890 3141472 8365877
41745H365877O530200M448254k49779m359504n326779k257311K618685M037611
$$ 8365877 14896077 19344331 19094552 14735048 9408269 7150958 9769643 13807254
41737A3807254l6366l601259l62067N295382L606038m616599p614794m86685P167731
$$ 13807254 13770888 10169629 9807562 15102944 18708982 14092383 6477589 5990904 13158635
41728A3158635O065041Q0362k219442o94353n13478k118614k318097j181957q10174
$$ 13158635 19223676 19304038 17084596 16390243 15876765 13758151 11440054 10258097 9447923
41719I447923n65813O57463J036832r7049Q34453N237738P841778M769563P52080
$$ 9447923 8882110 9539573 10576405 10479356 11313809 16551547 24393325 29162888 29914968
41710B9914968J068556J796197k979890q925219p038260J138801M905974M86336
$$ 29914968 30983524 32779721 29799831 20874612 13836352 14975153 19881127 20367463
41702B0367463m654757m385355j153555J183818K933403M193349K578784j449635
$$ 20367463 15712706 11327351 10173796 11357614 14291017 18484366 21063150 19613515
41694A9613515l323392j442652r3524k623653o314930o275764r58947O826435
$$ 19613515 16290123 14847471 14753947 12130294 5815364 -460400 -1419347 5407088
41686E407088J1118806O572649m174831r643344k875512P434972Q275798J655097
$$ 5407088 16525894 23098543 18923712 9280368 6404856 13839828 22115626 23770723
41678B3770723K44015N161087M019333n926281r986916J18157J0211453M443338
$$ 23770723 24014738 29175825 33195158 27268877 17281961 17400118 27611571 32054909
41670C2054909r767342j3112187l057611N323456L830499M52818L207267Q142677
$$ 32054909 22287567 9175380 6117769 11441225 15271724 15724542 18931809 27074486
41662B7074486P673148J743684l742248m230235K27384N275944N403942J6868
$$ 27074486 34747634 36491318 32749070 28518835 28746219 34022163 39426105 39442973
41654C9442973n109234n835308n504810p755730q351669j958668O962446R525385
$$ 39442973 34333739 28498431 22993621 15237891 6886222 4927554 11890000 21415385
41646B1415385N973697L606547L143393j084088p656300p837398j297736P69290
$$ 21415385 27389082 30995629 34139022 33054934 25398634 17561236 16263500 17032790
41638A7032790o734781j3728674j0271716p97433M818781N433175N027179K855014
$$ 17032790 10298009 -3430665 -13702381 -14499814 -9681033 -4247858 779321 3634335
41630C634335k520845n292994M31212R052488R643851J702290n295316o869657
$$ 3634335 1113490 -4179504 -3748292 5304196 14948047 16650337 11355021 4485364
41622D485364p575391r591412q126245j630426K798059r1334m683752k642081
$$ 4485364 -3090027 -12681439 -20807684 -22438110 -19640051 -19731385 -24415137 -27057218
41614b7057218M410648P446509L359009j051890Q14919O565859Q880482N403754
$$ -27057218 -22646570 -15200061 -11841052 -12892942 -12078023 -5512164 3368318 8772072
41606H772072R61315L33804K135035J729647j656101l994571k855951j436029
$$ 8772072 9733387 10067191 12202226 13931873 12275772 8281201 5425250 3989221
41598C989221l860786q395854q706828k081119O357137R298348N797659J920329
$$ 3989221 128435 -8267419 -16974247 -19055366 -12698229 -3399881 2397778 4318107
41590D318107K551488N025222L530385j439082k825335K244721O715515L314455
$$ 4318107 6869595 11894817 15425202 13986120 11160785 13405506 20121021 23435476
41582B3435476m089254n901646j383475R31695k359205m433943q07478K501258
$$ 23435476 19346222 13444576 12061101 12992796 10633591 6199648 5392170 7893428
41574G893428m39731m740844k895847K191498J996043l350027n513039j446588
$$ 7893428 7453697 2712853 -182994 2008504 4004547 654520 -4858519 -6305107
41566f305107K948324L113348J450993J138656J437236J075545L72778j442028
$$ -6305107 -3356783 -243435 1207558 2346214 3783450 4858995 5231773 3789745
41558C789745n366440q130502m764461K947136O883037L409229k180334l984129
$$ 3789745 -1576695 -9707197 -14471658 -11524522 -4641485 -1232256 -3412590 -7396719
41550g396719k078784J412546O183857J0407970R758388L780151j959087l621497
$$ -7396719 -9475503 -8062957 -1879100 8528870 18287258 22067409 20108322 16486825
41542A6486825l787009n176055n721775l942017l000181m368797l337796L269448
$$ 16486825 12699816 7523761 1801986 -2140031 -5140212 -9509009 -12846805 -9577357
41534i577357J0038860R864996L679924k366124n035844l933226J272447P138095
$$ -9577357 461503 10326499 14006423 11640299 6604455 2671229 3943676 11081771
41526A1081771N741007m487300j2564280q439250K235838O648197L475461J475050
$$ 11081771 16822778 12335478 -228802 -8668052 -6432214 215983 3691444 5166494
41518E166494L022148K388113q21494n02984K650398O10998o205945o331219M269828
$$ 5166494 8188642 10576755 9755261 9252277 11902675 12513673 6307728 -23491 4246337
41509D246337J3619737J0632998k28744q599127j2238671j3042873q775377R47479
$$ 4246337 17866074 28499072 28270328 19671201 7432530 -5610343 -14385720 -13438241
41501a3438241Q028369N910068M42365P06190M569522M153325P05939J708971
$$ -13438241 -5409872 500196 942561 1648751 6218273 10371598 11077537 12786508
41493A2786508O075678N278840j067901l510529J167468L916763j860902r341560
$$ 12786508 18862186 24141026 23073125 19562596 20730064 24646827 22785925 13444365
41485A3444365q581150q17314M830484M812838L894123N429467N423277r97903
$$ 13444365 4863215 4045901 8876385 13689223 17583346 23012813 28436090 27438187
41477B7438187j0320448j2391371k915309R091170J0835300J564098p261951q189829
$$ 27438187 17117739 4726368 1811059 10902229 21737529 23301627 16039676 7849847
41469G849847o215135p512344q593873m179282J540701J734580j33331L969181
$$ 7849847 1634712 -5877632 -14471505 -18650787 -17110086 -15375506 -15508837 -11539656
41461a1539656J0881617R403610o72479o100995j17408P361482N289095k973072
$$ -11539656 -658039 8745571 8073092 1972097 1854689 9216171 14505266 11532194
41453A1532194p040446m584399j078780J26716L7110l18117o06408j37276O3341
$$ 11532194 4491748 -92651 -1171431 -1044715 -1007605 -1325722 -1932130 -2069406 -2006065
41444b006065k354561n521585l355647M821747J0434450O906563o08249l270124
$$ -2006065 -4360626 -9882211 -13237858 -8416111 2018339 8924902 8316653 5046529
41436E046529j410010j450258l611941j878134M739544R528254P820723K518895
$$ 5046529 3636519 2186261 -1425680 -3303814 1435730 10963984 18784707 21303602
41428B1303602j798938m232412m672213j125314N945081J0001996M262112q806474
$$ 21303602 19504664 15272252 10600039 9474725 15419806 25421802 29683914 20877440
41420B0877440j7539861j3077035J7806Q460114O110939P58532J902091O814270
$$ 20877440 3337579 -9739456 -9721650 -1261536 4849403 5607935 7510026 14324296
41412A4324296O081357o1152j540444M520211Q002590J863830o233129n809899
$$ 14324296 20405653 20344501 18804057 23324268 31326858 33190688 26957559 21147660
41404B1147660J267068O122614O287633M359243l87401q249522j1976811n238482
$$ 21147660 22414728 28537342 34824975 39184218 38796817 30547295 18570484 13332002
41396A3332002N080731P012806J463912n67994L055003L686681q38519k400329
$$ 13332002 18412733 25425539 26889451 26321457 29376460 33063141 32224622 29824293
41388B9824293Q63300k79974q401218j1640782k675601P665077O900690j94885
$$ 29824293 30687593 30407619 22006401 10365619 7690018 15355095 22255785 22060900
41380B2060900k048246j45563l222622q091242l453570Q824414J2980360K690039
$$ 22060900 20012654 19867091 16644469 8553227 5099657 13924071 26904431 29594470
41372B9594470r047018q860068m78257L923248J298410j730044r19217J086903
$$ 29594470 20547452 11687384 11209127 15132375 16430785 14700741 13781524 14868427
41364A4868427Q20706j268233k460098j122936J835189L822360L431583K225169
$$ 14868427 15689133 14420900 11960802 10837866 12673055 16495415 19926998 22152167
41356B2152167J850908L42373m954638j0981030j0651256k580057N853062P928321
$$ 22152167 24003075 24345448 19390810 8409780 -2241476 -4821533 1031529 8959850
41348H959850N415585L378446J928929j258090l675971n17414O160431P867066
$$ 8959850 14375435 17753881 19682810 18424720 14748749 14231335 20391766 28258832
41340B8258832J146292o924190p910538k834518J27479l255115q509905q961214
$$ 28258832 29405124 22480934 14570396 11735878 11863357 8608242 98337 -8862877
41332h862877m132308J06062o40483l007673L58826J0123500J6498257J0078340
$$ -8862877 -12995185 -12889123 -13529606 -16537279 -16178453 -6054953 10443304 20521644
41324B0521644m856342j3372391p465136M809146J0823650Q610625N073934L181565
$$ 20521644 15665302 2292911 -5172225 -363079 10460571 19071196 24145130 27326695
41316B7326695p59264p533946j1095578p214189l6596M008977M548721N190100
$$ 27326695 26567431 19033485 7937907 723718 687122 4696099 9244820 14434920
41308A4434920O312322M814739j95521n538271p725317o142751k903770j241524
$$ 14434920 20747242 25561981 25366460 19828189 12102872 5960121 3056351 1814827
41300A814827k988855o081780o110360j909704K555886L709900K864765K603377
$$ 1814827 -1174028 -7255808 -13366168 -15275872 -12719986 -9010086 -6145321 -3541944
41292c541944K136452K74867l47838K410162M248868k25692p330200p514118K95822
$$ -3541944 -1405492 -1130625 -1478463 931699 5180567 4954875 -2375325 -9889443 -9593621
41283i593621N904044K743701k303928L4698O675266O705439k155717j0190655
$$ -9593621 -3689577 -945876 -3249804 -3215106 3460160 10165599 8009882 -2180773
41275b180773r236299k390489K365749K720414K221600L345296M984881N757916
$$ -2180773 -11417072 -13807561 -11441812 -8721398 -6499798 -3154502 1830379 7588295
41267G588295N775438M669563J004075m885772r462229r166077m151123K186321
$$ 7588295 13363733 18033296 19037371 14151599 4689370 -4476707 -8627830 -6441509
41259f441509O250523N921245J247994m443127o052013k293339J826942J728951
$$ -6441509 -190986 5730259 6978253 2535126 -3516887 -5810226 -3983284 -2254333
41251b254333N17745M034187R799144Q671999q59075q340515n647906J882765
$$ -2254333 -1736588 2297599 12096743 20768742 19909667 11569152 5921246 7804011
41243G804011M752910K895451J879098J200746l360055q714345o736466K590151
$$ 7804011 12556921 15452372 17331470 18532216 15172161 6457816 -278650 2311501
41235B311501J0031960J0080220O302688K667847j354998m930964m282072n46487
$$ 2311501 12343461 22423681 28726369 31394216 30039218 25108254 20826182 20279695
41227B0279695q50120p061553j0980293n941363L104931O489752J778708n759014
$$ 20279695 19429575 12368022 1387729 -4553634 -1448703 5041049 6819757 1060743
41219A060743r986747p376627J406347R788053J0217300L851060n50280M7836
$$ 1060743 -8926004 -16302631 -14896284 -5108231 5109069 8960129 8409849 8457685
41211H457685j198959p598337j0720822l104682Q685916J2762501P891991J906159
$$ 8457685 7258726 -339611 -11060433 -14165115 -5479199 7283302 15175293 17081452
41203A7081452q15335j181630R20278N303167P032716K214815m563223o739745
$$ 17081452 16266117 15084487 16004765 21307932 28340648 30555463 25992240 19252495
41195A9252495o051937p535938q660161m105574K238503K257686j536982O82397
$$ 19252495 13200558 5664620 -2995541 -7101115 -4862612 -2604926 -4141908 -3459511
41187c459511Q224192R240574J68021p616967n251521J376102L121528J368221
$$ -3459511 4764681 14005255 14173276 6556309 1304788 2680890 5802418 7170639
41179G170639K927052Q351372J2257136J0638450L404261n835566j0027497m712792
$$ 7170639 10097691 18449063 30706199 41344649 44748910 38913344 28885847 24173055
41171B4173055M065172N188554j755980m835086K183658R592892O009955n248260
$$ 24173055 28238227 33426781 31670801 26835715 29019373 38612265 44622220 39373960
41163C9373960j2043328r783775l935527j71532P88807Q16671J979546M495976
$$ 39373960 27330632 17546857 13611330 13439798 14228605 15045276 17024822 21520798
41155B1520798M660590r27787p354824m743063O895554J4355369Q301355m168569
$$ 21520798 26181388 25253601 17898777 13155714 20051268 34406637 42707992 38539423
41147C8539423j0395204p735688j093551O687091J2923570J1642015K720069k701105
$$ 38539423 28144219 20408531 19314980 26002071 38925641 50567656 53287725 50586620
41139E0586620K318017O849495j884047j5062680j2664885N010996J5743578Q034249
$$ 50586620 52904637 59754132 57870085 42807405 30142520 35153516 50897094 58931343
41131E8931343l428429k208172O465614P893968J149313l128208r16315J776664
$$ 58931343 55502914 53294742 59760356 67654324 68803637 65675429 64759114 66535778
41123F6535778N36167k480583m151690l753143j464153J249998R72785l757069
$$ 66535778 67071945 64591362 60439672 56686529 55222376 56472374 57445159 53688090
41115E3688090r421121j1626548r983218o312888j502690K834047L739041J701220
$$ 53688090 44266969 32640421 22657203 16344315 14841625 17675672 21414713 23115933
41107B3115933J751374N573874P254796K107279m956010o253466k475280J65155
$$ 23115933 24867307 30441181 37695977 39803256 34847246 28593780 26118500 26283655
41099B6283655L97101J317782J893861j747084p349924q206026m349238k739892
$$ 26283655 26680756 27998538 29892399 28145315 20795391 12589365 8240127 5500235
41091E500235m585330k345992O757602J3756565J0694182K503278j489119j487796
$$ 5500235 914905 -1431087 5326515 19083080 29777262 32280540 30791421 29303625
41083B9303625l548866o473067l101112O069849J0596231L956714p418412j2216959
$$ 29303625 25754759 19281692 16180580 22250429 32846660 36803374 29384962 17168003
41075A7168003o561700M035796J0757620P629879l997804j4769427j4992955n315824
$$ 17168003 10606303 14642099 25399719 33029598 29031794 14262367 -730588 -6046412
41067f046412L794739M995021J949997J647081L993126L840688k76337m842061
$$ -6046412 -2251673 2743348 4693345 6340426 10333552 14174240 13897903 9055842
41059I055842o742909n270806n58413N452915Q215966N417295J030697j12284
$$ 9055842 2312933 -2957873 -3516286 1936629 10152595 15569890 16600587 16488303
41051A6488303L52055j832214m591858k218337L487332L677563l893292j0210953
$$ 16488303 16840358 15008144 10416286 8197949 11685281 15362844 11469552 1258599
41043A258599p972634j547084J497894J983229M902755Q579850O691198q39363
$$ 1258599 -6714035 -8261119 -6763225 -4779996 122759 8702609 15393807 14554444
41035A4554444o941098p385734n007204l129532q16611L261541O933626P336313
$$ 14554444 7613346 227612 -4779592 -7909124 -8725735 -5464194 1469432 8805745
41027H805745M859247K125798Q89815J308292K498214K541384m66310n889200
$$ 8805745 13664992 15790790 16680605 17988897 20487111 23028495 22562185 16672985
41019A6672985r988785r236722m039784J630861M430499M795724N204793N860465
$$ 16672985 6684200 -2552522 -6592306 -4961445 -530946 4264778 9469571 15330036
41011A5330036M243111k25036l943498m161870l388295m536067m466867J036722
$$ 15330036 19573147 19348111 15404613 11242743 7854448 3318381 -1148486 -111764
41003a11764P490184N771490l176816p659631k722030K046129j574229p012427
$$ -111764 7378420 13149910 9973094 2313463 -408567 1637562 63333 -6949094
40995f949094m828142R92042R90855k277327P65780Q119473Q423542J172744j418861
$$ -6949094 -11777236 -10785194 -9794339 -12071666 -11305886 -3186413 5237129 6409873 4991012
40986D991012M745951Q648949L254527l218599k904488j528256n734244q966074
$$ 4991012 9736963 18385912 21640439 18421840 15517352 13989096 8254852 -711222
40978g11222k607761P650693J0032191M888084J235174Q6159m284296r349271
$$ -711222 -3318983 4331710 14363901 19251985 20487159 20573318 16289022 6939751
40970F939751o197655L244190O123860q44981n068908J706581R801191P147359
$$ 6939751 742096 3986286 10110146 9265165 4196257 5902838 15704029 22851388
40962B2851388k016712n114543p69425J693808j423465m340882l721526l432154
$$ 22851388 20834676 15720133 14950708 16644516 15221051 10880169 7158643 3726489
40954C726489n334696m858892J34378L833713J422453k332615k25083N425785
$$ 3726489 -1608207 -6467099 -6332721 -2499008 -1076555 -3409170 -3634253 1791532
40946A791532N666655j265831o647205l575938L693582O438239L011846j164096
$$ 1791532 7458187 6192356 -454849 -4030787 -337205 6101034 9112880 7948784
40938G948784k583951l036129m205053m215114j757243L1308k544206p263162
$$ 7948784 5364833 2328704 -1876349 -6091463 -7848706 -7817398 -10361604 -17624766
40930a7624766p061689J379982J2304162J6286646J0600233K020262j552267k7774
$$ -17624766 -24686455 -23306473 -11002311 5284335 15884568 17904830 16352563 16324789
40922A6324789Q03340j536778l461028k245348m87525o24721L31492N311739R561181
$$ 16324789 17128129 15591351 12130323 9884975 9397450 8772729 9104221 14415960 23977141
40913B3977141N456442n467441j2229873q156622N28416K960708l291341j0506912
$$ 23977141 29433583 23966142 11736269 3579647 4108063 7068771 3777430 -6729482
40905f729482r773761M13729J2394631J5224471N363183p751109j0908808k990288
$$ -6729482 -16503243 -16089514 -3694883 11529588 16892771 9141662 -1767146 -4757434
40897d757434L811810R23691n299460m510348J717311L619611l51650j059959
$$ -4757434 -945624 -21933 -5321393 -9831741 -8114430 -4494819 -4846469 -5906428
40889e906428O444583J4555721J3582979M422113m096759o623863n046784k829984
$$ -5906428 538155 15093876 28676855 33098968 29002209 22378346 17331562 14501578
40881A4501578o14656J938524L263859J089809m000466p944475p469359m441902
$$ 14501578 13886922 15825446 19089305 20179114 16178648 8234173 764814 -3677088
40873c677088l651939n707888n503871l21415M103583Q51730o718991p766983
$$ -3677088 -7329027 -13036915 -18540786 -18862201 -14758618 -13906888 -20625879 -28392862
40865b8392862R27684R858388J0215765N756983N149867P531137M582466m375327
$$ -28392862 -27465178 -17606790 -7391025 -1634042 3515825 11046962 15629428 11254101
40857A1254101r034154k755044P242423R862334M800200J10264j639311n934773
$$ 11254101 2219947 -535097 6707326 16569660 21369860 21480124 19840813 13906040
40849A3906040j4395596j8745353j1358914L342041J3584564J3673572P753377
$$ 13906040 -489556 -19234909 -30593823 -27251782 -13667218 6354 7759731
40842G759731K131788m87417M80075M764980R018717P703526p07664j0627726
$$ 7759731 9891519 9404102 9884177 14649157 23667874 31371400 30663736 20036010
40834B0036010j4696248j0802966k648400M576615P526019N820630K086491m7810
$$ 20036010 5339762 -5463204 -8111604 -3534989 3991030 9811660 11898151 11850341
40826A1850341N00449J357601l1764l374961o212554o122107k035938M454721
$$ 11850341 12350790 13708391 13676627 10301666 4089112 -2032995 -4068933 385788
40818C85788Q690993O700187N43374l017485r25197K134249N84519m123866o161901
$$ 385788 9076781 15776968 16320342 13302857 12377660 14511909 15096428 10972562 4810661
40809D810661l929842j464755j410447j026824K796112P397529O648614o47856
$$ 4810661 880819 -583936 -1994383 -3021207 -225095 7172434 13821048 13173192
40801A3173192p717390p611988k482252p42656m332281m602021M778405J6052389
$$ 13173192 5455802 -2156186 -4638438 -5381094 -9713375 -14315396 -9536991 6515398
40793F515398J6396335O123935j821633r05628J036651l487241r169716p326560
$$ 6515398 22911733 29035668 27214035 26308407 27345058 23857817 14688101 7361541
40785G361541o9575L789532K199702M28729Q46915L24360k985779o674412p704835
$$ 7361541 7291966 11081498 13281200 13709929 14556844 14881204 11895425 5221013 -2483822
40776b483822m970062J16644K662959j847975q971351p032136O309727J6590865
$$ -2483822 -7453884 -7337240 -4674281 -6522256 -15493607 -22525743 -16216016 374849
40768C74849J0968500k694106p229922j076792L014649P10141N173K259742j478141
$$ 374849 11343349 8649243 1419321 342529 3357178 4067319 4072492 6332234 4854093
40759D854093j0305285q790482P550978J9191757R396550r174600j1914504K396499
$$ 4854093 -5451192 -14241674 -6690696 12501061 21897611 12723011 808507 3205006
40751C205006J2357111O291682m646556o991513k265501J530847L112239N089538
$$ 3205006 15562117 21853799 17207243 10215730 7950229 9481076 12593315 17682853
40743A7682853O223036L903660l77834l641801n959789p893889o711106j32246
$$ 17682853 23905889 27809549 27431715 23789914 17830125 9936236 3225130 3092884
40735C092884P829898R533586K588331o985029j1465492r345295n049562k026006
$$ 3092884 10922782 20456368 23044699 16059670 4594178 -4751117 -9800679 -11826685
40727a1826685R54136N558422R045438P416237K093801j426451j929031m090544
$$ -11826685 -10872549 -5314127 3731311 11147548 13241349 11814898 9885867 5795323
40719E795323r815063j3450561r480149p14216N595423O521689M160784R12236
$$ 5795323 -4019740 -17470301 -26950450 -27664666 -22069243 -15547554 -11386770 -10474534
40711a0474534j302882k14495L386807M267261k0866l683198o35313N136274M815726
$$ -10474534 -11777416 -11991911 -8605104 -4337843 -4358709 -8041907 -8677220 -3540946 1274780
40702A274780j595618n574411l613466j189278j773841j268921K984659O158022
$$ 1274780 -320838 -5895249 -9508715 -10697993 -12471834 -13740755 -10756096 -4598074
40694d598074M222270J184997J696804K335606k170835q185975p178127R87091
$$ -4598074 -375804 809193 2505997 4841603 2670768 -5515207 -12693334 -11706243
40686a1706243O870366M389269j785642l883275p15746L345724N150515M827653
$$ -11706243 -4835877 -446608 -2232250 -6115525 -6831271 -3485547 1664968 6492621
40678F492621L275340J217797P3421P90285J624983n21679n667027r434467p660129
$$ 6492621 9767961 10985758 11059179 11849464 13474447 12952768 7285741 -2148726 -9808855
40669i808855j354803M518388O661788N873592L920545P75250l289615n066514
$$ -9808855 -11163658 -6645270 16518 5890110 9810655 10585905 7296290 2229776
40661B229776j270928O007660R770722N525276l433145r642844r191830m192613
$$ 2229776 958848 6966508 16737230 22262506 18829361 9186517 -5313 -4197926
40653d197926J307656N056329N867347K486997l933273q020292n044223K160835
$$ -4197926 -2890270 2166059 8033406 10520403 6587130 -1433162 -6477385 -4316550
40645d316550N524832K629591L87992M133163Q033991L309466o969512j0399127
$$ -4316550 1208282 3837873 4225865 8359028 16393019 19702485 12732973 2333846
40637B333846k839840N909197P026640M136424M209517N203977J347659m792015
$$ 2333846 -505994 5403203 12429843 16566267 20775784 25979761 27327420 22535405
40629B2535405n495018p55927J558735j845883n635054n181603k251347M99111
$$ 22535405 17040387 16284460 17843195 15997312 10362258 5180655 2929308 3428419
40621C428419L773381P688701R355282P326376L905604R43757j960120l402817
$$ 3428419 7201800 14890501 24245783 31572159 35477763 36421520 34461400 31058583
40613C1058583p8610O446782Q595671K497911n912198q916050o774891m488931
$$ 31058583 30979973 37426755 46022426 48520337 42608139 33692089 26917198 22428267
40605B2428267k791437J219777O544288Q032846L922494j528510l956765l507429
$$ 22428267 19636830 20856607 27400895 35433741 39356235 37827725 33870960 30363531
40597C0363531k310438o95260J984883M535029M157253j43694n055590n170290
$$ 30363531 28053093 27357833 29342716 33877745 38034998 37891304 32835714 27665424
40589B7665424P66900O507425M335052m652480r994034m382296O412872J0496677
$$ 27665424 28432324 34939749 39274801 34622321 24628287 20245991 26658863 37155540
40581C7155540M908983j761704k128812M64015j469518p486366r402530l217121
$$ 37155540 42064523 40302819 38174007 38638022 37168504 29682138 20279608 17062487
40573A7062487M522495N232589J2101j810187M479358J2331105J2366988M067818
$$ 17062487 21584982 26817571 26829672 25019485 29498843 41829948 54196936 58264754
40565E8264754m479238o676928l493806p8707J97216j968683l002466k9235M777699
$$ 58264754 53785516 47108588 43614782 43536075 43733291 41764608 38762142 38732907 43510606
40556D3510606M831535k695902j0964301j0484412j403581O705767P594833M692783
$$ 43510606 48342141 45646239 34681938 24197526 22793945 29499712 37094545 41787328
40548D1787328L204498K583115M78649j677398j989008k490447m857438n280079
$$ 41787328 44991826 47574941 48053590 46376192 44387184 41896737 37039299 31759220
40540C1759220N71307R732535J4651251J2401204O490755R26968k785272m051467
$$ 31759220 32330527 42063062 56714313 69115517 75606272 76533240 73747968 69696501
40532F9696501l479248l731008n421783l775855M785355J3871454J2304804q54830
$$ 69696501 66217253 62486245 57064462 53288607 58073962 71945416 84250220 83395390
40524H3395390j3505542j5375187r448334m830560l946597k368770K310686P518589
$$ 83395390 69889848 54514661 45066327 40235767 36289170 33920400 36231086 43749675
40516D3749675J0147664Q898139K969972o726880j5024791j5939499r921629l690479
$$ 43749675 53897339 62795478 65765450 59038570 44013779 28074280 18152651 14462172
40508A4462172j234631P72829N608966Q918905M472658m264100n932641L139000
$$ 14462172 13227541 14000370 19609336 28528241 33000899 28736799 22804158 25943158
40500B5943158J1901794Q458538l641833j0268902n842934P26547J14315n711673
$$ 25943158 37844952 46303490 42661657 32392755 26549821 27276368 27390683 21679010
40492B1679010r589974r806202q628928n483118R24797O519507N678620M11483
$$ 21679010 12089036 2282834 -6346094 -11829212 -10904415 -4384908 1293712 1705195
40484A705195j514569J839575L816307j33964n471680n777121j741127J463337
$$ 1705195 190626 2030201 5846508 5712544 240864 -5536257 -7277384 -5814047
40476e814047K077209K307622L392530M719113O408728Q322116P325390L67755
$$ -5814047 -3736838 -1429216 1963314 6682427 13091155 21413271 28738661 29106416
40468B9106416r236519j3221316p954658J026981O421344P577140P953230P416175
$$ 29106416 19869897 6648581 -1306077 -279096 6142248 13719388 21672618 29088793
40460B9088793L033317l284612n027824j300616j75995o754194j3182482q278351
$$ 29088793 32122110 28837498 23809674 22509058 22333063 15578869 2396387 -5881964
40452e881964N562501J4008369R574277o8050m922210n021174n093349m863591
$$ -5881964 -319463 13688906 23263183 23195133 18272923 13251749 8158400 3294809
40444C294809k191710k52699k893733o054649k547070O056252J0711460P943303
$$ 3294809 1103099 850400 -2043333 -8097982 -10645052 -4588800 6122660 14065963
40436A4065963L586877K525713K348466l62826l825135m191730l19797O440650
$$ 14065963 17652840 20178553 22527019 22164193 18339058 14147328 13827531 20268181
40428B0268181J2858208J3722638O934363p39820k03209O449805P797843J219106
$$ 20268181 33126389 46849027 53783390 53043570 52840361 59290166 67088009 68307115
40420F8307115j707211N654723J1608460L117962j2275229j6200465o837225k70808
$$ 68307115 66599904 72254627 83863087 86981049 74705820 58505355 51668130 51397322
40412E1397322m391698q356936l326388K065294k557402j0224045p310598L817030
$$ 51397322 47005624 38648688 35322300 37387594 34830192 24606147 17295549 21112579
40404B1112579Q210441K033672k429143K419172P737141L680112m621514n896618
$$ 21112579 29323020 31356692 28927549 31346721 39083862 42763974 38142460 32245842
40396C2245842k12637K834858l60707m038648m397936m754399p513291q717642
$$ 32245842 32033205 34868063 34507356 30468708 26070772 21316373 13803082 5085440
40388E085440m237450L574973Q677564P584092J130221o523814r481619m773394
$$ 5085440 847990 4422963 13100527 20684619 21814840 15291026 5809407 1036013
40380A036013L123642O461900L978993J663494K729181L153698k76108m271895
$$ 1036013 4159655 10621555 14600548 16264042 18993223 22146921 21870813 17598918
40372A7598918n348023n133128m541671J78109Q986490J2789135N410157n154343
$$ 17598918 12250895 7117767 2576096 2754205 11740695 24529830 29939987 24785644
40364B4785644p596017m223541n061059r035580n767288M441254Q287530Q59925
$$ 24785644 17189627 12966086 7905027 -1130553 -6897841 -2456587 5830943 6690868
40356F690868n380015j6719R504161J0720335M748010J370801K714065K867535
$$ 6690868 1310853 1294134 10798295 21518630 26266640 27637441 30351506 33219041
$$ [...]
##END NTUPLES=NMR SPECTRUM
##END=
