##TITLE=31Pdec_DE-80_oil
 D2O, 64 sc
 17.1.2025
##JCAMPDX= 6.0         $$ Bruker NMR JCAMP-DX V2.0
##DATA TYPE= NMR SPECTRUM
##DATA CLASS= NTUPLES
##ORIGIN= UXNMR, Bruker Analytische Messtechnik GmbH
##OWNER= root
$$ XWIN-NMR		Version 3.5
$$ Fri Jan 17 15:23:21 2025 Russian Standard Time (UT+4h)  she@DPX200
##.OBSERVE FREQUENCY= 81.013821
##.OBSERVE NUCLEUS= ^31P
##.ACQUISITION MODE= SIMULTANEOUS
##.ACQUISITION SCHEME= undefined
##.AVERAGES= 64
##.DIGITISER RES= 17
##SPECTROMETER/DATA SYSTEM= spect
##.PULSE SEQUENCE= zgpg30
##.SOLVENT NAME= DMSO
##.SHIFT REFERENCE= (INTERNAL, DMSO, 0, 198.062)
##AUDIT TRAIL= $$ (NUMBER, WHEN, WHO, WHERE, WHAT)
$$ ##TITLE= Audit trail, XWIN-NMR		Version 3.5
$$ ##JCAMPDX= 5.01
$$ ##ORIGIN= Bruker BioSpin GmbH
$$ ##OWNER= she
$$ F:/spectra/data/she/nmr/P31/2/pdata/1/auditp.txt
$$ ##AUDIT TRAIL=  $$ (NUMBER, WHEN, WHO, WHERE, WHAT)
(   1,<2025-01-17 15:22:09.67 +0400>,<she>,<DPX200>,
      <continue with go, POWCHK disabled, PULCHK disabled
       configuration hash MD5:
       00 E9 B6 7A A2 85 ED C7 34 08 36 98 17 FE 4E 26
       data hash MD5: 32K
       DD F5 82 43 5A DE 06 01 AA F7 3C 72 08 00 FF 61>)
(   2,<2025-01-17 15:22:11.48 +0400>,<she>,<DPX200>,
      <Start of raw data processing
       efp BC_mod = 2 LB = 1.5 FT_mod = 6 PKNL = 1 PHC0 = 1778.999 PHC1 = 59.2858 SI = 64K 
       data hash MD5: 64K
       CC E8 4E BE 46 16 49 24 BF 94 19 51 9E 1D E2 EB>)
(   3,<2025-01-17 15:22:44.17 +0400>,<she>,<DPX200>,
      <pk PHC0 = -375.4405 PHC1 = 886.0005 
       data hash MD5: 64K
       07 39 AA 95 5C B3 7C 22 7C 0E BF 55 E7 12 97 FA>)
$$ ##END=
$$ 
$$ hash MD5
$$ 79 28 E2 2B 88 B4 F4 5C 36 88 AF 4F 28 BE 98 02
##$RELAX= 
##$RELAX= 
##$RELAX= 
##$RELAX= 
##$RELAX= 
##$RELAX= 
##$RELAX= 
##$RELAX= 
$$ Bruker specific parameters
$$ --------------------------
##$DU= <F:/spectra>
##$EXPNO= 2
##$NAME= <P31>
##$PROCNO= 1
##$TYPE= <nmr>
##$USER= <she>
##$AMP= (0..31)
100 100 100 100 100 100 100 100 100 100 100 100 100 100 100 100 100 100 
100 100 100 100 100 100 100 100 100 100 100 100 100 100 
##$AQSEQ= 0
##$AQ_mod= 1
##$AUNM= <au_zg>
##$AUTOPOS= <>
##$BF1= 81.014009
##$BF2= 200.13
##$BF3= 200.13
##$BF4= 200.13
##$BF5= 200.13
##$BF6= 200.13
##$BF7= 200.13
##$BF8= 200.13
##$BYTORDA= 1
##$CFDGTYP= 0
##$CFRGTYP= 5
##$CHEMSTR= <none>
##$CNST= (0..31)
1 1 145 1 1 1 1 1 1 1 1 1 1 1 1 1 1 1 1 1 1 1 1 1 1 1 1 1 1 1 1 1 
##$CPDPRG= <waltz16>
##$CPDPRG1= <>
##$CPDPRG2= <waltz16>
##$CPDPRG3= <>
##$CPDPRG4= <mlev>
##$CPDPRG5= <mlev>
##$CPDPRG6= <mlev>
##$CPDPRG7= <mlev>
##$CPDPRG8= <mlev>
##$CPDPRGB= <>
##$CPDPRGT= <>
##$D= (0..31)
0 1 0 0 0 0 0 0 0 0.06 0 0.03 2e-05 3e-06 0 0 0.0002 0 0 0 0 0 0 0 0 0 
0 0 0 0 0 0 
##$DATE= 1737112831
##$DBL= (0..7)
120 120 120 11 120 120 24 19 
##$DBP= (0..7)
150 150 150 150 150 150 150 150 
##$DBP07= 0
##$DBPNAM0= <>
##$DBPNAM1= <>
##$DBPNAM2= <>
##$DBPNAM3= <>
##$DBPNAM4= <>
##$DBPNAM5= <>
##$DBPNAM6= <>
##$DBPNAM7= <>
##$DBPOAL= (0..7)
0.5 0.5 0.5 0.5 0.5 0.5 0.5 0.5 
##$DBPOFFS= (0..7)
$$ [...]
##$SUBNAM3= <"">
##$SUBNAM4= <"">
##$SUBNAM5= <"">
##$SUBNAM6= <"">
##$SUBNAM7= <"">
##$SUBNAM8= <"">
##$SUBNAM9= <"">
##$SW= 400.765351723535
##$SWIBOX= (0..15)
0 1 3 0 0 0 0 0 0 0 0 0 0 0 0 0 
##$SW_h= 32467.5324675325
##$TD= 32768
##$TD0= 1
##$TE= 0
##$TE2= 300
##$TE3= 300
##$TEG= 300
##$TL= (0..7)
0 120 53 12 22 120 120 120 
##$TP= (0..7)
150 150 150 150 150 150 150 150 
##$TP07= 0
##$TPNAME0= <>
##$TPNAME1= <>
##$TPNAME2= <>
##$TPNAME3= <>
##$TPNAME4= <>
##$TPNAME5= <>
##$TPNAME6= <>
##$TPNAME7= <>
##$TPOAL= (0..7)
0.5 0.5 0.5 0.5 0.5 0.5 0.5 0.5 
##$TPOFFS= (0..7)
0 0 0 0 0 0 0 0 
##$TUNHIN= 0
##$TUNHOUT= 0
##$TUNXOUT= 0
##$USERA1= <user>
##$USERA2= <user>
##$USERA3= <user>
##$USERA4= <user>
##$USERA5= <user>
##$V9= 5
##$VALIST= <valist>
##$VCLIST= <CCCCCCCCCCCCCCC>
##$VD= 0
##$VDLIST= <DDDDDDDDDDDDDDD>
##$VPLIST= <PPPPPPPPPPPPPPP>
##$VTLIST= <TTTTTTTTTTTTTTT>
##$WBST= 1024
##$WBSW= 4
##$XGAIN= (0..3)
0 0 0 0 
##$XL= 0
##$YL= 0
##$YMAX_a= 3531
##$YMIN_a= -11927
##$ZGOPTNS= <>
##$ZL1= 120
##$ZL2= 120
##$ZL3= 120
##$ZL4= 120
##$ABSF1= 0
##$ABSF2= 0
##$ABSG= 0
##$ABSL= 0
##$ALPHA= 0
##$AQORDER= 0
##$ASSFAC= 0
##$ASSFACI= 0
##$ASSFACX= 0
##$ASSWID= 0
##$AUNMP= <proc_1d>
##$AZFE= 0.1
##$AZFW= 0.5
##$BCFW= 0
##$BC_mod= 2
##$BYTORDP= 0
##$COROFFS= 0
##$CY= -3
##$DATMOD= 1
##$DC= 0
##$DFILT= <>
##$DTYPP= 0
##$F1P= 0
##$F2P= 0
##$FCOR= 1
##$FTSIZE= 65536
##$FT_mod= 6
##$GAMMA= 0
##$GB= 0
##$INTBC= 1
##$INTSCL= 9.790993e-09
##$ISEN= 30
##$LB= 1.5
##$LEV0= 0
##$LPBIN= 0
##$MAXI= 10000
##$MC2= 0
##$MEAN= 0
##$ME_mod= 0
##$MI= 50
##$NCOEF= 0
##$NC_proc= -8
##$NLEV= 6
##$NOISF1= 182.463
##$NOISF2= 159.3651
##$NSP= 0
##$NTH_PI= 0
##$NZP= 0
##$OFFSET= 198.0616
##$PC= 4
##$PHC0= 1403.559
##$PHC1= 945.2863
##$PH_mod= 1
##$PKNL= yes
##$PPARMOD= 0
##$PSCAL= 0
##$PSIGN= 0
##$REVERSE= no
##$SF= 81.0140089999434
##$SI= 65536
##$SIGF1= 159.3651
##$SIGF2= -187.1042
##$SINO= 113.3802
##$SIOLD= 16384
##$SREGLST= <1H.CDCl3>
##$SSB= 0
##$STSI= 65536
##$STSR= 0
##$SW_p= 32467.5324675325
##$SYMM= 0
##$S_DEV= 0
##$TDeff= 32768
##$TDoff= 0
##$TI= <>
##$TILT= no
##$TM1= 0
##$TM2= 0
##$TOPLEV= 0
##$USERP1= <user>
##$USERP2= <user>
##$USERP3= <user>
##$USERP4= <user>
##$USERP5= <user>
##$WDW= 1
##$XDIM= 65536
##$YMAX_p= 142529617
##$YMIN_p= -205064296
$$ End of Bruker specific parameters
$$ ---------------------------------
##NTUPLES= NMR SPECTRUM
##VAR_NAME=  FREQUENCY,     SPECTRUM/REAL,   SPECTRUM/IMAG
##SYMBOL=    X,             R,               I
##VAR_TYPE=  INDEPENDENT,   DEPENDENT,       DEPENDENT
##VAR_FORM=  AFFN,          ASDF,            ASDF
##VAR_DIM=   65536,         65536,           65536
##UNITS=     HZ,            ARBITRARY UNITS, ARBITRARY UNITS
##FACTOR=    0.49542278885378, 1,            1
##FIRST=     16045.7642231865, 0,            0
##LAST=      -16421.768244346, 0,            0
##MIN=       -16421.768244346, -205064296,   0
##MAX=       16045.7642231865, 142529617,    0
$$ Real data points
##PAGE= N=1
##DATA TABLE= (X++(R..R)), XYDATA
$$ [...]
##PAGE= N=2
##DATA TABLE= (X++(I..I)), XYDATA
6719C331085j040978j360563J539026J777468j824274l334831L01348M300229
$$ 3331085 2290107 929544 2468570 4246038 2421764 -913067 -611719 3688510
6711C688510L938333J165071j12307r6524o41073r58993K10828J197199j95402
$$ 3688510 7626843 8791914 8679607 8583083 7942010 6983017 7193845 8391044 8195642
6702H195642k966036m431828l691859j518963J225029L266422L115788J286488
$$ 8195642 5229606 797778 -2894081 -4413044 -3188015 78407 3194195 4480683
6694D480683K79940R81993J358917R15j674104k177514k080071j764584q7996
$$ 4480683 4760623 5742616 7101533 7102448 5428344 3250830 1170759 -593825 -681821
6685f81821K637597L321653L88377l067301l170857l77960J838140J688323O8700
$$ -681821 1955776 5277429 5665806 2598505 -572352 -950312 887828 2576151 2644851
6676B644851j641883k599657k507774k164032k576378k601619J38504M741400
$$ 2644851 1002968 -1596689 -4104463 -6268495 -8844873 -11446492 -11307988 -6566588
6668f566588O520490L177358j449007k458689q0658K079514K436452J773096L43593
$$ -6566588 -46098 3131260 1682253 -776436 -857094 1222420 3658872 5431968 5775561
6659E775561j784410k958967j836270N7387M81009q2668J49990Q76840O01732
$$ 5775561 3991151 1032184 -804086 -746699 -265690 -348358 -198368 678472 1280204
6650A280204m63775j156391j583958j954375r71548J700395L311862J586218j503295
$$ 1280204 816429 -339962 -1923920 -3878295 -4849843 -3149448 162414 1748632 245337
6641B45337k813691k670416k720779j764677J511679L937559J716665k548551
$$ 245337 -2568354 -5238770 -7959549 -9724226 -8212547 -4274988 -2558323 -5106874
6633e106874k835661R29827K898720Q57885q94130M98875K093418J125140l79184
$$ -5106874 -7942535 -7012708 -4113988 -3256103 -4150233 -3651358 -1557940 -432800 -811984
6624h11984K9535J092783J174141J427592K591931K616200N50107j004601m23463
$$ -811984 -782449 310334 1484475 2912067 5503998 8120198 8670305 7665704 7242241
6615G242241k23031k344714m090764k677204l75813p29093k565943k487881r69291
$$ 7242241 7019210 4674496 583732 -2093472 -2469285 -3198378 -5764321 -8252202 -9221493
6606i221493j019176k365549j962046N03300K246323K231506K146718K600651
$$ -9221493 -10240669 -12606218 -14568264 -14064964 -11818641 -9587135 -7440417 -4839766
6598d839766K340706J434611J444931K062746J170701j219577k554979j857700
$$ -4839766 -2499060 -1064449 380482 2443228 3613929 2394352 -160627 -2018327
6590b018327q26000k27303J012702K102378K6284m938111p328524l442642K844242
$$ -2018327 -2844327 -3071630 -2058928 43450 69734 -4868377 -12196901 -15639543 -12795301
6581a2795301N073424K874874J311842K686824L810969J953384r33657j915369
$$ -12795301 -7721877 -4847003 -3535161 -848337 2962632 4916016 3982359 2066990
6573B066990j606042k176377l076921k061618M87143J545969n9853j938124j730624
$$ 2066990 460948 -1715429 -4792350 -6853968 -6366825 -4820856 -4880709 -6818833 -8549457
6564h549457j42049Q32423P72006M03046o8722l83006O73643L381476N181182
$$ -8549457 -8691506 -7859083 -7087077 -6684031 -6752753 -7135759 -6462116 -3080640 2100542
6555B100542L218038j297075l736449j676048K134210L362215J096091j900130
$$ 2100542 5318580 4021505 285056 -1390992 743218 4105433 5201524 3301394
6547C301394k891374j867550p62393p60850q20423P37345L348150M302770K459573
$$ 3301394 410020 -1457530 -2219923 -2980773 -3801196 -3063851 284299 4587069 7046642
6538G046642J26811m29397n43226k472553m638761l452331M62380K288227J55111
$$ 7046642 7173453 6744056 6200830 3728277 -910484 -4362815 -3900435 -1612208 -1457097
6529a457097k101709j250512M25897l95080k166196j146993K140758L513123J446682
$$ -1457097 -3558806 -4809318 -4383421 -4778501 -6944697 -8091690 -5950932 -2437809 -991127
6520i91127j083048j244708L39970J581778J772151J505474J322687J253480R83197
$$ -991127 -2074175 -3318883 -2978913 -1397135 375016 1880490 3203177 4456657 5439854
6511E439854K74572m32678l61977K96935M99164K39950O67348J464857M05458
$$ 5439854 5714426 5281748 4919771 5216706 5715870 5955820 6623168 8088025 8493483
6502H493483k805376m658054k410741J472184K599979Q30844l65701L34276Q90625
$$ 8493483 5688107 1030053 -1380688 91496 2691475 3522319 3156618 3490894 4381519
6493D381519J41132o04127n85759p27567j126245o43652L04400k24097k032111
$$ 4381519 4522651 3918524 3332765 2605198 1478953 835301 1139701 915604 -1116507
6484a116507k417873n71363R80373P02030L70116J201583J220936q34219k272059
$$ -1116507 -3534380 -4105743 -3125370 -2423340 -2053224 -851641 369295 -464924 -2736983
6475b736983o37184J499046J83134l141547l234048Q50972L925867K094656j867574
$$ -2736983 -3374167 -1875121 -1691987 -4833534 -8067582 -7216610 -3290743 -1196087 -3063661
6466c063661k807711j81047K050521J192649j247800k359126j463843k10215j95238
$$ -3063661 -5871372 -6052419 -4001898 -2809249 -4057049 -6416175 -7880018 -8090233 -8285471
6457h285471j401025k529106k198255o8515K564019L451963J522303j533178k665245
$$ -8285471 -9686496 -12215602 -14413857 -14482372 -11918353 -8466390 -6944087 -8477265 -11142510
6448a1142510q52438J801914K891500K528550K345385K754364K774277J970823
$$ -11142510 -11994948 -10193034 -7301534 -4772984 -2427599 326765 3101042 5071865
6440E071865Q73298k51069j417421j993616j459661p75547j028566j100529P77263
$$ 5071865 5945163 5694094 4276673 2283057 823396 47849 -980717 -2081246 -1303983
6431a303983L267076K941367l17563k494147j509251l73218j690291k695090J17301
$$ -1303983 1963093 4904460 4586897 2092750 583499 210281 -1480010 -4175100 -4057799
6422d057799M118274L613515j182738l802057r42945K811139J926145k421017
$$ -4057799 60475 3673990 2491252 -1310805 -2253750 557389 2483534 62517
6414F2517m772672k888421N32858K286712J807991L14279q34565q61038j61756
$$ 62517 -4710155 -7598576 -7065718 -4779006 -2971015 -2656736 -3491301 -4352339 -4514095
6405d514095m0080q43374j127192N6024J105441J0370k247580k741092p58113
$$ -4514095 -4554175 -5397549 -6524741 -6468717 -5363276 -5352906 -7600486 -10341578 -11099691
6396a1099691J500635K450237K724359K682945J174577j712335l183713j312520
$$ -11099691 -9599056 -7148819 -4424460 -1741515 -566938 -2279273 -5462986 -6775506
6388f775506J647145J986655n69964l144782l926719l402230j965448N66091K860323
$$ -6775506 -5128361 -3141706 -3711670 -6856452 -10783171 -14185401 -16150849 -15584758 -12724435
6379a2724435K650186L72259n91850J280279L238435K580839R49432J526405L574810
$$ -12724435 -10074249 -9701990 -10293840 -9013561 -5775126 -3194287 -2244855 -718450 2856360
6370B856360L150682r79654n138727n297894j887266J067203O61648j858609k566691
$$ 2856360 6007042 5027388 -111339 -5409233 -7296499 -6229296 -5567648 -7426257 -9992948
6361i992948P85561N889873Q020214N342117R59199j094462m80853K42548l26826
$$ -9992948 -9207387 -3317514 4702700 10044817 11004016 9909554 9428701 9671249 9344423
6352I344423j358970k022369k399740k254440j044363N85710J176501N90357Q6580
$$ 9344423 7985453 5963084 3563344 1308904 264541 850251 2026752 2617109 2703689
6343B703689R8462k50415j117998j323259l35923P93180J141890J058835R97704
$$ 2703689 2802151 2551736 1433738 110479 -225444 567736 1709626 2768461 3766165
6334C766165O55692p3193n28485k09121P17288J881479K543019J402450j630761
$$ 3766165 4421857 4348664 3820179 3611058 4328346 6209825 8752844 10155294 8524533
6325H524533l958169k972341J3041J323211L60457L0566J270338J283618j158761
$$ 8524533 4566364 1594023 1607064 2930275 3290732 3321298 4591636 5875254 4716493
6316D716493k848985j357703N09050r30756m202648m956895k354255O64627K039005
$$ 4716493 1867508 509805 1018855 88099 -4114549 -9071444 -11425699 -10761072 -8722067
6307h722067J850048K19905k308762l349876j393888J005064O39185q41330N76598
$$ -8722067 -6872019 -6652114 -8960876 -12310752 -13704640 -12699576 -12060391 -12901721 -12325123
6298a2325123L970699M206100M91693j621440J072316M037741J814984l737935
$$ -12325123 -8354424 -4148324 -3656631 -5278071 -4205755 -168014 1646970 -2090965
6290b090965o165038k965729K354697N297329M209621K01318l866311m907681
$$ -2090965 -8256003 -11221732 -8867035 -3569706 639915 841233 -3025078 -7932759
6282g932759k462037M16513P52041p73636j409067k33901J442404K421194K310602
$$ -7932759 -10394796 -9978283 -9226242 -9999878 -11408945 -11642846 -10200442 -7779248 -5468646
6273e468646Q93725j157384j900482n13817R20756J80649j613225j728014o4850
$$ -5468646 -4574921 -5732305 -7632787 -8146604 -7225848 -7045199 -8658424 -10386438 -10451288
6264a0451288J135975J166254J355952J952356J662020N02037R058J62683p38434
$$ -10451288 -9315313 -8149059 -6793107 -4840751 -3178731 -2676694 -2667636 -2504953 -3243387
6255c243387k412210k176068N09747K430704J474006m2927O07989K107249J822115
$$ -3243387 -5655597 -7831665 -7321918 -4891214 -3417208 -3460135 -2852146 -744897 1077218
6246A077218N79535Q01417J447991o74945m808657n946627j865018L205450M010569
$$ 1077218 1656753 2458170 3906161 3231216 -1577441 -7524068 -9389086 -6183636 -2173067
6237b173067P84602k041196j934401m87252j56828j094626j722675j150785j25928
$$ -2173067 -1388465 -3429661 -5364062 -5851314 -6008142 -7102768 -8825443 -9976228 -10102156
6228a0102156K23214j0932K56974J223297J481253K5383j858784k136023r40612
$$ -10102156 -9878942 -9889874 -9632900 -8409603 -6928350 -6902967 -8761751 -10897774 -11838386
6219a1838386j30299p3009Q86938L216289M728668L628864J206720j21857r6588
$$ -11838386 -11968685 -12041694 -11154756 -7938467 -3209799 419065 1625785 1503928 1407340
6210A407340k28525j124175j883227j612668k78868J373359J923078M34860j558150
$$ 1407340 1178815 54640 -1828587 -3441255 -3720123 -2346764 -423686 11174 -1546976
6201a546976r74950K397213M471035K232459j427642j597904J357686K510523
$$ -1546976 -2521926 -124713 4346322 6578781 5151139 3553235 4910921 7421444
6193G421444j27352l316964m281162m034122l557837j265552L049049N726620
$$ 7421444 7294092 3977128 -304034 -4338156 -7895993 -9161545 -6112496 -385876
6185c85876M186598J188062M25636P61748p76703k775949j685202J076641M76663
$$ -385876 3800722 4988784 5414420 6176168 5399465 2623516 938314 2014955 2491618
6176B491618l395426m290113M34920M825606K870417k556522m226954j023757
$$ 2491618 -903808 -5193921 -4759001 66605 2937022 380500 -3846454 -4870211
6168d870211J681962Q24877q37840n02905M37498p3403q52307M4617J469490R32361
$$ -4870211 -3188249 -2363372 -3201212 -3704117 -3266619 -3340022 -4192329 -4147712 -2678222 -1745861
6158a745861j101754j613675N72992L204271L689843K003876R788q16355m45284
$$ -1745861 -2847615 -4461290 -3888298 -684027 3005816 5009692 5019480 4203125 3757841
6149C757841R7622j55724r12878p46465Q32256J961869N09816k605288l920744
$$ 3757841 3855463 3699739 2786861 2040396 2872652 4834521 5344337 2739049 -1181695
6140a181695j713393J772891L124201J471547j388587l324634l339567j784064
$$ -1181695 -2895088 -1122197 2002004 3473551 2084964 -1239670 -4579237 -6363301
6132f363301j36866K37990j79260L79157K109112K933511J683190J37231K36354
$$ -6363301 -6500167 -6262177 -6441437 -6062280 -3953168 -1019657 663533 800764 1037118
6123A037118R78860K78354j452692k081971j185773j57531M18196R31378Q69063
$$ 1037118 2015978 2294332 841640 -1240331 -2426104 -2583635 -2165439 -1234061 -364998
6114c64998m98494j922103j461175K53670Q82030K28536O8171L08046r21268k976445
$$ -364998 -863492 -2785595 -4246770 -3993100 -3111070 -2882534 -2814363 -2506317 -3427585 -6404030
6104f404030k627629N24282K558361J020843j456784j575383n8543O26894K66651
$$ -6404030 -9031659 -8507377 -5949016 -4928173 -6384957 -7960340 -8018883 -7391989 -7125338
6095g125338m9134k04842J54317K371222N655217O148194K238048k017537k288196
$$ -7125338 -7174472 -7379314 -7224997 -4853775 801442 6949636 9187684 7170147 4881951
6086D881951q5393M82598n18980j45559J129450k18639m407657p133550n344024
$$ 4881951 4796558 5279156 4760176 4614617 5744067 5525428 1117771 -6015779 -11359803
6077a1359803o83082L288546M495401L018888R19308R04316K895352L253574k2571
$$ -11359803 -12042885 -8754339 -4258938 -1240050 -320742 583574 3478926 6732500 6709929
6068F709929l592055l794433k637252l817402n298120k341597L474522N643337
$$ 6709929 3117874 -676559 -3313811 -7131213 -12429333 -14770930 -11296408 -5653071
6060e653071L036911J163115K149396J575529k219983l830621r9676L536092J711445
$$ -5653071 -2616160 -1453045 696351 2271880 51897 -3778724 -3878400 -342308 1369137
6051A369137j892977q30225L507994M705091J671864r28719r78052r47639k077137
$$ 1369137 -523840 -1354065 2153929 6859020 8530884 7602165 6624113 5676474 3599337
6042C599337k405436j071289K03600N32095P69645O20485j322602m021270m053401
$$ 3599337 1193901 122612 326212 858307 1627952 2248437 925835 -3095435 -7148836
6033g148836l43300L933410N212181L186791n2955k517092l194689k005538K48195
$$ -7148836 -7492136 -3558726 1653455 4840246 4787291 2270199 -924490 -2930028 -2681833
6024b681833K410535L534294K938872Q26205r08260l72097J182379M53511k574205
$$ -2681833 -271298 3262996 6201868 7028073 6119813 5747716 6930095 7383606 4809401
6015D809401l685648q83589J908998Q95011j382191l90917K647340K785834n82807
$$ 4809401 1123753 240164 2149162 3044173 1661982 1271065 3918405 6704239 6121432
6006F121432l313186l317564k221788n80405K701108N692396M136470j581517
$$ 6121432 2808246 -509318 -2731106 -3311511 -610403 5081993 9218463 7636946
5998G636946n458959l954215l13668J331369J408136J634638Q67689k004885m501144
$$ 7636946 2177987 -1776228 -2089896 -758527 649609 2284247 3151936 1147051 -3354093
5989c354093l839289j320953J07595M56104J357190K123327R56960j078847r50471
$$ -3354093 -7193382 -8514335 -8406740 -7950636 -6593446 -4470119 -3513159 -4592006 -5542477
5980e542477J845432M557151M753039K378362j239526m245440m702222k442134
$$ -5542477 -3697045 860106 5613145 7991507 6751981 2506541 -2195681 -4637815
5972d637815p2493p1191j394902j163140Q03859J743151L14029j407084j092819
$$ -4637815 -4710308 -4781499 -6176401 -7339541 -6535682 -4792531 -4478502 -5885586 -6978405
5963f978405P92593K323305K935712L396357L668117K353352j333465n704128
$$ -6978405 -6185812 -3862507 -926795 2469562 6137679 8491031 7157566 1453438
5955A453438p537062n315903j134069J505800J696591J633186K775445L320863
$$ 1453438 -6083624 -11399527 -12533596 -11027796 -9331205 -7698019 -4922574 -1601711
5947a601711J038556k695793m092116k026521M16430K73738j379478j426214O37479
$$ -1601711 -563155 -3258948 -7351064 -9377585 -8961155 -8687417 -10066895 -11493109 -10855630
5938a0855630K252659J864685J128351J953061L157960K181748o78854k266813
$$ -10855630 -8602971 -6738286 -5609935 -3656874 -498914 1682834 1003980 -1262833
5930a262833j018963J046428J733544J639512K020632J922585L3024k158195k148996
$$ -1262833 -2281796 -1235368 498176 2137688 4158320 6080905 6113929 3955734 1806738
5921A806738o01433m89439k204810k816887p75075J778120K515857J951840J454245
$$ 1806738 1205305 715866 -1488944 -4305831 -5080906 -3302786 -786929 1164911 2619156
5912B619156P00105j000820k712737l087984k215269p93159J076179K858779L021498
$$ 2619156 3319261 2318441 -394296 -3482280 -5697549 -6490708 -5414529 -2555750 465748
5903D65748J242250k93788K70363J614231J278327n58296j639695j252865q32727
$$ 465748 1707998 1414210 1684573 3298804 4577131 4018835 2379140 1126275 293548
5894B93548j081219q31098O56817K039675J475367j048805l646255m402082l111060
$$ 293548 -787671 -1618769 -961952 1077723 2553090 1504285 -2141970 -6544052 -9655112
5885i655112j421210j147962k248074k911770j967609m26042J01691j61603N33878
$$ -9655112 -11076322 -12224284 -14472358 -17384128 -19351737 -19777779 -19676088 -19837691 -19303813
5876a9303813K785587M702459L892453O08776j819973n55617K868955L778034
$$ -19303813 -16518226 -11815767 -7923314 -7314538 -9134511 -9690128 -6821173 -3043139
5868c043139L35830l498204l054394N11625J936220n55738l217810k770875l98321
$$ -3043139 -2707309 -6205513 -9259907 -8748282 -6812062 -7367800 -10585610 -13356485 -13754806
5859a3754806J643085L410682M913109M073255L70256k468890j229867J650169
$$ -13754806 -12111721 -8701039 -3787930 285325 655581 -1813309 -3043176 -1393007
5851a393007J753047m36856r18869P58163R59761j413245k763092o14155K550243
$$ -1393007 360040 -76816 -995685 -237522 722239 -691006 -3454098 -4068253 -1518010
5842a518010L270077J708491J05912q29255j690400k260625j725995r5345J819775
$$ -1518010 1752067 3460558 3566470 2737215 1046815 -1213810 -2939805 -3035150 -1215375
5833a215375K955964K072144j083113m089582l533298L77051L025944J081484
$$ -1215375 1740589 3812733 2729620 -1359962 -4893260 -4516209 -1490265 -408781
5825d08781k859336l704278p14792J874258Q46247k080074l151054j439994O63603
$$ -408781 -3268117 -6972395 -7687187 -5812929 -4966682 -7046756 -10197810 -11637804 -10974201
5816a0974201R25007l08509j228293r72358j42666O02212J378471K240783K508534
$$ -10974201 -10049194 -10357703 -11585996 -12558354 -12701020 -12098808 -10720337 -8479554 -5971020
5807e971020J755404Q50577R43534J667106J492515q851j284110o59055J487070
$$ -5971020 -4215616 -3365039 -2421505 -754399 738116 729265 -554845 -1213900 273170
5798B73170K895747J741439j249006l098873j546705K160649M314987K997503
$$ 273170 3168917 4910356 3661350 562477 -984228 1176421 5491408 8488911
5790H488911J11411j615578k085562k592499k544859j93815L644046N487614L612212
$$ 8488911 8600322 6984744 4899182 2306683 -238176 -431991 3212055 8699669 12311881
5781A2311881L23680j259479q26098o3161P0534l06377j129744k157870k307734
$$ 12311881 12635561 11376082 10549984 10486823 10557357 10250980 9121236 6963366 4655632
5772D655632p86007J408965K323917J199052j081257l193264l994370k566112
$$ 4655632 3869625 5278590 7602507 8801559 7720302 4527038 532668 -2033444
5764b033444P44058L379468K477728j518628m549900l454667J50697K054404J000142
$$ -2033444 -1289386 2090082 4567810 3049182 -1500718 -4955385 -4804688 -2750284 -1750142
5755a750142K5416J801778M632898M634741P57423m157707o816907o269218l572166
$$ -1750142 -1724726 77052 4709950 9344691 10102114 5944407 -872500 -7141718 -10713884
5746a0713884n31586J090176Q17853K41064J118097K744995L016931J921751J420699
$$ -10713884 -11245470 -10155294 -9337441 -9096377 -7978280 -5233285 -2216354 -294603 1126096
5737A126096J650089M91430k030742k545679K98526K716870J243655j604617j187297
$$ 1126096 2776185 3267615 1236873 -1308806 -1010280 1706590 2950245 1345628 158331
5728A58331J827384K587109l18310l180798l369818k721955l438700m246502k662724
$$ 158331 1985715 4572824 4254514 1073716 -2296102 -5018057 -8456757 -12703259 -15365983
5719a5365983J184174M718538N630536L627720N61019j076149q14682p17266j926064
$$ -15365983 -14181809 -9463271 -3832735 -205015 356004 -720145 -1534827 -2252093 -4178157
5710d178157k326755k6074K765975K936246J907222L150821N238675L192011k818992
$$ -4178157 -6504912 -6530986 -3765011 -828765 1078457 4229278 9467953 12659964 9840972
5701I840972o335731m100551p96470j192397k921755j372530K527658M373417
$$ 9840972 3505241 -595310 -1391780 -2584177 -5505932 -6878462 -4350804 22613
5693B2613L205724J601434Q27486J86359l31836n04437j438518l223958l018894
$$ 22613 3228337 4829771 5657257 5843616 5511780 5007343 3568825 344867 -2674027
5684b674027O21410L650340J601653k796828k716557K429676N687422K747270
$$ -2674027 -2052617 1597723 3199376 402548 -2314009 115667 5803089 8550359
5676H550359k140216l022567m50144Q65405m61000j551048n84996P69583N64967
$$ 8550359 6410143 3387576 2937432 3802837 3341837 1790789 1205793 1975376 2540343
5667B540343n56168q37993j51913J55202m62133r78852m38273P64303J791049
$$ 2540343 1984175 1146182 994269 1149471 687338 -291514 -729787 34516 1825565
5658A825565K522457K906583K268944P19216Q9751J290328J730615j521877o387225
$$ 1825565 4348022 7254605 9523549 10242765 10332516 11622844 13353459 11831582 5444357
5649E444357p374642l142737J514829K627049J887128K297241L052366K080500
$$ 5444357 -1930285 -5073022 -3558193 -931144 955984 3253225 6305591 8386091
5641H386091K77395n89017j374837l013666l132959K87537L992987L099927j598157
$$ 8386091 8663486 8074469 6699632 3685966 553007 840544 4833531 7933458 6335301
5632F335301m707530l808856j419878Q572N03937K23499r21209j293283P49565
$$ 6335301 1627771 -2181085 -3600963 -3592391 -3088454 -2864955 -3786164 -5079447 -4329882
5623d329882L301148L082388P52380k91087J50014o48786k377109j691254J274317
$$ -4329882 -1028734 2053654 2806034 2514947 2664961 2016175 -360934 -2052188 -777871
5614g77871K243881m7563j768557q34480n5236j042040p74714K416013M770189
$$ -777871 1466010 1418447 -350110 -1184590 -1239826 -2281866 -3056580 -640567 4129622
5605D129622L033730r6899p31339L1926q47912k592599k525617j017270j55669
$$ 4129622 7163352 7066453 6335114 6367040 5519128 2926529 400912 -616358 -772027
5596g72027J84721R89404J191274n4045o80590P55345J488887j158955m412603
$$ -772027 -587306 402098 1593372 1539327 858737 1614082 3102969 1944014 -2468589
5587b468589l803473k48038J727280J297063J627990L734345N092492M093605
$$ -2468589 -6272062 -6520100 -4792820 -3495757 -1867767 1866578 6959070 11052675
5579A1052675J494377k039122n577322o078164j763583L323671L395342o51982
$$ 11052675 12547052 10507930 4930608 -1147556 -2911139 412532 3807874 3155892
5571C155892k336477O64838L669318K879582K63750j367168k627373m175397l966930
$$ 3155892 819415 1484253 5153571 8033153 8296903 6929735 4302362 126965 -3839965
5562c839965j173481J184736Q08503k03608N65426J524945L85203j234548m74816
$$ -3839965 -5013446 -3828710 -3020207 -3223815 -2658389 -1133444 -748241 -1982789 -2457605
5553b457605J694733K002516L4514j650346j577483n21515N29042R76350J22890
$$ -2457605 -762872 1239644 1274158 -376188 -1953671 -2475186 -1946144 -969794 -846904
5544h46904j560452j805221M71370K869039K710144J100386Q46928J648598R01241
$$ -846904 -2407356 -4212577 -3741207 -872168 1837976 2938362 3785290 5433888 6335129
5535F335129j385748k305347r10231K19183p60022k130907j526555N95253J985497
$$ 6335129 4949381 2644034 1733803 1952986 1192964 -937943 -2464498 -1869245 116252
5526A16252J612876K94628o81130o39317j4032k06794j960314l607036k326642
$$ 116252 1729128 2023756 1342626 703309 689277 482483 -1477831 -5084867 -7411509
5517g411509K154182O336639O422432K341264k396475m268867k574738O36482
$$ -7411509 -5257327 1079312 7501744 9843008 7446533 3177666 602928 1239410
5509A239410K590744J899961o47331l017255l606243k233401m7084J279981Q30195
$$ 1239410 3830154 5730115 5082784 2065529 -1540714 -3774115 -3821199 -2541218 -1711023
5500a711023n47111r41060L78891J954652J993353O08589n93742n61945M84863
$$ -1711023 -2258134 -3199194 -2820303 -865651 1127702 1736291 1142549 580604 1065467
5491A065467J749234K197215Q84777j730127l380589k443388l83056k6442j639056
$$ 1065467 2814701 5011916 5896693 4166566 785977 -1657411 -2040467 -2066909 -3705965
5482c705965k655510j412955Q47182K157952K124795J383125N36515M56414J924028
$$ -3705965 -6361475 -7774430 -6927248 -4769296 -2644501 -1261376 -724861 -268447 1655581
5473A655581L958675M107926J565655j478072k782016k748245k710449k237841
$$ 1655581 5614256 9722182 11287837 9809765 7027749 4279504 1569055 -668786
5465f68786l28399J855116J981616l0669j859634k140090j958302k568978l375892
$$ -668786 -997185 857931 2839547 2808878 949244 -1190846 -3149148 -5718126 -9094018
5456i094018k962965r65039J741286L880877M444227L344411J764850J163872
$$ -9094018 -12056983 -13022022 -11280736 -7399859 -2955632 388779 2153629 3317501
5448C317501J676337K023918J028172j233630l443491l708893j093450K490171
$$ 3317501 4993838 7017756 8045928 6812298 3368807 -340086 -1433536 1056635
5440A056635L099998o55799m843466m579416n73562J988767J094139K49670J846297
$$ 1056635 4156633 3500834 -1342632 -5922048 -6495610 -4506843 -3412704 -3163034 -1316737
5431a316737K771992q702l293112j999894K469253L847719N17086k292130r24554
$$ -1316737 1455255 1446553 -1846559 -3846453 -1377200 2470519 2987605 695475 -229079
5422b29079J455132P36545j489075j167664J269151J786914o34859k564888j400758
$$ -229079 1226053 1962598 473523 -694141 575010 2361924 1727065 -837823 -2238581
5413b238581J404982L152522L180687K283456R72460m40819j472888k164848l025519
$$ -2238581 -833599 2318923 5499610 7783066 8755526 8314707 6841819 4676971 1651452
5404A651452l661819k789249l47756J755317K017400J279453J175305J723049
$$ 1651452 -2010367 -4799616 -5147372 -3392055 -1374655 -95202 1080103 2803152
5396B803152J851895J533323J728056K415942K221331L23061k333512m138717
$$ 2803152 4655047 6188370 7916426 10332368 12553699 12876760 10543248 6404531
5388F404531m361334l226286j202649J081588K512312J924503o13628l148659
$$ 6404531 2043197 -1183089 -2385738 -1304150 1208162 3132665 2519037 -629622
5380f29622l240745n74693K294358K724433J250997O80240J771367J816561j152713
$$ -629622 -3870367 -4445060 -2150702 573731 1824728 2504968 4276335 6092896 4940183
5371D940183m535894m057451J76063L390990K416492m24474j136306L99038R95601
$$ 4940183 404289 -3653162 -3477099 -86109 2330383 1905909 769603 1168641 2164242
5362B164242q17255k884144k601756n8186K558314L324830J766989j157024l420067
$$ 2164242 1346987 -1537157 -4138913 -4197099 -1638785 1686045 3453034 2296010 -1124057
5353a124057l076970q1427L196128L945754J601811j536792k353119J94570L796288
$$ -1124057 -4201027 -4282454 -1086326 2859428 4461239 2924447 571328 765898 4562186
5344D562186M583943R66390m214303o225252l540197M65879J571112m51616k217723
$$ 4562186 9146129 10112519 5898216 -327036 -3867233 -3401354 -1830242 -2281858 -4499581
5335d499581j354796R39147K163400J688643O82555M0164j70815K32800J416505
$$ -4499581 -5854377 -4915230 -2751830 -1063187 -380632 -340468 -511283 -278483 1138022
5326A138022K400172J656556n54909j862067q61407O39420J4924k294563l284241
$$ 1138022 3538194 5194750 4639841 2777774 1916367 2555787 2570711 276148 -3008093
5317c008093j689679L70569P34089J33040L86906J298450J347952N06914J09188
$$ -3008093 -4697772 -4327203 -3593114 -3460074 -3073168 -1774718 -426766 80148 189336
5308A89336K28110n35856k331398l225122j943345K72699J633932K138953K604186
$$ 189336 417446 -118410 -2449808 -5674930 -7618275 -7345576 -5711644 -3572691 -968505
5299i68505K653830J486295n4966j81773J020108J273733p21814l148503l159657
$$ -968505 1685325 3171620 3116654 2934881 3954989 5228722 4506908 1358405 -1801252
5290a801252m13814K557184L277037J646467p18329k444629l106039k724302j616170
$$ -1801252 -2215066 342118 3619155 5265622 4547293 2102664 -1003375 -3727677 -5343847
5281e343847n64903j67652J4346O76114J162176R8105j970214k402875j10192
$$ -5343847 -5908750 -6076402 -6062056 -5385942 -4223766 -4125661 -6095875 -8498750 -8608942
5272h608942K386849K345933O57106j18941j63581j524649l487509k839410O47610
$$ -8608942 -6222093 -3876160 -3219054 -3337995 -3501576 -5026225 -8513734 -11353144 -10705534
5263a0705534K961012J673603n57708n84469M43575l7969j024422L36351L568403
$$ -10705534 -7744522 -6070919 -6628627 -7213096 -6769521 -6807490 -7831912 -7495561 -3927158
5254c927158N214358L782886J087021j098645k744692l927621m142748l458675
$$ -3927158 1287200 5070086 6157107 5058462 2313770 -1613851 -5756599 -9215274
5246i215274k247129J1270L442226N801413M531804P45162j590789p09259J213184
$$ -9215274 -11462403 -11451133 -8008907 -2207494 2324310 3069472 1478683 769424 1982608
5237A982608J602242K50689j763977l383677l368821j241546J179207J572012
$$ 1982608 3584850 3835539 2071562 -1312115 -4680936 -5922482 -4743275 -3171263
5229c171263N56052O22101J667782J084147j235680j977754J19829J799704M45051
$$ -3171263 -2615211 -1993110 -325328 758819 -476861 -2454615 -2334786 -535082 -90031
5220i0031j825327j864000k16882P91605J018986J397291J113463q06439k816375
$$ -90031 -1915358 -3779358 -3996240 -3204635 -2185649 -788358 325105 -481334 -3297709
5211c297709k864359j596558o85635L17225K265429L264864J078815k351072k804648
$$ -3297709 -6162068 -7758626 -8444261 -8127036 -5861607 -2596743 -1517928 -3869000 -6673648
5202f673648J02319K504037K076332N05366m07468j385277k974262l348331j013440
$$ -6673648 -6571329 -4067292 -1990960 -1485594 -1893062 -3278339 -6252601 -9600932 -10614372
5193a0614372K231695L175004J141789j418343j841080J69635K594527L254232
$$ -10614372 -8382677 -5207673 -4065884 -5484227 -7325307 -7155672 -4561145 -1306913
5185a306913J994497O04478L97336O15401m8075j223530j433649l78907O80232
$$ -1306913 687584 1292062 1689398 2304799 2256724 1033194 -400455 -779362 -99130
5176i9130O53368l17584j366196j677430j024476o4111L95304O23975J406782
$$ -99130 554238 236654 -1129542 -2806972 -3831448 -3895559 -3500255 -2876280 -1469498
5167a469498K107196J122699j126896j959816m01929J027990K25902j287391j263183
$$ -1469498 637698 1760397 633501 -1326315 -1728244 -700254 -474352 -1761743 -3024926
5158c024926l44254j02400J27334J279248J684948j82941k084337j151285J070848
$$ -3024926 -3369180 -3471580 -3344246 -2064998 -380050 -562991 -2647328 -3798613 -2727765
5149b727765J102787m13863J7709K414905L387345K100403R50633M07469j350636
$$ -2727765 -1624978 -2038841 -2021132 393773 3781118 5881521 6832154 7239623 5888987
5140E888987l365928k276338J293943K606389N46282n92430Q36540N00385l736990
$$ 5888987 2523059 246721 1540664 4147053 4693335 4100905 4937445 5437830 1700840
5131A700840o590892l295281K336065L579063P30432p52219N26800Q32590j544623
$$ 1700840 -4890052 -8185333 -5849268 -2270205 -1539773 -2291992 -1765192 -932602 -2477225
5122b477225l756374l332150j299096L07522Q87217P40748M24803P30570J617313
$$ -2477225 -6233599 -9565749 -10864845 -10557323 -9670106 -8929358 -8504555 -7773985 -6156672
5113f156672J800455R45180Q73725K578058L673886J438873k867225n364800m316480
$$ -6156672 -4356217 -3411037 -2537312 40746 3714632 5153505 2286280 -3078520 -7395000
5104g395000j265671J470567K281472O02739j952133k272072K10209K024959O93806
$$ -7395000 -8660671 -7190104 -4908632 -4305893 -6258026 -8530098 -8319889 -6294930 -5601124
5095e601124j119659J95564L189447L761770J809643O47194Q24277k24977k409754
$$ -5601124 -6720783 -6525219 -3335772 425998 2235641 2882835 3707112 3482135 1072381
5086A072381k198725J253089L937433K861994J86176o87801J01542L83246l34353
$$ 1072381 -1126344 126745 4064178 6926172 7112348 6424547 6526089 6909335 6574982
5077F574982j112692j735854k427953k624619j736123k68414R56923J796301K218467
$$ 6574982 5462290 3726436 1298483 -1326136 -3062259 -3330673 -2373750 -577449 1641018
5068A641018J864207R51603N13705R29820J173777K59366j347691k376454k246385
$$ 1641018 3505225 4456828 4970533 5900353 7074130 7333496 5985805 3609351 1362966
5059A362966j542116j353647k112072k769797j681374J120697L399684L438468
$$ 1362966 -179150 -1532797 -3644869 -6414666 -8096040 -6975343 -3575659 -137191
5051a37191K324252K150288K806432K269078l41811l529354n041663l742395m82867
$$ -137191 2187061 4337349 7143781 9412859 9071048 5541694 500031 -3242364 -3725231
5042c725231K085039J752569k60014l25163K300419L641601P19708l413713l680211
$$ -3725231 -1640192 112377 -147637 -472800 1827619 5469220 6188928 2775215 -904996
5033i04996r2022K977176L299465K383892J274812q01564l344760m124127k626099
$$ -904996 -997018 1980158 5279623 7663515 8938327 8136763 4792003 667876 -1958223
5024a958223q35608r8205m5719o51845k214934l286570j889424J135225L134693
$$ -1958223 -2793831 -2892036 -2937755 -3589600 -5804534 -9091104 -10980528 -9845303 -6710610
5015f710610L612034L685955K460446j435078n165925m161256K29552J543724
$$ -6710610 -3098576 587379 3047825 1612747 -3553178 -7714434 -7484882 -5941158
5007e941158j864284l931176n70344L864848L807936Q59543o5245J130390R43670
$$ -5941158 -7805442 -11736618 -12306962 -8442114 -4634178 -3774635 -3839880 -2709490 -1765820
4998a765820j064006k136750j386017m54507n7671L54766L35852p90154j667057
$$ -1765820 -2829826 -4966576 -6352593 -6807100 -6864771 -6510005 -6174153 -6964307 -8631364
4989h631364m47137K052072L270639K207152k76274l133089m990390m042818n89513
$$ -8631364 -9078501 -7026429 -3755790 -1548638 -1824912 -4958001 -9948391 -13991209 -14580722
4980a4580722K010319J554860L91621J689157M189631M205931J465020q47010
$$ -14580722 -12570403 -11015543 -10623922 -8934765 -4745134 -539203 925817 78807
4972G8807j098010n41871k867J104109K290775J926087K26316n77575K88351J082461
$$ 78807 -1019203 -1561074 -1563941 -459832 1830943 3757030 3983346 3405771 3694122 4776583
4962D776583O09343j42934k70962n32112j492070k091009j489253p70392j140930
$$ 4776583 5385926 5242992 4972030 4439918 2947848 856839 -632414 -1402806 -2543736
4953b543736j553378j54906K244544K499575j53000j853652R37488N365900M756360
$$ -2543736 -4097114 -4252020 -2007476 492099 339099 -1514553 -577065 4788835 9545195
4944I545195k052164p984919o842931j476502J117163j28656n19383J888809M046800
$$ 9545195 7493031 -491888 -7334819 -8811321 -7694158 -7822814 -8342197 -6453388 -2406588
4935b406588L931834K869499J332823j746557m556080l331964Q23379K223224
$$ -2406588 1525246 4394745 5727568 3981011 -575069 -3907033 -3083654 -860430
4927h60430m09923j769903O61384K079232r98812m349845l235054N7554J226405
$$ -860430 -1270353 -3040256 -2378872 -299640 -1298452 -5648297 -8883351 -8825797 -7599392
4918g599392J028677J763647J885061j7171p62965J854539L784323J164442k667620
$$ -7599392 -6570715 -4807068 -2922007 -2939178 -3702143 -1847604 1936719 3101161 433541
4909D33541k982231j613524k317741l146893q68760J825618J395459R24844M160138
$$ 433541 -2548690 -4162214 -6479955 -9626848 -10495608 -8669990 -7274531 -6349687 -2189549
4900b189549O961256L878434j394980j980349K25975r81917l989936k930826N86101
$$ -2189549 4771707 8650141 7255161 5274812 5500787 4518870 528934 -2401892 -1815791
4891a815791J045823L37008L092550N133895L66412n285562k305678M469588L657141
$$ -1815791 -769968 -432960 2659590 7793485 8159897 2874335 568657 5038245 8695386
4882H695386j422724O57375N883776J765115n260781J786975J5186467J1086732
$$ 8695386 7272662 7930037 13813813 15578928 10318147 12105122 27291589 38378321
4874C8378321j270492J7912483O8244780Q5659432K6368240o0171072q9192656
$$ 38378321 37107829 55020312 123265092 208924524 235292764 175121692 85929036
4867H5929036n0129027p574321l649688j4359795q049194N251300L910479n660483
$$ 85929036 35800009 28225688 24576000 10216205 2167011 7418311 11328790 5668307
4859E668307o741693k956938n409854q477130k035731O706908N181470j983932
$$ 5668307 -1073386 -4030324 -9440178 -17917308 -19953039 -13246131 -8064661 -10048593
4851a0048593j989629L691627M301796m6369p11821K253282J516876k487677k748929
$$ -10048593 -12038222 -8346595 -4044799 -4091168 -4802989 -2549707 -1032831 -3520508 -6269437
4842f269437N37493P65901k259134k488536P14172K211704J207600J399503K301814
$$ -6269437 -5731944 -4966043 -7225177 -9713713 -8999541 -6787837 -5580237 -4180734 -1878920
4833a878920M14236k173523l08760L967505L567353j594591m352658k225782j58963
$$ -1878920 -1464684 -3638207 -3946967 20538 3587891 1993300 -2359358 -4585140 -4744103
4824d744103o67269n18075J286017J028244j942534k828598N78411M301649N013639
$$ -4744103 -5411372 -5929447 -4643430 -3615186 -5557720 -8386318 -7807907 -3506258 1507381
4815A507381M178718L262645J012192k199343l168791j383863l94619j615935
$$ 1507381 5686099 8948744 9960936 7761593 4592802 3208939 2814320 1198385
4807A198385k127009o37038l7387j592149k090622L04527K478045J839676P39303
$$ 1198385 -928624 -1565662 -1603049 -3195198 -5285820 -4981293 -2503248 -663572 75731
4798G5731J946432L726201K953036n6507k840613m110037l464130q58898J599264
$$ 75731 2022163 5748364 8701400 8644893 5804280 1694243 -1769887 -2628785 -1029521
4789a029521P45260k659703l696257l00339L433343L621125K094612K097123K457407
$$ -1029521 -284261 -2943964 -6640221 -6940560 -3507217 113908 2208520 4305643 6763050
4780F763050M60109k496970k898312q90772L88640J13857L09803J603465K002441
$$ 6763050 7223159 4726189 1827877 937105 1325745 1439602 1749405 3352870 5355311
4771E355311M7522l295351n869564n844598k778027J308874L142140K058911J068030
$$ 5355311 5402833 2107482 -3762082 -9606680 -12384707 -11075833 -7933693 -5874782 -4806752
4762d806752K347852L817977K646238O6185o04976O23053O43604j516949l169615
$$ -4806752 -2458900 1359077 4005315 4071500 3466524 4089577 4733181 3216232 46617
4753D6617k192221n8064M74832r16139j813287k7245L559452N488627L749659
$$ 46617 -2145604 -2203668 -1728836 -2644975 -4458262 -4485507 -926055 4562572 8312231
4744H312231O95392O2397J464696R76200k309574m354461k740484r11162k370916
$$ 8312231 9007623 9070020 10534716 11510916 9201342 4846881 2106397 1195235 -1175681
4735a175681m401127k423108J970717L031218j79804k541783q89195J869752J891796
$$ -1175681 -5576808 -7999916 -6029199 -2997981 -3177785 -5719568 -6608763 -4739011 -2847215
4726b847215o08536l135928m230851l392971o18678K435792L281701J841783O56583
$$ -2847215 -3455751 -6591679 -10822530 -14215501 -14834179 -12398387 -9116686 -7274903 -6618320
4717f618320J054959J610166J177929P04336R84473J375606J826296L265886M722612
$$ -6618320 -5563361 -3953195 -2775266 -2070930 -1086457 289149 2115445 5381331 10103943
4708A0103943L315169j014001l989291k740345j30312k91329k351112k332458
$$ 10103943 13419112 12405111 8415820 5675475 5545163 5253834 2902722 570264
4700E70264L13291K071183P93857j769346l119508k807992j579768q9597Q65510
$$ 570264 883555 2954738 3748595 1979249 -1140259 -3948251 -5528019 -5617616 -4752106
4691d752106O85772Q5367L25624J062113O38759j101866k120901j093311N89562
$$ -4752106 -4066334 -3980967 -3655343 -2593230 -1954471 -3056337 -5177238 -6270549 -5680987
4682e680987R03075O8908j19416P82824J265178L54092p15042l11240Q89043N71623
$$ -5680987 -4777912 -4709004 -4828420 -4045596 -2780418 -2426326 -3141368 -3452608 -2563565 -1991942
4672a991942j639326k905807p47532L156783M602853K058789j624903k933861
$$ -1991942 -3631268 -6537075 -7284607 -4127824 475029 2533818 908915 -2024946
4664b024946j353853J184635K755349K472216O67139r25925n43518J103154J232818
$$ -2024946 -3378799 -2194164 561185 3033401 3700540 2774615 2231097 3334251 4567069
4655D567069j043915l027474k302688m51451n65959k402428k803498m42201K522252
$$ 4567069 3523154 495680 -1807008 -2258459 -2824418 -5226846 -8030344 -8472545 -5950293
4646e950293L624217K680431R04292n88085r19652K14476J767274K101083Q41742
$$ -5950293 -2326076 354355 1258647 670562 -249090 -34614 1732660 3833743 4675485
4637D675485r61158k254729k349210n52109K607715M289362K088843j966299l045680
$$ 4675485 3714327 1459598 -889612 -1441721 1165994 5455356 7544199 5577900 2532220
4628B532220k9226K491275M39416m081821n900664l750361j021883k46110p7465
$$ 2532220 2502994 4994269 5433685 1351864 -4548800 -8299161 -9321044 -9567154 -9644619
4619i644619J516646L585266L419753L61323l192675m486924l123899q57654O28067
$$ -9644619 -8127973 -4542707 -1122954 -761631 -3954306 -8441230 -11565129 -12422783 -11794716
4610a1794716J079009R81844M26973o67190j592111j070839J254168M018721N155815
$$ -11794716 -10715707 -9733863 -9306890 -9974080 -11566191 -12637030 -11382862 -7364141 -2208326
4601b208326L724059Q85645q95934k09937J439661J038095j905266l917191j821140
$$ -2208326 1515733 2401378 1505444 1295507 2735168 3773263 1867997 -2049194 -3870334
4592c870334K410938L525870k02187m634314n212576k366782K35130Q97885R18252
$$ -3870334 -1459396 2066474 1864287 -2770027 -7982603 -10349385 -10114255 -9216370 -8298118
4583h298118J393913J667098J085010K39282k04004m91779q75531p52424M62322
$$ -8298118 -6904205 -5237107 -4152097 -3912815 -4116819 -4608598 -5484129 -6236553 -5774231
4574e774231K201302L225936L003059K086054J235116N92010j77207j172933j924401
$$ -5774231 -3572929 -346993 2656066 4742120 5977236 6569246 6392039 5219106 3294705
4565C294705j785247n94937J025059J961291J412882j79719j151740l23377J193405
$$ 3294705 1509458 914521 1939580 3900871 5313753 5134034 3982294 3658917 4852322
4556D852322R64928j447876l398246k492328J95721J924158K232352K718873L437156
$$ 4852322 5817250 4369374 971128 -1521200 -1325479 598679 2831031 5549904 8987060
4547H987060K498761l00431k413950k297959j571430j787294j613584M03100K372668
$$ 8987060 11485821 11185390 8771440 6473481 4902051 3114757 1501173 1904273 4276941
4538D276941J364025k006605m254738l750972k071947r46265n03952n21487p96330
$$ 4276941 5640966 3634361 -620377 -4371349 -6443296 -7389561 -7893513 -8415000 -9211330
4529i211330j28940K399422M797759L769582k00542k506496p94244J432172J97916
$$ -9211330 -9340270 -6940848 -2143089 1626493 1425951 -1080545 -1874789 -442617 -244701
4520b44701k653798k353309J148147K939553P11092j825440q06327K051667K462522
$$ -244701 -2898499 -5251808 -4103661 -1164108 -453016 -2278456 -3084783 -1033116 1429406
4511A429406L776j853125j128208N79721J377663J451201J448013J023187J15196
$$ 1429406 1433182 -419943 -1548151 -968430 409233 1860434 3308447 4331634 4446830
4502D446830m02665n23578j563627l474679l828220j366725J409006J604847K04042
$$ 4446830 4044165 3520587 1956960 -1517719 -5345939 -6712664 -5303658 -3698811 -3494769
4493c494769J52276J568270K189239J641822J450503J140999j353955m815526
$$ -3494769 -3342493 -1774223 415016 2056838 3507341 4648340 3294385 -1521141
4485a521141m752384j6943M621322M908648K533960J331208J472521R83370J62147
$$ -1521141 -6273525 -6290468 -1669146 3239502 5773462 7104670 8577191 9560561 9722708
4476I722708L48181L90725j332178k992813j996050l30827j998561n480269m675242
$$ 9722708 10070889 10461614 9129436 6136623 4140573 3809746 1811185 -3669084 -8344326
4467h344326J411068N706141K780405l227796m619128p80866K132877O75357j797246
$$ -8344326 -6933258 -1227117 1553288 -1674508 -6293636 -7074502 -4941625 -4266268 -6063514
4458f063514j047742K077139L598743K008416m05261j070258l5846R58173J054398
$$ -6063514 -7111256 -5034117 -1435374 573042 167781 -902477 -938323 19850 1074248
4449A074248Q76518R05150N30067o93612j799257j536194k75896M55745K13161
$$ 1074248 1950766 2855916 3385983 2692371 893114 -643080 -918976 -463231 -250070
4440b50070J14308R40598J979052K179922J491235N89201O6938K26092R03151
$$ -250070 -135762 804836 2783888 4963810 6455045 7044246 7111184 7337276 8240427
4431H240427J240809M82685p06876o60600J042435K562252J717854j537005n050062
$$ 8240427 9481236 9963921 9257045 8596445 9638880 12201132 13918986 12381981 7331919
4422G331919o526052n315631k555827M371J312685J310513K92182j284495k192601
$$ 7331919 805867 -4509764 -7065591 -7061220 -5748535 -4438022 -4145840 -5430335 -7622936
4413g622936q85099K317796M367884K498176k088681n143342m175836r15062J393027
$$ -7622936 -8508035 -6190239 -1822355 675821 -1412860 -6556202 -10732038 -11647100 -10254073
4404a0254073J713676J426908J808362K426898J951833J1333k014561k333864
$$ -10254073 -8540397 -7113489 -5305127 -2878229 -926396 -915063 -2929624 -5263488
4396e263488r59753N5574q61686k695802l058850j051545J866003L378368K033437
$$ -5263488 -6223241 -6167667 -7029353 -9725155 -12784005 -13835550 -11969547 -8591179 -6557742
4387f557742j712601n208636n241112j215872L831495O289606N173219J657036
$$ -6557742 -8270343 -13478979 -18720091 -19935963 -16104468 -9814862 -4641643 -2984607
4379b984607k675039n593457m508660K45077M063952L242472K35583J21809K830098
$$ -2984607 -5659646 -11253103 -15761763 -15516686 -11452734 -8210262 -7974679 -7852870 -5022772
4370e022772L436957K47434k404894r87849K011205K338248J13270j365064p72434
$$ -5022772 -1585815 -1338381 -3743275 -4731124 -2719919 -381671 -268401 -1633465 -2405899
4361b405899K87508L70629j59606k03737O85392J684457J220218r30167k380848
$$ -2405899 -2118391 -1747762 -1907368 -2111105 -1425713 258744 1478962 548795 -1832053
4352a832053r08619J755414J632922j742369m429231l784857j714845p44997j88966
$$ -1832053 -2740672 -985258 647664 -1094705 -5523936 -9308793 -11023638 -11768635 -11957601
4343a1957601J517361L437229L677245K326344O64393q09713j812943j707693
$$ -11957601 -10440240 -7003011 -3325766 -999422 -335029 -1144742 -2957685 -4665378
4335d665378j092083j720711l253142k729383P85344L877992L479749J099476
$$ -4665378 -5757461 -7478172 -10731314 -13460697 -12675353 -8797361 -5317612 -4218136
4327d218136k64024n69875r78716m84134J825995L351219J100156l072398m393540
$$ -4218136 -4482160 -5052035 -6030751 -6514885 -4688890 -1337671 -237515 -3309913 -7703453
4318g703453j610318K049968L682901L088668R90647j654192k782516q67427K433791
$$ -7703453 -9313771 -7263803 -3580902 -492234 498413 -1155779 -3938295 -4805722 -2371931
4309b371931L844838K599912P61085j44712m54471p28753r78227j205243j070824
$$ -2371931 1472907 4072819 4833904 4689192 4234721 3505968 2527741 1322498 251674
4300B51674J08801J588496J111143j538890l078681j271414J443880J837269Q60554
$$ 251674 360475 1948971 3060114 1521224 -1557457 -2828871 -1384991 452278 1312832
4291A312832J081079J651274L02917j675532j414607J04063j90423j445842k98656
$$ 1312832 2393911 4045185 4348102 2672570 1257963 1362026 1171603 -274239 -572895
4282e72895K322522J900054j835009l798242j469244J688747K367336J676153
$$ -572895 1749627 3649681 1814672 -1983570 -3452814 -1764067 603269 2279422
4274B279422J213712r1445k573740l623559j721296R13380K099730K581740K953965
$$ 2279422 3493134 3401689 827949 -2795610 -4516906 -3603526 -1503796 1077944 4031909
4265D031909J628389j393037k523902K17810L154644J759770k830536n714428
$$ 4031909 5660298 4267261 1743359 1961169 5115813 6875583 4045047 -1669381
4257a669381m918607k745449j464000q13434L17948J876112K581059J192508j717762
$$ -1669381 -6587988 -9333437 -10797437 -11610871 -11292923 -9416811 -6835752 -5643244 -7361006
4248g361006l356378j609874J722612K898284J553783J015001K594351L237969
$$ -7361006 -10717384 -12327258 -10604646 -7706362 -6152579 -5137578 -2543227 694742
4240F94742P48262k076635j510351J279913J842822j229244m501840m092901J5501
$$ 694742 1443004 -633631 -2143982 -864069 978753 -250491 -4752331 -8845232 -8829731
4231h829731M136799M439144N92157l764329m740400k286129M14035J127563M06884
$$ -8829731 -4692932 -253788 338369 -3425960 -8166360 -10452489 -10038454 -8910891 -8504007
4222h504007m03025o94435j4227J711836K956989J797641j125224k860806j908214
$$ -8504007 -8907032 -9601467 -9615694 -7903858 -4946869 -3149228 -4274452 -7135258 -9043472
4213i043472K5201M31753j212047l050361k236252K303966P342739P651739K732069
$$ -9043472 -9018271 -8586518 -9798565 -12848926 -15085178 -12781212 -5438473 2213266 4945335
4204D945335j593142j145511O56369q88232l501655k376162L75719j147673n738560
$$ 4945335 3352193 2206682 2863051 1974819 -1526836 -3902998 -3527279 -4674952 -10413512
4195a0413512o230599j379526K521709K826680L889771P020577O716194R53357
$$ -10413512 -16644111 -18023637 -15501928 -12675248 -8785477 -1764900 4951294 5904651
4187E904651l545190j592098K366390K023080j340629k824597j843071p11368
$$ 5904651 2359461 767363 3133753 5156833 3816204 991607 -851464 -1562832
4179a562832M3762L75652r02544k831802k195293M80062N95377k238426k613061
$$ -1562832 -1519070 -1143418 -2045962 -4877764 -7073057 -6592995 -5997618 -8236044 -10849105
4170a0849105R02121K456202n64879k340396R21863M057048K515676J94453R87147
$$ -10849105 -9946984 -7490782 -8055661 -10396057 -9474194 -5417146 -2901470 -2707017 -1719870
4161a719870J193318k225562m444690j854023K64739k311085l881030P50346N701876
$$ -1719870 -526552 -2752114 -7196804 -9050827 -8786088 -11097173 -14978203 -14227857 -8525981
4152h525981L996494l27248n85788N72628j529833l142194m13335J041211l055287
$$ -8525981 -4529487 -4856735 -5442523 -4869895 -6399728 -9541922 -9955257 -8914046 -11969333
4143a1969333n280959J39376M766203R34657l249156j7324J391000o611224j0979929
$$ -11969333 -17250292 -17110916 -12344713 -11410056 -14659212 -14676536 -13285536 -19896760 -30876689
4134c0876689j548800M355631r036770k1325584j0399244l938610m1396150r0422108
$$ -30876689 -32425489 -28069858 -37106628 -58432212 -68831456 -72770066 -114166216 -204588324
4126b04588324o8864196L2780315J16442435J00767897K5853643j4438427j58769
$$ -204588324 -273452520 -240672205 -124229770 -23461873 2391770 -12046657 -12205426
4119a2205426J5085551L161371q474200j47273Q485547J553677n965926q10398
$$ -12205426 2880125 6041496 -2432704 -2579977 5905570 7459247 1493321 682923
4111F82923N242453J180756l305917O55324M092435p51612n321901k156381J171277
$$ 682923 5925376 7106132 3800215 4455539 8547974 7796362 2474461 318080 1489357
4102A489357k049464m693972m95138L735741J723581p30726J714577L498928K56669
$$ 1489357 -560107 -5254079 -5749217 -2013476 -289895 -1020621 693956 4192884 4449553
4093D449553j903605J005107K152606k283186l916004K427918P153612J857001
$$ 4449553 2545948 3551055 5703661 3420475 -495529 1932389 9086001 10943002
4085A0943002n217595k896819M260762M896498k97892k638252j298907j452611
$$ 10943002 5725407 2828588 7089350 11985848 11687956 9049704 7750797 6298186
4077F298186k192957N84592L667543J206734l718288l653736M54487J922179M17841
$$ 6298186 4105229 4689821 8357364 9564098 5845810 2192074 2646561 4568740 4986581
4068D986581N42654J486452p81101l610920j317421L190759J963424l847642n143724
$$ 4986581 5529235 7015687 6234586 2623666 1306245 4497004 6460428 2612786 -2530938
4059b530938l41184K080865j747114n048520k446311J797712K121430R2362m81274
$$ -2530938 -2872122 -791257 -2538371 -7586891 -10033202 -8235490 -6114060 -6021698 -6502972
4050f502972l02786j357578j931935L08678L696977M921833L549834J417834l35551
$$ -6502972 -6805758 -8163336 -10095271 -9786593 -6089616 -1167783 2382051 3799885 3464334
4041C464334j571126k279256k685730k784000j743707L13218Q56655j823400m960006
$$ 3464334 1893208 -386048 -3071778 -5855778 -7599485 -7286267 -6429612 -8253012 -13213018
4032a3213018m521324j182036J074904J503848K809379N061010M906439J677948
$$ -13213018 -17734342 -18916378 -17841474 -16337626 -13528247 -8467237 -3560798 -1882850
4024a882850j025079j288372j353745k326360j549013K009421M391065K230460
$$ -1882850 -2907929 -4196301 -5550046 -7876406 -9425419 -7415998 -3024933 -794473
4016g94473j861921l123090j106659J081918J721235J272165N1668j574102j901547
$$ -794473 -2656394 -5779484 -6886143 -5804225 -4082990 -2810825 -2759157 -4333259 -6234806
4007f234806J83515K834533L447081K431582K137428K669915J797170q23406k294587
$$ -6234806 -6051291 -3216758 230323 2661905 4799333 7469248 9266418 8443012 6148425
3998F148425n79997K224238K580013K68100j666433j465388q64112j833795l158037
$$ 6148425 5568428 7792666 10372679 10640779 8974346 7508958 6644846 4811051 1653014
3989A653014k432010l36242O2736j670355k233069L34274L488399M113142K855831
$$ 1653014 -778996 -1115238 -1052502 -2722857 -4955926 -4621652 -1133253 2979889 5835720
3980E835720J807720L48901k998851o240385n729785j852396J199369J486661
$$ 5835720 7643440 7992341 4993490 -1246895 -6976680 -8829076 -7629707 -6143046
3972f143046J237305K113848K581148J390838L9346k11227n73313j739732j657618
$$ -6143046 -4905741 -2791893 -210745 1180093 1219439 1008212 434899 -1304833 -2962451
3963b962451Q17094K574199J88447m291088n401779j822288J827554J515727j034299
$$ -2962451 -2145357 428842 617289 -3673799 -9075578 -10897866 -9070312 -7554585 -8588884
3954h588884j421189J429368M609019N428628L936527J463756j126408l061675
$$ -8588884 -10010073 -8580705 -3971686 1456942 5393469 6857225 5730817 2669142
3946B669142l283084j745153p6423L60524K93337J044279K005247J482568l67883
$$ 2669142 -613942 -2359095 -2435518 -2074994 -1781657 -737378 1267869 2750437 2382554
3937B382554j649913j754257j865042k109855r77601J445692K600763J550737
$$ 2382554 732641 -1021616 -2886658 -4996513 -5974114 -4528422 -1927659 -376922
3929c76922J085513L194719N010902K732461k097718m184019j837521R77145L70585
$$ -376922 708591 3903310 8914212 11646673 9548955 5364936 3527415 4504560 4875145
3920D875145k764346m709760l416114j58894J939436P89320k211316l131801j73885
$$ 4875145 2110799 -2598961 -6015075 -6173969 -4234533 -3445213 -5656529 -8788330 -8962215
3911h962215L807606N235536M504110L927019K877626p34754n059512n539549
$$ -8962215 -5154609 80927 4585037 8512056 11389682 10654928 5595416 55867
3903E5867k068594K03670j264070k767530j086035J069468K33260j288174P88672
$$ 55867 -2012727 -1809057 -3073127 -5840657 -6926692 -5857224 -5623964 -6912138 -6123466
3894f123466M920774N367925R33780l116625k582481N07863J779086K05607k165203
$$ -6123466 -1202692 4165233 5099013 1982388 -600093 -92230 1686856 1892463 -272740
3885b72740l865335m931013n155794l572978J2778L929748N655586M125150J037556
$$ -272740 -4138075 -9069088 -14224882 -17797860 -17785082 -13855334 -8199748 -4074598 -3037042
3876c037042o16358K96183J933778K037484P36533k77753n83267j303478k684375
$$ -3037042 -3653400 -3357217 -1423439 614045 1350578 1072825 489558 -813920 -3498295
3867c498295l246129j962433J46842J501552J970122K323957K431770J317687
$$ -3498295 -6744424 -8706857 -8560015 -7058463 -5088341 -2764384 -332614 985073
3859I85073j038429l001951k812861m71234K092296K665158Q03556j503705j605190
$$ 985073 -53356 -3055307 -5868168 -6339402 -4247106 -1581948 -778392 -2282097 -3887287
3850c887287Q38123L059247K317834l99659j304809J098400L553293K203944j995520
$$ -3887287 -3049164 10083 2327917 1928258 623449 1721849 5275142 7479086 5483566
3841E483566m337938k621772J95437N01459j074324j249207P05528J881575M3212
$$ 5483566 1145628 -1476144 -1280707 -779248 -1853572 -3102779 -2397251 -515676 -472464
3832d72464l033100l789725j529495P68281N30779r20610m18556K122387L212001
$$ -472464 -3505564 -7295289 -8824784 -8056503 -7525724 -8446334 -8864890 -6742503 -3530502
3823c530502J054629j223411n452L016085K976969r49225m434077m387351k399653
$$ -3530502 -2475873 -3699284 -3704736 -688651 2288318 1339093 -3094984 -7482335 -9881988
3814i881988p08401J000258K650179J865268j709976l785181j177524K705337
$$ -9881988 -10590389 -9590131 -6939952 -5074684 -6784660 -10569841 -11747365 -9042028
3806i042028K675946k68755r32542J626578L226528J818171R2599Q2743J47311
$$ -9042028 -6366082 -6634837 -7567379 -5940801 -2714273 -896102 -803503 -720760 -573449
3797e73449j176364k511144k495456j785859q75824O81003J830947N87397j762481
$$ -573449 -1749813 -4260957 -6756413 -8542272 -9418096 -8737093 -6906146 -6318749 -8081230
3788h081230j184276K675640M957483K823106j98994k44941P73036p57003l500492
$$ -8081230 -9265506 -6589866 -1632383 1190723 991729 746788 1519824 762821 -2737671
3779b737671l538169j027442M80571k3794m93985m05302j206220k397114j594366
$$ -2737671 -6275840 -7303282 -6822711 -6846505 -7340490 -7745792 -8952012 -11349126 -12943492
3770a2943492J033459K364937J174510j89200J6575M88324N4267J32401J951805
$$ -12943492 -11910033 -9545096 -8370586 -8559786 -8543211 -8054887 -8000620 -7868219 -5916414
3761e916414L780888L328835J326941L83807J128323J594010K45887k044535l353316
$$ -5916414 -2135526 1193309 2520250 2904057 4032380 5626390 5872277 3827742 474426
3752D74426l004229j994384j481497j328615m82953J216470K291895J367632p61446
$$ 474426 -2529803 -4524187 -6005684 -7334299 -7817252 -6600782 -4308887 -2941255 -3702701
3743c702701j819149q10191Q93504J487404Q06479j18922p91960j501281k036285
$$ -3702701 -5521850 -6332041 -5438537 -3951133 -3144654 -3263576 -4055536 -5556817 -7593102
3734g593102j340596Q75242K905068K670738N89218n56485O90058K187658R81185
$$ -7593102 -8933698 -8058456 -5153388 -2482650 -1893432 -2449917 -1759859 427799 1408984
3725A408984k559529n183880m919598k795201m07097K033443M501955N889949
$$ 1408984 -1150545 -6334425 -11254023 -14049224 -14456321 -12422878 -7920923 -2030974
3717b030974N161819K747278J5763j771140j799066l90830M02506j311869m222561
$$ -2030974 3130845 5878123 5893886 4122746 2323680 1932850 2335356 1023487 -3199074
3708c199074m573295r17354L627869M943672K217391k062719m583953k984077
$$ -3199074 -7772369 -8689723 -5061854 -118182 2099209 36490 -4547463 -7531540
3700g531540K390847P224811O385620K87477m411665k892933J467761J921240
$$ -7531540 -5140693 2084118 8469738 8757215 4345550 1452617 2920378 4841618
3692D841618k512230o554517o258160l040719r9942J490299K089969J744801O60681
$$ 4841618 2329388 -4225129 -10483289 -13524008 -13623950 -12133651 -10043682 -8298881 -7638200
3683g638200j88607j05821N15149Q99641P53845L72646M29791J303937K184877
$$ -7638200 -7826807 -7932628 -7417479 -6517838 -5763993 -5391347 -4961556 -3657619 -1472742
3674a472742J753382K91966l10397N05448R28454J485l60137J363659L223754
$$ -1472742 280640 572606 262209 767657 1696111 1697596 1337459 2701118 5924872
3665E924872K699123P29574k32613m20775j445342k316558r12710J470620J397432
$$ 5924872 8623995 9353569 9120956 8700181 7254839 4938281 4025571 5496191 6893623
3656F893623j151370k763493k147951j323921r55612P68498L525188L824858N08539
$$ 6893623 5742253 2978760 830809 -493112 -1448724 -680226 2844962 6669820 7178359
3647G178359k832485l123028j763197j044396l50551J204892J712096n30839l420077
$$ 7178359 4345874 1222846 -540351 -1584747 -1935298 -730406 981690 450851 -2969226
3638b969226l806521k021732o51752m14514j12206O93980J610077K727351L605553
$$ -2969226 -6775747 -8797479 -9449231 -9863745 -9975951 -9281971 -7671894 -4944543 -1338990
3629a338990K430156j179573l938193k453872J868843M364930L030010K64188
$$ -1338990 1091166 -88407 -4026600 -6480472 -4611629 -246699 2783311 3047499
3621C047499r83919l26756Q20024J070778M3457j127174o93031J079978J339341
$$ 3047499 2063580 1736824 2556848 3627626 3671083 2543909 1850878 2930856 4270197
3612D270197j576687n136350n681311l313313j043924p7098Q63497K002043J903921
$$ 4270197 2693510 -2442840 -8124151 -11437464 -12481388 -12558486 -11694989 -9692946 -7789025
3603g789025P90760J029123L173076M453948K752637l52649k198843k576992k694299
$$ -7789025 -6998265 -5969142 -2796066 1657882 4410519 4057870 1859027 -717965 -3412264
3594c412264k329072m14695K337715L605145K271739l19482j994504j681148J36555
$$ -3412264 -5741336 -6156031 -3818316 -213171 2058568 1739086 -255418 -1936566 -1800011
3585a800011J939706K177669O01282j272546j622407l23490J030680J145504M35554
$$ -1800011 139695 2317364 2918646 1646100 23693 -299797 730883 1876387 2311941
3576B311941J12483L94357K87828r15023k589576l538032l309966k288301q89254
$$ 2311941 2424424 2818781 3106609 2191586 -397990 -3936022 -7245988 -9534289 -10423543
3567a0423543N67944J433059J161515L01751R4854P88900J285907Q80592L29261
$$ -10423543 -9855599 -8422540 -7261025 -6959274 -6864420 -6075520 -4789613 -3909021 -3579760
3558c579760N04278R39073O42377l82379j407190k104694k347196j525783N88542
$$ -3579760 -3075482 -2136409 -1494032 -1876411 -3283601 -5388295 -7735491 -9261274 -8672732
3549h672732K627668K708103Q52194q33286o46998R70176K363102K358947P68373
$$ -8672732 -6045064 -3336961 -2484767 -3318053 -3965051 -2994875 -631773 1727174 2495547
3540B495547j742639l608992l009716L77680M351208N754785L504681k13274k129861
$$ 2495547 752908 -2856084 -5865800 -5488120 -1136912 4617873 8122554 7909280 5779419
3531E779419j186557P68047J545214J039766M92989K22957m88352j553594j936741
$$ 5779419 4592862 5360909 6906123 7945889 8438878 8661835 8173483 6619889 4683148
3522D683148j707381k332304l935582m171647j589956J413684J450394q83092
$$ 4683148 2975767 643463 -3292119 -7463766 -9053722 -7640038 -6189644 -7072736
3514g072736j693748N36911K914273K705656J201746J074523J984537J535616
$$ -7072736 -8766484 -8229573 -5315300 -2609644 -1407898 -333375 1651162 3186778
3506C186778m58474j672712j248927j151222k498505l080517o15431L105524L957372
$$ 3186778 2728304 1055592 -193335 -1344557 -3843062 -6923579 -7539010 -4433486 -476114
3497d76114R72119k359918k706889p46818N66193l7840j291944j523523k95187
$$ -476114 496005 -1863913 -4570802 -5317620 -4751427 -4789267 -6081211 -7604734 -7899921
3488g899921J595604K729874K055206M4475j549813j674087j042128o70639l65743
$$ -7899921 -6304317 -3574443 -1519237 -1474762 -3024575 -4698662 -5740790 -6411429 -6777172
3479f777172M40250J417412K077364K776740L646251L519310J518188j108362
$$ -6777172 -6336922 -4919510 -2842146 -65406 3580845 7100155 8618343 7509981
3471G509981k353055j909474p57632O34186J865233J607883n70015k417796j675949
$$ 7509981 5156926 3247452 2489820 3124006 4989239 6597122 6027107 3609311 1933362
3462A933362L55156P66557l84846q02955m56168j372940l203491l328061j703300
$$ 1933362 2288518 3055075 2670229 1867274 1411106 38166 -3165325 -6493386 -8196686
3453h196686j102526j811624r03896J885625K651964j43495k561309j436103R19006
$$ -8196686 -9299212 -11110836 -12014732 -10129107 -7477143 -7620638 -10181947 -11618050 -10699044
3444a0699044J480392J360639K119282J830925o15714j638036J257776L678491
$$ -10699044 -9218652 -7858013 -5738731 -3907806 -4523520 -6161556 -4903780 -1225289
3436a225289N22677n049639n582159l54811M334100M851274L485886K390282Q85059
$$ -1225289 -702612 -5752251 -11334410 -11689221 -7355121 -2503847 982039 3372321 4257380
3427D257380p43238q59939o03263k609244n022404k975391K819502N461514J959723
$$ 4257380 3514142 2654203 2050940 -558304 -5580708 -8556099 -5736597 -275083 1684640
3418A684640k289082k025468O69869J324769O3507n85211o57161j192384j113761
$$ 1684640 -604442 -2629910 -1960041 -635272 -571765 -1156976 -1814137 -3006521 -4120282
3409d120282J96186J77906k958294o132954n316619j491913J178922J445427J476560
$$ -4120282 -3924096 -3746190 -6704484 -12837438 -18154057 -19645970 -18467048 -17021621 -15545061
3400a5545061K533337L644912L918097L382793K152942Q02845N53000J380191
$$ -15545061 -13011724 -9366812 -5448715 -2065922 87020 889865 1442865 2823056
3392B823056J482588K36934m33049M99955R46889o36035k052792r11808J021395
$$ 2823056 4305644 4542578 4109529 4609484 5556373 4920338 2867546 1955738 2977133
3383B977133N03315k023078l436585k620467q86064Q23621K041413J679573p9806
$$ 2977133 3480448 1457370 -1979215 -4599682 -5485746 -4662125 -2620712 -941139 -1020945
3374a020945o37492J076665J842017q15261l431500j460916K818822L284460k59654
$$ -1020945 -1658437 -581772 1260245 444984 -2986516 -4447432 -1628610 1655850 1396196
3365A396196j895268O37285K684794Q01723k013010j895406J78833J382793J495312
$$ 1396196 -499072 138213 2823007 3624730 1611720 -283686 -104853 1277940 2773252
3356B773252J182339n12238l627017n227413l103949Q78076L789845N365396N982748
$$ 2773252 3955591 3443353 -183664 -5411077 -8515026 -7636950 -3847105 1518291 7501039
3347G501039L909146j683135p078916p526419l477475J78490N94311m87537m66200
$$ 7501039 11410185 9727050 2648134 -4878285 -8355760 -8177270 -7582959 -8070496 -8536696
3338h536696Q02812J840978J512310k99485k469681l013590j031703J825306L048544
$$ -8536696 -7733884 -5892906 -4380596 -4680081 -7149762 -10163352 -11195055 -9369749 -6321205
3329f321205K175547Q68960N26883J081153J852749K365592K402309K084728J688733
$$ -6321205 -4145658 -3276698 -2749815 -1668662 184087 2549679 4951988 7036716 8725449
3320H725449R70792n74843k379645k957311k067940j203530r90443q688K310044
$$ 8725449 9696241 9121398 6741753 3784442 1716502 512972 -477471 -486159 1823885
3311A823885L659727K006569r05578j886810q94440l78818r82101j154797o52063
$$ 1823885 5483612 7490181 6584603 4697793 3803353 3424535 2442434 1287637 635574
3302F35574r74931k116346k195443r61706m27648j059009o57896J421942K224504
$$ 635574 -339357 -2455703 -4651146 -5612852 -6040500 -7099509 -7757405 -6335463 -4110959
3293d110959k82215l366844l201674m74400Q62818n81616k144305j175915J966335
$$ -4110959 -4393174 -7760018 -10961692 -11436092 -10573274 -11154890 -13299195 -14475110 -12508775
3284a2508775N064634O107059M198223L62873k456399k017336M59626J788900
$$ -12508775 -7444141 -1337082 2861141 3224014 767615 -1249721 -790095 998805
3276I98805R82116n1271M5179L82271K20582N19795J687517J963656L7144k311367
$$ 998805 1980921 1929650 1974829 2357100 2577682 3097477 4784994 6748650 6785794 4474427
3266D474427k426574o23622M97994J6466m83109o4192L0832j190339k495728k152992
$$ 4474427 2047853 1424231 1922225 1938691 1455582 1391390 1422222 231883 -2263845 -4416837
3256d416837k85525J743944L210024L929150L245623Q89117j548428j917246n38522
$$ -4416837 -4702362 -2958418 251606 4180756 7426379 8315496 6767068 4849822 4311300
3247D311300j16047j861285l435105k225927O28138J601755l45753k567167k610855
$$ 4311300 4195253 2333968 -1101137 -3327064 -2698926 -1097171 -1442924 -4010091 -6620946
3238f620946j010876N99752J823404K436017J264175j457609k427259P78087N088394
$$ -6620946 -7631822 -7032070 -5208666 -2772649 -1508474 -2966083 -5393342 -4615255 473139
3229D73139M989311O6837m392510m883565l459057k526221o44372L185904N249149
$$ 473139 5462450 5529287 1136777 -3746788 -7205845 -9732066 -10376438 -7190534 -1941385
3220a941385K101216k797184l003453J498400M376187K338145j112988k248776
$$ -1941385 159831 -2637353 -5640806 -4142406 233781 2571926 1458938 -789838
3212g89838j982034k052623j292589J133362K724319J491069k87324K20018J655015
$$ -789838 -2771872 -4824495 -6117084 -4983722 -2259403 -768334 -1055658 -835640 819375
3203H19375J331335L64331J397125K971575J351519k601445l733200n86030J906516
$$ 819375 2150710 2515041 3912166 6883741 8235260 5633815 1900615 1314585 3221101
3194C221101j82162l804406l522044O89128L801525K712716m08009j834353q61315
$$ 3221101 3038939 -765467 -4287511 -3598383 203142 2915858 2507849 673496 -187819
3185a87819L16193j5799j133112j284041k25296M90504k07794j375898j542407
$$ -187819 128374 112575 -1020537 -2304578 -2529874 -2039370 -2247164 -3623062 -5165469
3176e165469q60683n76521r54579j181988r51455n00634P04398L344598O079197
$$ -5165469 -6026152 -6602673 -7557252 -8739240 -9690695 -10191329 -9486931 -6142333 -63136
3167f3136O146114L025409l29812j145016j55445J52390p51073j374278j027516
$$ -63136 6082978 9108387 8778575 7633559 7478114 7630504 6879431 5505153 4477637
3158D477637o44088q79223j177264j052817q66531q60158o68352l68918p85607
$$ 4477637 3833549 2954326 1777062 724245 -142286 -1002444 -1670796 -2039714 -2825321
3149b825321j861114j891085K37958K844259L268889J620325O03011J227427J086051
$$ -2825321 -4686435 -6577520 -6339562 -3495303 -226414 1393911 1996922 3224349 4310400
3140D310400j617018m438300l678322J16598K594629J392657j376226k848269
$$ 4310400 2693382 -1744918 -5423240 -5306642 -2712013 -1319356 -2695582 -5543851
3132e543851k710640j663777N91181L795830N664138M404559J508452j31179p57
$$ -5543851 -8254491 -9918268 -9327087 -5531257 132881 4537440 6045892 5914713 5913956
3123E913956J15446p11821j454829r11603Q71000K669604K675288n9091l750591
$$ 5913956 6029402 5317581 3862752 2951149 3822149 6491753 9167041 9107950 5357359
3114E357359m882033k501260R8284j31039j617893q85642J925001L532440K634671
$$ 5357359 475326 -2025934 -1927650 -2058689 -3676582 -4562224 -2637223 895217 3529888
3105C529888J035508j20764j702157l740935m479073l175534j199140M83198K340359
$$ 3529888 4565396 4444632 2742475 -998460 -5477533 -8653067 -9852207 -9369009 -7028650
3096g028650M006295L687826J103283j316909j568046m92865J75407L41046P26975
$$ -7028650 -3022355 665471 1768754 451845 -1116201 -1609066 -1433659 -1092613 -365638
3087c65638J037282L90900j227510k786924k915861q39865K347890L801083J915580
$$ -365638 671644 1062544 -164966 -2951890 -5867751 -6707616 -4359726 -558643 1356937
3078A356937j233213k318417j008388M87499J306630K332143L188832K387161
$$ 1356937 123724 -2194693 -3203081 -2715582 -1408952 923191 4112023 6499184
3070F499184N37414j66610J10229p74702k360538j781981P06576J226711j287435
$$ 6499184 7036598 6869988 6980217 6205515 3844977 2062996 2769572 3996283 2708848
3061B708848l103003k070601q12010j000657j1667L104649L849562n73771n121153
$$ 2708848 -394155 -2464756 -3276766 -4277423 -4289090 -1184441 2665121 2091350 -3029803
3052c029803l756880J311151L427979J569445J47205Q39069J252438O64889P83574
$$ -3029803 -6786683 -5475532 -2047553 -478108 -330903 508166 1760604 2425493 3209067
3043C209067J163291l38006k680010k675764p83035m95384k080603k455407j285652
$$ 3209067 4372358 4034352 1354342 -1321422 -2104457 -2599841 -4680444 -7135851 -8421503
3034h421503j346947k490323j480847J272717J361955j604053k279226J547094
$$ -8421503 -9768450 -12258773 -13739620 -12466903 -11104948 -12709001 -14988227 -13441133
3026a3441133M886162L895216K051098L339936M860861K066573k804243l918147
$$ -13441133 -8554971 -4659755 -2608657 731279 5592140 7658713 4854470 936323
3018I36323q84488J523922J226143O32577J078026P96634r96473k418713k378483
$$ 936323 51835 1575757 2801900 3434477 4512503 5309137 4312664 1893951 -484532
3009d84532k228452k784775k592663o11324J502276J383594q53942k571395j426959
$$ -484532 -2712984 -5497759 -8090422 -8701746 -7199470 -5815876 -6669818 -9241213 -10668172
3000a0668172K057714M584109L132281j589270n345487m726833p93305K252461
$$ -10668172 -8610458 -4026349 -894068 -2483338 -7828825 -12555658 -13348963 -11096502
2992a1096502J537597j800682l906920j997893K570168N350083L899434R69014
$$ -11096502 -9558905 -11359587 -15266507 -17264400 -14694232 -9344149 -5444715 -4475701
2984d475701O83037K513168K270368j108060l791212l016944p06021O74584J748822
$$ -4475701 -3792664 -1279496 990872 -117188 -3908400 -6925344 -7631365 -6956781 -5207959
2975e207959L156858K913693L54009r78085J309693L411551P40988m059558m353701
$$ -5207959 -2051101 862592 1216601 238516 1548209 4959760 5700748 1641190 -2712511
2966b712511M94620M339247L349757J74564j690611k224772k031937j87797K700765
$$ -2712511 -2217891 2121356 5471113 5645677 3955066 1730294 -301643 -489440 2211325
2957B211325L382860N16316k897675l874138l147989k390556j056444J263510
$$ 2211325 5594185 6110501 3212826 -661312 -3809301 -6199857 -7256301 -5992791
2949e992791K385616P65631j095995J6792K838480L190445m0378l532809l911435
$$ -5992791 -3607175 -2841544 -3937539 -3920747 -1082267 2108178 2067800 -1465009 -5376444
2940e376444j140486K303675L839039K651320N13155M9969J191178R33734j910622
$$ -5376444 -6516930 -4213255 -374216 2277104 2790259 2840228 4031406 4965140 3054518
2931C054518m005560k109372J658401K668837M94700j257557j114316j247153
$$ 3054518 -951042 -3060414 -1402013 1266824 1761524 503967 -610349 -1857502
2923a857502k512868k505522N123K574053K934681K034774J236439k41007k620016
$$ -1857502 -4370370 -6875892 -6870769 -4296716 -1362035 672739 1909178 1668171 -951845
2914i51845l351469o69578K955582L986467K519495Q93118m10440k175748l500469
$$ -951845 -4303314 -4972892 -2017310 1969157 4488652 5381770 4971330 2795582 -704887
2905g04887l002474j652509r46345K42204L125179M979300K473876k089746l351031
$$ -704887 -3707361 -5359870 -6306215 -6064011 -2938832 2040468 4514344 2424598 -926433
2896i26433j252750p11237k609401k146607J902052L616559m50653m677043k852232
$$ -926433 -2179183 -2890420 -5499821 -7646428 -5744376 -2127817 -2578470 -7255513 -10107745
2887a0107745K100933L283560N88845p37542M37272N09578j199431j306253Q97973
$$ -10107745 -8006812 -4723252 -4134407 -4871949 -4434677 -3925099 -5124530 -6430783 -5532810
2878e532810J895423J66566j374024m82864J369969K270518K237571J414368m61821
$$ -5532810 -3637387 -3470821 -4844845 -5327709 -3957740 -1687222 550349 1964717 1502896
2869A502896k168184k040077j012152j033512j021809J192035L628455K354778
$$ 1502896 -665288 -2705365 -3717517 -4751029 -5772838 -4580803 -952348 1402430
2861A402430j341283k205427J98532Q78574j271347j258153K381978L769814k59547
$$ 1402430 61147 -2144280 -1945748 -1067174 -2338521 -3596674 -1214696 2555118 2295571
2852B295571l864105j657613K254613J549178j636141j087764K579538L614056
$$ 2295571 -1568534 -3226147 -971534 577644 -1058497 -2146261 433277 4047333
2844D047333J152302m13679K36087Q1325j618931k194830j176731r87211j734155
$$ 4047333 5199635 4785956 5022043 5103368 3484437 1289607 112876 -874335 -2608490
2835b608490r62352R68783P49132j833373k867962n67118K059373K210205R80853
$$ -2608490 -3570842 -2602059 -1852927 -3686300 -6554262 -7121380 -5062007 -2851802 -1870949
2826a870949N22679Q00695O27685m28838j941538k737067j553337P07225J048413
$$ -1870949 -1348270 -547575 80110 -348728 -2290266 -5027333 -6580670 -5873445 -4825032
2817d825032r35454j108994K878110O389031M040667j470368k992515M46900L427693
$$ -4825032 -5760486 -6869480 -3991370 2397661 6438328 4967960 1975445 2422345 5850038
2808E850038L386412K720461K065237o48994l795467k696279J749961K886392
$$ 5850038 9236450 11956911 14022148 13373154 9577687 6881408 8631369 11517761
2800A1517761j050207l861216j812012P43537l3528r52788J170432K973240Q14587
$$ 11517761 10467554 6606338 4794326 5537863 5504335 4551547 5721979 8695219 9509806
2791I509806k405954k692236j892943l053399l717152m66726L912402M490679
$$ 9509806 7103852 4411616 2518673 -534726 -4251878 -4718604 -806202 3684477
2783C684477K114594Q25730L65393k118929n255014n015387j671173Q17296J203748
$$ 3684477 5799071 6624801 6990194 4871265 -383749 -5399136 -7070309 -6253013 -5049265
2774e049265J359980J628134J045737Q19093K333047L161539M40944l245829l053240
$$ -5049265 -3689285 -2061151 -1015414 -196321 2136726 5298265 5739209 2493380 -559860
2765e59860K59733J561640l64163j814518j129475o08113j177110q65288O89313
$$ -559860 -300127 1261513 897350 -917168 -2046643 -2654756 -3831866 -4697154 -4007841
2756d007841J358947P82494O64821N21920j771822m787139m287139p4915L118871
$$ -4007841 -2648894 -1866400 -1201579 -679659 -2451481 -7238620 -11525759 -11600674 -8481803
2747h481803K712383J138666M45147o08482k232319j648272J870483M423169K911534
$$ -8481803 -5769420 -4630754 -4185607 -4794089 -7026408 -8674680 -6804197 -2381028 530506
2738E30506m06946j494114J08777J767916J446310o39159k343679j272428J889460
$$ 530506 123560 -1370554 -1261777 506139 1952449 1313290 -1030389 -2302817 -413357
2729d13357K726885j053657m793848k724116K848119M577706J636642M26647K892179
$$ -413357 2313528 1259871 -3533977 -6258093 -3409974 1167732 2804374 3231021 6123200
2720F123200K882053k678471p440729n615411j122645n13459k621148k170912
$$ 6123200 9005253 6326782 -1113947 -6729358 -7852003 -8365462 -10986610 -13157522
2712a3157522Q46287K580897K844586M218009N809534M469853R06727j292733
$$ -13157522 -12311235 -9730338 -6885752 -2667743 3141791 7611644 8518371 7225638
2704G225638j727255k832455m344781l459962k13332K089189J783403J72720j633025
$$ 7225638 5498383 2665928 -1678853 -5138815 -5352147 -3262958 -1479555 -1306835 -2939860
2695b939860l363136l766173k055706m38461j301095k770089j227202K577134
$$ -2939860 -6302996 -10069169 -12124875 -12563336 -13864431 -16634520 -17861722 -15284588
2687a5284588M359729K758762N21859m77004r70001j112092l3J408194J103719
$$ -15284588 -10924859 -8166097 -7644238 -8121242 -9091243 -10203335 -10203368 -8795174 -7691455
2678g691455o0981N20094K128008J385866j581776k595167j23577K254702J732263
$$ -7691455 -7752436 -7232342 -5104334 -3718468 -5300244 -7895411 -8018988 -5764286 -4032023
2669d032023J12630k56112k00328r33997j213860M3191J250439P41852n38146
$$ -4032023 -3919393 -4175505 -4375833 -5309830 -6523690 -6480499 -5230060 -4488208 -5026354
2660e026354q77462J122J932984M629947N679957J837309n498651r587099o070036
$$ -5026354 -5903816 -5902694 -3969710 660237 6340194 8177503 2678852 -6908247 -12978283
2651a2978283J342004N764189N184961K679776J054321P72444J540795K488789
$$ -12978283 -11636279 -5872090 -687129 1992647 3046968 3819412 5360207 7848996
2643G848996J693246j554102m708259m699023k031088N2848j76007j540713k162505
$$ 7848996 9542242 7988140 3279881 -1419142 -3450230 -3397382 -3573389 -5114102 -7276607
2634g276607j238106Q08301K555138K719381J953955K089419K818579J532509
$$ -7276607 -8514713 -7706412 -5151274 -2431893 -477938 1611481 4430060 5962569
2626E962569k121599m469519l007143m62063l89358j342727L74886M013859N191686
$$ 5962569 3840970 -628549 -3635692 -4097755 -4487113 -5829840 -5454954 -1441095 3750591
2617C750591K622210n97504k302621l358889m033810k744497L25105K239154J546296
$$ 3750591 6372801 5775297 3472676 113787 -3920023 -6664520 -6339415 -4100261 -2553965
2608b553965K62810J99518N08871M19301J115013K893339L502107J646999n51818
$$ -2553965 -2291155 -2091637 -1582766 -1163465 -48452 2844887 6346994 7993993 7442175
2599G442175j039024j090676k289488k805164k55947L570523M766507L013181
$$ 7442175 6403151 5312475 3022987 217823 -38124 3532399 8298906 11312087
2591A1312087J312731N49423j428496m794583o001028k887425J608445L192575
$$ 11312087 12624818 13174241 11745745 6951162 950134 -1937291 -328846 2863729
2583B863729J557750k98307n69955j34072l91398j681039l454475m420087l011924
$$ 2863729 4421479 4123172 3553217 3419145 3027747 1346708 -2107767 -6527854 -9539778
2574i539778N86530L292034K002352k214020m734569k848745J047857K749397
$$ -9539778 -8953248 -5661214 -3658862 -5872882 -10607451 -13456196 -12408339 -9658942
2566i658942J371673k50377M44772K867478M346038L025371m40434l466873l828945
$$ -9658942 -8287269 -8537646 -8092874 -5225396 -879358 2146013 1705579 -1761294 -5590239
2557e590239j839546J3647J14529j76117J498085M770496O335865L869183j053711
$$ -5590239 -7429785 -7416138 -7301609 -7477726 -5979641 -1209145 5126720 8995903 7942192
2548G942192m722660n167279l447186j683745q54907n46001j16977L73132M51063
$$ 7942192 3219532 -1947747 -5394933 -7078678 -7933585 -8479586 -8596563 -8223431 -7772368
2539g772368K64142Q07358K578735M325995M057182J421823j722505l281217k653455
$$ -7772368 -7508226 -6700868 -4122133 203862 4261044 5682867 3960362 679145 -1974310
2530a974310n06726J867786K636785N66844k771332l448286L65510N330267O424109
$$ -1974310 -2481036 -613250 2023535 2590379 -180953 -3629239 -3263729 2066538 8490647
2521H490647L084945m04891p95846L58261j22554k268578l391544k187636k33370
$$ 8490647 11575592 11170701 10374855 10733116 10610562 8341984 4950440 2762804 2529434
2512B529434M60828m17922k072897l703802m302473k739648O12585L108161K297135
$$ 2529434 2990262 2572340 499443 -3204359 -7506832 -10246480 -9633895 -6525734 -4228599
2503d228599q19676k483041o59832K436917L285124J464003l60178l14968O61642
$$ -4228599 -5048275 -7531316 -8191148 -5754231 -2469107 -1005104 -1365282 -1680250 -1018608
2494a018608R11837L73031j54159o99353j658247k335051j496639N91260J905177
$$ -1018608 -106771 266260 112101 -587252 -2245499 -4580550 -6077189 -5485929 -3580752
2485c580752R52059j305773k401694j189617O64826M32249k365828n017785m605249
$$ -3580752 -2628693 -3934466 -6336160 -7525777 -6860951 -6428702 -8794530 -13812315 -18417564
2476a8417564j331278K162240M194532N066856M989961L447982J252426O24321
$$ -18417564 -19748842 -17586602 -13392070 -8325214 -3335253 112729 1365155 1989476
2468A989476J768037J831543o45674k725886j508646O15000o62189m049429l550713
$$ 1989476 3757513 5589056 4943382 2217496 708850 1323850 661661 -3387768 -6938481
2459f938481K464382P835908O438760j58998n497369n954641k939973M22770J799341
$$ -6938481 -4474099 3361809 9800569 9641571 4144202 -1810439 -4750412 -4327642 -2528301
2450b528301K66845k737926l892587j607213J746417L093821K636946K177260
$$ -2528301 -2261456 -4999382 -8891969 -10499182 -8752765 -5658944 -3021998 -844738
2442h44738J177669k023175n889645o431509k614955K161734M547117M301454
$$ -844738 332931 -1690244 -7579889 -14011398 -16626353 -14464619 -9917502 -5616048
2434e616048K466348k33074k140302j127681J980385L298892J121215j442543
$$ -5616048 -3149700 -3382774 -5523076 -6650757 -4670372 -1371480 -250265 -1692808
2426a692808j284692k0767r27930l433715m257572k634321o61972P93782K699700
$$ -1692808 -2977500 -2998267 -3926197 -7359912 -11617484 -14251805 -14913777 -14119995 -11420295
2417a1420295M460174L806662Q50619j206707o72093L61477j82001j152308o85311
$$ -11420295 -6960121 -3153459 -2302840 -3509547 -4181640 -3820163 -4002164 -5154472 -5839783
2408e839783O13760J264768J552713K114253J755321n46586k923190k868499j128607
$$ -5839783 -5226023 -3961255 -2408542 -294289 1461032 914446 -2008744 -4877243 -6005850
2399f005850k54371k07960R45186K368231Q12170l488086n592634k722253J331477
$$ -6005850 -6260221 -6468181 -5522995 -3154764 -2342594 -5830680 -11423314 -14145567 -12814090
2390a2814090J766292k34540j04392K388272K882790j39418k368508M62M339445
$$ -12814090 -11047798 -11282338 -11386730 -8998458 -6115668 -6255086 -8623594 -8623132 -4283687
2381d283687M922244N72849l887244l682813M99063L759116K578437j609212m237253
$$ -4283687 638557 1211406 -2675838 -6358651 -5859588 -2100472 477965 -1131247 -5368500
2372e368500k528176J771312M615478L965327J175112j335935k391525k000807
$$ -5368500 -7896676 -6125364 -1509886 2455441 3630553 2294618 -96907 -2097714
2364b097714o34918O29162N13947q06036j400020q5952J635015J551299p1460
$$ -2097714 -2732632 -2103470 -1589523 -2395559 -3795579 -3881531 -2246516 -695217 -766677
2355g66677j020626n10108j1914m71014p32752K81202J438109Q28889j574171
$$ -766677 -1787303 -2297411 -2309325 -2780339 -3513091 -3231889 -1793780 -964891 -2539062
2346b539062l876262m235170k082789J619541M376924L743445M41057j443671
$$ -2539062 -6415324 -10650494 -12733283 -11113742 -6736818 -2993373 -2552316 -3995987
2338c995987M84394K969233J299865l282210m578890m96917L588846K965479N60141
$$ -3995987 -3511593 -542360 757505 -2524705 -7103595 -7600512 -4011666 -1046187 -486046
2329d86046J431014L795149J765821m285568p050883l143354J755995J665904
$$ -486046 944968 4740117 6505938 2220370 -4830513 -7973867 -6217872 -4551968
2321d551968j192071j225384J269027J494451j252343k488745m3100K761382K777535
$$ -4551968 -5744039 -6969423 -5700396 -4205945 -5458288 -7947033 -7990133 -5228751 -2451216
2312b451216J466326J456284K081705J157557r35111j765724n23704J028571R93311
$$ -2451216 -984890 471394 2553099 3710656 2775545 1009821 486117 1514688 2507999
2303B507999o84848k507144k839733j312948P35960J637738J296802R24839R57760
$$ 2507999 1823151 -683993 -3523726 -4836674 -4100714 -2462976 -1166174 -241335 716425
2294G16425O00107l55351q95943n62103k10417k06324M18575J869484K384740
$$ 716425 1316532 961181 65238 -496865 -707282 -913606 -495031 1374453 3759193
2285C759193P68591j252271j156584P18380J593761J1266k460351l298542j653058
$$ 3759193 4527784 3275513 2118929 2837309 4431070 4442336 1981985 -1316557 -2969615
2276b969615J122261K847953K621024J868424K574651M205340L876045M43184
$$ -2969615 -1847354 1000599 3621623 5490047 8064698 12270038 16146083 16589267
2268A6589267l291755m027622k164163o40976p46273j262466j024924j53284Q18197
$$ 16589267 13297512 9269890 7105727 6464751 5718478 4456012 3431088 3277804 4096001
2259D096001J149732j27258k529685l388190j193729J328046N55516k299255k537064
$$ 4096001 5245733 5118475 2588790 -799400 -1993129 -665083 -109567 -2408822 -4945886
2250d945886Q79127L620743K505076k68410j298271p63826m36153p6134R87085
$$ -4945886 -4066759 -446016 2059060 1790650 492379 -271447 -707600 -783734 203351
2241B03351J201201p13524k462899j155301J639960J768595j074605k786422j029802
$$ 203351 1404552 691028 -1771871 -2927172 -1287212 481383 -593222 -3379644 -4409446
2232d409446J814663K860566K420965J863324P51247j561546l566733l300042
$$ -4409446 -2594783 265783 2686748 4550072 5301319 3739773 173040 -3127002
2224c127002j253875L83137M80515o71697k602573m321146l797020k41013L554661
$$ -3127002 -4380877 -3997740 -3517225 -4188922 -6791495 -11112641 -14909661 -15150674 -11596013
2215a1596013L809087Q94150p59896J218940L674661K366549k033862m834349
$$ -11596013 -7786926 -6892776 -7652672 -6433732 -2759071 -392522 -2426384 -7260733
2207g260733l326356N20484L216567L378114J774843k91750j652393j560288l21209
$$ -7260733 -10587089 -10066605 -6850038 -3471924 -1697081 -1988831 -3641224 -5201512 -5522721
2198e522721J005813J914718K560878K449670O21583k142280l068711q16175K174722
$$ -5522721 -4516908 -2602190 -41312 2408358 3029941 887661 -2181050 -2997225 -822503
2189h22503K523780K05110j845801j790717n74776K17712K60035N3409J54689
$$ -822503 1701277 1906387 60586 -1730131 -2304907 -2087195 -1827160 -1773751 -1619062
2180a619062R95658K154611J946460p10499m174772n616550m586975k993180j530814
$$ -1619062 -623404 1531207 3477667 2767168 -1407604 -7024154 -11611129 -14604309 -16135123
2171a6135123J097204M545521N365949J418782m087141n572439j546218L880253
$$ -16135123 -15037919 -10492398 -5126449 -3707667 -7794808 -13367247 -14913465 -11033212
2163a1033212N803564L364168l30691j997961j322932m23505n47749l85569J372700
$$ -11033212 -5229648 -1865480 -2196171 -4194132 -5517064 -5940569 -6488318 -6873887 -5501187
2154e501187L018411J754502j653657l161950j175865R96529J16857k195296k075087
$$ -5501187 -2482776 -728274 -2381931 -5543881 -6719746 -5723217 -5606360 -7801656 -9876743
2145i876743J047445M102338M443373K073089j229804l152753k318326j97272
$$ -9876743 -8829298 -4726960 -283587 1789502 559698 -2593055 -4911381 -5108653
2137e108653j22125k673216m079641j594401J866629J907918m75068o42405K062741
$$ -5108653 -5230778 -7903994 -11983635 -13578036 -11711407 -9803489 -10278557 -10920962 -8858221
2128h858221L420813J376534r12011n68570P12375K24780j212971j033168R80862
$$ -8858221 -5437408 -4060874 -4972885 -5541455 -4829080 -4604300 -5817271 -6850439 -5869577
2119e869577K855059L179929J762853j099779m237811n634356m399002j912768
$$ -5869577 -3014518 165411 1928264 828485 -3409326 -9043682 -13442684 -15355452
2111a5355452l8476Q04751J130358J322923J788189K710658L095750J745344l64795
$$ -15355452 -15393928 -14589177 -13458819 -12135896 -10347707 -7637049 -4541299 -2795955 -3160750
2102c160750q69573J87283N3076k038420k940732n16499K382590J961929n70407
$$ -3160750 -4030323 -3843040 -3789964 -5828384 -8769116 -9285615 -6903025 -4941096 -5511503
2093e511503p53254K397583M987438L684542k91761l263513l205836j146870K82903
$$ -5511503 -6264757 -3867174 1120264 4804806 4513045 1249532 -1956304 -3103174 -2820271
2084b820271n78102k518381k482301O45308M101726M353565J341608j852850k882288
$$ -2820271 -3398373 -5916754 -8399055 -7753747 -3652021 701544 2043152 190302 -2691986
2075b691986k055902r00036m70398r62073j707343j665261p20536M5743N0133
$$ -2691986 -4747888 -5647924 -6118322 -7080395 -8787738 -10452999 -11173535 -11127792 -11077659
2066a1077659Q0765N78351N46535m32864p05538J039788L265426L615993K222923
$$ -11077659 -10996894 -10418543 -9872008 -10304872 -11010410 -9970622 -6705196 -3089203 -866280
2057h66280Q12266j42188q99342m84501J738067L589239K510059j88280r68305
$$ -866280 -54014 -196202 -1095544 -1580045 158022 3747261 6257320 6069040 5100735
2048E100735M60266J024922m05866j596810j397768j617479l169026l943151k204812
$$ 5100735 5561001 6585923 6180057 4583247 3185479 1568000 -1601026 -5544177 -7748989
2039g748989Q76132L500454N073563M587195P38637m524768o217284k584188K030954
$$ -7748989 -6872857 -3372403 1701160 6288355 7026992 2502224 -3715060 -6299248 -4268294
2030d268294L197221J997108J561405J455303k77304k172049j414163O63361J84357
$$ -4268294 -1071073 926035 2487440 3942743 3665439 1493390 79227 742588 926945
2021I26945k698874l678513j019963K068786K732417K081879K034161K056422
$$ 926945 -1771929 -5450442 -6470405 -4401619 -1669202 412677 2446838 4503260
2013D503260J000452n34936j563468k257682k573612j495821P50169J901033Q95159
$$ 4503260 5503712 4968776 3405308 1147626 -1425986 -2921807 -2171638 -270605 624554
2004F24554j55252O63973J696517L90753k130216k363086K55145K515061K219226
$$ 624554 469302 1133275 2829792 3220545 1090329 -1272757 -1017612 1497449 3716675
1995C716675Q33089L32268P7426j286494k807336k641401j466312j639631k963839
$$ 3716675 4549764 4882032 4959458 3672964 865628 -1775773 -3242085 -4881716 -7845555
1986g845555k258947J596404M788821L240646j337723l236564l92057L019954
$$ -7845555 -10104502 -8508098 -3719277 -478631 -1816354 -5052918 -5444975 -2425021
1978b425021K663328k21326j313291O14623K784927K708306O94171j682403l204210
$$ -2425021 238307 16981 -1296310 -681687 2103240 4811546 5505717 3823314 619104
1969F19104k962717q94159J213540J226694l27842p26708Q87233K102088R81544
$$ 619104 -2343613 -3237772 -2024232 -797538 -1125380 -1852088 -964855 1137233 2118777
1960B118777r78614j354544m13204k0257k47972L67608J780954K235199J184207
$$ 2118777 1140163 -214381 -627585 -647842 -895814 -528206 1252748 3487947 4672154
1951D672154R9075j11308l54067j198253j444119j91678J169726O82780j370144
$$ 4672154 4771229 4659921 4305854 3107601 1663482 1471804 2641530 3324310 1954166
1942A954166k921329k782913j434096L12960J825021K112860N67033j611324k376382
$$ 1954166 -967163 -3750076 -5184172 -4871212 -3046191 -933331 -366298 -1977622 -4354004
1933d354004j568722r70838j164117m79415J687194K763954N70533k564985k366198
$$ -4354004 -5922726 -6893564 -8057681 -8537096 -6849902 -4085948 -3515415 -6080400 -8446598
1924h446598J223691L749711K582445K57946J9845J006455M36192j452581j799239
$$ -8446598 -7222907 -3473196 -890751 -632805 -612960 393495 829687 -622894 -2422133
1915b422133L18463K614752K922530J486942k55943j143563l32366J970844L370518
$$ -2422133 -2103670 511082 3433612 4920554 4664611 3521048 3188682 5159526 8530044
1906H530044J144679l797670o937237n483766j782917L05150N34091J263046K633861
$$ 8530044 9674723 5877053 -1060184 -6543950 -8326867 -8021717 -7487626 -6224580 -3590719
1897c590719K125877q80085l237421k210461O54605J822989O50039k41081R41044
$$ -3590719 -1464842 -2344927 -5582348 -7792809 -7138204 -5315215 -4665176 -4906257 -3965213
1888c965213K829636L165997J760377J94921m27916l31721j86707m03264j031564
$$ -3965213 -1135577 2030420 3790797 3985718 3557802 3226081 3039374 2636110 1604546
1879A604546j489093p26947J259868K428679P76898k456604l621385j511339O71711
$$ 1604546 115453 -611494 648374 3077053 3853951 1397347 -2224038 -3735377 -3063666
1870c063666q5438j965366j116894J994384K786163m47808l523906k279721J572113
$$ -3063666 -3149104 -5114470 -6231364 -4236980 -1450817 -1898625 -5422531 -7702252 -6130139
1861f130139L421774K433937J617024K230911K094869r1021k247081k182368p49246
$$ -6130139 -2708365 -274428 1342596 3573507 5668376 5577355 3330274 1147906 398660
1852C98660j2867k81061p21250j201001j592794p67298J540665L105579J888681
$$ 398660 385793 104732 -616518 -1817519 -3410313 -4177611 -2636946 468633 2357314
1843B357314n84349j226222j53273k87424k183966k843381p91488J132672K48903
$$ 2357314 1772965 546743 393470 106046 -2077920 -4921301 -5712789 -4580117 -4331214
1834d331214j627176j314193M65467O09637q27743p59655J332477K141607J61502
$$ -4331214 -5958390 -7272583 -6807116 -6197479 -7025222 -7784877 -6452400 -4310793 -4149291
1825d149291j203100J324017N444617O065874K114689k526600m316127l336951
$$ -4149291 -5352391 -4028374 1416243 7482117 9596806 7070206 2754079 -582872
1817e82872j238192J157396L127192L254850J119889j460176k427524j962842
$$ -582872 -1821064 -663668 2463524 5718374 6838263 5378087 2950563 987721
1809I87721j654155j873460j495936Q839J670423K376190J982659Q42573o69436
$$ 987721 -666434 -2539894 -4035830 -4026991 -2356568 19622 2002281 2844854 2175418
1800B175418j784155j585424k91276N43549k11285j947691l234892l157188j269734
$$ 2175418 391263 -1194161 -1485437 -941888 -1153173 -3100864 -6335756 -9492944 -10762678
1791a0762678K317988N649339N328828M17546n039974o030615k782147q1791l07470
$$ -10762678 -8444690 -2795351 2533477 2951023 -2088951 -8119566 -10901713 -10983504 -11290974
1782a1290974o66721J355502L433776K116170j438713k924948q21115K389733
$$ -11290974 -11957695 -10602193 -7168417 -5052247 -6490960 -9415908 -10237023 -7847290
1774g847290M259305M542017L547090J301331j296263k904183l661412m602201
$$ -7847290 -3587985 954032 4501122 5802453 4506190 1602007 -2059405 -6661606
1766f661606n163163l648724l34407K343389L015503K451419J294631m97636j630499
$$ -6661606 -11824769 -15473493 -15807900 -13464511 -10449008 -7997589 -6702958 -7200594 -8831093
1757h831093j03091L141615M286097J748486j612886k830673k386497j731104
$$ -8831093 -8934184 -5792569 -1506472 242014 -1370872 -4201545 -6588042 -8319146
1749h319146m34397J762551K893503J661773J35152O64213K075691J797493o8435
$$ -8319146 -8753543 -6990992 -4097489 -2435716 -2300564 -1636351 439340 2236833 2168398
1740B168398j721888k934117m227289m371771k018183J332639L083235L140885
$$ 2168398 446510 -2487607 -6714896 -11086667 -13104850 -11772211 -8688976 -5548091
1732e548091K863554J910102m85423k498263j765713N27045J363055P12714O70526
$$ -5548091 -2684537 -774435 -1259858 -3758121 -5523834 -4996789 -3633734 -2921020 -2250494
1723b250494Q21439q75963l075826k017581K062805M392825K558125n47298j831874
$$ -2250494 -1429055 -2305018 -5380844 -7398425 -5335620 -942795 1615330 1068032 -763842
1714g63842j666973j022338O83677K971647L459544J596298k49545r10183j799474
$$ -763842 -2430815 -3453153 -2769476 202171 3661715 5258013 5008468 4098285 2298811
1705B298811k845611j635330J413649J987272j179456l231121p66708K223917
$$ 2298811 -546800 -2182130 -768481 1218791 39335 -3191786 -3958494 -1734577
1697a734577O84350l244639l752295l40570K300917J704804k48747j609951k188840
$$ -1734577 -1050227 -4294866 -8047161 -8387731 -6086814 -4382010 -4630757 -6240708 -8429548
1688h429548j790685n49194j86733j410410j445870J969378N773505N317008J623205
$$ -8429548 -10220233 -10769427 -10956160 -12366570 -13812440 -11843062 -6069557 -752549 870656
1679H70656j14968J429385K527238J253732R3000P38744J370818P90713P85129
$$ 870656 755688 2185073 4712311 5966043 6059043 6797787 8168605 8959318 9744447
1670I744447K230550K677962K70239k945989l985288k876746j660763j383453
$$ 9744447 11974997 14652959 14923198 11977209 7991921 5115175 3454412 2070959
1662B070959j766202k246606k105876j001402L137l57117j102066l8368K458428
$$ 2070959 304757 -1941849 -4047725 -5049127 -5045990 -5403107 -6505173 -6543541 -4085113
1653d085113L370027J438290j031602j703656j004136l99950l63243j033208k438741
$$ -4085113 -715086 723204 -308398 -2012054 -3016190 -3416140 -3779383 -4812591 -7251332
1644g251332l145270j307806J945880K994021P39285j777595k097153j475045
$$ -7251332 -10396602 -11704408 -9758528 -6764507 -6025222 -7802817 -9899970 -11375015
1636a1375015j520492j053649J060066K778567J735919p19202j330166N68477
$$ -11375015 -12895507 -13949156 -12889090 -10110523 -8374604 -9093806 -10423972 -9855495
1628i855495K896507L957612L457217J589085p46557j873065j313960o66871j007744
$$ -9855495 -6958988 -3001376 455841 2044926 1298369 -574696 -1888656 -2555527 -3563271
1619c563271j150082k16664K08450j114719k175430n86008K192209K701659N46138
$$ -3563271 -4713353 -4930017 -4721567 -5836286 -8011716 -8597724 -6405515 -3703856 -3157718
1610c157718j536299j942161j442663n97994R12529K321218K062394N27466J06971
$$ -3157718 -4694017 -6636178 -8078841 -8676835 -7764306 -5443088 -3380694 -2853228 -2746257
1601b746257J853715M004135M302353K276084r27794l538753m140843l089339
$$ -2746257 -892542 3111593 7413946 9690030 8762236 5223483 1082640 -2006699
1593b006699k534820l562164m187061k197539J018702K202024J171721Q88674
$$ -2006699 -4541519 -8103683 -12290744 -14488283 -13469581 -11267557 -10095836 -9207162
1585i207162K534870L812374K870945Q71895n40172j554252k510521k417094r19518
$$ -9207162 -6672292 -2859918 11027 882922 342750 -1211502 -3722023 -6139117 -7058635
1576g058635L79767L74981K14909P29238L83189j523494j754007K771161Q585961
$$ -7058635 -6678868 -6303887 -6088978 -5359740 -4976551 -6500045 -8254052 -5482891 3103070
1567C103070Q112933k21600q430864q451911k270329J435747q17150l815993k511536
$$ 3103070 11216003 10994403 2563539 -5888372 -8158701 -6722954 -7540104 -11356097 -13867633
1558a3867633R29406J945111J202925K391191M690750L497604j376934m244447
$$ -13867633 -12938227 -10993116 -9790191 -7399000 -2708250 789354 -587580 -4832027
1550d832027k110973P30754k4326j529072J324574P049420R130903N087413j111277
$$ -4832027 -6943000 -6212246 -6236572 -7765644 -6441070 608350 9739253 14826666 13715389
1541A3715389n208249o538780n712773l093766m99590l24429j690583j072824
$$ 13715389 8507140 1968360 -3744413 -6838179 -7337769 -7662198 -9352781 -10425605
1533a0425605K008772L621439J416224j604613j576258J079227L451534M273270
$$ -10425605 -8416833 -4795394 -3379170 -4983783 -6560041 -5480814 -2029280 2243990
$$ [...]
##END NTUPLES=NMR SPECTRUM
##END=
