##TITLE=31Pdec_DE-80_ORG_F
 CDCl3, 64 sc
 3.2.2025
##JCAMPDX= 6.0         $$ Bruker NMR JCAMP-DX V2.0
##DATA TYPE= NMR SPECTRUM
##DATA CLASS= NTUPLES
##ORIGIN= UXNMR, Bruker Analytische Messtechnik GmbH
##OWNER= root
$$ XWIN-NMR		Version 3.5
$$ Mon Feb  3 18:48:06 2025 Russian Standard Time (UT+4h)  she@DPX200
##.OBSERVE FREQUENCY= 81.013821
##.OBSERVE NUCLEUS= ^31P
##.ACQUISITION MODE= SIMULTANEOUS
##.ACQUISITION SCHEME= undefined
##.AVERAGES= 64
##.DIGITISER RES= 17
##SPECTROMETER/DATA SYSTEM= spect
##.PULSE SEQUENCE= zgpg30
##.SOLVENT NAME= CDCl3
##.SHIFT REFERENCE= (INTERNAL, CDCl3, 0, 198.062)
##AUDIT TRAIL= $$ (NUMBER, WHEN, WHO, WHERE, WHAT)
$$ ##TITLE= Audit trail, XWIN-NMR		Version 3.5
$$ ##JCAMPDX= 5.01
$$ ##ORIGIN= Bruker BioSpin GmbH
$$ ##OWNER= she
$$ F:/spectra/data/she/nmr/P31/2/pdata/1/auditp.txt
$$ ##AUDIT TRAIL=  $$ (NUMBER, WHEN, WHO, WHERE, WHAT)
(   1,<2025-02-03 18:47:00.48 +0400>,<she>,<DPX200>,
      <created by zg, POWCHK disabled, PULCHK disabled
       configuration hash MD5:
       00 E9 B6 7A A2 85 ED C7 34 08 36 98 17 FE 4E 26
       data hash MD5: 32K
       03 15 EA 61 6E 09 BC 01 D2 34 3F 51 91 EF 58 32>)
(   2,<2025-02-03 18:47:02.70 +0400>,<she>,<DPX200>,
      <Start of raw data processing
       efp BC_mod = 2 LB = 1.5 FT_mod = 6 PKNL = 1 PHC0 = 1736.927 PHC1 = 177.2909 SI = 64K 
       data hash MD5: 64K
       25 A1 E7 48 A5 06 9E 66 8D EC 19 23 B1 33 E8 C1>)
(   3,<2025-02-03 18:47:23.00 +0400>,<she>,<DPX200>,
      <pk PHC0 = 108.8664 PHC1 = 0 
       data hash MD5: 64K
       DF CD 3C C1 64 DB BE 55 F4 BC 89 B3 EC 00 50 90>)
$$ ##END=
$$ 
$$ hash MD5
$$ 50 BD A2 C2 99 B1 FC 4A 90 8F 40 ED 13 65 0C B2
##$RELAX= 
##$RELAX= 
##$RELAX= 
##$RELAX= 
##$RELAX= 
##$RELAX= 
##$RELAX= 
##$RELAX= 
$$ Bruker specific parameters
$$ --------------------------
##$DU= <F:/spectra>
##$EXPNO= 2
##$NAME= <P31>
##$PROCNO= 1
##$TYPE= <nmr>
##$USER= <she>
##$AMP= (0..31)
100 100 100 100 100 100 100 100 100 100 100 100 100 100 100 100 100 100 
100 100 100 100 100 100 100 100 100 100 100 100 100 100 
##$AQSEQ= 0
##$AQ_mod= 1
##$AUNM= <au_zg>
##$AUTOPOS= <>
##$BF1= 81.014009
##$BF2= 200.13
##$BF3= 200.13
##$BF4= 200.13
##$BF5= 200.13
##$BF6= 200.13
##$BF7= 200.13
##$BF8= 200.13
##$BYTORDA= 1
##$CFDGTYP= 0
##$CFRGTYP= 5
##$CHEMSTR= <none>
##$CNST= (0..31)
1 1 145 1 1 1 1 1 1 1 1 1 1 1 1 1 1 1 1 1 1 1 1 1 1 1 1 1 1 1 1 1 
##$CPDPRG= <waltz16>
##$CPDPRG1= <>
##$CPDPRG2= <waltz16>
##$CPDPRG3= <>
##$CPDPRG4= <mlev>
##$CPDPRG5= <mlev>
##$CPDPRG6= <mlev>
##$CPDPRG7= <mlev>
##$CPDPRG8= <mlev>
##$CPDPRGB= <>
##$CPDPRGT= <>
##$D= (0..31)
0 1 0 0 0 0 0 0 0 0.06 0 0.03 2e-05 3e-06 0 0 0.0002 0 0 0 0 0 0 0 0 0 
0 0 0 0 0 0 
##$DATE= 1738594019
##$DBL= (0..7)
120 120 120 11 120 120 24 19 
##$DBP= (0..7)
150 150 150 150 150 150 150 150 
##$DBP07= 0
##$DBPNAM0= <>
##$DBPNAM1= <>
##$DBPNAM2= <>
##$DBPNAM3= <>
##$DBPNAM4= <>
##$DBPNAM5= <>
##$DBPNAM6= <>
##$DBPNAM7= <>
##$DBPOAL= (0..7)
0.5 0.5 0.5 0.5 0.5 0.5 0.5 0.5 
##$DBPOFFS= (0..7)
$$ [...]
##$SUBNAM3= <"">
##$SUBNAM4= <"">
##$SUBNAM5= <"">
##$SUBNAM6= <"">
##$SUBNAM7= <"">
##$SUBNAM8= <"">
##$SUBNAM9= <"">
##$SW= 400.765351723535
##$SWIBOX= (0..15)
0 1 3 0 0 0 0 0 0 0 0 0 0 0 0 0 
##$SW_h= 32467.5324675325
##$TD= 32768
##$TD0= 1
##$TE= 0
##$TE2= 300
##$TE3= 300
##$TEG= 300
##$TL= (0..7)
0 120 53 12 22 120 120 120 
##$TP= (0..7)
150 150 150 150 150 150 150 150 
##$TP07= 0
##$TPNAME0= <>
##$TPNAME1= <>
##$TPNAME2= <>
##$TPNAME3= <>
##$TPNAME4= <>
##$TPNAME5= <>
##$TPNAME6= <>
##$TPNAME7= <>
##$TPOAL= (0..7)
0.5 0.5 0.5 0.5 0.5 0.5 0.5 0.5 
##$TPOFFS= (0..7)
0 0 0 0 0 0 0 0 
##$TUNHIN= 0
##$TUNHOUT= 0
##$TUNXOUT= 0
##$USERA1= <user>
##$USERA2= <user>
##$USERA3= <user>
##$USERA4= <user>
##$USERA5= <user>
##$V9= 5
##$VALIST= <valist>
##$VCLIST= <CCCCCCCCCCCCCCC>
##$VD= 0
##$VDLIST= <DDDDDDDDDDDDDDD>
##$VPLIST= <PPPPPPPPPPPPPPP>
##$VTLIST= <TTTTTTTTTTTTTTT>
##$WBST= 1024
##$WBSW= 4
##$XGAIN= (0..3)
0 0 0 0 
##$XL= 0
##$YL= 0
##$YMAX_a= 2650
##$YMIN_a= -24107
##$ZGOPTNS= <>
##$ZL1= 120
##$ZL2= 120
##$ZL3= 120
##$ZL4= 120
##$ABSF1= 0
##$ABSF2= 0
##$ABSG= 0
##$ABSL= 0
##$ALPHA= 0
##$AQORDER= 0
##$ASSFAC= 0
##$ASSFACI= 0
##$ASSFACX= 0
##$ASSWID= 0
##$AUNMP= <proc_1d>
##$AZFE= 0.1
##$AZFW= 0.5
##$BCFW= 0
##$BC_mod= 2
##$BYTORDP= 0
##$COROFFS= 0
##$CY= -3
##$DATMOD= 1
##$DC= 0
##$DFILT= <>
##$DTYPP= 0
##$F1P= 0
##$F2P= 0
##$FCOR= 1
##$FTSIZE= 65536
##$FT_mod= 6
##$GAMMA= 0
##$GB= 0
##$INTBC= 1
##$INTSCL= 9.790993e-09
##$ISEN= 30
##$LB= 1.5
##$LEV0= 0
##$LPBIN= 0
##$MAXI= 10000
##$MC2= 0
##$MEAN= 0
##$ME_mod= 0
##$MI= 50
##$NCOEF= 0
##$NC_proc= -9
##$NLEV= 6
##$NOISF1= 182.463
##$NOISF2= 159.3651
##$NSP= 0
##$NTH_PI= 0
##$NZP= 0
##$OFFSET= 198.0616
##$PC= 4
##$PHC0= 1845.793
##$PHC1= 177.2909
##$PH_mod= 1
##$PKNL= yes
##$PPARMOD= 0
##$PSCAL= 0
##$PSIGN= 0
##$REVERSE= no
##$SF= 81.0140089999434
##$SI= 65536
##$SIGF1= 159.3651
##$SIGF2= -187.1042
##$SINO= 113.3802
##$SIOLD= 16384
##$SREGLST= <1H.CDCl3>
##$SSB= 0
##$STSI= 65536
##$STSR= 0
##$SW_p= 32467.5324675325
##$SYMM= 0
##$S_DEV= 0
##$TDeff= 32768
##$TDoff= 0
##$TI= <>
##$TILT= no
##$TM1= 0
##$TM2= 0
##$TOPLEV= 0
##$USERP1= <user>
##$USERP2= <user>
##$USERP3= <user>
##$USERP4= <user>
##$USERP5= <user>
##$WDW= 1
##$XDIM= 65536
##$YMAX_p= 380920962
##$YMIN_p= -213719502
$$ End of Bruker specific parameters
$$ ---------------------------------
##NTUPLES= NMR SPECTRUM
##VAR_NAME=  FREQUENCY,     SPECTRUM/REAL,   SPECTRUM/IMAG
##SYMBOL=    X,             R,               I
##VAR_TYPE=  INDEPENDENT,   DEPENDENT,       DEPENDENT
##VAR_FORM=  AFFN,          ASDF,            ASDF
##VAR_DIM=   65536,         65536,           65536
##UNITS=     HZ,            ARBITRARY UNITS, ARBITRARY UNITS
##FACTOR=    0.49542278885378, 1,            1
##FIRST=     16045.7642231865, 0,            0
##LAST=      -16421.768244346, 0,            0
##MIN=       -16421.768244346, -213719502,   0
##MAX=       16045.7642231865, 380920962,    0
$$ Real data points
##PAGE= N=1
##DATA TABLE= (X++(R..R)), XYDATA
$$ [...]
##PAGE= N=2
##DATA TABLE= (X++(I..I)), XYDATA
7398H987919N71077p200223r267687m117237L046384O269467L876603j142764
7390A023539m385619m216051k885164k789213k769925k85324L852229O055320
7382f400208M726864J218258l112429o862099o752391j205428M743248M490245
7374i153940R8750P7199N632082P844858J997427m332432l306602J332310K122010
7365B311662M66364K140583N587480M763106L05532j876263q75102l07828L58686
7356A2874220M108166P306149K939542o802619j1590194q049514l853293m551456
7348g618999o181992m243228o12705K491072O484215R892108O894366k090446
7340E014391p155374k881329K814867J617006j566443K058939Q798626P598532
$$ plain form
7398 8987919 9558996 2358773 -6908914 -11026151 -7979767 -1710300 2166303 1023539
7390 1023539 -3362080 -7578131 -10463295 -13252508 -16022433 -16307757 -12455528 -6400208
7382 -6400208 -1673344 -455086 -3567515 -10429614 -17182005 -18387433 -13644185 -9153940
7374 -9153940 -9055190 -8977991 -3345909 4498949 6496376 2163944 -1142658 189652 2311662
7365 2311662 2778026 4918609 10506089 15269195 15574727 13698464 12823362 12515534 12874220
7356 12874220 16982386 24288535 27228077 20425458 8835264 785750 -3067543 -7618999
7348 -7618999 -13800991 -18044219 -18656924 -16165852 -9681637 210471 7104837 5014391
7340 5014391 -2140983 -5022312 -2207445 -590439 -2156882 -97943 8700683 16299215
7332A6299215j728432p783894m914935O9633N13385r60910j00337O03117k754759
7323g57917p264510o798054j227062L476017L467867Q49223r82023j869529k977313
7314a4083301k984164N05195O048192Q283916M617071n49736j355062J496522
7306A978633K414410k26474k231446j287575o41245k471543l145878N97242N197257
7297A83381N291941J954868K43750Q01054J2979k488633k729703O28845L583470
7288G481952K640868o66411k815638k750174j702351q38958m40680j10905O58780
7279A456483J300818M38492j350074r34561K757890N686030L873162j77131q92102
7270A2159007J578894J427236l609632q481929p917115k804655K543262N671362
$$ plain form
7332 16299215 14570783 6786889 1871954 1941587 2454972 1494062 1393725 1996842 -757917
7323 -757917 -8022427 -14820481 -16047543 -12571526 -9103659 -8254436 -9236459 -11105988 -14083301
7314 -14083301 -17067465 -16562270 -10514078 -2230162 2386909 1837173 482111 1978633
7306 1978633 4393043 4166569 1935123 647548 6303 -2465240 -5611118 -5013876 183381
7297 183381 5475322 7430190 7673940 8474994 8487973 5999340 3269637 3898482 7481952
7288 7481952 10122820 9456409 6640771 3890597 2188246 1349288 908608 797703 1456483
7279 1456483 2757301 3195793 1845719 911158 3669048 9355078 13228240 13051109 12159007
7270 12159007 13737901 15165137 11555505 3073576 -4843539 -7648194 -5104932 566430
7262E66430O290699M661783K164056J022827J477106J328785m26745k076592k403740
7253A2604609k357333k154997k07872L071960L904963K40926m810099p269601
7245C022556o846865m427578J004070Q513141J1812682N914945m311111q574159
7237F107681m206006J191656J107021j979696k632521q37007J738m90495l21319
7228b058948N6342j139788k136195P24758O011024P179729J549051n115046o036688
7219i65761j979817J407326K077766K627425M095486L983165J189691j453919
7211A0981362j286508Q04430K718977L859995L812720J371952k876355n714863
7203A3671710n472405m477505m744394m062881L4359M774449N074843Q71662k771295
$$ plain form
7262 566430 6857129 11518912 13682968 14705795 16182901 17511686 17084941 15008349 12604609
7253 12604609 10247276 8092279 7884407 10956367 14861330 15102256 10292157 3022556
7245 3022556 -3824309 -8251887 -7247817 1265324 13078006 18992951 14681840 6107681
7237 6107681 1901675 3093331 4200352 2220656 -411865 -1248872 -1247134 -1737629 -2058948
7228 -2058948 -2002606 -3142394 -5278589 -4553831 1457193 8636922 10185973 5070927 -965761
7219 -965761 -2945578 -1538252 539514 3166939 7262425 11245590 12435281 10981362
7211 10981362 9694854 10499284 13218261 17078256 20890976 22262928 19386573 13671710
7203 13671710 8199305 3721800 -1022594 -5085475 -5051116 -276667 4798176 5669838 2898543
7194B898543k545392L8342K478298M276262N290487M328916Q03887l880638p080743
7185F607962o222074p71819N351798N813019l94102n731229l228189L493707N321357
7176A0240430J105309j681917K13709J137862k649563n906384l208054K030257
7168A281649L530366J857694J411135J703909j058383n877236p415858m036136
7160h602860K45948J778865P15812j310952k890718k482076J13859K423343K371381
7151g637398J364913J374212J244633l32971j020198J028056K001942k284659
7143d261470q006010p570303j371628K632041J381786L29893K778451M223955
7135i863285J235060j693013L91985M603781N382464L281234K384893K470599
$$ plain form
7194 2898543 353151 391493 2869791 7146053 12436540 16765456 17569343 13688705 6607962
7185 6607962 385888 -385931 4965867 10778886 10384784 4653555 1425366 4919073 10240430
7176 10240430 11345739 9663822 9877531 11015393 8365830 2459446 -748608 1281649
7168 1281649 4812015 6669709 8080844 9784753 8726370 2849134 -4566724 -8602860
7160 -8602860 -8356912 -6578047 -5862235 -7173187 -10063905 -12545981 -12432122 -10008779 -7637398
7151 -7637398 -6272485 -4898273 -3653640 -3986611 -5006809 -3978753 -1976811 -4261470
7143 -4261470 -12267480 -19837783 -21209411 -18577370 -17195584 -16865691 -14087240 -9863285
7135 -9863285 -8628225 -10321238 -9929253 -5325472 56992 3338226 5723119 8193718
7127H193718J84192l930865n484255k653897J931927N073871N168321J720450
7119A0203462l614125o685438n229986k541156l212011o364867o961995l097477
7111b7503593J867551M214610L550577J687727O67353J641308L508594L674939
7103f690934K188908K817193P012669R866470O712442J005871m78304J606108
7095B4040423O14170m324005o203613j605494L549511L268686j92375j840978
7087A7306325k098706m011845o587480o592867m194819j824330K03867K403519
7079e396336K938749N17327j769672n48658J777389M47792l556697m593920j035880
7070a1219906K873771M128034M390532N286536N348173L299523J72189l148968
$$ plain form
7127 8193718 8377910 4447045 -1037210 -3691107 -1759180 3314691 8483012 10203462
7119 10203462 6589337 -96101 -5326087 -7867243 -11079254 -17444121 -24406116 -27503593
7111 -27503593 -25636042 -21421432 -17870855 -16183128 -15515775 -13874467 -10365873 -6690934
7103 -6690934 -4502026 -1684833 5327836 15194306 21906748 22912619 22434315 24040423
7095 24040423 24654593 20330588 14126975 12521481 16070992 19339678 19147303 17306325
7087 17306325 15207619 11195774 4608294 -1984573 -6179392 -8003722 -7799855 -5396336
7079 -5396336 -2457587 -1940260 -3709932 -4258590 -2481201 -2033409 -5590106 -10184026 -11219906
7070 -11219906 -8346135 -4218101 172431 5458967 10807140 14106663 14278852 11129884
7062A1129884o351114o877194j937844N032052N980818l22902m376071J224383
7054C502012R945402R565733m09985p857288m886217K222479L129838k508259
7046A2703715o382409l876652P24717J499188j146540k048875J298393N649350
7038H420887O407789L244779J9029l41184O94308l83288m190518p207148n714049
7029I50605j66540N035452N948727K649732j626780l989850l720661j392983J926706
7020E614408M190556L116917r23534l974863k397438K812942P204840P680406
7012B3324234M422716q05599n513040o369267k012964L503068L916390j042556
7004A9422982m297077p23491N537452O581716J087661n023262o858707m947948
$$ plain form
7062 11129884 4778770 -2098424 -4036268 995784 6976602 6653700 2277629 3502012
7054 3502012 13447414 23013147 22603162 14745874 9859657 12082136 15211974 12703715
7046 12703715 6321306 2444654 3169371 4668559 3522019 1473144 2771537 8420887
7038 8420887 14828676 18073455 18092484 17751300 18445608 18062320 13871802 6664654 950605
7029 950605 784065 5819517 11768244 14417976 12791196 8801346 5080685 3687702 5614408
7020 5614408 9804964 12921881 11998347 8023484 5626046 8438988 15643828 23324234
7012 23324234 27746950 26941351 21428311 15059044 13046080 16549148 20465538 19422982
7004 19422982 15125905 14402414 19939866 26521582 27609243 22585981 15727274 10779326
6996A0779326j654264K001497M541774L202163k162621o756865n701354l83395
6988C866261K905906Q47597k887446k744639J376936M281733K721962l24967l47891
6979I695452J807863J156101l525516o898025m126379K155885N126556K585307
6971G977244r73834r78674J721227K981678O94773l440158o061096m813505l3607
6962b925952M894229N778311J870818k505838k357024J884846M738537K996380
6954A4374307K09345J440652N506876O538990K841995q05446j023987o08683k250873
6945B6223176k989635m07959M80172n507028j2567595r829665J812862R086503
6937F300831M894611k568184l738073j035999j299310l106289q20466M198692
$$ plain form
6996 10779326 9125062 11126559 15668333 18870496 16707875 9951010 4249656 3866261
6988 3866261 6772167 7619764 4732318 1987679 3364615 7646348 10368310 10043343 9695452
6979 9695452 11503315 12659416 9133900 2235875 -1890504 265381 5391937 7977244
6971 7977244 7003410 6024736 7745963 10727641 11422414 7982256 1921160 -2892345 -2925952
6962 -2925952 1968277 7746588 9617406 7111568 4754544 6639390 11377927 14374307
6954 14374307 14583652 16024304 21531180 28070170 30912165 30106719 29082732 28474049 26223176
6945 26223176 23233541 22825582 23305754 17798726 5231131 -4598534 -2785672 6300831
6937 6300831 11195442 8627258 4889185 3853186 2553876 -552413 -1372879 2825813
6929B825813N858279L517065J417243N08981j143341k156506j38506J832936o75671
6920A1846293m621374l457084J412965K409441j595041m045923k275280m42593
6912g68596o7931K110645N074940K929105l749618o522184k766637K33j930782
6903e690825j652078M681108Q802661L985281k354869m90842N453685N087133
6895A7821254q21900l093943k36896O95960k594169m957660l795448j702410M29382
6886A744170L597852M643515m27044p290439p147890j77461M340390K194392j116269
6877C61216j418821j563713l211214k477908K023701N182430M043252K916377
6869E855320N012383O127521K210382l067875m368912l146931l823887n515550
$$ plain form
6929 2825813 8684092 12201157 13618400 14127381 12984040 10827534 10689028 12521964 11846293
6920 11846293 7224919 3767835 5180800 7590241 5995200 1949277 -326003 -768596
6912 -768596 -836527 1274118 6349058 9278163 5528545 -993639 -3760276 -3760043 -5690825
6903 -5690825 -7342903 -2661795 6140866 10126147 7771278 7280436 12734121 17821254
6895 17821254 16999354 13905411 13668515 14364475 11770306 6812646 3017198 1314788 1744170
6886 1744170 5342022 9985537 9558493 2268054 -4879836 -5057297 -716907 1477485 361216
6877 361216 -1057605 -2621318 -5832532 -8310440 -6286739 -1104309 2938943 5855320
6869 5855320 10867703 16995224 19205606 16137731 11768819 8621888 4798001 -717549
6861g17549l849402J339007N417270M810732K6361n471740p020966k017724O215504
6852a268507J0648585Q557615L924869M11373l046953p099208q250645m636572
6844g59443n60948k55508j393549m4174K087038J352993n14099N35537L097990
6835C545837K545163o07439j475755Q17464K240466J197557K52542J53204j201800
6826G467239k680338K60106O991440R442682K841589o214450p833244j797030
6818H477994L368560K856610R01543K501327N206408L067663l789076q256978
6810A4334051n317487J691935N839371M957283K297578N95616n90159j893379
6802B1914809k587535l053838n214365q812275j0399983q049580m181045j489110
$$ plain form
6861 -717549 -4566951 -3227944 2189326 7000058 7026419 1554679 -5466287 -7484011 -1268507
6852 -1268507 9380078 17937693 21862562 22273935 19226982 12127774 3877129 -759443
6844 -759443 -1320391 -1575899 -2969448 -3013622 -926584 426409 -87690 447847 3545837
6835 3545837 6091000 5483561 4007806 4825270 7065736 8263293 8515835 8669039 7467239
6826 7467239 4786901 5047007 12038447 21481129 24322718 18108268 10275024 8477994
6818 8477994 11846554 14703164 15604707 18106034 23312442 26380105 22591029 14334051
6810 14334051 9016564 10708499 16547870 21505153 23802731 24398347 23808188 21914809
6802 21914809 19327274 16273436 11059071 2246796 -8153187 -16202767 -20383812 -21872922
6794b1872922R13730M332774O253987L304200k838233o244877l326801L826815
6786a5651327J0218369J1952773Q250090J691804l748195o132559o358268n355899
6778e133212k959898l94976k69282j994590j119079L654323O872527M068436q24320
6769A899929j349670J567622K368958R98043K269655O006957O457481K577119
6761B2796094M10796K535550L130714k130368q245201q460587m160685j170987
6753D705326o03147J61182P13643j173168l458656j866527K520457M105880J496453
6744F601443q19100n92185j308575m950685p074223l549614J952693K675299j182370
6735h247317k732831J546921P112707P995695M103598l10766k434518k341549
$$ plain form
6794 -21872922 -20959192 -16626418 -10372431 -7068231 -9906464 -16151341 -19478142 -15651327
6786 -15651327 -5432958 6519815 14769905 16461709 12713514 6580955 222687 -5133212
6778 -5133212 -8093110 -8488086 -8757368 -10751958 -11871037 -8216714 -1344187 2724249 1899929
6769 1899929 550259 2117881 4486839 5484882 7754537 13761494 20218975 22796094
6761 22796094 23206890 25742440 28873154 26742786 18497585 10036998 5876313 4705326
6753 4705326 4102179 4263361 4977004 3803836 345180 -1521347 999110 5104990 6601443
6744 6601443 5782343 5190158 3881583 -1069102 -8143325 -11692939 -9740246 -7064947 -8247317
6735 -8247317 -10980148 -9433227 -2320520 5675175 9778773 9468007 7033489 4691940
6727D691940o65037J953924L759234L066343P85689k68872J108500L283605M140647
6718B1855973L086405P18528j749181k701512j694560q68556k507216m987938
6710A1151943m106126N50110L744422J322484l782922n265979j597864K692067
6702D708135L244482L63654k992974n162569o416869o901381n541680j542314
6694b0241516L558786O686759O772521N985852N897453M414677l11725m651653
6686H111154l149140K757551N380827J556948k956607k444630J049915K686215
6678A2992233K151975J275009q57204m720969o347057k711930K089835K408193
6670F280085j17370j9018K246482J528669k511144m751750l053324m00098J075705
$$ plain form
6727 4691940 4026903 5980827 9740061 12806404 13592093 13323221 14431721 17715326 21855973
6718 21855973 24942378 25660906 23911725 21210213 19515653 18647097 16139881 11151943
6710 11151943 7045817 7595927 11340349 12662833 8879911 3613932 2016068 4708135
6702 4708135 7952617 8316271 5323297 160728 -6256141 -13157522 -18699202 -20241516
6694 -20241516 -16682730 -9995971 -3223450 2762402 8659855 13074532 12762807 8111154
6686 8111154 4962014 7719565 13100392 14657340 11700733 9256103 10306018 12992233
6678 12992233 15144208 16419217 15562013 10841044 4493987 1782057 3871892 6280085
6670 6280085 6162715 6143697 8390179 9918848 7407704 2655954 -397370 -797468 278237
6661B78237J631872L06534l122914l648863L204102J1578697J0573305J60413
6653B0961383p826035o517670j893536p46425j002995R35930K587513J532047
6645H030212J358947M948072Q565230Q594404P262290N912105N78808q653301
6637C6596767j2377745n254741K866933K29783q515309r670863j956724K947404
6629D865505k10946m006602k738470l85138o35469n4281L639536N585064K104619
6620H163818k109075j385237J844886J707316j318894j689966K060823N208868
6612A2482539L828197k74818k643681j701749K88125Q59188K59842P2156L82600
6603A3552399N00977J496423M340517N774175J399567n784484o593029J015103
$$ plain form
6661 278237 1910109 2216643 -906271 -4555134 -1351032 10227665 20800970 20961383
6653 20961383 13135348 6617678 4724142 3977717 2974722 3910652 6498165 8030212
6645 8030212 9389159 14337231 22902461 31496865 38759155 44671260 45250068 36596767
6637 36596767 24219022 18964281 21831214 22060997 13545688 3874825 1918101 4865505
6629 4865505 4654559 647957 -2090513 -2475651 -3111120 -3165401 474135 6059199 8163818
6620 8163818 6054743 4669506 6514392 8221708 6902814 5212848 7273671 12482539
6612 12482539 16310736 16035918 13392237 11690488 11978613 12837801 13097643 13169799 13552399
6603 13552399 14053376 15549799 19890316 25664491 27064058 21279574 14686545 15701648
6595A5701648O804006K320407o490331q536336l562439P57590K700872N670940
6587A5366357O759359l6902r403130q077236M284646J1506237L904355p773560
6579A6530126r395021l272426p80535l806739n228039k721577p84918j169734
6571a0628863q63372J009137J896145J251980J186719K036508K326676K371075
6563E86005L341352L823190J632767k019014m011636l633839k161714k00249J374141
6554a268997P05946j284553j07510M952452O826801j76535j0687917j4388275
6546a5428588r222750j755147L336260O582286P926280N601322J093163j624203
6538c491377k245443l400941m118158r65171M308553N999140M170813M973213
$$ plain form
6595 15701648 22505654 24826061 18335730 9799394 6236955 6994545 9695417 15366357
6587 15366357 22125716 22088814 12685684 4608448 8893094 20399331 24303686 16530126
6579 16530126 7135105 3862679 3082144 -724595 -5952634 -8674211 -9459129 -10628863
6571 -10628863 -11492235 -10483098 -8586953 -7334973 -6148254 -4111746 -1785070 586005
6563 586005 3927357 7750547 9383314 7364300 3352664 -281175 -2442889 -2643138 -1268997
6554 -1268997 -563051 -1847604 -1955114 2997338 9824139 9647604 -1040313 -15428588
6546 -15428588 -24651338 -26406485 -23070225 -16487939 -8561659 -2960337 -1867174 -3491377
6538 -3491377 -5736820 -9137761 -13255919 -14221090 -9912537 -3913397 257416 5230629
6530E230629R278686R637238K492820m606893l851230J154875J489218l641768
6522A7183575o870938m039164J083156L330898K167096J73654q86070j023971
6514A1118236r27284j106533j619667k145605k066140m68537K740196M903293
6506A0427959J992172n553287j0481780o327840L776093J0448670R463954M615185
6498A8361126j50000m595430p259759m379713K862328O767919L371806j475180
6490A3503097j216320J800040J872745J30534J642416N488649N585136K73814
6482B9080111n784490q843901r090212o880907k179571K129527K378293J02333
6474I11183Q3948J904230J03233n515351o899687P95806J0432612J1188182K433904
$$ plain form
6530 5230629 14509315 24146553 26639373 22032480 18181250 19336125 20825343 17183575
6522 17183575 10312637 6273473 7356629 10687527 12854623 13028277 12142207 11118236
6514 11118236 10190952 9084419 7464752 5319147 3253007 2784470 5524666 10427959
6506 10427959 12420131 6866844 -3614936 -9942776 -6166683 4281987 13745941 18361126
6498 18361126 18211126 13615696 6355937 1976224 4838552 11606471 14978277 13503097
6490 13503097 12286777 14086817 15959562 16090096 17732512 23221161 28806297 29080111
6482 29080111 23295621 14451720 5361508 -1519399 -3698970 -1569443 808850 911183
6474 911183 995131 2899361 3002594 -2512757 -9412444 -8616638 1815974 13004156 15438060
6465A5438060o079233o424807k24607N446302N922111K023795k031190k672263
6457A1398168j31593J998457J001005j582258j959397P85538L167697J625224
6449A6302841k696017n000140k814880P55889J230124r98861j381496J786865
6441G184325M549269L130838n65271k122533p99299Q26273J429500J353248O8469
6432A5054819k423412k823537J758787P581511P174649n98038q404273r808142
6424G512364n947204j173241K687650M855402L392808j335313m604031k921469
6416B466966R98373K501914J519753J053934J720608J894632J322878P81097q6992
6407A4173163j260017j007799N51760k08724m199931n522950K94794P288231O192894
$$ plain form
6465 15438060 9358827 2934020 2709413 8155715 14077826 16101621 14070431 11398168
6457 11398168 11266575 13265032 14266037 12683779 10724382 11509920 14677617 16302841
6449 16302841 13606824 8606684 5791804 6547693 7777817 6778956 5397460 7184325
6441 7184325 11733594 14864432 14299161 12176628 11377329 12203602 13633102 14986350 15054819
6432 15054819 12631407 9807870 11566657 19148168 26322817 25724779 17320506 7512364
6424 7512364 1565160 391919 3079569 7934971 11327779 9992466 5388435 2466966
6416 2466966 3465339 5967253 7487006 8540940 10261548 12156180 13479058 14260155 14173163
6407 14173163 12913146 11905347 12457107 12248383 8048452 2525502 2820296 10108527 16301421
6398A6301421j209589m009723J252605N485418J308135o442135r367739p342279
6390d023886n439608m510205j748232K601218N406204N679243M499827J843962
6382D308523j974732l916771k133324k43244k498801o396901n830283n88368L406981
6373a5866920L380755L067518N496507P951047O570271J942811k234420l173070
6365G134499k98538M450153O679742L257868l110943o493777n377243l325183
6357B916578j600279K607052Q387368Q727148R22352o754867n687811L96170J494354
6348A1408065l032295m454392L10877L884982J214010k112847L22403M852507
6340A2393310L766745k285692n657709l499088q45985j746147l655504k612926
$$ plain form
6398 16301421 15091832 11082109 12334714 17820132 19128267 12686132 3318393 -4023886
6390 -4023886 -9463494 -13973699 -15721931 -13120713 -7714509 -2035266 2464561 4308523
6382 4308523 2333791 -1582980 -3716304 -3959548 -6458349 -12855250 -18685533 -19273901 -15866920
6373 -15866920 -12486165 -9418647 -3922140 4028907 10599178 12541989 10307569 7134499
6365 7134499 6835961 11286114 17965856 21223724 18112781 11619004 6241761 2916578
6357 2916578 1316299 3923351 12310719 21037867 21960219 15205352 9517541 9913711 11408065
6348 11408065 8375770 3921378 4232255 8117237 9331247 7218400 7540803 12393310
6340 12393310 16160055 13874363 8216654 4717566 3871581 2125434 -1530070 -4142996
6332d142996O23820K249990M65639l196743n671790m184362J651469Q162806J0017868
6323E975701N941415M96063j333088K47947J421914N07164l83654P78476K530293
6314A6182231J350933l875389r205660q308958O50142J0928366J2653364L733398
6306B4108427p092407j0207397n658001o12131J237690K437642M408280L665807
6298A2287910j757906o812634m949707K942748R347790R155044M288894o07872
6290B3894267l550782n080791n465691m291450j975161J39848J424474K652218
6282G746932M345363M969147K181014l551365q067725p878162m324548j182852
6274e762196P93970L525382O260869N313245L56957l883125m660617m900366o335817
$$ plain form
6332 -4142996 -3519176 -1269186 -803547 -4000290 -9672080 -13856442 -12204973 -4042167 5975701
6323 5975701 11917116 12413179 11080091 11328038 12749952 13257116 12873462 13651938 16182231
6314 16182231 17533164 13657775 4452115 -3856843 -3206701 7721665 20375029 24108427
6306 24108427 17016020 6808623 1150622 538491 1776181 4213823 8622103 12287910
6298 12287910 10530004 3717370 -1232337 1710411 11058201 20213245 24502139 23894267
6290 23894267 20343485 15262694 9797003 5505553 3530392 3670240 5094714 7746932
6282 7746932 12092295 17061442 19242456 15691091 7623366 -254796 -4579344 -5762196
6274 -5762196 -4968226 -1442844 4818025 10131270 10488227 6605102 1944485 -2955881 -9291698
6265i291698m640426K644322Q441419M967192k866096l129941M651104Q091682
6257H867558J475256n022523j892636M346890K210810n674257o751963J242468
6249a198397O653517J693023o673758p691413j059819M977441N086782J390295
6241C177671j227538p19800O53957p43893m748781o103543j151276N504666N967444
6232F08907M43524k627804O80034L961530J210778l398759k757628J360352J845672
6223A326606j210820n87546N394878Q979661M576655k751928m802577j124183
6215I800746K671207L922232M490249M911404K832617j895475n078665l415129
6207A8239186O68521J844310j480684n364281n216804j198820K073641J045486
$$ plain form
6265 -9291698 -13932124 -11287802 -2846383 2120809 -745287 -3875228 775876 8867558
6257 8867558 10342814 5320291 3427655 7774545 9985355 4311098 -2440865 -1198397
6249 -1198397 5455120 7148143 474385 -7217028 -8276847 -3299406 1787376 3177671
6241 3177671 1950133 1230333 1884290 1140397 -3608384 -9711927 -10863203 -5358537 608907
6232 608907 1052431 -1575373 -895339 3066191 4276969 878210 -1879418 -519066 1326606
6223 1326606 115786 -471760 4923118 13902779 18479434 15727506 10924929 9800746
6215 9800746 12471953 16394185 20884434 25795838 28628455 26732980 21654315 18239186
6207 18239186 18907707 20752017 19271333 13907052 8690248 7491428 9565069 10610555
6199A0610555k466400l497460k58387L507382L453128K08245k068187j612645
6191G876231n18835k39101Q78554L884403N998856M016535p29026l952451m111989
6182A3103177l289162k729443j206565J411594K625799J287540K00234K152075
6174A3555249N426697O005755K767414k118191o501320q939127p440279j571359
6166A184839M320770M303883j348097n145395j414120O331916R724947N465695
6158B3424438j915620o234750n629911k260121J288974L796776M756682L687700
6150B0914168P11844k640507m081042k551467P41321L645805M876575M077322
6142B5694019J296735k210170l771496k110899J91297l53935k950791l436220
$$ plain form
6199 10610555 8144155 4646695 4388308 7895690 11348818 11557063 9488876 7876231
6191 7876231 7357396 7118295 7996849 11881252 17880108 21896643 21167617 17215166 13103177
6182 13103177 9814015 7084572 5878007 7289601 9915400 11202940 11403174 13555249
6174 13555249 18981946 24987701 27755115 25636924 19135604 10196477 2756198 1184839
6166 1184839 5505609 9809492 8461395 3316000 1901880 8233796 17958743 23424438
6158 23424438 21508818 15274068 9644157 7384036 8673010 12469786 17226468 20914168
6150 20914168 21626012 18985505 14904463 12352996 13094317 16740122 21616697 25694019
6142 25694019 26990754 24780584 21009088 18898189 19089486 18735551 15784760 12348540
6134A2348540p87632J077744l73937k024245k08152L065965L225793O32286J84182
6125A7140544L592079O497214M622476m54299l619317k452287N63690J229485
6117B7119585j934951o131587p169579m268094r88576l66216q67700L94828K041223
6108G828933N161n394025q349923n029825J493366N837212O612175N545005L345062
6099A1893141J26062j995730r34631J271466L24167l924171o418067l619627J497108
6090a780282L257707L94980k947289k685537Q33165M201940M987840L282865K57179
6081I802568k906940m376628k112734L155026O686734M367485j449716l949265
6073I216530p39152K712904R29931l583010m343229p68507J417576m79090k223174
$$ plain form
6134 12348540 11560908 12638652 12264715 10240470 10032318 13098283 16324076 16956362 17140544
6125 17140544 20732623 27229837 31852313 31398014 27778697 25326410 25890100 27119585
6117 27119585 25184634 19053047 11883468 7615374 6626798 6260582 5392882 5787710 7828933
6108 7828933 7834094 2440069 -5909854 -10939679 -9446313 -3609101 3003074 8548079 11893141
6099 11893141 12019203 10023473 9088842 10360308 10684475 6760304 342237 -3277390 -1780282
6090 -1780282 1477425 1872405 -1074884 -3760421 -2927256 1274684 6262524 9545389 9802568
6081 9802568 6895628 2519000 406266 3561292 10248026 14615511 13165795 9216530
6073 9216530 8477378 11190282 12120213 8537203 4193974 3425467 4843043 4363953 2140779
6064B140779j42813K676479J648117j574217j728406J516837L111647P48530j647716
6055F749237k16600L106193L821452J048761k492949m881766o263892o578476
6047e708040m997469j789019J404917L360595L690302J794184k293277n872166
6039a0409973n123214R5332N094123N458937J620662k953855n922182o280377
6031a8420547k708265M550793J0893468J0578024L781076k713197l348488L50524
6023B963388L401393L899904L063322J080424k825181o606958o020601o23268
6015a667577L972175K423045l373564o315019k681535L716622O542715M194984
6007F811846O10450k82909J060183J543433L8385j460267j025715O99183J908033
$$ plain form
6064 2140779 1997966 4674445 6322562 4748345 3019939 4536776 7648423 8396953 6749237
6055 6749237 6532637 9638830 13460282 14509043 12016094 7134328 870436 -5708040
6047 -5708040 -10705509 -12494528 -11089611 -7729016 -4038714 -2244530 -4537807 -10409973
6039 -10409973 -15533187 -15437855 -10343732 -4884795 -3264133 -6217988 -12140170 -18420547
6031 -18420547 -21128812 -16578019 -5684551 4893473 8674549 5961352 2612864 2963388
6023 2963388 6364781 10264685 13328007 14408431 11583250 4976292 -1044309 -1667577
6015 -1667577 2304598 4727643 1354079 -4960940 -7642475 -3925853 2616862 6811846
6007 6811846 7422296 7139387 8199570 9743003 9781388 8321121 7295406 7994589 9902622
5998I902622K001491J248642o32585l557292n417172l853967L621J982125J03190
5989A780675k695629k666976k93906J036846K73044k26208J046292K053589J39538
5980D47265l813026n745585k737068L774066Q979728Q761133L320224k803372
5972A0183365m704619j579352K748657L737362L77509m246464o085124l723083
5964c291749P17208L996546M903121M507285L404365L06829n206314r753458q643435
5955i059602j744520N346353P168051L918881K3307j246490q2535J724979K775397
5946H823821K297361J78846k630860m444860l852055m67972M460516P773136O260749
5937A8398682M42719m545286m060561K98074K340301r35278n463426n220623M26548
$$ plain form
5998 9902622 11904113 13152755 12520170 8962878 3545706 -308261 -304640 1677485 1780675
5989 1780675 -914954 -3581930 -3875836 -2838990 -2565946 -2792154 -1745862 307727 447265
5980 447265 -3365761 -9111346 -11848414 -8074348 905380 9666513 12986737 10183365
5972 10183365 5478746 3899394 6648051 10385413 10762922 6516458 431334 -3291749
5964 -3291749 -2574541 1422005 6325126 10832411 14236776 14543605 9337291 -416167 -9059602
5955 -9059602 -10804122 -5457769 1710282 5629163 5652470 4405980 4323445 6048424 8823821
5946 8823821 11121182 11300028 8669168 4224308 372253 -95719 4364797 12137933 18398682
5937 18398682 18841401 14296115 10235554 10533628 12873929 11938651 6475225 1254602 1681150
5928A681150O126229O544781J533797m430148o722135m273527K85401L411222
5920D156770L533877J689253j1047l00595L36606K85225j314888l159104l041689
5911B174408q03029J198701J165550j83247j702856l549038m731404j757675O075432
5902b113158J1857245P544680m215139j1063030o399287J961482L036804k618821
5894b009224n967192l656898p92116k77867J711608P063715J0236188O487295
5886A2795509J26698j598675O09421J4398m939206q263361n891755j278160P21081
5877g704050M27714M90347N33529j077243k717133j228303L090263P105676R375171
5868H295971J0076272P663660Q84450n915082n665822J270818N645381J473569
$$ plain form
5928 1681150 7807379 14352160 15885957 11455809 4733674 460147 745548 4156770
5920 4156770 7690647 9379900 9368853 9068258 9404864 9690089 8375201 5216097 2174408
5911 2174408 1371379 2570080 3735630 3552383 1849527 -1699511 -6430915 -8188590 -2113158
5902 -2113158 9744087 17288767 13073628 2010598 -4388689 -2427207 609597 -2009224
5894 -2009224 -7976416 -11633314 -12425430 -12703297 -10991689 -3927974 6308214 12795509
5886 12795509 12922207 11323532 11932953 11947351 7008145 -1255216 -7146971 -8425131 -7704050
5877 -7704050 -7276336 -6785989 -6252460 -7329703 -10046836 -11275139 -8184876 -1079200 8295971
5868 8295971 18372243 26035903 26920353 21005271 15339449 16610267 22255648 23729217
5860B3729217n598836o791323k416494M74288q88976l548714o134212r431928
5852a0606978j0293903l951027O041501R066710K266809m076806j188483N664138
5844g078039O283488R54894k057477m43161M37150j465917j522550K667914O610730
5835D387032N705917J222741k740436l972892k368272O10052J827670j97003j775481
5826B699328J381523O245886N315127j790113o558995l772083J457154K411321
5818G389148J1874j322094j139194p83846J035863M443481M860524M7380l565948
5809A0977188N17547P206810N933669k990086p950509l000402M155009M449104
5801A9298330m26832l309310k639328j902854j972204o87932J346593L82143m523864
$$ plain form
5860 23729217 18130381 11339058 8922564 9396852 8507876 4959162 -1175050 -10606978
5852 -10606978 -20900881 -24851908 -18810407 -9743697 -7476888 -11553694 -12742177 -7078039
5844 -7078039 -794551 160343 -1897134 -2340295 -1903145 -3369062 -4891612 -2223698 4387032
5835 4387032 10092949 11315690 8575254 4602362 2234090 2844142 4671812 4474809 2699328
5826 2699328 4080851 10326737 15641864 13851751 7292756 3520673 4977827 7389148
5818 7389148 7401022 6078928 4939734 4155888 5191751 9635232 14495756 14543136 10977188
5809 10977188 11494735 18701545 24635214 21645128 13694619 10694217 14849226 19298330
5801 19298330 18871498 15562188 12922860 11020006 9047802 8359870 9706463 10088606 5564742
5792E564742r200865r189325m381959K057627P325963J0150137R687309N417956
5784A7431585j252497o526043o945569k810058K122399M430891L474618N01786
5776A0427112k411784k526643J162570M785239K935910k821616l764490L670250
5768A1456548J0480916O507396m624469j0272291o403953r18416N92632J821163
5760H639526N514416O418811M10262p189423r319609p026178m637657r42934O460196
5751a672590J2499722R961004J538564k685580M14140L688534J586610k732206
5743B2598198m356337l535553k344409k98094K760099L770160N12441m219808
5735A4886697n799091l343260K0889R29780j319997l964457k754412K805081O853631
$$ plain form
5792 5564742 -3636123 -12825448 -17207407 -15149780 -7823817 2326320 12013629 17431585
5784 17431585 16179088 9653045 2707476 -102582 2019817 6450708 9925326 10427112
5776 10427112 8015328 5488685 6651255 11436494 14372404 11550788 7786298 11456548
5768 11456548 21937464 28444860 23820391 13548100 7144147 6225731 6818363 8639526
5760 8639526 14153942 20572753 20983015 13793592 4473983 -2552195 -7189852 -8132786 -1672590
5751 -1672590 10827132 20788136 22326700 19641120 20055260 23743794 25330404 22598198
5743 22598198 18241861 14706308 12361899 12063805 14823904 18594064 19106505 14886697
5735 14886697 9087606 5744346 5765235 6695015 5375018 1410561 -1343851 1461230 8314861
5726H314861L787044k985652m504662P36353M055271k10279n776166m309588J433701
5717E40883K207398k970750n341718J0220O773846O548603L2108m996437m037593
5708a233440j54473J468199n2672j620399j285090o03423j209718j376049J204950
5699d862115M335818L133931k448500o306721m474782o04280J4843j957001k649433
5690a5818240k043567k704836l428147m58004N169210P566431M460099N33047
5682f724007N15247L447804N965712P069874O760596L503830l163006r444724
5674G931326j0272845n148807J072526L157530L89339l007085k128519L050107
5666d956428O960707N035076j07552k361959j233466k116298o467587p696038
$$ plain form
5726 8314861 12101905 9116253 4611591 5347944 9403215 9192936 3416770 -892818 540883
5717 540883 2748281 -222469 -5564187 -5553967 1219879 7768482 7800590 2804153 -1233440
5708 -1233440 -1387913 80286 27614 -1592785 -2877875 -3481298 -4691016 -6067065 -4862115
5699 -4862115 -526297 2607634 159134 -6147587 -10622369 -11226649 -11211806 -13168807 -15818240
5690 -15818240 -17861807 -20566643 -23994790 -24452794 -19283584 -11717153 -7257054 -6724007
5682 -6724007 -6208760 -2760956 3204756 10274630 17035226 20539056 17376050 7931326
5674 7931326 -2341519 -7490326 -6417800 -3260270 -2870931 -5878016 -8006535 -4956428
5666 -4956428 2004279 7039355 6931803 4569844 3336378 1220080 -5247507 -12943545
5658a2943545p15950R063197J1836745O008169r37973l141239k316014k418194
5650D435196l489176l237740j527584l79074p04514j070489M24995L766135O398866
5641D616615N304436N60691l623633l014212J410528M025054J073963m767382
5633E586060p496168m555137R29885M415401M725032L708280K530049N41493k008876
5624H376019k584180N67570N323296P708016O315282K935915l47689k558934l152507
5615B2582788k487709k363341l425182l005455R10771M479122J710134o268276
5607A2132852j1183619q622255l655351k574571m163303l388290M16277L982511
5599a7055749N791421O499870N694199K548667j628764m691367n674730l362203
$$ plain form
5658 -12943545 -13659495 -4596298 7240447 13248616 12310643 9169404 6853390 4435196
5650 4435196 946020 -2291720 -3819304 -4198378 -4902892 -5973381 -5548386 -1782251 4616615
5641 4616615 9921051 10481742 6858109 3843897 5254425 9279479 10353442 5586060
5633 5586060 -1910108 -6465245 -5535360 -1119959 3605073 7313353 9843402 10384895 8376019
5624 8376019 5791839 6359409 11682705 19390721 25706003 28641918 28294229 25735295 22582788
5615 22582788 20095079 17731738 14306556 11301101 12211872 16690994 18401128 12132852
5607 12132852 949233 -7673022 -11328373 -13902944 -18066247 -21454537 -21038260 -17055749
5599 -17055749 -11264328 -4764458 929741 3478408 1849644 -2841723 -8516453 -11878656
5591a1878656L382968J0726024J0436142O49957q746865q232194j739868N36436
5583d866056j545469M95207P791784J1520687P710588L282135L511354L802825
5575C1703055l81162m390315k494317J804019J618610j933216k268683J525580
5567B5183571L659206Q79345l393394m486254j798053J685426K556210j58510
5559B4127547l806134m840889l380447k560189k895806j511497J569920J740891
5551H443396k414988n057912j557452L664895L663411l03051j352223J833666
5543F919742L525546M98077l295450l079807L48632K700622J946951J14949K24515
5534I903777K221955K518032j249953n863496o070510k212612L18034j66365N14129
$$ plain form
5591 -11878656 -8495688 2230336 12666478 13316435 4569570 -3662624 -5402492 -4866056
5583 -4866056 -6411525 -5916318 1875466 13396153 21106741 24388876 27900230 31703055
5575 31703055 31321893 26931578 24437261 26241280 27859890 25926674 23657991 25183571
5567 25183571 28842777 29722122 26328728 21842474 20044421 21729847 24286057 24127547
5559 24127547 20321413 15480524 12100077 9539888 6644082 5132585 6702505 8443396
5551 8443396 6028408 970496 -586956 3077939 6741350 6438299 5086076 6919742
5543 6919742 10445288 10943365 7647915 4568108 4916740 7617362 9564313 9679262 9903777
5534 9903777 12125732 14643764 13393811 7530315 1459805 -752807 -434773 -601138 -87009
5525h7009L718562M172792q18028n082670k622275K803118M141618K120429K068269
5516A0414806L874921L580683J795699J918940K511232J25324k629810j065570
5508B0526225J686783j024864o491425n372296K354327N891293L78665o024192
5500A1924516n602203j388622P19747Q00808M34892k153601o506725o884197r42728
5491i598113M918824M669520J162090Q2307J321518J995011K347996K935371J394320
5482A1228844k330499l150176R65024L833414N51935l845657k658782J177200
5474E771303O59965k965566k863924J373582L739083K372813J448646K967079
5466A2502981M307910L887401K656531L89403l413375n945278m650082k858786
$$ plain form
5525 -87009 3631553 7804345 6986317 1903647 -718628 2084490 6226108 8346537 10414806
5516 10414806 14289727 17870410 19666109 21585049 24096281 24221605 21591795 20526225
5508 20526225 22213008 21188144 14696719 9324423 11678750 17570043 17948708 11924516
5500 11924516 6322313 4933691 5653438 6454246 6889138 4735537 -1771188 -8655385 -9598113
5491 -9598113 -4679289 -9769 1152321 1234628 2556146 4551157 6899153 9834524 11228844
5482 11228844 8898345 5748169 6713193 10546607 11098542 7252885 4594103 5771303
5474 5771303 6431268 3465702 601778 1975360 5714443 8087256 9535902 12502981
5466 12502981 16810891 20698292 23354823 23744226 20330851 14385573 9735491 6876705
5458F876705n038010q072661n268681J873810M792739J292327j246716J797768
5450b992719N411543M115192N28643n5585K129948L603535L785855M028860L576225
5441B4131497R12893k740197m735092m503945l305739j758540L06129K384669
5433A0691675L143664J486314k179339n097144l869073J181589M922017L386376
5425A3666079p22637j832823Q09263L298457L443737K187112k77967m403634p707643
5416H459944o859608l365025j576146j091020K461081Q492964J0467672N777376
5408B2767238j70187k422985k639350l679110m315110l094926j793166j240442
5400C411962P76586L927295L871066L81340j67703M238269N530181j641716q719314
$$ plain form
5458 6876705 1838695 -6233966 -11502647 -9628837 -4836098 -3543771 -4790487 -2992719
5450 -2992719 2418824 6534016 7062659 7007074 9137022 12740557 16526412 20555272 24131497
5441 24131497 25044390 22304193 17569101 13065156 9759417 8000877 8307006 10691675
5433 10691675 13835339 15321653 13142314 8045170 4176097 5357686 10279703 13666079
5425 13666079 12943442 11110619 11919882 15218339 18662076 20849188 20571221 16167587 8459944
5416 8459944 1600336 -1764689 -3340835 -4431855 -1970774 6522190 16989862 22767238
5408 22767238 22597051 20174066 17534716 13855606 9540496 6445570 4652404 3411962
5400 3411962 4188548 8115843 11986909 12368249 12200546 16438815 21968996 20327280 11607966
5391A1607966n053759M569667O382723j168631n927545k144287J403644k338739
5383G331039o441102j877988P041650Q901544K178354l482797j576878L787145
5375A5860967N462101K009938l034998o135100n724281k316775J221913J663469
5367I007234n75619j297933J882936N694256N264672O61140l484076m300186l435632
5358I416792l153071l103359k559313k612024l282757j084785O315691J4144544
5350A4081718J4058254M503305o419537j0162524o666479k156322r56583k293672
5342C988160l298824k150422J040815M191719M550876J725615j278104j559094
5334G210741J25605J070282P27769O46237R21641l13260l320625n317099m051328
$$ plain form
5391 11607966 6554207 11123874 17506597 16337966 10410421 8266134 9669778 7331039
5383 7331039 889937 -988051 6053599 14955143 17133497 13650700 12073822 15860967
5375 15860967 21323068 23333006 20298008 14162908 8438627 6121852 7343765 9007234
5367 9007234 8431615 7133682 9016618 14710874 19975546 20636686 17152610 12852424 9416792
5358 9416792 6263721 3160362 601049 -2010975 -5293732 -6378517 -62826 14081718
5350 14081718 28139972 32643277 26223740 16061216 9394737 7238415 6281832 3988160
5342 3988160 689336 -1461086 -420271 3771448 8322324 10047939 8769835 7210741
5334 7210741 7336346 8406628 9134397 9780634 10702275 10389015 7068390 1751291 -2300037
5325b300037r95251Q42343J039121J420846K128880J020762j909482k451401K391346
5316A187127Q440354Q078578L58452o876353o820604j723089J815810J728767
5308F189042K98318j757322n061794o807362k675742N800634J1345266R819526
5300A7150566M312613p85396m654743p178169o588559l102151m30909k47117Q79770
5291f44095N334271Q980123O316701j407848p568452q154909m903693j705143
5283c753045p62352j283669k18894L974505P443893M452571l597315p648018k840909
5274d233233M317889N538755K408776J747217L518401K082716k382971l145886
5266I851664J570348M974276K435325j467513q46081K237286J727686k633971
$$ plain form
5325 -2300037 -3295288 -2452945 -1413824 7022 2135902 3156664 1247182 -1204219 1187127
5316 1187127 9627481 17706059 18064511 11188158 4367554 2644465 4460275 6189042
5308 6189042 6487360 4730038 -331756 -7139118 -9814860 -4014226 7331040 17150566
5300 17150566 21463179 20677783 16023040 8844871 2256312 -845839 -1276748 -1523865 -644095
5291 -644095 4690176 13670299 19987000 18579152 11010700 2855791 -2047902 -3753045
5283 -3753045 -4515397 -5799066 -6017960 -2043455 5400438 9853009 6255694 -1392324 -4233233
5274 -4233233 84656 5623411 8032187 9779404 13297805 15380521 12997550 9851664
5266 9851664 11422012 16396288 18831613 17364100 16518019 18755305 20482991 17849020
5258A7849020m972709j844425L135864M124034K36473l594097k662506J846794
5250A4118448M534547K647364j155013l380302l816461l412712j739126N11805
5242H308550K21558k893429l395100K153176P865800N675632k480008p278664
5234H177515n617599l103071k823162r64912M048791P031079M824512J850181
5226A3423334J937302J792079j562408l624707k3184M276036J951127m162422
5218A4007157m678800J834059O949338N238368O36763j908974l506053o374435
5210A2197423p975923n149201l61308J313522l25368p15169K313870N508472N262391
5201A2068709K713106J740731L374777M573953K582619j501158m522469n280808
$$ plain form
5258 17849020 12876311 11031886 14167750 18291784 18528257 14934160 12271654 14118448
5250 14118448 18652995 21300359 20145346 16765044 12948583 9535871 7796745 8308550
5242 8308550 8530108 5636679 2241579 4394755 12260555 17936187 15456179 8177515
5234 8177515 2559916 -543155 -3366317 -4331229 -282438 6748641 11573153 13423334
5226 13423334 15360636 17152715 15590307 11965600 11942416 16218452 18169579 14007157
5218 14007157 9328357 11162416 18111754 23350122 23986885 22077911 18571858 12197423
5210 12197423 4221500 -927701 -1289009 24513 -300855 -1016024 1297846 6806318 12068709
5201 12068709 14781815 16522546 19897323 24471276 27053895 25552737 21030268 15749460
5193A5749460n175097n441225n373520l354727J279776O971330R725773N760697
5185B0142467l435392j0180606q246533q80403K825436l72635m620086m532871
5177i300623k400759k547762l543636j360943K752356L480998m18480m322034
5169a7660883m253453j111272K064055L657144L751338L478584M274717N656465
5161a43305M632243J36455l400587j137042M328221N360902j03967n876152o772528
5152b975760m616040k238710K130925R175042J2411470N594302n996276r898621
5144C586332k776900N010349L771166l056698n418325q74585L853075L531962
5136G626376L23774j488963j497944j580721j721994m79079J849315L159384K392642
$$ plain form
5193 15749460 10574363 5133138 -240382 -3595109 -2315333 4655997 14381770 20142467
5185 20142467 16707075 6526469 -1720064 -2600467 224969 -147666 -4767752 -9300623
5177 -9300623 -11701382 -14249144 -17792780 -19153723 -16401367 -12920369 -13338849 -17660883
5169 -17660883 -21914336 -23025608 -20961553 -17304409 -13553071 -10074487 -5799770 -143305
5161 -143305 4488938 4625393 1224806 87764 4415985 9776887 9672920 3796768 -2975760
5152 -2975760 -7591800 -9830510 -7699585 1475457 13886927 19481229 13484953 3586332
5144 3586332 809432 5819781 9590947 6534249 1115924 241339 4094414 7626376
5136 7626376 7950150 6461187 4963243 3382522 1660528 1181449 3030764 6190148 8582790
5127H582790O69933n24115r51837r94958m37140J122804K823277K676219L368
5118A2970341k958642l367230j555359n77447j522426j736810P72985L687700
5110E713112L741394J642985J97811q62433l830385p500422p589054l250267J379197
5101a0358062L208815L365388L139891J623476p05814j010312Q05054J091622
5093A160058o18648M39806N359576P091246J063138n686240m233626J925022K153419
5084H653751m279842p369710k695517K399509J803288o8063K861164P912488Q548849
5075A7765917M542055R56626O5718k75989j857120l968273n284581n219286m107337
5066B617730l233813l175564j822600L044857Q697391R009508K789066l347290
$$ plain form
5127 8582790 9252723 8728608 7776771 6781813 6344673 7467477 10290754 12966973 12970341
5118 12970341 10011699 6644469 5089110 4511663 2989237 1252427 2025412 5713112
5110 5713112 9454506 11097491 11295302 10432869 6602484 -897938 -8486992 -11737259 -10358062
5101 -10358062 -7149247 -3783859 -643968 979508 273694 -736618 68436 1160058
5093 1160058 541410 981216 6340792 13432038 14495176 8808936 4575310 6500332 8653751
5084 8653751 4373909 -2995801 -5691318 -3291809 -1488521 -1556584 1304580 9217068 17765917
5075 17765917 22307972 23264598 23330316 23054327 21197207 17228934 11944353 6725067 2617730
5066 2617730 -616083 -3791647 -5614247 -2569390 6128001 15137509 17926575 14579285
5058A4579285k987196K321046N949430M256487p46762m842965n585964l977590
5050H965771k986332l327110j882671K919794O254463K722071m151175n261521
5042C253290P81860N510594L741208N85181J421000K976672M65713l126338k317222
5033A3291958J024040P09693l717669o770724n178770p54625L346024M647954
5025F597881J581634m026536o763226l795367J182688L540126L782589M214581
5017F314370L739101Q90509j887424k291769k618397m689880m683994M89992N928399
5008A190907N422325J676591J362461L069219j686o717233p838816k75344P816551
4999E704975Q805866M739259J543620N03427p10031k899231m446015l148946K036678
$$ plain form
5058 14579285 11592089 13913135 19862565 24119052 23372290 18529325 12943361 8965771
5050 8965771 5979439 2652329 769658 3689452 9943915 12665986 8514811 3253290
5042 3253290 4035150 9545744 13286952 13872133 15293133 18269805 18735518 15609180 13291958
5033 13291958 14315998 15025691 11308022 4537298 -641472 -1396097 1949927 6597881
5025 6597881 8179515 4152979 -2610247 -6405614 -5222926 -1682800 2099789 6314370
5017 6314370 10053471 10943980 9056556 6764787 4146390 -543490 -5227484 -4737492 1190907
5008 1190907 6613232 8289823 9652284 12721503 12719817 6002584 -1836232 -2111576 5704975
4999 5704975 14510841 19250100 20793720 21297147 20587116 17687885 13241870 10092924 12129602
4990A2129602Q723418J1334514P100056N40249k212557j818246l263628o769666
4982B5763742p658767m716792k074447k272450l233705k657667l50030L594850
4974F394734P782406P788981J590631m475447k495324M781343O624360p8586o342530
4965B1570568m437542K023340M798966J627634l498496o068183m250337J50043
4957A1915993K614601R67768j099558K53700J891154j191261n495887k500818
4949G355692P322272J3028868P808062k764877r404577q953177l445136L724845
4941A4671972Q332304P943761N443795M619152L065219l330792j0474297j0329810
4933A9941304m512365k528758n803047n556542J207035O235900M439511J425021
$$ plain form
4990 12129602 20853020 32187534 39287590 39827839 37615282 35797036 32533408 25763742
4982 25763742 18104975 13388183 11313736 9041286 5807581 3149914 2799884 6394734
4974 6394734 14177140 21966121 23556752 19081305 16585981 21367324 27991684 27913098 21570568
4965 21570568 17133026 19156366 23955332 25582966 22084470 16016287 11765950 11915993
4957 11915993 14530594 15498362 14398804 14652504 16543658 15352397 9856510 7355692
4949 7355692 14677964 27706832 35514894 32750017 23345440 14392263 10947127 14671972
4941 14671972 23004276 30948037 36391832 41010984 44076203 40745411 30271114 19941304
4933 19941304 15428939 12900181 7097134 1540592 2747627 8983527 13423038 14848059
4925A4848059J521314K69445m804493p213552k667252K721972K692412K53348
4917G621253J08928O42582M7235J481359N581534O738777L075245R61259L587876
4908B9846048M782428L25370m705339n923885o230518o581034k088597O324887
4900A5749360R209474M333454J514057M826061N347417n84554l094162J928466
4892C9229573L826944j754393l102785L780308M304084o405854r236122N385050
4884C6026805J6015501O300536m744992K524650J1883954M640256q6163J7920336
4876I0480883L3025973J9185922J4296555O4735164J19853100P3614926p3194827
4869C41997696j82763731j53748292m8574604Q731549l497573j5691816M420134
$$ plain form
4925 14848059 16369373 16638818 11834325 4620773 1953521 4675493 7367905 7621253
4917 7621253 7730181 8372763 8419998 9901357 15482891 22221668 25296913 26258172 29846048
4908 29846048 34628476 34953846 30248507 24324622 18094104 11513070 9424473 15749360
4900 15749360 24958834 29292288 30806345 35632406 40979823 40395269 37301107 39229573
4892 39229573 43056517 41302124 38199339 41979647 46283731 39877877 30641755 36026805
4884 36026805 52042306 58342842 53597850 56122500 68006454 72646710 72560547 90480883
4876 90480883 123506856 142692778 156989333 221724497 341577597 415192523 341997696
4869 341997696 159233965 5485673 -43088931 -34357382 -37854955 -53546771 -49126637
4862d9126637K0499781R552808l328973O04150M974147j938548n270438L419453
4854b0614257Q703656J248354n865685l468289j576408o711317q749823j809408
4846c8843177L946066K143158J603077P719022J1262031N978873K79095J474260
4838d437595L826310J569095m92663J756600K967771r98118n352266o041504n763105
4829a2965475n169561l14210O370317N711584k436100o561316k030642J839211
4821a5556192o68234j871210L698860Q231276M659287j063665j571007k10610
4813d351495j631745j516003L734855P377493L338445k326900j804406J128705
4805C948949r41231n443222n308183j671720m07238j365465q53112K28132k24184
$$ plain form
4862 -49126637 -28626856 -19074048 -22403021 -21798871 -16824724 -18763272 -24033710 -20614257
4854 -20614257 -11910601 -10662247 -16527932 -19996221 -21572629 -28283946 -37033769 -38843177
4846 -38843177 -34897111 -32753953 -31150876 -23431854 -12169823 -6190950 -5911855 -4437595
4838 -4437595 -611285 957810 465147 2221747 5189518 4191400 -1160866 -7202370 -12965475
4829 -12965475 -18135036 -18449246 -12078929 -6367345 -8803445 -15364761 -17395403 -15556192
4821 -15556192 -16224426 -18095636 -14396776 -6165500 -1506213 -2569878 -4140885 -4351495
4813 -4351495 -5983240 -7499243 -3764388 3613105 6951550 4624650 2820244 3948949
4805 3948949 3007718 -2435504 -7743687 -9415407 -9822645 -11188110 -12041222 -11813090 -12037274
4796a2037274Q22425N678584Q942609N098123j838795m574723l334758k368109
4788c611918j321327J448706K728705M30803j76513M593401P994389L218550l650579
4779A1654217k839309K360789J176690o103030r103374n123826k012077l085396
4771a3075316k486054K403701N921559M652606K616016K560789J395078k184187
4763A804192l959439j740978Q48663J466558K797061N872036O520970K376369
4755A5985432k428889l412233j824661j376281k976566n158095o069345l770030
4747a1030668J462795M823907K006973l399893l747377R77132K619340k244441
4739h532232o680269m176272J958203M625484K717807j1243j344476j284216m9959
$$ plain form
4796 -12037274 -11214849 -5536265 3406344 8504467 6665672 2090949 -1243809 -3611918
4788 -3611918 -4933245 -3484539 -755834 -325031 -501544 4091857 12086246 15304796 11654217
4779 11654217 8814908 11175697 12352387 6249357 -2854017 -7977843 -9989920 -13075316
4771 -13075316 -15561370 -13157669 -7236110 -2583504 32512 2593301 3988379 1804192
4763 1804192 -2155247 -3896225 -3047562 -1581004 1216057 7088093 13609063 15985432
4755 15985432 13556543 10144310 8319649 6943368 3966802 -1191293 -7260638 -11030668
4747 -11030668 -9567873 -4743966 -2736993 -6136886 -9884263 -8907131 -6287791 -8532232
4739 -8532232 -15212501 -19388773 -17430570 -12805086 -10087279 -10098522 -11442998 -12727214 -12777173
4730a2777173O82873j829069o235903o365509L06908P321603P031942P34052l689067
4721a4819343k013671K894084O317626O250204L527938O33539p9523J099758J572725
4712E383337L81793n33599l79242j367245m073176m576529k2186N779171O720721
4703G313045K665302r77743j033757K43819j67972j691478j401207K183470P000064
4694A4133543Q429877L394967n375111j0685237q206716j178765L737460L563463
4686G813481J37299l673518n961957n331063j675134K717366N012465M634113
4678C673052K902592Q79881q80507j722204j784265k154322k481767m73864L923509
4669A882105O257794L043423k276616l223641O31287L268781J357930j095016
$$ plain form
4730 -12777173 -12094300 -13923369 -20159272 -26524781 -26217873 -18896270 -11864328 -11130276 -14819343
4721 -14819343 -16833014 -13938930 -7621304 -1371100 2156838 2790377 2710854 3810612 5383337
4712 5383337 5765130 5231531 4852289 3485044 -588132 -5164661 -5186847 592324 7313045
4703 7313045 9978347 9000604 7966847 8210666 8042694 6351216 4950009 7133479 14133543
4694 14133543 22563420 25958387 20583276 9898039 1691323 512558 4250018 7813481
4686 7813481 7950780 4277262 -1684695 -7015758 -8690892 -5973526 -961061 3673052
4678 3673052 6575644 7455525 6575018 4852814 3068549 914227 -1567540 -2041404 1882105
4669 1882105 8139899 11183322 8906706 5683065 6314352 9583133 10941063 9846047
4661I846047O22206M558215M836901j41554n657822o650190l286261J50450M98180
4652D776172j449227l095883l529874l587853l229037j217973J997818L629908
4644e705949K521001J586479L680352O683183O043328J418768k820402l712168
4636I694592k648732j517993K62598L017370M466661K916816M89831J39000J046046
4627A7866189J78840k650718m860360n894775p891487j0492690r012668p39257
4619b3496926R504946J3845187J0429245M520398R31764n66542j461329o36670
4611A3070073K599204M834424K305742k941325m983750k052374J429304J551913
4603A5813211l69534j564672k558720n034509p406392o313244j840255J943357
$$ plain form
4661 9846047 10468253 15026468 19863369 19721815 14063993 7413803 4127542 4277992 4776172
4652 4776172 3326945 231062 -3298812 -6886665 -10115702 -11333675 -9335857 -5705949
4644 -5705949 -3184948 -1598469 2081883 8765066 14808394 16227162 13406760 9694592
4636 9694592 7045860 5527867 5790465 8807835 13274496 16191312 16681143 16820143 17866189
4627 17866189 18045029 15394311 10533951 4639176 -3252311 -13745001 -22757669 -23496926
4619 -23496926 -13991980 -146793 10282452 14802850 15734614 15168072 13706743 13070073
4611 13070073 15669277 20503701 22809443 19868118 14884368 12831994 14261298 15813211
4603 15813211 15443677 13879005 11320285 6285776 -1120616 -7433860 -9274115 -7330758
4595g330758K064894R9022k69367K031560M062273K296667k631672n531334k468428
4586g677143L580609N561262J341021l301576k464098K173094M405625J927370
4578E546164k019643m021614l567196j350511J462410K153072j267963n705098
4570h770379m814507K817540J0526405J1136135N227677r35151l657053m326613
4562G204054m542606l011721J165047N060242M639487J01446m043374m602985
4554A969590l258076l197548m034091k698645J089119L439684J659855j489905
4546f520017j221969K919985O582128O028893J864786k679601n165292n084093
4538c275180l175103p65558O64240J54550j869641l130476p63221N270341J0144295
$$ plain form
4595 -7330758 -5265864 -5166842 -5436209 -3404649 657624 2954291 322619 -5208715 -7677143
4586 -7677143 -4096534 1464728 2805749 -495827 -2959925 -786831 3618794 5546164
4578 5546164 3526521 -495093 -4062289 -5412800 -3950390 -1797318 -3065281 -8770379
4570 -8770379 -13584886 -10767346 -240941 10895194 16122871 15187720 11530667 7204054
4562 7204054 2661448 -350273 814774 5875016 10514503 10615949 6572575 1969590
4554 1969590 -1288486 -4486034 -8520125 -11218770 -10129651 -6689967 -5030112 -6520017
4546 -6520017 -7741986 -4822001 1760127 7789020 9653806 6974205 1808913 -3275180
4538 -3275180 -6450283 -7215841 -6551601 -6397051 -8266692 -11397168 -12160389 -6890048 3254247
4529C254247Q072187n45019q201946q484667l182523J181402J890297J594038
4521d421984K421604K757719O97867k456047l771996k153948Q15761K649109K314728
4512a147187J388000K206862M256080M110601M61137l096521k952093r64731j368284
4503B893864l888073m434716j812274J053737K424645L368609L656511J115456
4495D377759l616134o292661m698870j144071J826302L928684M371858J699772
4487D52639j958026j895296J701165K994358m3816j798606J310219L981434Q43305
4478E587376l775210k581150K402970K968444k038000n350663k970944Q48944
4470d908233J666290R29902J469057K340182J379441n48422o53221K103731N771252
$$ plain form
4529 3254247 11326434 10781415 2579469 -5905198 -9087721 -7906319 -6016022 -4421984
4521 -4421984 -2000380 757339 1455206 -1000841 -4772837 -6926785 -6111024 -3461915 -1147187
4512 -1147187 240813 2447675 6703755 10814356 11275493 8178972 5226879 4262148 2893864
4503 2893864 -994209 -5428925 -7241199 -6187462 -3762817 -394208 3262303 4377759
4495 4377759 761625 -5531036 -10229906 -11373977 -9547675 -5618991 -1247133 452639
4487 452639 -1505387 -3400683 -1699518 1294840 1251024 -547582 762637 4744071 5587376
4478 5587376 1812166 -768984 1633986 4602430 2564430 -2786233 -5757177 -4908233
4470 -4908233 -3241943 -2312041 -842984 1497198 2876639 2328217 1674996 3778727 9549979
4461I549979O927066L784975j108244k965365j196261p26494l977698n618956
4453D669002n54395O483966O594957m9373m775149l804262k441687m419497n535273
4444c831711j581032M129784N716200K662395r16740j529780J451911N331831
4436A1432858M870709j905939q264395n414224M375818R119256M049145j631910
4428A6631318L98480N035382L414206k648224n298601m115524m541492o272197
4420B603348l950620J657584L433977k95331k810913O0437L935768L797990J374366
4411I806606J024300L195289N317683N524180K948375k339536p623222q952939
4403H900736o111872l236958l066485l699801k486008J45782K398477L560210
$$ plain form
4461 9549979 16477045 20262020 19153776 16188411 14992150 14265656 10287958 4669002
4453 4669002 4114607 10598573 17193530 17144157 12369008 8564746 6123059 1703562 -3831711
4444 -3831711 -5412743 -1282959 4433241 7095636 6178896 4649116 6101027 11432858
4436 11432858 16303567 14397628 6133233 719009 5094827 14214083 18263228 16631318
4428 16631318 17029798 22065180 25479386 22831162 17532561 13417037 8875545 2603348
4420 2603348 -1347272 310312 3744289 3448958 638045 698482 4634250 8432240 9806606
4411 9806606 10830906 14026195 19343878 24868058 27816433 25476897 17853675 8900736
4403 8900736 2788864 -448094 -3514579 -7214380 -9700388 -9554606 -7156129 -3595919
4395c595919L071436J62581l791141n458136l943296k139019j797015m51585L962224
4386a3979870Q191820P115870R15319m579965m670982n53952K954543K798551
4378a808666K55446j103398M54140K972161L380769J293738r09232j393021o52830
4369B489107j4758q1852r94680k657044m207218m466462l127655n40597L080224
4360a0520935O618941P206785L205178k187986l538967N421L613087L543906J824684
4351I770114K222795M337963M546558J399701k518884l731613j295604K507474
4343A7238504L980638J256008l479762n859333m032269m92804J109683m57124
4335I263541l939276p051798p173611k924487L283974O219268L480715j167923
$$ plain form
4395 -3595919 -524483 -361902 -4153043 -9611179 -13554475 -15693494 -17490509 -17942094 -13979870
4386 -13979870 -5788050 1327820 2243139 -2336826 -7007808 -7561760 -4607217 -1808666
4378 -1808666 -1553220 -2656618 -2202478 769683 4150452 5444190 4534958 3141937 2489107
4369 2489107 2474349 2392497 1397817 -1259227 -5466445 -9932907 -13060562 -13601159 -10520935
4360 -10520935 -3901994 3304791 6509969 4321983 783016 788437 4401524 7945430 9770114
4351 9770114 11992909 16330872 20877430 22277131 19758247 16026634 14731030 17238504
4343 17238504 21219142 22475150 18995388 13136055 9103786 8610982 9720665 9263541
4335 9263541 5324265 -1727533 -8901144 -11825631 -8541657 -2322389 1158326 -9597
4327i597k235494Q51691L844604L565238J018829j245800k092119j372347Q93661
4318C218666L296893L009721o16164l630211j710167L412559N421743K466973
4310A4870013N74284M662466R834076P422218j975841q637842p511009m285796
4302A4952569m783737n893437k686632J841663J842235r78634o52116J987843
4294E629754P42838m383554o595364m125186l124638o051259o338605M62508P910152
4285a5873354P440044N50840m180384k634722K072008N694199O476854M345649
4277C891134P09884k072575l571977n386538o569099l255422L948315P337080
4269d969198K176581m939153m515817K120696N226326J398674k321237j49090
$$ plain form
4327 -9597 -2245091 -1393400 2451204 6016442 7035271 5789471 3697352 2325005 3218666
4318 3218666 6515559 9525280 8909116 5278905 3568738 6981297 12403040 14870013
4310 14870013 15444297 20106763 29940839 37363057 35387216 26749374 19238365 14952569
4302 14952569 10168832 4275395 1588763 3430426 5272661 4294027 3641911 5629754
4294 5629754 6372592 1989038 -4606326 -8731512 -11856150 -17907409 -24246014 -23783506 -15873354
4285 -15873354 -8433310 -7882470 -12062854 -14697576 -12625568 -6931369 -454515 3891134
4277 3891134 4601018 2528443 -1043534 -6430072 -12999171 -16254593 -12306278 -4969198
4269 -4969198 -2792617 -7731770 -12247587 -10126891 -4900565 -3501891 -5823128 -5972218
4261e972218M205913M309578M44270k163312j446166m71438k170001n301076o307943
4252a4872393l734780J72103K228421K007473J958508M055510P481306R611918
4244H908066Q059452K255586m909176p742851l497221K552537K147524m864226
4236B909691r470383n654411J784498N187087M467494M140016M229860J295567
4228H889419l326530l465299K982822J0224543J1042444M147428n262694j0077021
4220A5155112p072144k56082K821358k20238m114252m131806k481086k721703
4212c020841k551679J634658O553446N991120J210018m20690L058870N598187
4204A8053089L004059j552927l841662m355367n241267o233613o150912m841182
$$ plain form
4261 -5972218 -1766305 2543273 2987543 824231 -621935 -1093373 -3263374 -8564450 -14872393
4252 -14872393 -18607173 -18435070 -16206649 -14199176 -12240668 -8185158 -703852 8908066
4244 8908066 16967518 19223104 14313928 6571077 3073856 5626393 7773917 2909691
4236 2909691 -6560692 -12215103 -10430605 -5243518 -776024 3363992 7593852 8889419
4228 8889419 5562889 2097590 5080412 15304955 26347399 30494827 25232133 15155112
4220 15155112 8082968 7826886 10648244 10428006 6313754 2181948 -299138 -3020841
4212 -3020841 -5572520 -3937862 2615584 8606704 9816722 9396032 12454902 18053089
4204 18053089 21057148 19504221 15662559 11307192 6065925 -167688 -6318600 -11159782
4196a1159782j995759K678419P227767Q862749Q024326P322998O469582K806561
4188C0236861k833055n837014m384610j583827p445J085237J891727O08068k279163
4179A6896779l218575j573924j714274n984029r608315o609470J540369O958501
4171c312938M509290k376657n410408n15967P211219Q889677K310392n802073
4163E502535q945677p766127n128242p2016P559558J1521487O309178k953659
4155F027037o041254j335190L909345N243869M437939K575946j100440l982503
4147I734749k733663p04131l678607r034222q845497k896072J687050K434188
4139a4036205K115669j04103n044001m940758M773718J0136781j161870o976129
$$ plain form
4196 -11159782 -13155541 -10477122 -3249355 5613394 13637720 20960718 27430300 30236861
4188 30236861 27403806 21566792 17182182 15598355 15590910 16676147 18567874 19175942 16896779
4179 16896779 13678204 12104280 10390006 4405977 -5202338 -11811808 -10271439 -3312938
4171 -3312938 1196352 -1180305 -6590713 -7106680 104539 8994216 11304608 5502535
4163 5502535 -3443142 -11209269 -16337511 -16409527 -8849969 2671518 8980696 6027037
4155 6027037 -14217 -1349407 2559938 7803807 12241746 14817692 13717252 9734749
4147 9734749 7001086 6296955 2618348 -6415874 -15261371 -18157443 -16470393 -14036205
4139 -14036205 -11920536 -12024639 -17068640 -22009398 -17235680 -7098899 -8260769 -15236898
4131a5236898K8290820R1139262J14261339N8241916l0992483p7023335o3249256
4124A05431365l3641080k0485145j4607086m213955L69982p286874j2129268l059605
4116A0378334P422173N181720k500341j658008N296344O757055J366222l764507
4108B8478992o385492q666491r399232o415673j966168J374915M736131P656813
4100I413795O020686O42225m30725N535094R708767N137657k159265l808319k603483
4091B7456432n659680j0710271r903161l081333K528497L217733J098440j972569
4083B974088n126655n366891q52085M415972N258939K668321J047788Q17589m68490
4074E368576k248580k128171q37231o86357j253164j355649k400513m837803m821244
$$ plain form
4131 -15236898 13053922 104193184 218454523 276696439 245703956 168680621 105431365
4124 105431365 71790285 51305140 36698054 32484099 32854081 25567207 13437939 10378334
4116 10378334 17800507 22982227 20481886 18823878 24120222 30877277 32243499 28478992
4108 28478992 22093500 13427009 4027777 -2387896 -4354064 -2979149 1756982 9413795
4100 9413795 15434481 16076706 15645981 21181075 30889842 36027499 33868234 30059915 27456432
4091 27456432 21796752 11086481 1183320 -1898013 630484 3848217 4946657 2974088
4083 2974088 -2152567 -7519458 -8371543 -3955571 1303368 3971689 5019477 5837066 5368576
4074 5368576 3119996 991825 154594 -531763 -1784927 -3140576 -5541089 -10378892 -15200136
4065a5200136l5779M801529M572401K217483L309400N519241K166330n497322
4057A853147q712157m068482K456102N406546N870989N599671K803437k490352
4049H718901n205729k165348K077659J362700k831825l388531J948325O843044
4041G359196M794781j837655m682797o14996L977566K344738k959265m375338
4033D006230j057000N27749k169833l624117m3507L935625L138792L03999O52766
4024E670704K923028K514666j00127j044979m82541j546300l637872l324176o64230
4015C08173J384434K501532L945680L667609p35652n512350m784886o62762j166723
4006a054945p119337r482444k656593O928280R779406N272164L4709j454131j43664
$$ plain form
4065 -15200136 -15235915 -10434386 -5861985 -3644502 -335102 5184139 7350469 1853147
4057 1853147 -6859010 -10927492 -8471390 -3064844 2806145 8405816 11209253 8718901
4049 8718901 3513172 1347824 3425483 4788183 1956358 -1432173 516152 7359196
4041 7359196 12153977 10316322 5633525 5018529 8996095 11340833 8381568 4006230
4033 4006230 2949230 3476979 1307146 -2316971 -2360478 1575147 4713939 5017938 5670704
4024 5670704 8593732 11108398 11008271 9963292 9480751 7934451 4296579 972403 308173
4015 308173 1692607 4194139 8139819 11807428 11071776 5559426 774540 111778 -1054945
4006 -1054945 -8174282 -17656726 -20313319 -13385039 -3605633 1666531 1701240 247109 103445
3997A03445J061746L06782k141810l577942j363472K897416M273596J118742k190778
3988D87725j202755K742153N229670N077812M721637N384608N073415J968576
3980B9482841k174302l632579j685503m40954l886558r650852j0796120m856336
3972g640363K387136M515254K341543N99825K44809o96996j116115J741164N531057
3963G907314M331588k055014o437098l957016J699115M319935K905002N17273
3955I231099q86550j377307j348954j356822j807879j585552O26222K949896J589138
3946F033291l316924o690451m998022l05352L722573O031244O434778L963174
3938A0874311j07881j636162L22013O44219m167008q943963o442547J164170M351399
$$ plain form
3997 103445 1165191 1471973 -669837 -4247779 -5611251 -2713835 1559761 2678503 487725
3988 487725 -715030 2027123 7256793 12334605 17056242 22440850 27514265 29482841
3980 29482841 27308539 23675960 21990457 21549503 17662945 8012093 -2784027 -7640363
3972 -7640363 -5253227 -737973 1603570 2203395 2448204 1751208 635093 2376257 7907314
3963 7907314 12238902 10183888 3746790 -210226 1488889 5808824 8713826 9231099
3955 9231099 8344549 6967242 5618288 4261466 2453587 868035 1494257 4444153 6033291
3946 6033291 2716367 -3974084 -8972106 -9277458 -5554885 476359 6911137 10874311
3938 10874311 10766430 9130268 9452281 10096500 5929492 -3014471 -9457018 -8292848 -3941449
3929c941449j32052m708406k410079L376556N273218L405879L772748O871237
3921A1507652N809595k203860r471233q039706j402792J110129j191345l65335
3913d246895N583019Q041734J788275n144277k867375N344249Q260030L259030
3905B0017790j689189j430982N1689k118108o643935r454635q595329m029884
3897a3892583K585312O877393N406309J157195M01839L591329M986376K027980
3889A3141150j260519j718329j407927k190135k120822k09976Q55970j72941n33434
3880D383037J115841K052176J221940J885862N046011N982027J514367m521668
3872A8679593p289170p367755p001441n327407k057045n95867k292241k633577
$$ plain form
3929 -3941449 -4073501 -8781907 -11191986 -7815430 -2542212 863667 4636415 11507652
3921 11507652 17317247 15113387 5642154 -2397552 -3800344 -2690215 -3881560 -4246895
3913 -4246895 1336124 9377858 11166133 6021856 3154481 8498730 16758760 20017790
3905 20017790 18328601 16897619 16949308 14831200 8187265 -1267370 -9862699 -13892583
3897 -13892583 -11307271 -4429878 976431 2133626 2535465 6126794 11113170 13141150
3889 13141150 11880631 10162302 8754375 6564240 4443418 4233442 5089412 4916471 4383037
3880 4383037 5498878 7551054 8772994 10658856 15704867 21686894 23201261 18679593
3872 18679593 11390423 4022668 -2978773 -8306180 -10363225 -10959092 -13251333 -15884910
3864a5884910J437338N541498M965009K429368K249916K101716j626576n021201
3856c807842k190438L661196M091994j405538n120821l249537K71693K017462
3848e731831K998078L597575K000196j070914k268438j085788R7245J127003L235921
3839B899047L980155P1494n312498n796845k178669r94017k364148Q98281R755079
3830I57879J4550677Q794213j204459o044422n342318m191832l832334k398452
3822A288952l04110J114766K639933M087277K444659k193926l705913J416962
3814F788600P114007N856517l07974l814467l273157l216043m323857k524093
3806B299533K142254L844900J61530l489676j637343L532925N423823J375274
$$ plain form
3864 -15884910 -14447572 -8906074 -3941065 -1511697 738219 2839935 1213359 -3807842
3856 -3807842 -5998280 -2337084 1754910 349372 -4771449 -8020986 -7749293 -5731831
3848 -5731831 -2733753 863822 2864018 1793104 -475334 -1561122 -1463877 -336874 2899047
3839 2899047 6879202 6950696 1638198 -4158647 -6337316 -7331333 -9695481 -8797200 957879
3830 957879 15508556 24302769 23098310 17053888 11711570 7519738 3687404 1288952
3822 1288952 984842 2099608 4739541 8826818 11271477 9077551 5371638 6788600
3814 6788600 13902607 19759124 19451150 15636683 12363526 9147483 4823626 2299533
3806 2299533 4441787 8286687 8448217 4958541 3321198 6854123 12277946 13653220
3798A3653220m666550o686381k781736K738755M064409J148657k45336K644645
3790I869683M748433J127218m212753l842847J314936L588538J193817M93976
3782A4281001M048295N337450k42231o732897o275306r24733J298967j348259
3774I442287l378322j739715N05592K76229j515897k903089l184918j482390K815781
3765a164442P194729P534174L645095k86207j729511k363119l366474k679993
3757F784252N19211K695101Q58628k411982k600173L11863K620357K233356k83805
3748A0726808m093805p627743p528188k654415K025693O54543m780355o324930
3740a9602392j061373N493689Q300643Q893946R632502Q014195J954905l787752
$$ plain form
3798 13653220 8986670 2300289 -481447 2257308 6321717 7470374 7225038 9869683
3790 9869683 14618116 15745334 11532581 7689734 9004670 12593208 13787025 14281001
3782 14281001 18329296 23666746 23424515 16691618 10416312 9491579 10790546 9442287
3774 9442287 6063965 4324250 4829842 5106071 3590174 687085 -2497833 -3980223 -1164442
3765 -1164442 6030287 13564461 17209556 16923349 15193838 12830719 9464245 6784252
3757 6784252 7303463 9998564 10857192 8445210 5845037 6156900 8777257 11010613 10726808
3748 10726808 6633003 -994740 -8522928 -11177343 -9151650 -8497107 -13277462 -19602392
3740 -19602392 -20663765 -15170076 -6869433 2024513 11657015 19671210 21626115 17838363
3732A7838363l060789K045699L647963k99795l333330r62947J951761j812056
3724A6014869j0735059j5152889q897370K939551R567406O564713K38102o02310
3716f2987M818822R320654P498775J751282k459023l723381m219404m699711l857482
3707D367545j825085o34070q99958r16960K92871J341572P92398n54150o22380
3698A341783J608344N092838P243898N575202M3562n927817p725068l651362L037650
3689F639030O422639L263419l030415m989102L23224O511339N100855l001094
3681A7239895q223843n409297l22993r5782k962066k775594P53490K955854K604948
3672C764612K533306L171863K160628M9276j6116J384234J17790m046793o051827
$$ plain form
3732 17838363 14777574 16823273 20471236 20171441 16838111 15875164 17826925 16014869
3724 16014869 5279810 -9873079 -18770449 -15830898 -6263492 301221 539323 -62987
3716 -62987 4755835 14076489 21575264 23326546 20867523 17144142 12924738 8225027 4367545
3707 4367545 2542460 1908390 1008432 91472 384343 1725915 2518313 1964163 1341783
3698 1341783 2950127 8042965 15286863 20862065 20905627 14977810 7252742 3601380 6639030
3689 6639030 13061669 16325088 13294673 8305571 8628795 15140134 20240989 17239895
3681 17239895 9016052 3606755 3283762 3187980 225914 -2549680 -1796190 1159664 3764612
3672 3764612 6297918 9469781 11630409 11679685 11663569 13047803 13165593 9118800 3066973
3663C066973l218487J005576K806577K628973K091380R13331q56515j592077j068996
3654E776735j018351j367051k8790K447199K862763J437234K386177O190546P096420
3645B5782882J775061m797818o234375k998235L43688J847669J828416j78104
3637A7369184l431766m535963k435270j198008l295619m389538m45913M137040
3629A774147K622035k789200l646762K041516P489553P533846M183290Q66608
3621B0075033k168417m803948n120027k960323j023052m68405M84635K040768
3613F056264J390013k057029m248242k174615J458030K302571L87280j095534
3605B018738j012533j046222k099423k651994q79876K895321N984066N412219
$$ plain form
3663 3066973 -151514 854062 3660639 6289612 8380992 9294323 8437808 6845731 5776735
3654 5776735 4758384 3391333 3362543 5809742 8672505 10109739 12495916 18686462 25782882
3645 25782882 27557943 22760125 16525750 13527515 13871203 15718872 17547288 17369184
3637 17369184 13937418 9401455 6966185 5768177 2472558 -1916980 -2362893 1774147
3629 1774147 4396182 1606982 -2039780 1736 7491289 15025135 19208425 20075033
3621 20075033 17906616 13102668 7982641 5022318 3999266 3530861 4015496 6056264
3613 6056264 7446277 5389248 1141006 -1033609 424421 2726992 3114272 2018738
3605 2018738 1006205 -40017 -2139440 -4791434 -5671310 -2775989 3208077 8620296
3597H620296J050087l281127l255708R29985M349894K829984k475049o547975
3589B220387n570685p7110N996629Q786793P403114L700035l95785m231411p044949
3580A0787018p299901m718595j305500J145377K873370M127964L811014K141189
3572A1561936J627865K498907P85184m649789p023779k97978R641070J0949349
3564B5092765K568472m251636k878766J01363k229955n170390j427901M957388
3556A6761340M165888l311702o919663k284054K769325J057618l628113l961032
3548D649607o53236k04421m178340o985509m130998J888867N115155L056350j115501
3539b558026k329735R51393N030232N329552K320295J039748L765368N993632
$$ plain form
3597 8620296 9670383 6389256 3133548 4063533 8413427 11243411 8768362 2220387
3589 2220387 -3350298 -3427408 2569221 11356014 18759128 22459163 22063378 17831967 10787018
3580 10787018 3487117 -1231478 -2536978 -1391601 1481769 5609733 9420747 11561936
3572 11561936 13189801 15688708 16473892 11824103 4800324 4502346 14143416 25092765
3564 25092765 27661237 23409601 20530835 20632198 18402243 13231853 11803952 16761340
3556 16761340 20927228 17615526 10695863 8411809 11181134 12238752 8610639 4649607
3548 4649607 3996371 3791950 -386390 -7371899 -11502897 -9614030 -4498875 -1442525 -2558026
3539 -2558026 -4887761 -3936368 1093864 6423416 8743711 9783459 13548827 19542459
3531A9542459K572219m203776o800803k351771L888982N768371K972753q57521
3523B0530913k798056j288288L814112Q632673O737068k252749r037794n563646
3515A8774233K973206M360530l412966r679500p130665j460945q65886l793074
3507b35067l684831j78204K064839K121798K617931K731862p72687n803261n794843
3498f932463J10837M224823O73429o179956p402836p77307P137533R234750N456758
3489E545568J620668J819345L671806K470511j367780k832432o25963L35271k591828
3480H045166m347416k38462N357377N066447k76545m095005m941220o169074o574244
3471h172976j609112N798095O467726m81774m823661j157936K694947n00227m938872
$$ plain form
3531 19542459 22114678 17910902 11110099 8758328 12647310 18415681 21388434 20530913
3523 20530913 17732857 16444569 20258681 28891354 35628422 33375673 24337879 18774233
3515 18774233 21747439 26107969 22695003 13015503 5884838 4423893 3558007 -235067
3507 -235067 -3919898 -4098102 -2033263 88535 2706466 5438328 4665641 -1137620 -6932463
3498 -6932463 -6821626 -2596803 -1923374 -8103330 -15506166 -16283473 -9145940 88810 5545568
3489 5545568 7166236 8985581 12657387 15127898 13760118 10927686 10301723 10636994 8045166
3480 8045166 3697750 3459288 8816665 13883112 13606567 9511562 4570342 -1598732 -8172976
3471 -8172976 -9782088 -3983993 2483733 2001959 -2821702 -3979638 -1284691 -1784918 -6723790
3462f723790j961700M963285N911828K87070l772058l188819k619699l692923
3454a0796806j502761O017068J3032411J3391284P967176J764623k155723l678902
3446B4038370l987602m765544o517614o892677l378351K100964M578707K507329
3438G683582o54345k039276k779322m279044m690123j869973K326220L729010
3430b573271J330973j106017M51963N069698P232823L221066l656441o185815
3422C784979j779631M689694P515958O421103M074985P94172m356752r216416
3414A1928092r664113m714441K511125Q106629R278247M946539k154883o067097
3406A4170098m355551k214966n156546r907979q766884j493290M504608N671226
$$ plain form
3462 -6723790 -8685490 -3722205 2189623 2476693 -1295365 -4484184 -7103883 -10796806
3454 -10796806 -12299567 -6282499 6749912 20141196 28108372 29872995 27717272 24038370
3446 24038370 20050768 15285224 8767610 1874933 -1503418 597546 5176253 7683582
3438 7683582 7029237 4989961 2210639 -2068405 -6758528 -8628501 -6302281 -2573271
3430 -2573271 -1242298 -2348315 -1896352 3173346 10406169 13627235 9970794 3784979
3422 3784979 2005348 6695042 14211000 20632103 24707088 25501260 21144508 11928092
3414 11928092 2263979 -2450462 60663 8167292 17445539 22392078 20237195 14170098
3406 14170098 9814547 7599581 2443035 -7464944 -16231828 -17725118 -13220510 -7549284
3398g549284N909621P259723N445118j525950p743898p612511l847185j803647
3390a1468013j024494J383789L383755J254393k521969j994645K667152N075979
3382c244053K195874j990435l195985j887910j49152J987305M856837O823244
3374E395725N625274O95419o090733j0474633p885024J441887J0252272J0921822
3366I882009M108573k732756m827485l766671k262171p08428L01032m18255j045227
3357a469379J715945N796443M767194j572013m655608K17616N773162L898488
3349A4471848j540233j793926J866945J130659m050967n059618J23457L125634
3341H273799l46132l397419n34702K741371K59505l357880o14177N550766O126858
$$ plain form
3398 -7549284 -1639663 5620060 11065178 9539228 1795330 -5817181 -9664366 -11468013
3390 -11468013 -12492507 -11108718 -7724963 -6470570 -8992539 -10987184 -8320032 -3244053
3382 -3244053 -1048179 -3038614 -6234599 -8122509 -8271661 -6284356 -1427519 5395725
3374 5395725 11020999 11716418 5625685 -4848948 -12733972 -11292085 -1039813 9882009
3366 9882009 13990582 11257826 6430341 2663670 401499 -306929 -5897 -424152 -1469379
3357 -1469379 246566 6043009 10810203 9238190 4582582 4800198 10573360 14471848
3349 14471848 12931615 11137689 13004634 14135293 10084326 5024708 5148165 8273799
3341 8273799 7927667 4530248 3995546 6736917 6996422 3638542 3024365 8575131 14701989
3332A4701989R5045n181554n660898m156504l110544j695411J1559P67898J785287
3323b443133M376690N128101L75071n822196o241042k136615j135530l640861
3315a1539515k062972M591665P002689R45969m677658k034277L375892L215420
3307a182787M08578K379750O800411N651393l63108k852010N09830L673990L160654
3298A8186701J725807Q69208j257327l563839k253293J233368P89274l929980
3290A1799919n884193k144909J175649o03954l065127q61453K931423K184862
3282E532217k029444l276121N05200M847564N296728J753084l007999n849341
3274C771888n039021j981423j85439q01678j130629O08777J899080K85496j602479
$$ plain form
3332 14701989 14797034 9615480 3954582 -201922 -3312466 -5007877 -4996318 -4228420 -2443133
3323 -2443133 1933557 7061658 7436729 1614533 -4626509 -6763124 -7898654 -11539515
3315 -11539515 -13602487 -9010822 -2008133 -1062164 -5739822 -7774099 -4398207 -1182787
3307 -1182787 -774209 1605541 8405952 14057345 13694237 10842227 11352057 15026047 18186701
3298 18186701 19912508 20781716 19524389 15960550 13707257 14940625 15729899 11799919
3290 11799919 5915726 3770817 4946466 4342512 1277385 415932 3347355 5532217
3282 5532217 3502773 226652 731852 5579416 10876144 12629228 9621229 3771888
3274 3771888 -1267133 -3248556 -3433995 -4235673 -5366302 -4757525 -2858445 -2572949 -4175428
3265d175428M22086N017155O243641J601199m707219p434907o132055l810421
3257a2975949k090173j4126L057610N692440O390292O000658O461641P494959
3249B0017352O666199L281819q9860j391520k040307l939563n753496n123652
3241A1626972k776080j071237j07961J049007J070340j209468k770688l43676
3233E467209K842384Q52201m661288n502809M36974N453456L848727q7939k63464
3224H385451J987345K428342J759756K515714K817187r2236l730686m355846l842534
3215G872493n806695p684641m234533K619331N197338J341193k699749j660054
3207e055317K401945M567615K922599j418147n965449p408208m168353P79683
$$ plain form
3265 -4175428 -3753342 1263813 7507454 9108653 4401434 -3033473 -9165528 -12975949
3257 -12975949 -15066122 -15080248 -12022638 -6330198 60094 6060752 12522393 20017352
3249 20017352 26683551 29965370 29875510 28483990 26443683 22504120 16750624 11626972
3241 11626972 8850892 7779655 7671694 8720701 9791041 8581573 5810885 5467209
3233 5467209 8309593 9161794 4500506 -1002303 -565329 4888127 8736854 8648915 8385451
3224 8385451 10372796 12801138 14560894 17076608 19893795 19801559 16070873 11715027 7872493
3215 7872493 2065798 -5618843 -9853376 -7234045 -2036707 -695514 -3395263 -5055317
3207 -5055317 -2653372 1914243 4836842 3418695 -2546754 -9954962 -14123315 -13343632
3199a3343632K787725J332189j99499J19442J293069K428516L009200J185615
3191a387375l307014n562829p55456P367136R800779M710302k48166N19084L655595
3182A4792056M056136K129775K12206k105604m688523m331066k97439K324969
3174A2092510l59687n005469o726619o268546o124516m279137J321198N908309
3166i441957L463245l098326n399170k157206n4642k049915l293194m01118L117996
3157a9314287L750243L342334L850607L019099k23917j701549J405149M698764
3149a173557L203137k18952K43983L217096K560156j690049l037142N29672L489461
3140G123805K740897K696998O421297Q758797M377527k628100m469206j703013
$$ plain form
3199 -13343632 -10555907 -9223718 -9423217 -9303775 -8010706 -5582190 -2572990 -1387375
3191 -1387375 -4694389 -10257218 -11012674 -3645538 6155241 10865543 10617377 11136461 14792056
3182 14792056 18848192 20977967 21190173 19084569 14396046 10064980 9767541 12092510
3174 12092510 11732823 6727354 735 -6267811 -12392327 -16671464 -15350266 -9441957
3166 -9441957 -5978712 -9077038 -14476208 -16633414 -16688056 -18737971 -22031165 -22432283 -19314287
3157 -19314287 -15564044 -12221710 -8371103 -5352004 -5575921 -7277470 -5872321 -1173557
3149 -1173557 2029580 1810628 2054611 5271707 7831863 6141814 3104672 3634344 7123805
3140 7123805 9864702 12561700 18982997 27741794 32119321 29491221 25022015 23319002
3132B3319002j611023n785595p520488k764147L651647N672197L966226K393630
3124B1321449J400986m11607j685808l02768K162424K622098J586143J667508
3116B8360425K269892N43965k980971m745265m355390n347674q569513r695264
3108d519795n623213P87185N123414O944082P710144O490633J897467l681706
3100A5128211o000103m302848j383458Q21504K246840K158373l09380l008566
3092E350573k267390J556825L730245J684298j667892k902250k647729k517691
3084C18989j088581K990316O369710M413268j613301n473110m257058j425147
3076B35086p71691j577523j419773j07038J299755K258538J578900k089978o262711
$$ plain form
3132 23319002 21707979 15922384 8401896 5637749 9289396 14961593 18927819 21321449
3124 21321449 22722435 22310828 20625020 20322252 22484676 25106774 26692917 28360425
3116 28360425 30630317 31174282 28193311 23448046 19092656 13744982 5175469 -4519795
3108 -4519795 -10143008 -9355823 -4232409 2711673 10421817 16912450 18809917 15128211
3100 15128211 9128108 4825260 3441802 4263306 6510146 8668519 8359139 5350573
3092 5350573 3083183 4640008 8370253 10054551 8386659 5484409 2836680 318989
3084 318989 -769592 2220724 8590434 13003702 11390401 5917291 1660233 235086
3076 235086 -536605 -2114128 -3533901 -3640939 -2341184 -82646 1496254 -593724 -6856435
3067f856435n071434K659147R476937Q238442J938269j130209M81717J340890
3059A1077324R7831J586032O114960N650098l988434j3929781j2521539r45484
3051f858993Q690188Q955855L789095l4339j151721j411768r39673R67762K854728
3042A4861134K352247n22125l393705m469712m103209l496591k772455r00634
3034b445050K388025N243992N341677K903530P22202O78231J590844J243078p39344
3025A6927185k803099l210041j571076J49084j315903o132230q726052l504325
3017a0186457O513613J1674204P817783J181552j331222r51366j973809l666555
3009I077743l227401k149109k768387k279794K275883O289068L385283l276008
$$ plain form
3067 -6856435 -11927869 -9268722 208215 8446657 10384926 9254717 9736434 11077324
3059 11077324 11175155 12761187 18876147 24526245 20537811 6608030 -5913509 -6858993
3051 -6858993 1831195 10787050 14576145 14541806 13390085 11978317 11038644 12006406 14861134
3042 14861134 17213381 16691256 13297551 8827839 4724630 1228039 -1544416 -2445050
3034 -2445050 -57025 5186967 10528644 13432174 14154376 14832607 16423451 17666529 16927185
3025 16927185 14124086 10914045 9342969 9492053 8176150 2043920 -6682132 -10186457
3017 -10186457 -3672844 8001360 15819143 17000695 15669473 14718107 12744298 9077743
3009 9077743 5850342 3701233 932846 -1346948 928935 7218003 10603286 7327278
3001G327278m845794q62050O15488k656491l428879J735481N910259L302390j750343
2992E347339l031098j793361j545825p04395K377900L375042r42495m688170o36156
2983b241219P558946R881863M650840j80373J25409J498893m59580l891917n203898
2974A1738964m489735l311376j003072L707455R442677J2570098J0107544K262028
2966D1024583o621714j0596311p766853k601742n57961j852274l073087k907386
2958E047255k480483j553684J006113L429982K297567j976408m856895l578571
2950b665124R4453L450492N643673O270682M706189K040270O41028O37777l41928
2941B0477512k815452l712911o53211M260856O648697M535553j63314l690613
$$ plain form
3001 7327278 2481484 1619434 2234922 -421569 -3850448 -2114967 3795292 7097682 5347339
2992 5347339 2316241 522880 -1022945 -1727340 650560 4025602 3083107 -1605063 -2241219
2983 -2241219 5317727 15199590 19850430 19670057 19795466 21294359 20834779 16942862 11738964
2974 11738964 7249229 3937853 2934781 6642236 16084913 28655011 38762555 41024583
2966 41024583 34402869 23806558 16039705 13437963 12880002 11027728 7954641 5047255
2958 5047255 2566772 1013088 2019201 5449183 7746750 5770342 913447 -2665124
2950 -2665124 -2570671 879821 6523494 12794176 17500365 19540635 20181663 20819440 20477512
2941 20477512 17662060 13949149 13295938 17556794 24205491 28741044 28577730 24887117
2933B4887117l581871j021820k8991k793029o338081o040869k063376O27365r96770
2924B649675m200926m538952j401473J949626K459210K94584j405645M09432M932793
2915A148324P273251L708193l227146p103071n122762j018155J60926j876601
2907f057041l022708k75893M153234M681363j145783q499179r752304l562952
2899b3481263L412547N178821L192380J996646K091928J448774P90256J825872
2891c544039K378295p67864n383523o156994k786647M30636K521266O345857J0787973
2882C824960J0047050K964086l671476m145166m95810K524179L513847K628784
2874A7190454m73751l610472k671141J311828J693634l224373n747812k98720
$$ plain form
2933 24887117 21305246 20283426 20254435 17461406 11123325 5082456 3019080 3646445 2649675
2924 2649675 -1551251 -6090203 -7491676 -5542050 -3082840 -2788256 -4193901 -3784469 1148324
2915 1148324 8421575 12129768 8902622 1799551 -3323211 -4341366 -4180440 -6057041
2907 -6057041 -9079749 -9355642 -5202408 -521045 -1666828 -10166007 -19918311 -23481263
2899 -23481263 -20068716 -14889895 -11697515 -9700869 -7608941 -6160167 -5369911 -3544039
2891 -3544039 -1165744 -1933608 -7317131 -13474125 -16260772 -15830136 -13308870 -6963013 3824960
2882 3824960 13872010 16836096 13164620 9019454 8523644 11047823 14561670 17190454
2874 17190454 16716703 13106231 10435090 11746918 13440552 10216179 4468367 4169647
2866D169647O966637P005072J136141k453396j526299o07942j429354j270226
2858A1990280o4927r58149l296630k460872K023180M764381K726130n21360q68537
2849A3333496R04140J936966J333526p12717m201462p698453q378521n373567
2841h856592q08355L133297N615089N697410K939819l32928j073316j18887q01139
2832E394398k788676k211300J160757K353982r91193m479284l803864r68861K55950
2823f078091P82620L195265N633855M385051P72169k74194J878460K412679j357743
2814A1350071n774356n990851k031483K387296M784078N509240N732088N710280
2806B1676363M669862J505792l799913q850809r985755o030720l92395K029714
$$ plain form
2866 4169647 11136284 18141356 19277497 16824101 15297802 14689860 13260506 11990280
2858 11990280 11925353 10967204 7670574 5209702 7232882 11997263 14723393 14202033 13333496
2849 13333496 14237636 16174602 17508128 16795411 12593949 4895496 -3483025 -8856592
2841 -8856592 -9664947 -6531650 -916561 4780849 7720668 7387740 6314424 6195537 5394398
2832 5394398 2605722 394422 1555179 3909161 2917968 -1561316 -5365180 -6334041 -6078091
2823 -6078091 -5295471 -2100206 3533649 7918700 8690869 8416675 10295135 12707814 11350071
2814 11350071 5575715 -415136 -2446619 -59323 4724755 10233995 15966083 21676363
2806 21676363 26346225 27852017 24052104 15201295 5215540 -815180 -1207575 822139
2798H22139J45709k358528j823823R89671K653212K190682K033397L547294M246742
2789A2446495J379631l370597n353382k677147J793158M165073L189115k451l657550
2780G912345o035443n940707l793825j321109M19262J865178L543998M960179
2772A609878N306633M314350K138710o12728k716900l433634l695010m630552
2764a719253m992448k264469L084492O810374N767520J792857q83834o95506N60510
2755G460243J031622P99329P23357Q50631M63835p34796j703292p44745K121893
2746A0268077L949850J773217k979200m976496j052814N674450R052516O208906
2738B7918506m05945o013341p180894l615905J890190N419277M915898J447072
$$ plain form
2798 822139 967848 -1390680 -3214503 -2224832 428380 2619062 4652459 8199753 12446495
2789 12446495 13826126 10455529 5102147 2425000 4218158 8383231 11572346 11569895 7912345
2780 7912345 1876902 -4063805 -7857630 -9178739 -8759477 -6894299 -3350301 1609878
2772 1609878 6916511 11230861 13369571 12756843 10039943 6606309 2911299 -1719253
2764 -1719253 -6711701 -8976170 -5891678 918696 6686216 8479073 7595239 6899733 7460243
2755 7460243 8491865 9291194 10014551 10865182 11329017 10594221 8890929 8146184 10268077
2746 10268077 14217927 15991144 13011944 8035448 6982634 12657084 21709600 27918506
2738 27918506 27512561 21499220 14318326 10702421 12592611 18011888 22927786 24374858
2730B4374858k337657m158758k854366R00229M200348M309473K151334J067775
2722B7653236J290189r82273o895842j1053389q330609j931496N67416j925531
2714a608299k898506J421684O367268O078552J825580q95872o09252n57901k241040
2705F882214k834441j31520L146467K352703k765871o854913m789548K141212
2697b853697P291528O260728J886418O1288J856149K808126K044l915908n495662
2688G901014n621969o465753o022126p19168P259503J0741803P007687J632343
2680A5713334L11866J284351m7809k706911k279269M53011Q2100l714235m253338
2671D843100J410185O392839L804117k534171m061644o88375K33615l123850m285911
$$ plain form
2730 24374858 22037201 17878443 15024077 15924306 20124654 24434127 26585461 27653236
2722 27653236 28943425 27961152 21065310 10011921 1681312 -250184 317232 -1608299
2714 -1608299 -4506805 -3085121 3282147 9360699 11186279 10290407 9681155 9123254 6882214
2705 6882214 4047773 3916253 7062720 9415423 6649552 -205361 -4994909 -2853697
2697 -2853697 4437831 10698559 12584977 12646265 14502414 17310540 17312584 13396676 7901014
2688 7901014 2279045 -4186708 -10208834 -10928002 -3668499 7073304 14080991 15713334
2680 15713334 16025200 17309551 17261742 14554831 12275562 12728573 12810673 9096438 4843100
2671 4843100 6253285 12646124 16450241 13916070 9854426 9166051 9399666 6275816 1989905
2662A989905k33955K894016M2963m352075m133900j488105j937719l878579j717600
2653a2815049L074399L369570j300984k987697K048080P201424N793460M76810
2645D860013k525391k817176l606931m338030j994953K493448M978669M134546
2637A184195K058768k9996k199969l035129j099856J624708K303034K281138M477522
2628G564415O632072L477620l967072q157661o025253l332129m536025n102505
2620a3446538K82082P273160P392883J145378k650946k36837K458759M96452k118518
2611E95875L24120N263520N330603l07418m186684q51547N734324P501763K327119
2602B1731675m179460o042063l335128o85434j320045m108174n870788n168790
$$ plain form
2662 1989905 1755950 4649966 4692929 340854 -3793046 -5281151 -7218870 -11097449 -12815049
2653 -12815049 -9740650 -6371080 -7672064 -10659761 -8611681 -1410257 4383203 4860013
2645 4860013 2334622 -482554 -4089485 -8427515 -10422468 -7929020 -2950351 1184195
2637 1184195 3242963 3212967 1012998 -2022131 -3121987 -1497279 805755 3086893 7564415
2628 7564415 14196487 17674107 13707035 5549374 -475879 -3808008 -8344033 -13446538
2620 -13446538 -13164456 -5891296 1501587 2646965 -3981 -240818 2217941 2714393 595875
2611 595875 919995 6183515 11514118 11206700 7020016 6168469 11902793 19404556 21731675
2602 21731675 17552215 11510152 8175024 7489590 6169545 2061371 -3809417 -8978207
2594h978207l357390k368040j984723K0167M427425Q058817O858927J816495j102945
2585C390526J180125M084892K046164k588267k900739J267972K293227l237356
2577E536544q448203o270948J50912K927197R71079o77624j74374M689Q260K852255
2567c120213P148017O983283J100639m247822m291733j759435q21801o89465P43279
2558A044749J936046J161298P37679K734417M076086J412191k283290k126440
2550H692736Q4574j347962n755247o108432j00189N792063N711875J924588m02505
2541H491501q44774j862808l110396k553060j136054j541468l166654k740648
2533h464361L4160J603381L45231n59181J624509L897347J108739o010159j0110605
$$ plain form
2594 -8978207 -12335597 -14703637 -16688360 -16668193 -12240768 -4181951 2676976 4493471 3390526
2585 3390526 4570651 8655543 10701707 8113440 5212701 6480673 8773900 5536544
2577 5536544 -2911659 -9182607 -9031695 -6104498 -5133419 -5811043 -5985417 -5980728 -5972468 -3120213
2567 -3120213 4027804 11011087 12111726 7863904 3572171 1812736 990935 301470 1044749
2558 1044749 2980795 4142093 4879772 7614189 11690275 13102466 10819176 8692736
2550 8692736 8777310 7429348 1674101 -4434331 -4534520 1257543 6969418 8894006 8491501
2541 8491501 7646727 5783919 2673523 120463 -1015591 -2557059 -5723713 -8464361
2533 -8464361 -8430201 -6826820 -6481589 -7040770 -5416261 -1518914 -410175 -6420334 -16530939
2524a6530939n746327L817197J0281751R422126M342861L75634o61418o11880
2516D689005j543923l524217m910241m033916j159666J121289M93821k032673
2508a0900521l086619j130364J938589L700041L851719L353800K877685K919976
2500C524306L618972L702846J553535k030819m282026m134071k862069q49923
2492a759249K614810N698454M919957J332414M07400L022055K724242l513257
2484A5446826q232326m034792M230962O477062K606057O95363K223139N53914
2476A9966205n302389p096210j125531M593522K553579l069627l954820J32667
2468F697396L505208M061006L774752L044041Q47042j605785k524353k901000
$$ plain form
2524 -16530939 -22277266 -18460069 -8178318 1243808 5586669 5962303 5300885 4689005
2516 4689005 3145082 -379135 -5289376 -9323292 -10482958 -9361669 -8867848 -10900521
2508 -10900521 -13987140 -15117504 -13178915 -9478874 -5627155 -2273355 604330 3524306
2500 3524306 7143278 10846124 12399659 10368840 6086814 1952743 -909326 -1759249
2492 -1759249 855561 6554015 11473972 12806386 13213786 16235841 18960083 15446826
2484 15446826 7214500 3179708 7410670 13887732 16493789 17189152 19412291 19966205
2476 19966205 14663816 7567606 6442075 11035597 13589176 10519549 6564729 6697396
2468 6697396 10202604 14263610 18038362 21082403 21929445 20323660 17799307 14898307
2460A4898307l965719l777760p98721J696246k21606m362891m750220K21815O185160
2451E124611Q683553P087627L322443j68137j679452j678673k107949l107013
2443A5477010k689980p79866K9945n97082L53919K976061K595073k142529n432116
2434I790435l630999j942478m919776o748794l00319R190316J0537807L724283
2426A5700475j058951j44001J65327k538661k239486K928375N462952J060678
2418A9336708m006976m243288m107212q351091j1462453n772823N565317J2517446
2410e24372J1435499O759097K405388j394135m573362o585232p887773p873468
2402h238358m086111K521721N774269K747145o65799J203048M226703J736703
$$ plain form
2460 14898307 10932588 7154828 6356107 8052353 7830747 3467856 -1282364 -1060549 5124611
2451 5124611 13808164 20895791 24218234 24050097 22370645 20691972 18584023 15477010
2443 15477010 12787030 12007164 12037109 11440027 11793946 14770007 17365080 15222551 9790435
2434 9790435 6159436 4216958 -702818 -7451612 -7751931 1438385 11976192 15700475
2426 15700475 14641524 14497523 14662850 12124189 9884703 12813078 18276030 19336708
2418 19336708 15329732 11086444 6979232 -1371859 -12834312 -18607135 -13041818 -524372
2410 -524372 10911127 17670224 20075612 18681477 14108115 7522883 -364890 -8238358
2402 -8238358 -12324469 -9802748 -4028479 -1281334 -1947133 -744085 3482618 5219321
2394E219321l357652l457605o8504j487783p651947r041478k261966M505457N057535
2385a2544622L738408N460591O741659L389841r20927j420639r57175l698595
2377b11459n754382j421803N192565M926070j933977n974498l367074l45578j392838
2368a0282974k632986o78598O79058j821083l642894L17811O490012P833787M528701
2359G90834K066364J375665j167868n054093n221144j016895K068824J521191
2351d637122J527917M668639O595217L318231j754629l079987r34331R06944J641086
2342H251965K335712J690161j475882m143120l109258p07454q20549j724164N53865
$$ plain form
2394 5219321 1861669 -1595936 -1664440 -3152223 -10804170 -19845648 -22107614 -17602157 -12544622
2385 -12544622 -8806214 -3345623 3396036 6785877 5864950 4444311 3487136 -211459
2377 -211459 -5965841 -7387644 -2195079 2730991 797014 -5177484 -8544558 -8890136 -10282974
2368 -10282974 -12915960 -13594558 -12915500 -14736583 -18379477 -18061666 -11571654 -3737867 790834
2359 790834 2857198 4232863 3064995 -1989098 -7210242 -8227137 -6158313 -4637122
2351 -4637122 -3109205 1559434 8154651 11472882 9718253 6638266 5703935 6610879 8251965
2342 8251965 10587677 12277838 10801956 6658836 3549578 2842124 2021575 297411 851276
$$ [...]
##END NTUPLES=NMR SPECTRUM
##END=
