##TITLE=31Pdec_DE-80_DRG_K
 D2O, 64 sc
 3.2.2025
##JCAMPDX= 6.0         $$ Bruker NMR JCAMP-DX V2.0
##DATA TYPE= NMR SPECTRUM
##DATA CLASS= NTUPLES
##ORIGIN= UXNMR, Bruker Analytische Messtechnik GmbH
##OWNER= root
$$ XWIN-NMR		Version 3.5
$$ Mon Feb  3 19:08:00 2025 Russian Standard Time (UT+4h)  she@DPX200
##.OBSERVE FREQUENCY= 81.013821
##.OBSERVE NUCLEUS= ^31P
##.ACQUISITION MODE= SIMULTANEOUS
##.ACQUISITION SCHEME= undefined
##.AVERAGES= 64
##.DIGITISER RES= 17
##SPECTROMETER/DATA SYSTEM= spect
##.PULSE SEQUENCE= zgpg30
##.SOLVENT NAME= D2O
##.SHIFT REFERENCE= (INTERNAL, D2O, 0, 198.062)
##AUDIT TRAIL= $$ (NUMBER, WHEN, WHO, WHERE, WHAT)
$$ ##TITLE= Audit trail, XWIN-NMR		Version 3.5
$$ ##JCAMPDX= 5.01
$$ ##ORIGIN= Bruker BioSpin GmbH
$$ ##OWNER= she
$$ F:/spectra/data/she/nmr/P31/2/pdata/1/auditp.txt
$$ ##AUDIT TRAIL=  $$ (NUMBER, WHEN, WHO, WHERE, WHAT)
(   1,<2025-02-03 19:03:26.96 +0400>,<she>,<DPX200>,
      <created by zg, POWCHK disabled, PULCHK disabled
       configuration hash MD5:
       00 E9 B6 7A A2 85 ED C7 34 08 36 98 17 FE 4E 26
       data hash MD5: 32K
       00 D5 7C B6 F2 C6 22 00 D8 76 02 44 6C D2 3F A3>)
(   2,<2025-02-03 19:07:03.92 +0400>,<she>,<DPX200>,
      <Start of raw data processing
       efp BC_mod = 2 LB = 1.5 FT_mod = 6 PKNL = 1 PHC0 = 1845.793 PHC1 = 177.2909 SI = 64K 
       data hash MD5: 64K
       78 11 B2 E7 34 06 BD F0 BC 06 00 35 C0 03 AA 09>)
(   3,<2025-02-03 19:07:22.57 +0400>,<she>,<DPX200>,
      <pk PHC0 = -128.9556 PHC1 = 0 
       data hash MD5: 64K
       01 01 1C 5A C3 35 69 D2 07 BF 7B D9 28 00 31 B5>)
(   4,<2025-02-03 19:07:31.12 +0400>,<she>,<DPX200>,
      <abs ABSG = 5 
       data hash MD5: 64K
       F8 5E 4D 63 DC B4 F0 21 2F 5A B5 74 5C C6 4A B5>)
$$ ##END=
$$ 
$$ hash MD5
$$ 4F 3C D7 DE 1C 9B F0 08 AA 41 6C 1A 58 D2 30 B5
##$RELAX= 
##$RELAX= 
##$RELAX= 
##$RELAX= 
##$RELAX= 
##$RELAX= 
##$RELAX= 
##$RELAX= 
$$ Bruker specific parameters
$$ --------------------------
##$DU= <F:/spectra>
##$EXPNO= 2
##$NAME= <P31>
##$PROCNO= 1
##$TYPE= <nmr>
##$USER= <she>
##$AMP= (0..31)
100 100 100 100 100 100 100 100 100 100 100 100 100 100 100 100 100 100 
100 100 100 100 100 100 100 100 100 100 100 100 100 100 
##$AQSEQ= 0
##$AQ_mod= 1
##$AUNM= <au_zg>
##$AUTOPOS= <>
##$BF1= 81.014009
##$BF2= 200.13
##$BF3= 200.13
##$BF4= 200.13
##$BF5= 200.13
##$BF6= 200.13
##$BF7= 200.13
##$BF8= 200.13
##$BYTORDA= 1
##$CFDGTYP= 0
##$CFRGTYP= 5
##$CHEMSTR= <none>
##$CNST= (0..31)
1 1 145 1 1 1 1 1 1 1 1 1 1 1 1 1 1 1 1 1 1 1 1 1 1 1 1 1 1 1 1 1 
##$CPDPRG= <waltz16>
##$CPDPRG1= <>
##$CPDPRG2= <waltz16>
##$CPDPRG3= <>
##$CPDPRG4= <mlev>
##$CPDPRG5= <mlev>
##$CPDPRG6= <mlev>
##$CPDPRG7= <mlev>
##$CPDPRG8= <mlev>
##$CPDPRGB= <>
##$CPDPRGT= <>
##$D= (0..31)
0 1 0 0 0 0 0 0 0 0.06 0 0.03 2e-05 3e-06 0 0 0.0002 0 0 0 0 0 0 0 0 0 
0 0 0 0 0 0 
##$DATE= 1738595006
##$DBL= (0..7)
120 120 120 11 120 120 24 19 
##$DBP= (0..7)
150 150 150 150 150 150 150 150 
##$DBP07= 0
##$DBPNAM0= <>
##$DBPNAM1= <>
##$DBPNAM2= <>
$$ [...]
##$SUBNAM3= <"">
##$SUBNAM4= <"">
##$SUBNAM5= <"">
##$SUBNAM6= <"">
##$SUBNAM7= <"">
##$SUBNAM8= <"">
##$SUBNAM9= <"">
##$SW= 400.765351723535
##$SWIBOX= (0..15)
0 1 3 0 0 0 0 0 0 0 0 0 0 0 0 0 
##$SW_h= 32467.5324675325
##$TD= 32768
##$TD0= 1
##$TE= 0
##$TE2= 300
##$TE3= 300
##$TEG= 300
##$TL= (0..7)
0 120 53 12 22 120 120 120 
##$TP= (0..7)
150 150 150 150 150 150 150 150 
##$TP07= 0
##$TPNAME0= <>
##$TPNAME1= <>
##$TPNAME2= <>
##$TPNAME3= <>
##$TPNAME4= <>
##$TPNAME5= <>
##$TPNAME6= <>
##$TPNAME7= <>
##$TPOAL= (0..7)
0.5 0.5 0.5 0.5 0.5 0.5 0.5 0.5 
##$TPOFFS= (0..7)
0 0 0 0 0 0 0 0 
##$TUNHIN= 0
##$TUNHOUT= 0
##$TUNXOUT= 0
##$USERA1= <user>
##$USERA2= <user>
##$USERA3= <user>
##$USERA4= <user>
##$USERA5= <user>
##$V9= 5
##$VALIST= <valist>
##$VCLIST= <CCCCCCCCCCCCCCC>
##$VD= 0
##$VDLIST= <DDDDDDDDDDDDDDD>
##$VPLIST= <PPPPPPPPPPPPPPP>
##$VTLIST= <TTTTTTTTTTTTTTT>
##$WBST= 1024
##$WBSW= 4
##$XGAIN= (0..3)
0 0 0 0 
##$XL= 0
##$YL= 0
##$YMAX_a= 13542
##$YMIN_a= -3271
##$ZGOPTNS= <>
##$ZL1= 120
##$ZL2= 120
##$ZL3= 120
##$ZL4= 120
##$ABSF1= 198.0616
##$ABSF2= -202.7028
##$ABSG= 5
##$ABSL= 3
##$ALPHA= 0
##$AQORDER= 0
##$ASSFAC= 0
##$ASSFACI= 0
##$ASSFACX= 0
##$ASSWID= 0
##$AUNMP= <proc_1d>
##$AZFE= 0.1
##$AZFW= 0.5
##$BCFW= 0
##$BC_mod= 2
##$BYTORDP= 0
##$COROFFS= 0
##$CY= -3
##$DATMOD= 1
##$DC= 0
##$DFILT= <>
##$DTYPP= 0
##$F1P= 0
##$F2P= 0
##$FCOR= 1
##$FTSIZE= 65536
##$FT_mod= 6
##$GAMMA= 0
##$GB= 0
##$INTBC= 1
##$INTSCL= 9.790993e-09
##$ISEN= 30
##$LB= 1.5
##$LEV0= 0
##$LPBIN= 0
##$MAXI= 10000
##$MC2= 0
##$MEAN= 0
##$ME_mod= 0
##$MI= 50
##$NCOEF= 0
##$NC_proc= -9
##$NLEV= 6
##$NOISF1= 182.463
##$NOISF2= 159.3651
##$NSP= 0
##$NTH_PI= 0
##$NZP= 0
##$OFFSET= 198.0616
##$PC= 4
##$PHC0= 1716.837
##$PHC1= 177.2909
##$PH_mod= 1
##$PKNL= yes
##$PPARMOD= 0
##$PSCAL= 0
##$PSIGN= 0
##$REVERSE= no
##$SF= 81.0140089999434
##$SI= 65536
##$SIGF1= 159.3651
##$SIGF2= -187.1042
##$SINO= 113.3802
##$SIOLD= 16384
##$SREGLST= <1H.CDCl3>
##$SSB= 0
##$STSI= 65536
##$STSR= 0
##$SW_p= 32467.5324675325
##$SYMM= 0
##$S_DEV= 0
##$TDeff= 32768
##$TDoff= 0
##$TI= <>
##$TILT= no
##$TM1= 0
##$TM2= 0
##$TOPLEV= 0
##$USERP1= <user>
##$USERP2= <user>
##$USERP3= <user>
##$USERP4= <user>
##$USERP5= <user>
##$WDW= 1
##$XDIM= 65536
##$YMAX_p= 308677265
##$YMIN_p= -158574507
$$ End of Bruker specific parameters
$$ ---------------------------------
##NTUPLES= NMR SPECTRUM
##VAR_NAME=  FREQUENCY,     SPECTRUM/REAL,   SPECTRUM/IMAG
##SYMBOL=    X,             R,               I
##VAR_TYPE=  INDEPENDENT,   DEPENDENT,       DEPENDENT
##VAR_FORM=  AFFN,          ASDF,            ASDF
##VAR_DIM=   65536,         65536,           65536
##UNITS=     HZ,            ARBITRARY UNITS, ARBITRARY UNITS
##FACTOR=    0.49542278885378, 1,            1
##FIRST=     16045.7642231865, 0,            0
##LAST=      -16421.768244346, 0,            0
##MIN=       -16421.768244346, -158574507,   0
##MAX=       16045.7642231865, 308677265,    0
$$ Real data points
##PAGE= N=1
##DATA TABLE= (X++(R..R)), XYDATA
$$ [...]
7367A1709174k602271k163297j00491M570750O350109J895804l276693l486290
7359A2896795k188376m994074q885371p335022k115202k63577j815647p58262
7351a5458736K865467K575687j826862j892831N572372J1580515P365736l339906
7343G441442j0251866r466996m881576r12132O35422o26610k973362k626035J650527
7334b2011186N997274O538608M292330J980921m58448l163874l029284J346264
7326h507395M491662O99115n811521n099057L676447R521410M690943m325902
7318f64298o172975k71214L731549M34776m568841m109619K75543K046703M41477
7309h856899J258339O450361R160914L224441o464858r283645l350792K050731
$$ plain form
7367 11709174 9106903 6943606 6843115 11413865 17763974 19659778 16383085 12896795
7359 12896795 10708419 5714345 -3171026 -10506048 -12621250 -12884827 -14700474 -15458736
7351 -15458736 -12593269 -10017582 -11844444 -13737275 -8164903 3415612 10781348 7441442
7343 7441442 -2810424 -12277420 -17158996 -18071128 -17435706 -18062316 -21035678 -23661713 -22011186
7334 -22011186 -16013912 -9475304 -5182974 -3202053 -3660501 -6824375 -9853659 -8507395
7326 -8507395 -4015733 -3316618 -9128139 -14227196 -10550749 -1029339 3661604 -664298
7318 -664298 -6837273 -7108487 -3376938 -2942162 -7511003 -11620622 -11345079 -9298376 -8856899
7309 -8856899 -7598560 -1148199 8012715 11237156 4772298 -4511347 -7862139 -5811408
7301e811408j54769n407075n113514J249240O735198O725270K978467o51785j956832
7292a407208n09016K064998K425036p27842m276873n034327m343853m392490k744901
7283a8946476L367352R253378P204328j020588m598963J018636P306110N526699
7275I110476j038517l920321k387975j707761k490435m89346M248558O088570
7267G413249K451336k600662m712888l944327j867327J150710M084091M880882
7259F855064L702837K902093K474195m10137n586207p851985l609489L641638
7251B118009P385511N308264J00397m433846n602140k628757J943789L506583
7243G697810M80221l554986m662646l049453q30552J353423K625333N80160m102191
$$ plain form
7301 -5811408 -5966177 -11373252 -16486766 -15237526 -8502328 -1777058 1201409 549624 -1407208
7292 -1407208 -1916224 148774 2573810 1845968 -2430905 -7465232 -11809085 -16201575 -18946476
7283 -18946476 -15579124 -6325746 878582 -142006 -4740969 -3722333 3583777 9110476
7275 9110476 8071959 4151638 1763663 55902 -2434533 -2923879 1324679 7413249
7267 7413249 9864585 7263923 2551035 -1393292 -3260619 -2109909 1974182 6855064
7259 6855064 10557901 13459994 15934189 15524052 9937845 2085860 -1523629 2118009
7251 2118009 9503520 14811784 14912181 10478335 4876195 2247438 4191227 7697810
7243 7697810 8178031 4623045 -39601 -3089054 -3919606 -2566183 59150 639310 -3462881
7234c462881n388175K43299O703491N803900l48017k564129O83236J325023l860076
7225h64329p021600k291141M010171L507251j149643k212777l15530j639140m891727
7216a2868465k660691M551946P218368K181323j665798J990084O288184K638952
7208G673903m904593o058261l12658L490009J588505o21787M42241Q08235k480978
7199c75384m540390J30564Q000139R849967K311111q149892j2490269p628977
7191a2893131J958436Q868019Q763679L332858j973492l174200o32539K612623
7183F862253L866515K070766k025188o007913p302045n401195k000501R76297
7175h961011K286321R61240k559782m972954k934086J920215M167164K141880
$$ plain form
7234 -3462881 -8851056 -8607757 -1904266 3899634 3551617 987488 1670724 2995747 -864329
7225 -864329 -7885929 -10177070 -6166899 -2659648 -3809291 -6022068 -6337598 -7976738 -12868465
7216 -12868465 -15529156 -10977210 -3758842 -1577519 -3243317 -1253233 5034951 7673903
7208 7673903 2769310 -3288951 -3601609 -111600 1476905 855118 1297359 2105594 -375384
7199 -375384 -4915774 -4785210 3214929 13064896 15376007 7226115 -5264154 -12893131
7191 -12893131 -10934695 -2066676 6697003 10029861 8056369 4882169 4249630 6862253
7183 6862253 10728768 12799534 10774346 4766433 -2535612 -7936807 -9937308 -8961011
7175 -8961011 -6674690 -5713450 -8273232 -13246186 -16180272 -14260057 -10092893 -7951013
7167g951013L94509K212878L939142R78608l987295m572953o61134J597761l68504
7158h418001k187688n07813J797762J375671J978K70114P2221l304647o627976
7149a7528379m426913J977553N361602K920634j66289P22881L044596K490089
7141e604226N47180J622580N084039N807853K272326j197864j403648p10693k072993
7132D344554l718689k593711k34828n72255l348894m626789l428107k654268k732502
7123a9565489m7862N900725R227520N651993o24761l056742k103779k403553l485058
7114a0507006q21789M862646P398330N161550L430253M568244L778584j418697
7106A6452115n039240j844314L565786L931009O42463o4580J488554k59965n258403
$$ plain form
7167 -7951013 -7556504 -5343626 -1404484 -425876 -4413171 -8986124 -9647258 -8049497 -8418001
7158 -8418001 -10605689 -11113502 -9315740 -7940069 -7938091 -7667977 -7595756 -10900403 -17528379
7149 -17528379 -21955292 -19977739 -14616137 -11695503 -11861792 -11138911 -8094315 -5604226
7141 -5604226 -5057046 -3434466 1649573 7457426 9729752 8531888 7128240 6417547 4344554
7132 4344554 625865 -1967846 -2202674 -2774929 -6123823 -10750612 -14178719 -16832987 -19565489
7123 -19565489 -19613351 -13712626 -4485106 1166887 542126 -2514616 -4618395 -7021948 -10507006
7114 -10507006 -11328795 -6466149 932181 6093731 9523984 14092228 17870812 16452115
7106 16452115 11412875 9568561 13134347 17065356 17707819 17643239 19131793 18871828 13613425
7097A3613425p458793n258844l605561m447123l501073R25635L811324J974430
7089c946580j48496J984095N505147N326853K057466o58409k651628n329037o443513
7080d304102k911733K819566M809770J481863k826953l635300l76915M074979
7072h68825N006547q28523j0044130j3530542o996784K092800L536920k008307
7064b3640844m950223q22428M995291O803925N385193L482330J147753j518302
7056i117305k359834q63333N04668Q02361J748814K513522p02325o777668p750630
7047b2001730Q9965Q585778P769413j17575l860254J222883Q018382P966660Q03404
7038H476926p172165j0087573o411688P90746O364078P990096Q488464J0819270
$$ plain form
7097 13613425 6154632 895788 -2709773 -7156896 -10657969 -9732334 -5921010 -3946580
7089 -3946580 -4095076 -2110981 3394166 8721019 10778485 10120076 7468448 2139411 -4304102
7080 -4304102 -7215835 -4396269 413501 1895364 -931589 -4566889 -4943804 -868825
7072 -868825 4137722 3309199 -6734931 -20265473 -27262257 -25169457 -21632537 -23640844
7064 -23640844 -28591067 -29413495 -24418204 -17614279 -12229086 -8746756 -7599003 -9117305
7056 -9117305 -11477139 -12340472 -11835804 -11033443 -9284629 -6771107 -7473432 -14251100 -22001730
7047 -22001730 -21911765 -13325987 -5556574 -5674149 -9534403 -8311520 -293138 7673522 8476926
7038 8476926 1304761 -8782812 -15194500 -14403754 -8039676 -49580 8438884 19258154
7030A9258154J2079974O787308l911905j1327246r506179k554348J159252o10973
7022A1374037k809798j062579K733597L729423Q84237j833721j127961R11152
7014A2798387P1582k900860k366885L596348Q553729N464597l331153q693609
7006A3192136o505869j936342j177202l665168m797788k840959o7184J051581
6998f746795J27467j644429k356001n83890K779331M661897L065560m58661k549825
6989c705346j540792J515693M361515N198547L768293J716802J127751J939756
6981A4382219J753129r26935m282279n248881l296421p75514K52804K23870Q41396
6972B923388K545327L814776K841876l37420l371695l336109N56431N393619O028440
$$ plain form
7030 19258154 31338128 38125436 34213531 22886285 13380106 10825758 11985010 11374037
7022 11374037 8564239 7501660 10235257 13964680 14848917 13015196 11887235 12798387
7014 12798387 12869969 9969109 7602224 11198572 19752301 25216898 21885745 13192136
7006 13192136 6686267 4749925 3572723 -92445 -4890233 -7731192 -7798376 -6746795
6998 -6746795 -6619328 -8263757 -10619758 -11203648 -8424317 -3762420 -696860 -1155521 -3705346
6989 -3705346 -5246138 -3730445 631070 5829617 9597910 11314712 12442463 14382219
6981 14382219 16135348 15208413 10926134 5677253 2380832 1605318 1858122 2081992 2923388
6972 2923388 5468715 9283491 12125367 11787947 8416252 5080143 5636574 11030193 17058633
6963A7058633k98242r740489j3833680q201679J401686N037595P07239l657007
6955a1525944j781276K449226K091995j620369j596864L501099P110420M772520
6947C400807j25958k687523l175689m252122n606066m841511j294381L596210
6939a4986233P779236Q958518O035333J577114q4999J386179J797818r51793l785745
6930G725428l979700l179807k995420j454433K095732L328958m99854m487363
6922c446459k902561J264965Q57255l555110m433514N59433N311329N307111L216058
6913B178507K010448k83623m935176p481465l561618L785958P395193M570362
6905C678586j009506m284867l081213R11695L350924J290258k509030k017629
$$ plain form
6963 17058633 16760391 7019902 -6813778 -15015457 -13613771 -8576176 -7868937 -11525944
6955 -11525944 -13307220 -10857994 -8765999 -10386368 -11983232 -8482133 -1371713 3400807
6947 3400807 3274849 587326 -2588363 -6840485 -12446551 -17288062 -18582443 -14986233
6939 -14986233 -7206997 1751521 7786854 9363968 9278969 10665148 12462966 11511173 7725428
6930 7725428 3745728 565921 -2429499 -3883932 -1788200 1540758 1040904 -3446459
6922 -3446459 -6349020 -5084055 -4226800 -7781910 -12215424 -11655991 -6344662 -1037551 2178507
6913 2178507 4188955 3905332 -1029844 -8511309 -12072927 -8286969 -891776 3678586
6905 3678586 2669080 -1615787 -4697000 -3785305 -434381 855877 -1653153 -3670782
6897c670782L574207P218008K738621o743580j2633174j0969232n197560m34743
6889b6118235J488557J985473L504302O882401R293337O486020j071219o754938
6881d304302n338122L62405L785825L252893K043116J790753J167941O15553K752177
6872F128239O953284Q343339M275566j788926n022516m998765m608917n459366
6864C821938o459273n661525k130350K971338O543795O091413K366316j817544
6856E726108m815534o112408m250784J358833O753660O281013M50617l607533
6848A783972j682473J964072J635514j492190k419278l03906J778937K930429
6840D195077M740717O295849M315498j107157n456691n724798l712353k127227
$$ plain form
6897 -3670782 -96575 7121433 9860054 3116474 -9516700 -20485932 -25683492 -26118235
6889 -26118235 -24629678 -22644205 -19139903 -12257502 -2964165 3521855 2450636 -4304302
6881 -4304302 -9642424 -9280019 -5494194 -2241301 -198185 1592568 2760509 3376062 6128239
6872 6128239 13081523 21424862 25700428 23911502 18888986 13890221 9281304 3821938
6864 3821938 -2637335 -8298860 -10429210 -7457872 -914077 5177336 7543652 5726108
6856 5726108 910574 -5201834 -9452618 -8093785 -1340125 4940888 5391505 1783972
6848 1783972 101499 2065571 3701085 2208895 -210383 -514289 1264648 4195077
6840 4195077 8935794 15231643 19547141 18439984 12983293 7258495 3546142 1418915
6832A418915q02712J406660L691097M289892K741425j77196l145454m153869j878032
6823C390726J606012J856913k276225o040926m340826J356884M592213K216218
6815B360989j814526k163627O65170J533277j519001m151276k232588J520921
6807e800661J611790q28871J249576R022547J3096998N634198p532000j3794343
6799B659234j0005368l887877m88698L242000Q582729R580662K925813m348771
6791H259724m316529m0704j91955n367267q137455n105557o29890J595604K901573
6782a1032456M069876K561335j668490l492588K09045M931871M313996j253783
6774a361194n568610m381904Q58278N635812O159574J826519l691054m878869
$$ plain form
6832 1418915 616203 2022863 5713960 10003852 12745277 12568081 9422627 5268758 3390726
6823 3390726 4996738 6853651 4577426 -1463500 -5804326 -4447442 144771 2360989
6815 2360989 546463 -1617164 -951994 581283 -937718 -5088994 -7321582 -5800661
6807 -5800661 -4188871 -5017742 -3768166 5254381 18351379 23985577 16453577 2659234
6799 2659234 -7346134 -11234011 -11722709 -8480709 102020 9682682 12608495 8259724
6791 8259724 3943195 3902491 3710536 -1656731 -9794186 -14899743 -15529633 -13934029 -11032456
6782 -11032456 -6962580 -4401245 -6069735 -9562323 -9353278 -4421407 -107411 -1361194
6774 -1361194 -6929804 -11311708 -10453430 -4817618 1341956 3168475 -522579 -5401448
6766e401448j25101N783933O823712K548732k091425k876190j44070L010904M073690
6757A1602737K276637j681780n869387p743440n790182j191758K382376J632639
6749d382158l014786p448684p993403m850133p04132K760771N291748O367360
6741a3973417N779264N263379O368773O726128K162709o327053j1367549p446125
6733a2813891K018770Q474486P591983K484297j287376j438847J96801Q11211
6725F037434m7722k67369J492616L128262J505087k808953n640982m376744o56926
6716a635297K471524L447076J794184j918349m726053l384817O27178J850623
6708a473931j453976m303061k473985J019992Q53108k537757m355332k517635
$$ plain form
6766 -5401448 -5526549 257384 7081096 9629828 7538403 4662213 4518143 7529047 11602737
6757 11602737 13879374 12197594 6328207 -1415233 -7205415 -8397173 -6014797 -4382158
6749 -4382158 -7396944 -14845628 -22839031 -27689164 -28393296 -25632525 -20340777 -13973417
6741 -13973417 -8194153 -2930774 3437999 10164127 12326836 5999783 -5367766 -12813891
6733 -12813891 -10795121 -2320635 5271348 7755645 6468269 5029422 5226223 6037434
6725 6037434 5989712 5722343 7214959 10343221 11848308 9039355 3398373 -978371 -1635297
6716 -1635297 836227 4283303 6077487 4159138 -566915 -3951732 -3324554 -1473931
6708 -1473931 -2927907 -7230968 -9704953 -8684961 -7831853 -10369610 -14724942 -17242577
6700a7242577J198427N133516Q303228Q608750N136243J004590m64467q54677
6692A0823033l153548n126000k455198K592808L069980j494329l599009J68191
6684H25928L252121p0139m594153j718865O911712J0940542N499150k983052o424666
6675A1638578m995603m248346n892944n971146j911589K549620J908325l383303
6667a0306408p013915m862368K32696L248551L469191L407229L699630K946125
6659e179269J350877M94604k002j642660l052154r33053M448193Q495459P802838
6650A1782833L253994k522292p060889p472401k679345L025868L660128K9644
6642B017540q50872L381975O338540K994422k233081k667274M93902J590901L01043
$$ plain form
6700 -17242577 -16044150 -10910634 -2607406 6001344 11137587 12142177 11677710 10823033
6692 10823033 7669485 2543485 88287 2681095 5751075 4256746 657737 825928
6684 825928 4078049 4007910 -586243 -2305108 4606604 15547146 21046296 18063244 11638578
6675 11638578 6642975 2394629 -3498315 -9469461 -11381050 -8831430 -6923105 -10306408
6667 -10306408 -17320323 -22182691 -21949995 -18701444 -15232253 -11825024 -8125394 -5179269
6659 -5179269 -3828392 -3333788 -3335790 -4978450 -8030604 -8963657 -4515464 3979995 11782833
6650 11782833 15036827 12514535 5453646 -2018755 -4698100 -1672232 1987896 2017540
6642 2017540 1166668 4548643 10887183 13881605 11648524 8981250 9475152 11066053 11367096
6633A1367096Q47649L415265L681548P53504j110335J31117J007852j174254l479616
6624A5439826j972930J803717K436182k223176p926735q357374j861322O398177
6616C736365R313498M945977k012606n939478n651280l316934n16855K298539
6608B857226M069405L614056J302097j638245m581169o596408n691569j487640
6600h152247K605641K831960J07868j166119R35176L624354L199064r18746n952439
6591b885488q108686n586024n24696K913174L403615L551704M771596M125260
6583A660455o62725n809339n566690k60307M325657M897882L510362K723348K447463
6574G266106K067493J622030K39641k821118n104772k952088K656110O242439
$$ plain form
6633 11367096 12214745 15630010 19311558 20065062 18954727 19085844 20093696 18919442 15439826
6624 15439826 13466896 15270613 17706795 15483619 7556884 -800490 -2661812 3736365
6616 3736365 13049863 17995840 15983234 10043756 4392476 1075542 558687 2857226
6608 2857226 6926631 10540687 11842784 10204539 5623370 -973038 -6664607 -8152247
6600 -8152247 -5546606 -2714646 -2606778 -3772897 -2837721 786633 3985697 3066951 -2885488
6591 -2885488 -10994174 -16580198 -17104894 -14191720 -10788105 -7236401 -2464805 1660455
6583 1660455 997730 -4811609 -10378299 -10638606 -6312949 -1415067 2095295 4818643 7266106
6574 7266106 9333599 10955629 11195270 8374152 3269380 317292 2973402 9215841
6566I215841M881612J291033j107417k055578k020706l24630K085668K078767
6558A4044590p30033k102811P57666M485244M187773J17341l666797n009502m554834
6549G528637k828976j54143J604724O85031j560562k094584l75955J291384J356486
6540E452042O90691N29222O07342j06779j751907l043252k446987k61342J045309
6531G14339j05803j766445j215249M25607M8811j098858J817654Q467227J1220861
6522A8508144N626160k277611m572391k786680l480316o067980m337396Q33554
6514A445484P41569o543809j0658380l881654O205836P157723l63753m546808
6506a0443792k94518M779607L453506j083656k539092j801803l641685p327200
$$ plain form
6566 9215841 14097453 15388486 14281069 12225491 10204785 9880155 11965823 14044590
6558 14044590 13314557 11211746 11969412 16454656 20642429 20759770 17092973 12083471 7528637
6549 7528637 4699661 4545518 6150242 6835273 5274711 3180127 2804172 4095556 5452042
6540 5452042 6142733 6671955 7279297 7172518 5420611 2377359 -69628 -330970 714339
6531 714339 608536 -1157909 -2373158 -1947551 -1898740 -2997598 -1179944 7287283 18508144
6522 18508144 24134304 21856693 17284302 14497622 11017306 4949326 611930 1445484
6514 1445484 2187053 -4356756 -15015136 -18896790 -12690954 -5533231 -5896984 -10443792
6506 -10443792 -10738310 -5958703 -2505197 -3588853 -6127945 -7929748 -11571433 -18898633
6498a8898633p371176k149035M101216P546809P876450N262096r9076m284395
6490h015744j470233P444126J3038028Q523807j084134n846313l865622j440699
6482G283216k082540k468627j28366J467002j282383n709589o301538k169893
6474a1392718K372191L657142K392989J704139L111809M879470M218635J114759
6466A2058416j241105j060094j176800m721196q935960p780601q61886N022929
6458h696297M746784Q17044j721253k017417j816488q24782K161742N706329P084737
6449E440399N811959L025748p89585m627265n698577k766010J071185K362600
6441C830454K233261L542400N025023L070700j545742l861705k033545K43243
$$ plain form
6498 -18898633 -26269809 -28418844 -24317628 -16770819 -8894369 -3632273 -3731349 -8015744
6490 -8015744 -9485977 -2041851 10996177 19519984 18435850 12589537 8723915 7283216
6482 7283216 5200676 2732049 2603683 4070685 2788302 -2921287 -9222825 -11392718
6474 -11392718 -9020527 -5363385 -2970396 -1266257 1845552 6725022 10943657 12058416
6466 12058416 10817311 9757217 8580417 3859221 -5076739 -12857340 -13719226 -8696297
6458 -8696297 -3949513 -3132469 -4853722 -6871139 -8687627 -9512409 -7350667 -1644338 5440399
6449 5440399 11252358 14278106 13488521 8861256 3162679 396669 1467854 3830454
6441 3830454 6063715 9606115 14631138 17701838 16156096 12294391 10260846 10504089
6433A0504089k06008j739556j609454n88662j272801l727873n311022m229072
6425h180359j720509n29530j572178k517837o33748K992599M229213J865924j01678
6416f168103J456441L439318J152319l927772o037760l732817j161643o78428
6408a5658445J59893K859275M601022L148154P97692N13427J692199K620747L644404
6399D378368M658782K892053k655584p286288o031237j429063n43554m392525
6391a0409048n898491k27022P525940Q725664K675727k751522j625703L104752
6383A120297M892301K526981K42172L16908J68014k121883l633951j157583K888989
6374E242245L301556k81556k883372j433726J464046K077325M94816o67818j16101
$$ plain form
6433 10504089 10298081 8558525 6949071 6360409 5087608 1359735 -3951287 -8180359
6425 -8180359 -9900868 -10430398 -12002576 -14520413 -15154161 -12161562 -7932349 -6066425 -6168103
6416 -6168103 -4711662 -1272344 -120025 -4047797 -10085557 -13818374 -14980017 -15658445
6408 -15658445 -15498552 -12639277 -8038255 -4890101 -4092409 -3578982 -1886783 733964 4378368
6399 4378368 9037150 11929203 9273619 1987331 -4043906 -5472969 -6016523 -10409048
6391 -10409048 -16307539 -16534561 -9008621 -282957 2392770 -358752 -1984455 1120297
6383 1120297 6012598 8539579 8781751 9098659 9266673 7144790 3510839 2353256 5242245
6374 5242245 8543801 8262245 5378873 3945147 5409193 7486518 7981334 7313516 7197415
6365G197415J183165J298098j260379n719035q388676o133287o18572L752828
6357h688443N988051Q327458R444458L970382p829999j5739938j1116037P36176
6349a4907892O663482K530928l327787l569608q28967l90332r64073J490586N134039
6340h169624M434499l13079k316840J698652O383682N627295J315751j99092K013307
6331A0474551K554263j270734m832591l059258J968389M100236J603729j601171
6323I937414k403381k043002k631502l618739l162236p26597K751438N366552
6315C469947M499168p28639o340804n952776J663774R829513J0975694M653730
6307B2069607l222005o971841m913676R37669N742143M259114l728580j1078902
$$ plain form
6365 7197415 8380580 9678678 8418299 2699264 -5689412 -11822699 -12441271 -8688443
6357 -8688443 -2700392 5627066 15071524 19041906 11211907 -4528031 -15644068 -14907892
6349 -14907892 -8244410 -5713482 -9041269 -12610877 -13439844 -13830176 -14794249 -13303663 -8169624
6340 -8169624 -3735125 -4048204 -6365044 -4666392 1717290 7344585 8660336 8461244 10474551
6331 10474551 13028814 11758080 6925489 3866231 5834620 9934856 11538585 9937414
6323 9937414 7534033 5491031 2859529 -759210 -3921446 -4648043 -1896605 3469947
6315 3469947 7969115 7240476 899672 -5053104 -3389330 6440183 17415877 22069607
6307 22069607 18847602 11875761 6962085 7899754 13641897 17901011 14172431 3093529
6299C093529j0051923j529650N700057N192320p78717n806087o934467n695490
6291a6810428m093258k462833o50649R45847J904840K296104K426736K626260
6283a3817381L279463M475307N458004N035547L155265J704051K520175M332654
6275A6143085L445899j043022m503231k269973L015151L819965j819123p006488
6267I782263n706895j221144m97352l479733m231474j108108J024833n79201k134295
6258h151106m9021L289497M097065L385011M263954O024376N452647K147754j802752
6249A8657425n854950j0027449j1146104n829280K538155N891370K340707j072541
6241d502667L28353J228022l959720r133431l766816R499484J5309242O446207
$$ plain form
6299 3093529 -6958394 -8488044 -2787987 2404333 1625616 -4180471 -11114938 -16810428
6291 -16810428 -20903686 -23366519 -24017168 -23071321 -21166481 -18870377 -16443641 -13817381
6283 -13817381 -10537918 -6062611 -604607 4430940 7586205 9290256 11810431 16143085
6275 16143085 19588984 18545962 14042731 11772758 14787909 18607874 16788751 9782263
6267 9782263 4075368 2854224 2356872 -1122861 -5354335 -6462443 -5437610 -6016811 -8151106
6258 -8151106 -8200127 -4910630 -813565 2571446 6835400 12859776 18312423 20460177 18657425
6249 18657425 12802475 2775026 -8371078 -14200358 -11662203 -5770833 -3430126 -4502667
6241 -4502667 -4174314 -2946292 -6906012 -16039443 -19806259 -10306775 5002467 11448674
6233A1448674n472125o321306J387749M729666N83644j805480K256786N031945
6225A1839553p71909j0206657j3297614q194996r07396L938598N841795M870462
6217f888164J733275n3726K179188N169749L500006k072345n267710l159755Q27226
6208d032256L099325L648629K651911j051429n892856p038122k918620J798595
6200i734823K723937J310029P37657L72349j377480k157677J043875N719048O289910
6191D926825J904116k976161n213534n443922m142824n49646L622731M632612
6183c239803K762990L055747P237711R584674M973200k674651n262139j632147
6175A4805582J856204J053638j534824k663663k881070k898516p53311L537254
$$ plain form
6233 11448674 5976549 -344757 1042992 5772658 6356302 4550822 6807608 11839553
6225 11839553 11067644 860987 -12436627 -20631623 -21539019 -17600421 -11758626 -6888164
6217 -6888164 -5154889 -5208615 -3029427 2140322 5640328 3567983 -1699727 -4859482 -4032256
6208 -4032256 -932931 2715698 5367609 4316180 -1576676 -8614798 -11533418 -9734823
6200 -9734823 -7010886 -5700857 -4963200 -4590851 -5968331 -8126008 -7082133 -1363085 4926825
6191 4926825 6830941 3854780 -1358754 -6802676 -10945500 -11495146 -7872415 -3239803
6183 -3239803 -476813 2578934 9816645 19401319 24374519 21699868 16437729 14805582
6175 14805582 16661786 17715424 16180600 13516937 10635867 7737351 6984040 10521294
6167A0521294M790205n90387p385716p254038p85934K679078j563222o828970
6159f417690n168323J055488L285231m69091l416895l82144N272541P026294L567354
6150D352765q26127j981774L42582K872836J424423n348610j3059002j4042261
6142b6265168n222655P083398J2638688P778456j276213n706391k852846K856067
6134a0966664N851802M741643K400504K204200M442102O114664M363164j0915
6126A9140500l269523l153877j226142N352N20074J305994J019360k230962n887348
6117F223428m273894L084346Q707589O481675K97650j883042j57746j735034q008228
6108H736744j0834670m997709K937415M105653K29826m99229K964922L873750
$$ plain form
6167 10521294 15311499 14721112 7335396 81358 -704576 1974502 411280 -6417690
6159 -6417690 -11586013 -10530525 -7245294 -7714385 -11131280 -11513424 -6240883 785411 4352765
6150 4352765 3526638 1544864 1887446 4760282 6184705 836095 -12222907 -26265168
6142 -26265168 -31487823 -24404425 -11765737 -3987281 -5263494 -10969885 -13822731 -10966664
6134 -10966664 -5114862 -373219 2027285 4231485 8673587 14788251 19151415 19140500
6126 19140500 15870977 12717100 11490958 11496310 12016384 13322378 14341738 12110776 6223428
6117 6223428 1949534 5033880 13741469 20223144 20520794 18637752 18480006 16744972 8736744
6108 8736744 -2097926 -7095635 -4158220 -52567 177259 -321970 2642952 6516702
6100F516702O3306k093773J378474N006828K582663k828599l747491K30959K303879
6091I412948j260212o579438q478268o463861k738158J755839O533219R355843
6083A537912Q100144M093101J007620M05168M16655p79735k201748k007829o72315
6074I898973k35800r61046r50349N72801J701667O40186j662159l146212l436201
6065B421860l102562j396345K657952P249142Q552765N147919k42602l966515
6057A7321614m703540l214843r85048L7503j509210m099844l722772J540376Q226403
6048H890639J0467259N903115k431601r417384j1723414q981174l020311L239483
6040g073388O852924N942331Q33627n222595p323902k904451M952780R795819
$$ plain form
6100 6516702 6580008 4486235 5864709 10871537 13454200 10625601 6878110 7109069 9412948
6091 9412948 8152736 1573298 -6904970 -13368831 -16106989 -14351150 -7817931 1537912
6083 1537912 9638056 13731157 14738777 15143945 15560600 14780865 12579117 10571288 9898973
6074 9898973 9663173 8702127 7751778 8324579 10026246 10666432 9004273 5858061 2421860
6065 2421860 -680702 -2077047 580905 7830047 16382812 21530731 21288129 17321614
6057 17321614 12618074 9403231 8418183 8455686 6946476 2846632 -876140 664236 8890639
6048 8890639 19357898 25261013 22829412 13412028 1688614 -7292560 -10312871 -7073388
6040 -7073388 -220464 5721867 6555494 1332899 -5991003 -8895454 -3942674 5853145
6032E853145Q426226L908654R04119j27207j742147l906039l359771N74560L061265
6023A3592805m55634p197694r331467l481433N132540R295944P744191M190315
6015A9489567Q35101l121893p047145p513822l160245K288856M322524K901655
6007H994598J126283M73298m49r02254j577758j429763k98982J694277L245323
5998A1324573K383220l64011j638014o00420j595669p265038j1809665p468472
5990a7033496L160977Q489522L148669m791015n122233J402184N850025L421134
5982a474233j848019l174807J749377Q960341J1692084O797129j294253n134741
5974A6272878l377394j807133m073525o273073l892307N64432J697976n03804
$$ plain form
6032 5853145 14279371 18188025 19092144 18964937 17222790 13316751 9956980 10531540 13592805
6023 13592805 13137171 5939477 -3391990 -6873423 -1740883 7555061 15299252 19489567
6015 19489567 20324668 17202775 10155630 2641808 -518437 1770419 6092943 8994598
6007 8994598 10120881 10594179 10593730 9691476 8113718 6683955 6384973 8079250 11324573
5998 11324573 13707793 13343782 11705768 11105348 9509679 2244641 -9565024 -17033496
5990 -17033496 -13872519 -5382997 -2234328 -7025343 -12147576 -10745392 -4895367 -1474233
5982 -1474233 -3322252 -6497059 -4747682 4212659 15904743 22701872 21407619 16272878
5974 16272878 12895484 11088351 7014826 741753 -3150554 -2586122 -888146 -1391950
5966a391950j892924j250590n93047m7348J837652L528129K088033p41650P9521
5957A615826M584180O659273L177700j122335j081383J061728k86311n010281
5949I598397p262081l984659Q05802J573271j589720l621052j418475K326209
5941c572308L168480R83233l81870J018292K721678J992913n43839l061142n379987
5932c054550p151874n928913o02122N047651O087682K759521m71638j321779j369840
5923f005862j803409j449419N45433L240900N373992N661708K277291m550638
5915C289996r988398q742766j857320M551934P302612Q419921R243933P729323
5907A9949235L312172n91446j607910j793707l296000m429328l084654q11145
$$ plain form
5966 -1391950 -3284874 -4535464 -5128511 -5175859 -3338207 189922 2277955 1536305 1615826
5957 1615826 6200006 12859279 16036979 14914644 13833261 14894989 14608678 9598397
5949 9598397 2336316 -1648343 -842541 730730 -858990 -4480042 -5898517 -3572308
5941 -3572308 -403828 579405 197535 1215827 3937505 5930418 5386579 2325437 -3054550
5932 -3054550 -10206424 -16135337 -16737459 -11689808 -5602126 -2842605 -3314243 -4636022 -6005862
5923 -6005862 -7809271 -9258690 -8713257 -5472357 -98365 5563343 7840634 3289996
5915 3289996 -6698402 -15441168 -17298488 -12746554 -5443942 2975979 12219912 19949235
5907 19949235 23261407 22669961 21062051 19268344 15972344 11543016 8458362 7647217
5899G647217m27096k037347l777450m055565j554320L544870O897654L327638
5891I565601m765666p943989k556898K978496N29901m918229l093620M988413
5883e215991Q462929L368892k605973l462625k680757l860810l065343K958277
5875f101401Q196189N229016k777149o319313l404733q12486k121232k923771
5867a1034880J47985L121190J488521k123089k177222J269364L483765K570605
5859c253761R06516k85615k597848n753829n942982j311144M161324N321634K380962
5850f374743k27820k46530L62428n66801k461270l776814m171409l572645r97761
5841b2033365L686337P667490P114325J853486l339331l635474P5826K191399
$$ plain form
5899 7647217 7220121 5182774 1405324 -2650241 -4204561 -659691 6237963 9565601
5891 9565601 4799935 -3144054 -5700952 -2722456 -2192555 -7110784 -10204404 -5215991
5883 -5215991 3246938 6615830 4009857 547232 -2133525 -5994335 -9059678 -6101401
5875 -6101401 2094788 7323804 4546655 -1772658 -5177391 -5989877 -8111109 -11034880
5867 -11034880 -10886895 -7765705 -6277184 -8400273 -10577495 -9308131 -5824366 -3253761
5859 -3253761 -2347245 -2632860 -5230708 -10984537 -16927519 -18238663 -14077339 -8755705 -6374743
5850 -6374743 -6602563 -6849093 -6486665 -7053466 -9514736 -13291550 -17462959 -21035604 -22033365
5841 -22033365 -18347028 -10679538 -3565213 -1711727 -5051058 -8686532 -8610706 -6419307
5833f419307l09572l912702l965098j756852k073405m535494l134926L843208
5825b2264148R283339O893437P05482j004308J983687K792579q11247l600980
5817f022159k440727q23820j365877r58521K506567M735008J617311l520058m910215
5808a1182491k858814j345907k28509L432372Q004869Q310312L974700L95921
5800H502453N73523J815605J831966K130371K987575Q73684n114368q956793n085205
5791d41189K829447O018834K338026j617579n31413K555816J591663l386787n963152
5782C393666j458451P033683J1364474O615276l397198r301410n870703J804342
5774A0183679L865033k296587q586514o712001J039755N644304M002703J852615
$$ plain form
5833 -6419307 -6728879 -10641581 -14606679 -16363531 -18436936 -22972430 -26107356 -22264148
5825 -22264148 -12980809 -6087372 -5381890 -6386198 -4402511 -1609932 -2421179 -6022159
5817 -6022159 -8462886 -9286706 -10652583 -11611104 -9104537 -4369529 -2752218 -6272276 -11182491
5808 -11182491 -14041305 -15387212 -15615721 -12183349 -4178480 4131832 8106532 8502453
5800 8502453 9075976 10891581 12723547 14853918 17841493 18715177 13600809 4644016 -441189
5791 -441189 2388258 8407092 10745118 9127539 8596126 11151942 12743605 9356818 3393666
5782 3393666 1935215 8968898 20333372 26948648 23551450 14250040 8379337 10183679
5774 10183679 14048712 11752125 3165611 -3546390 -2506635 3137669 7140372 8992987
5766H992987L540318N329207K313091l205571n480416m065086k894642k680414
5758A849474p37501K084961J094123m205256p756075n252226Q6547L009535L212593
5749f613825L418063M140999M189000L668703K909063O72029l194256n516533
5741C673243l719850j04046J335945P25640J281241L653287M951583K956705j529554
5732A3224194n930299p270828l762278K381537N461346K758071j220891m86021
5724E154831M114351O497166M082949K28706j853434k968827m874978p002643
5716C378121p396892m652892J069070O771613P602312K389353l143008k797359
5708C220318J650121L261205J73916k912884l329327l649656m967357l995041
$$ plain form
5766 8992987 12533305 17862512 20175603 16970032 11489616 7424530 4529888 1849474
5758 1849474 1111973 3196934 4291057 85801 -7670274 -12922500 -12835953 -9826418 -6613825
5749 -6613825 -3195762 945237 5134237 8802940 11712003 12384032 9189776 3673243
5741 3673243 -46607 -150653 1185292 1910932 3192173 6845460 11797043 14753748 13224194
5732 13224194 7293895 23067 -3739211 -1357674 4103672 6861743 5640852 5154831
5724 5154831 9269182 15766348 19849297 20078003 18224569 15255742 10380764 3378121
5716 3378121 -4018771 -8671663 -7602593 -830980 6771332 9160685 6017677 3220318
5708 3220318 4870439 8131644 8305560 5392676 2063349 -1586307 -6553664 -10548705
5700a0548705J31756K564589L26894k403435j246411J292233J147609M44254L179223
5691e111993O525187M185558k835632o462531l166865J449635J622404r11770
5683d706007j351336O04207J614440M98457o32448q1247J329797J648882j98199
5674a273454l335167m980598k580320K973639P200635O359682J323732l708424
5666A979725n478931l798513p05798J050764j96950k924740k931334J893394P904840
5657c207543R345532N402495N97169k039986m186723p094689p760986l973230
5649a2917961L70407K24294k395219j123687M593167Q578064P787883O109509
5641A1226457N908814K931490n498512j2969070j1249038j740763O564268Q346251
$$ plain form
5700 -10548705 -10416949 -7852360 -7525466 -9928901 -11175312 -9883079 -8735470 -8291216 -5111993
5691 -5111993 1413194 5598752 2763120 -3699411 -6866276 -5416641 -3794237 -4706007
5683 -4706007 -6057343 -5453136 -3838696 -3340239 -3972687 -4053934 -2724137 -1075255 -1273454
5674 -1273454 -4608621 -9589219 -12169539 -9195900 -1995265 4364417 5688149 1979725
5666 1979725 -3499206 -7297719 -8003517 -6952753 -7149703 -10074443 -13005777 -11112383 -3207543
5657 -3207543 6137989 11540484 12137653 10097667 5910944 -1183745 -8944731 -12917961
5649 -12917961 -12547554 -12323260 -14718479 -15842166 -11248999 -2670935 5116948 11226457
5641 11226457 17135271 20066761 14568249 1599179 -9649859 -11390622 -4826354 3519897
5633C519897N356710O51524m021969n959058l189333J209274K187220M63218J403498
5624A620981N576821O905244K317720k788873k161378K833327N965232L987253
5616B4256327j424420o717913q685742o168250j930873n44536k626576l853393
5608g695376j207892L130011N993539P504359Q376397O605003O72784o324058
5600A7054767r458917p590288l614281o50333j92014k230453m903068n537368
5592a7121955l744476j651263j73K933913O954211Q333132N373052J900366J626371
5583D603178K295763l09010n133585p236001m762678l00200L469283N472865M704338
5574B803953R89521l156994m717346l721137k062312j32919K425309M210002L730249
$$ plain form
5633 3519897 8876607 9528131 5506162 -452896 -3642229 -2432955 -245735 217483 1620981
5624 1620981 7197802 14103046 16420766 13631893 11470515 14303842 20269074 24256327
5616 24256327 22831907 16113994 7428252 1260002 -670871 -1215407 -3841983 -7695376
5608 -7695376 -8903268 -5773257 220282 7724641 16101038 22706041 23378825 17054767
5600 17054767 7595850 5562 -3608719 -4259052 -4451066 -6681519 -11584587 -17121955
5592 -17121955 -20866431 -22517694 -22517867 -19583954 -12629743 -4296611 1076441 2976807 4603178
5583 4603178 6898941 6589931 1456346 -5779655 -10542333 -10842533 -7373250 -1900385 2803953
5574 2803953 3793474 636480 -4080866 -7802003 -9864315 -9997234 -7571925 -3361923 368326
5565C68326K290037J840284J372934r54978l559779l323234o69328J339598K087783
5556G91643L306709M478471K869679j650533n865374p693382p847305o799998
5548a8410090l786211N16881L545612L938629K748633J436939P41057R10021Q39422
5539g519107j665358o072139p667733l676142J424398J643050j367501r62224
5531b5862756L774646O994031O072450N190336O932647P456978L757981j57325
5523A4158988Q29155M893719N795795R32769o853744j3433116j6127174j4037918
5515b3841526q569346k745855J560873M558014O258116N764716L582922J749303
5507a1682783P63008m09120n04784L572627J0591785J3704347Q499250r46062
$$ plain form
5565 368326 2658363 4498647 5871581 4916603 1356824 -1966410 -2635738 -1296140 791643
5556 791643 4098352 8576823 11446502 9795969 3930595 -3762787 -11610092 -18410090
5548 -18410090 -22196301 -21679420 -18133808 -14195179 -11446546 -10009607 -9268550 -8358529 -7519107
5539 -7519107 -9184465 -15256604 -22924337 -26600479 -25176081 -23533031 -24900532 -25862756
5531 -25862756 -22088110 -15094079 -9021629 -3831293 3101354 10558332 14316313 14158988
5523 14158988 14988143 19881862 25677657 26610426 19756682 6323566 -9803608 -23841526
5515 -23841526 -32410872 -35156727 -33595854 -29037840 -22779724 -17015008 -13432086 -11682783
5507 -11682783 -10919775 -11328895 -11833679 -8261052 2330733 16035080 24534330 23588268
5499B3588268p197500p840054n782974l984437l177881k812571j456657J836292
5491f827514M532837K009689n225155r062629k908174Q742997J4468112R120897
5483A4851060r08265n750638k438762L340746M100123j417494o824189n312564
5475c59983K203920Q356997Q388433M360752n1467m027786o806718n738237j134984
5466E190927J337380j833249n496913k486988N559536R985467O570975m85865
5458A8341270n621877p344748o148099k345711K198044M065924K062906j332050
5450C875659l247441l008042j209429J119589J904621p20340n399161p676600
5442a4361144m321497L222259R910957J1166395O620074N66025k316169k047263
$$ plain form
5499 23588268 16390768 8550714 2767740 -1216697 -4394578 -7207149 -8663806 -6827514
5491 -6827514 -2294677 -284988 -5510143 -14572772 -17480946 -8737949 5730163 14851060
5483 14851060 13942795 8192157 5753395 9094141 13194264 11776770 4952581 -359983
5475 -359983 1843937 10200934 18589367 22950119 22898652 18870866 12064148 6325911 5190927
5466 5190927 6528307 4695058 -801855 -3288843 2270693 12256160 18827135 18341270
5458 18341270 12719393 5374645 -773454 -3119165 -921121 3144803 5207709 3875659
5450 3875659 628218 -2379824 -3589253 -2469664 -565043 -1285383 -6684544 -14361144
5442 -14361144 -18682641 -15460382 -5549425 5616970 12237044 12803069 10486900 8439637
5434H439637k217707l652146l054526N13266K700003Q76752p87932J632573M222101
5425H672021J464949l457915k935099K371787M164329j65007l947461k571905
5417C595699L03142O99614L07280P21188o68003m357656n329512j277952K252655
5408c753545P75170j450316N89091L103556K98684m300078l085462K284654L279731
5399b258515j035316k732710J007721L411343O22239j359736K395126O353149
5391F403301L275422l622547n217454J76038N373533M702710m22339n626932p940402
5382b898670o283178k163528K95491j023792k384936P01865N733043O267729K381118
5373F25142J145187N046509P063918J312808p391849j0311718o943783l928645
$$ plain form
5434 8439637 6221930 2569784 -484742 28524 2728527 3605279 2817347 4449920 8672021
5425 8672021 10136970 6679055 3743956 6115743 10280072 10115065 6167604 3595699
5417 3595699 3898841 4598455 4905735 5626923 4958920 601264 -4728248 -6006200 -3753545
5408 -3753545 -2978375 -4428691 -3839600 -736044 -437360 -4737438 -7822900 -5538246 -2258515
5399 -2258515 -3293831 -6026541 -5018820 -1607477 -985238 -2344974 50152 6403301
5391 6403301 9678723 6056176 838722 1014760 6388293 11091003 10668664 5041732 -2898670
5382 -2898670 -9181848 -11345376 -11049885 -12073677 -14458613 -13756748 -8023705 -1755976 625142
5373 625142 1770329 6816838 13880756 15193564 7801715 -2510003 -9453786 -13382431
5365a3382431m166964l827129n3857M223171M606321N25420m770728o749694k410891
5356b6006782O066760J1140274P588176n0714k694158Q07215K755087o71067l279185
5347d344394O33461O479162O389935J224439j777656n34260M37686o99014q7095
5338G722264M031420O895254L808155k954060p106158n885408j979606P65515
5330E297376J446532J959275L507342L937915J38774o416153r447107n747375
5322e323421n58518r56934n726429p018857j616796M974875O581478L477379j98264
5313f365487j668634j28462L774834O715100M689052j166581m217864o11320N269157
5304F289795O627591K546257k856082o709128q783615q569690n414255j155926
$$ plain form
5365 -13382431 -17549395 -21376524 -21430381 -17207210 -12600889 -12075469 -16846197 -23595891 -26006782
5356 -26006782 -19940022 -8799748 -1211572 -1262286 -3956444 -3149229 -394142 -1065209 -4344394
5347 -4344394 -3710933 2768229 9158164 10382603 8604947 8070687 8508373 7809359 7722264
5338 7722264 11753684 18648938 22457093 19503033 12396875 6511467 4531861 5297376
5330 5297376 6743908 8703183 12210525 16148440 16287214 9871061 423954 -5323421
5322 -5323421 -5881939 -6838873 -12565302 -19584159 -21200955 -16226080 -9644602 -6167223 -6365487
5313 -6365487 -8034121 -8162583 -4387749 2327351 7016403 5849822 1631958 1020638 6289795
5304 6289795 12917386 15463643 12607561 5898433 -2885182 -11454872 -16869127 -18025053
5296a8025053Q54308m21335k976273m424856l632765o36241L192321N879686P258199
5287a2932009R018837J0816765R002999K108396m914796n897812j382117K652568
5279H472831K759410M23574k476901n401115o217221k077986N093407Q779763
5271I355762O014163J359603J7744P88962m49450l401771m231265k366481j720370
5262E366897m768624q937510r892178o078250P65126P551724J1350156J0622283
5254E979624O368850J594879r82784p18367Q95255J251458j400292n627019p215450
5245A46154l783317J575482L623741J658807j58570N91200J483212L33671o63129
5236D807251Q32043K265469L840l864659l873228L23687L291884K236995O23426
$$ plain form
5296 -18025053 -17170745 -17592080 -20568353 -24993209 -28625974 -29262215 -26069894 -20190208 -12932009
5287 -12932009 -3913172 6903593 15906592 18014988 13100192 7202380 5820263 8472831
5279 8472831 11232241 11655815 9178914 3777799 -2439422 -4517408 575999 9355762
5271 9355762 15369925 16729528 16747272 17536234 17086784 13685013 9453748 7087267 5366897
5262 5366897 598273 -8339237 -18231415 -24309665 -23544539 -15992815 -4642659 5979624
5254 5979624 12348474 13943353 12960569 12242202 13137457 14388915 12988623 7361604 146154
5245 146154 -3637163 -2061681 1562060 3220867 3062297 3653497 5136709 5470380 4807251
5236 4807251 5639294 7904763 7908603 4043944 170716 494403 3786287 6023282 6646708
5227F646708J576314K770052R08701k803818n108796n371520m581184k752249
5219h715792n57949l29072j909212j068029L743200O910800L407807k538747l310473
5210d367467M14715J864150K40877J151084M889238M648605q49935l028310L000016
5201G962973R319461O743564j486541n661449m117315l042778m980863o317102
5193a580050n017598k963527p46757K738042N160714K113136n058345q993185
5185a4347570o039860r32198Q55782P64300L576613R177921J1742631O732408
5177A1530027l198281r785639p164125J328070O172522K945792k249756j661660
5169b083050L106680M321532J72828l332113k325144L09273J709108L301088N342209
$$ plain form
5227 6646708 8223022 10993074 11901775 9097957 3989161 -1382359 -5963543 -8715792
5219 -8715792 -9273741 -9602813 -11512025 -12580054 -8836854 -1926054 1481753 -1056994 -4367467
5210 -4367467 -3952752 -2088602 -1847725 -696641 4192597 8841202 7991267 4962957 7962973
5201 7962973 17282434 24025998 22539457 16878008 12760693 9717915 4737052 -1580050
5193 -1580050 -6597648 -9561175 -10307932 -7569890 -2409176 -296040 -5354385 -14347570
5185 -14347570 -20387430 -21319628 -20463846 -19699546 -16122933 -6945012 4797619 11530027
5177 11530027 8331746 -1453893 -8618018 -7289948 -1117426 1828366 -421390 -2083050
5169 -2083050 1023630 5345162 5517990 2185877 -139267 170006 1879114 5180202 10522411
5160A0522411L891324k151710o373287k828307M974849Q674106O147787K549370
5152B5406543J730649J959869J83965l535727o450206n658314o90508M560011
5144A7506282M234396k437162q508239p341318j365386J704515k8054j076554
5136B688480J703444M043729J459464l419206m620719r67817L416749N031175
5128I335299L898124J447181j211545k911252k979360k535405l147622l920939
5120b025519k223514J883374M356988K194291j979828k909347N36537M488125
5112D321107N812068N233620L709739k30415o306577q991197l502430N802781
5104E848696Q837782K553964n024592n708153r88001K596021L279261L809896
$$ plain form
5160 10522411 14413735 12262025 5888738 3060431 8035280 16709386 22857173 25406543
5152 25406543 27137192 29097061 29281026 25745299 19295093 13636779 12946271 17506282
5144 17506282 21740678 19303516 10795277 3453959 2088573 3793088 3765034 2688480
5136 2688480 4391924 8435653 9895117 6475911 1855192 887375 4304124 9335299
5128 9335299 13233423 14680604 13469059 10557807 7578447 5043042 1895420 -2025519
5120 -2025519 -4249033 -2365659 1991329 4185620 2205792 -703555 -167018 4321107
5112 4321107 10133175 15366795 19076534 18846119 12539542 3548345 45915 5848696
5104 5848696 14686478 17240442 12215850 6507697 5519696 8115717 11394978 15204874
5096A5204874M315479J988325k549301m576867k257982M83137M2589j796245j418843
5087I435166R33048J990065L19716k336996l935368m190726l707261k513850k56206
5078d262412K382188L352060J532019p93880J57610M418619P413134O053675K761658
5069B3014671O95836j457270n324561o909552j811901N330511N007161l061085
5061A5483810q620680n860219q89798m04167j752840k87106J539377J59989r52606
5052a584240K023996M378474N70434m328310k187466L195992J599858n278814
5044a610076n394858L124377Q084012L566829o07196L330807P429704K211089
5036B0134688o349448o092322K392850Q134278O449911K098616j276832m522801
$$ plain form
5096 15204874 19520353 21508678 18959377 14382510 12124528 12607665 12650254 10854009 9435166
5087 9435166 10368214 12358279 12677995 10340999 6405631 2214905 -1492356 -4006206 -4262412
5078 -4262412 -1880224 1471836 3003855 2209975 2367585 6786204 14199338 20253013 23014671
5069 23014671 23710507 22253237 16928676 10019124 8207223 13537734 18544895 15483810
5061 15483810 6863130 1002911 113113 -291054 -2043894 -2331000 -791623 -631634 -1584240
5052 -1584240 439756 4818230 5388664 1060354 -1127112 2068880 3668738 -1610076
5044 -1610076 -7004934 -3880557 4203455 7770284 7163088 10493895 17923599 20134688
5036 20134688 13785240 7692918 10085768 18220046 24669957 26768573 25491741 20968940
5028B0968940p290459p903045p905702r191942q302073j248725P729345J0214020
5020b929641N241953n80191l130619l307019j287554L207376O088647L194572
5012F497524j312434N6581N387945N739098L32582j893817K187356M451653k87885
5003B1158603n468594m014881Q23430K442089R64606k63096j504871l350636k602425
4994H184225J870277M324013j54521p249683q800278l269459M151337Q560977
4986G616888Q238452M109535L2863n3826K190860J494018j736443j321431K987797
4977B3558713L062377l582455p524697k602561K576040j762382r984308r893259
4969f152532j702362M335205M568496L459976J795530l321688q048766m519368
$$ plain form
5028 20968940 13678481 5775436 -2130266 -11322208 -19624281 -20873006 -13143661 -2929641
5020 -2929641 2312312 1732121 -1398498 -4705517 -5993071 -2785695 3302952 6497524
5012 6497524 5185090 5241671 10629616 16368714 16701296 14807479 16994835 21446488 21158603
5003 21158603 15690009 11675128 12498558 14940647 15905253 15642157 14137286 10786650 8184225
4994 8184225 10054502 14378515 14223994 6974311 -1825967 -5095426 -944089 7616888
4986 7616888 15855340 19964875 19997738 19943912 22134772 23628790 21892347 20570916 23558713
4977 23558713 26621090 23038635 15513938 12911377 15487417 13725035 3740727 -6152532
4969 -6152532 -7854894 -3519689 1048807 4508783 6304313 2982625 -5066141 -9585509
4961i585509N190707R626852M528413j537314p80368L681241M615417M95775m398991
4952A1836223m786447J437785R423334R647529k41085r228716o516441K419693
4944A3991875L671298m081544q907466n235069n68446p16533j516545O48391K043702
4935f70337N50369P50067M218006M500234j736791p240862m882736J437810L606994
4926E32754J073741q89017o4009J573776K282115J599502k98477j538094J10610
4917D382901L437206N014207M476326L989415L127703J75636k537301j714313
4909B0351780k12905k779630o120691l122695L956595N700572Q84972k178884
4901A6479114r0183K228524L121629N812574P606974K140327o181198n820475
$$ plain form
4961 -9585509 -4394802 5232050 9760463 8223149 7442781 11124022 15739439 16235214 11836223
4952 11836223 7049776 8487561 17910895 27558424 27317339 18088623 11572182 13991875
4944 13991875 17663173 13581629 4674163 -560906 -1129352 -1845885 -3362430 -2714039 -670337
4935 -670337 -119968 630099 4848105 9348339 7611548 370686 -4512050 -3074240 532754
4926 532754 1606495 717478 653469 2227245 4509360 6108862 5810385 4272291 4382901
4917 4382901 7820107 12834314 17310640 21300055 24427758 24603394 22066093 20351780
4909 20351780 20138875 17359245 11238554 8115859 12072454 17773026 18657998 16479114
4901 16479114 16388931 18617455 21739084 27551658 35158632 37298959 31117761 25297286
4893B5297286J884998L583544k726164m334087K379341N612690J039618r84141
4885C1753085K495364J617845k513314M074628J7484305J5220602j363072j246277
4877F7523166K1418760L0732907J5755230K2253042O8955673Q2038487j0699788
4870B97977477j48444597j90053634r8636749J2885732M0184014Q648501l338671
4863h0777927J2730528J3211013o546252j0999044O552817J6176864O767851j051776
4855d3935926K605570L804099k654334l708517L600071N122635k856329o008679
4847d4031410J524168P082998L156874m83154L608182P608300L774914k798418
4839b0557546m872292l695960k347816J87372K930984J450827l111869l545997
$$ plain form
4893 25297286 27182284 30765828 28039664 23705577 26084918 31697608 32737226 31753085
4885 31753085 34248449 35866294 33352980 37427608 54911913 70132515 68769443 67523166
4877 67523166 88941926 119674833 135430063 157683105 226638778 308677265 297977477
4870 297977477 149532880 -40520754 -139157503 -126271771 -86087757 -77439256 -80777927
4863 -80777927 -68047399 -54836386 -61382638 -72381682 -65828865 -49652001 -42884150 -43935926
4855 -43935926 -41330356 -37526257 -40180591 -43889108 -40289037 -35166402 -38022731 -44031410
4847 -44031410 -42507242 -35424244 -32267370 -32750524 -29142342 -21534042 -17759128 -20557546
4839 -20557546 -25429838 -29125798 -31473614 -31286242 -28355258 -26904431 -30016300 -33562297
4831c3562297J455748M864253L758845L591452O584189O613012L65389o000625
4823a2330034o570347l859310k280674p34008L077309O723605O316855J927604
4815g729000l134013n235053j876216N636569J1033631R285820L308782n00253
4807A0790267j477005k977512l916468p43863L267798O01480p834545j2180483
4799a4470331p735187o72982K716356L595010M155901K413868j849155l343730
4791a5190250J072091O555861O980807K930927j133054l453248m716506m783456
4783a1736828l416486j768119n98692O51579J583649N89841j849120k714826n77757
4774a9836759K504240L971116L282478J572621J128040L976181Q188612Q000791
$$ plain form
4831 -33562297 -32106549 -27242296 -23483451 -19891999 -13307810 -6694798 -6329409 -12330034
4823 -12330034 -18900381 -22759691 -25040365 -25774373 -22697064 -15973459 -9656604 -7729000
4815 -7729000 -10863013 -16098066 -17974282 -12337713 -1304082 7981738 11290520 10790267
4807 10790267 9313262 6335750 2419282 1675419 4943217 5544697 -2289848 -14470331
4799 -14470331 -22205518 -22878500 -20162144 -16567134 -12411233 -9997365 -11846520 -15190250
4791 -15190250 -14118159 -7562298 -581491 2349436 1216382 -2236866 -6953372 -11736828
4783 -11736828 -15153314 -16921433 -17520125 -16868546 -15284897 -14695056 -16544176 -19259002 -19836759
4774 -19836759 -17332519 -13361403 -10078925 -8506304 -7378264 -3402083 4786529 12787320
4766A2787320J593035m348603l290739J225872J421788j924083j523649L044185
4758H985126M240682l26043l692595j091352L147588L736981J718363j71376k554564
4749A3992810n937610p975306p515857o242342m187307O03595O206758P244117
4741c811142L296137Q0724R3528m54348k757651j825460M055421Q208943N429378
4732A2315530L11987j48947L117863M117541Q29599l627376n773790m284546p69509
4723F088352L24173l229238o079866j322416P576905R208982N18071q560716r948726
4714e424479p025108m850739j344012M983302Q268585M695318L61880J113281
4706G78028K350342j682364n956133k772010M206198N476080J033233j103265
$$ plain form
4766 12787320 14380355 10031752 6741013 7966885 9388673 7464590 5940941 8985126
4758 8985126 13225808 12899765 9207170 8115818 11263406 15000387 16718750 16547374 13992810
4749 13992810 8055200 79894 -7435963 -13678305 -17865612 -17262017 -11055259 -3811142
4741 -3811142 -515005 -434281 -340753 -795101 -3552752 -5378212 -1322791 6886152 12315530
4732 12315530 12627517 12478570 15596433 19713974 20543573 16916197 11142407 6857861 6088352
4723 6088352 6412525 3183287 -2896579 -4218995 3357910 12566892 13084963 4524247 -5424479
4714 -5424479 -12449587 -17300326 -18644338 -13661036 -5392451 -697133 -335253 778028
4706 778028 3128370 1446006 -4510127 -7282137 -3075939 2400141 3433374 2330109
4698B330109J067517J846001j089971l696563l324719j351941J364148M545501
4690A690082N184375R52941m479873n705515l103971m85827J317757K311015n13722
4681b832738p131710r500146j934937P850512Q457481J822295r49469K142547
4673b076165K750622j794786m565844k410048p03272k014705j460317L007027
4665i267488N881180L617222p2595j749021k478013j982686K064605O177122K822651
4656E012977o079339q229488R68938R914570P622585n51333k874166R76752K274077
4647I035573j771786n450508m616989j106258J853356K568728L73743l194150
4639b308291m463447k547508j370832l182119l944880J60245N501011N885898
$$ plain form
4698 2330109 3397626 5243627 4153656 457093 -2867626 -4219567 -2855419 1690082
4690 1690082 6874457 7827398 3347525 -2357990 -5461961 -5947788 -4630031 -2319016 -2832738
4681 -2832738 -9964448 -19464594 -21399531 -13549019 -5091538 -3269243 -4218712 -2076165
4673 -2076165 674457 -1120329 -5686173 -8096221 -8799493 -10814198 -12274515 -9267488
4665 -9267488 -3386308 230914 158319 -1590702 -4068715 -6051401 -3986796 2190326 5012977
4656 5012977 -1066362 -9295850 -8326912 1587658 9210243 8658910 5784744 6761496 9035573
4647 9035573 7263787 1813279 -2803710 -3909968 -2056612 512116 885859 -2308291
4639 -2308291 -6771738 -9319246 -10690078 -13872197 -17817077 -17656832 -12155821 -6269923
4631f269923J751079j335673j250674p17290j389266j746517n00207J891911M564471
4622e002089O069561M320781j77517k996946j195151J991993J803884p30691q56809
4613C227016J813989K578535p31632m243080l872458j163794p09993l368500m750038
4604a1219955j087931M939915O583886J787751l249824k017566L194752M743123
4596C674151J015007j609151J001468M607356L428931j771928n711636n084682
4588d50484n04681M519119M694672k543790j1557794j2706058m725912K851815
4580b0423113L171283J300936M534073R813892Q743882J140726m751046l830982
4572c00349J180300N466260O256473K508728l445298n178733P40184Q068667P645959
$$ plain form
4631 -6269923 -4518844 -5854517 -7105191 -7822481 -9211747 -10958264 -11458471 -9566560 -5002089
4622 -5002089 1067472 5388253 5210736 2213790 1018639 3010632 4814516 4083825 3227016
4613 3227016 5041005 7619540 6887908 2644828 -1227630 -2391424 -3101417 -6469917 -11219955
4604 -11219955 -12307886 -7367971 -784085 1003666 -2246158 -4263724 -1068972 3674151
4596 3674151 4689158 3080007 4081475 8688831 12117762 10345834 4634198 -450484
4588 -450484 -955165 3563954 8258626 5714836 -5842958 -18549016 -23274928 -20423113
4580 -20423113 -17251830 -15950894 -11416821 -1602929 7140953 8281679 3530633 -300349
4572 -300349 879951 6346211 12602684 15111412 11666114 6487381 7227565 15296232 22942191
4563B2942191j43447o367300o332761m032863l590822l982607l884540m436085
4555i828234m519216p2814Q238731J2619917Q000727j20486k388610K839337Q725845
4546B3495197Q579871J869583o591316j0683954p839717k008175O9547k839989
4538D051047m691704q54522M911137N951695K447549N18399K526070L727334m8372
4529A8538633n779003p266325l270792J727181L955235M115506M131565L287765
4521A9439765L6657m040267n354555l499725k429335n241251r863674j1481417
4513b2433802p862269r62241N456548Q516948P774345N359159L645187K251489
4505A745364r00525n065534o091765k052958L225496M560155J083016m535003
$$ plain form
4563 22942191 22798744 16431444 10098683 6065820 2474998 -1507609 -5392149 -9828234
4555 -9828234 -14347450 -14420264 -6181533 6438384 14439111 14318625 11930015 14769352 23495197
4546 23495197 32075068 33944651 27353335 16669381 8829664 6821489 6891036 4051047
4538 4051047 -640657 -1495179 3415958 9367653 11815202 12333601 14859671 18587005 18538633
4529 18538633 12759630 5493305 2222513 3949694 7904929 12020435 16152000 19439765
4521 19439765 19476422 15436155 10081600 6581875 4152540 -1088711 -10952385 -22433802
4513 -22433802 -30296071 -31258312 -25801764 -17284816 -9510471 -4151312 -506125 1745364
4505 1745364 844839 -4220695 -10312460 -12365418 -9139922 -4579767 -3496751 -8031754
4497h031754r687880j1925391q537059Q242Q276145J1234058R476256N856071
4489c331312K49737p324315j1614662p292708J980984O877384M891486K528398
4481a3035008M287387O850847O330071M154509K411868k32599l823047m162620
4473B781408L91457M040558J091716n235091p226899l268083J438663K737357
4465c248914Q19671k794231o229863o086683n92150O093949P511675L200712j040705
4456b366539j654156j362350l298315n596284m623120n63621L217288M643175
4448a1603922M250000L184195K090479J486334J545847J607153Q92062m42926
4440C009222j501809j478744j3540K463042M339214L860213J304478r22479j329137
$$ plain form
4497 -8031754 -17719634 -29645025 -38182084 -38173842 -29897697 -18663639 -9187383 -3331312
4489 -3331312 -3081575 -10405890 -22020552 -29313260 -27332276 -20454892 -15563406 -13035008
4481 -13035008 -8747621 -1896774 4433297 8587806 10999674 10767075 6944028 2781408
4473 2781408 3172865 7213423 8305139 3070048 -4156851 -7424934 -5986271 -3248914
4465 -3248914 -2429243 -5223474 -11453337 -17540020 -18132170 -12038221 -4526546 -1325834 -2366539
4456 -2366539 -4020695 -5383045 -8681360 -14277644 -18900764 -19464385 -16247097 -11603922
4448 -11603922 -7353922 -4169727 -2079248 -592914 952933 2560086 3452148 3009222
4440 3009222 1507413 28669 15129 2478171 6817385 10677598 11982076 11059597 9730460
4431I730460j383068l154257n915797p053762n834115l826893j447890K949891
4423a5935431R045065J2306975Q684844K59373o669128q440880o126276j587818
4415h463276M362074R211332Q769809K741102k971164k985770O55931J840841
4407A3160879r72949l542245k821928j034345j637401m133096m693936q59499
4399f534520N303129Q508394N313495j476494m934814j996261K545502K350485
4391I078916k145414n155338l776421m90121J889499K915760J867850k400491
4383A784240p360831p389636j141386N558770P063268M538899K115210K43760
4375E412294k523491m046659p81729N268672P398536K983870l126232n659631
$$ plain form
4431 9730460 8347392 5193135 -722662 -7776424 -13610539 -17437432 -18885322 -15935431
4423 -15935431 -6890366 5416609 14101453 14360826 7691698 -749182 -6875458 -8463276
4415 -8463276 -4101202 5110130 13879939 16621041 13649877 10664107 11320038 13160879
4407 13160879 12187930 8645685 5823757 4789412 3152011 -981085 -5675021 -6534520
4399 -6534520 -1231391 7277003 12590498 11114004 6179190 4182929 6728431 9078916
4391 9078916 6933502 1778164 -1998257 -2488378 -598879 2316881 4184731 1784240
4383 1784240 -5576591 -12966227 -14107613 -8548843 -1485575 3053324 5168534 5412294
4375 5412294 2888803 -1157856 -1939585 3329087 10727623 13711493 10585261 4925630
4367D925630n256772n085997m590276p89320N607396R677824Q279135L304371
4359A6071991j740958n077380n270145o02383O699539Q928916J033869j0916987
4351I126462j5218653q727032K95391M492190N539893O872529N805418n65834
4343G620364o934827n408673K816817Q787713P551200J941118m083362q669936
4335C620414r228115m022633K670311M077548O15941q12470J944873L545458J367481
4326C778808K7893K346177L889886J130149k281423k563338k272943m060822m636803
4317d642416j426227J151026n69963j570358L341718Q455676M968100l653717
4309F053839n543547J371335O488929L185663k407785k851455k27267l2872j436166
$$ plain form
4367 4925630 -331142 -5417139 -10007415 -10796735 -5189339 4488485 12767620 16071991
4359 16071991 14331033 9253653 3983508 3381125 10080664 19009580 20043449 9126462
4351 9126462 -6092191 -14819223 -14523832 -10031642 -4491749 2380780 8186198 7620364
4343 7620364 685537 -4723136 -1906319 6881394 14432594 16373712 12290350 3620414
4335 3620414 -5607701 -9630334 -6960023 -2882475 -2266534 -3079004 -1134131 2411327 3778808
4326 3778808 3806701 6152878 10042764 11172913 8891490 6328152 4055209 -5613 -4642416
4317 -4642416 -6068643 -4917617 -5487580 -7057938 -3716220 4739456 9707556 6053839
4309 6053839 510292 1881627 8370556 11556219 9148434 6296979 6069712 6036840 4600674
4300D600674j93915L213798M666485L194195J351169M2688k330393n536969o154074
4291B853658j981813M149131O773974L852312q01092k117373j24616L96704k996298
4282A0004587o485524n240858l10080K869377J641332j477857l214563l181312
4274e394898k571214j651579K60768L245778N768746N423648J659525k286648
4266D454126k233013J628956M794753M631350L180095K358066N52381l140204
4258A6226510n391684l479630l32375j81324j908145j481853J332677L579773
4250H363949M280007M047741J769498k924040n966486l638896O48594P87743k184766
4241E183344j837654K621458M864920J911544j469402r46155J590659L251027
$$ plain form
4300 4600674 4406759 7620557 12287042 15481237 16832406 16875094 14544701 9007732 2853658
4291 2853658 871845 5020976 11794950 15647262 14846170 12728797 12604181 13000885 10004587
4282 10004587 3519063 -1721795 -2031875 837502 2478834 1000977 -2213586 -5394898
4274 -5394898 -7966112 -9617691 -9356923 -6111145 -342399 5081249 6740774 4454126
4266 4454126 2221113 3850069 8644822 13276172 16456267 18814333 19366714 16226510
4258 16226510 10834826 7355196 7022821 6841497 4933352 3451499 4784176 8363949
4250 8363949 12643956 16691697 18461195 15537155 9570669 5931773 6580367 7368110 5183344
4241 5183344 3345690 5967148 10832068 12743612 11274210 10328055 11918714 15169741
4233A5169741M945818P333520P204533K259786m026942o305904l999198j174111
4225B1407243j291497m031627o314179n605813k871724j449276j894705n23007
4217b574585M216272P392664M439962q38451j580965J216566Q43011l403650n397518
4208D313306l237769j922179l278352k383911K679910N980580L165616j486278
4200C830923k393054q45284p46430j444071j7441L156738N418690N370412K751707
4191A5082190j708184m675849k870492J467323K951850J484148J660871L237754
4183A6629611R48476m178763l477416M999578J0760477N920887k892404n197783
4175B3512663j540441M75529j268946l124539l120990j395208K517491O667714
$$ plain form
4233 15169741 20115559 27449079 34653612 36913398 32886456 26580552 22581354 21407243
4225 21407243 20115746 16084119 9769940 4164127 1292403 -156873 -2051578 -2574585
4217 -2574585 1641687 9034351 13474313 12635862 11054897 12271463 13114474 9710824 4313306
4208 4313306 1075537 -846642 -4124994 -6508905 -3828995 2151585 5317201 3830923
4200 3830923 1437869 592585 -153845 -1597916 -1615357 1541381 6960071 12330483 15082190
4191 15082190 13374006 8698157 5827665 7294988 10246838 11730986 13391857 16629611
4183 16629611 17578087 13399324 9921908 14921486 25681963 31602850 28710446 23512663
4175 23512663 21972222 22447751 21178805 18054266 14933276 13538068 16055559 22723273
4167B2723273N801453p46600n628782l600189Q46234J607704P1851n2819Q6691
4158B1108816q21706L92476M404368N240645P5271m849880m911316m293824n260683
4149A1084167j659667P763005J2111943N548284j240498P97819L897000Q83886
4141C9185939J051477J0218757J3187387m1809r131724N274676K3214342J7071752
4133A00030797N805110K6201332N5316532K4521527p2450560j45763431j20022814
4126a26361507l2213000K4986319K1917416K957816K948949J0359945R598402
4119h5805660Q415506J2771166J1977247J847563m821890j272638K755085J567439
4111e2566182K683824P912195O719029k691703n990964L246164J0704169M307160
$$ plain form
4167 22723273 28524726 27778126 22149344 18549155 19395389 21003093 21074944 21022125 21108816
4158 21108816 20287110 20679586 25083954 30324599 30399870 25549990 20638674 16344850 11084167
4149 11084167 9424500 17187505 29299448 34847732 33607234 34405053 38302053 39185939
4141 39185939 40237416 50456173 63643560 63601751 54470027 59744703 82959045 100030797
4133 100030797 105835907 132037239 187353771 211875298 139424738 -6338693 -126361507
4126 -126361507 -158574507 -133588188 -111670772 -108712956 -105764007 -95404062 -85805660
4119 -85805660 -77390154 -64618988 -52641741 -50794178 -55616068 -56888706 -54133621 -52566182
4111 -52566182 -49882358 -41970163 -35251134 -37942837 -43933801 -40687637 -29983468 -25676308
4103b5676308o357305o606161J012798M579841K369528J186959K645755L065885
4095b3779008K079264J819909J454395l88504j754666j124262k61204M30659L121927
4086a8401490N914368L122096l834723n302547J362990N570147n7348o995322
4078a8621829m221157M395476P346933L329200k31063j538729m659892q076992
4070b2278053n586456J590487M879882J706495j295943m05493n56209n242861
4062b7188151q848185m586757N002014J0880337Q377883J384785l107282k095891
4054b0181247J519358K997746J301517m84308m51905o17885k278837k167531K432588
4045a7930504P353143O056542n05124m590933k618578N37111j40162k734727k651307
$$ plain form
4103 -25676308 -32033613 -38639774 -37626976 -33047135 -30677607 -29490648 -26844893 -23779008
4095 -23779008 -21699744 -19879835 -18425440 -18813944 -20568610 -21692872 -21954076 -21523417 -18401490
4086 -18401490 -12487122 -9365026 -13199749 -18502296 -17139306 -11569159 -11626507 -18621829
4078 -18621829 -22842986 -18447510 -11100577 -7771377 -8002440 -9541169 -14201061 -22278053
4070 -22278053 -27864509 -26274022 -21394140 -19687645 -20983588 -21389081 -21945290 -27188151
4062 -27188151 -36036336 -40623093 -35621079 -24740742 -16362859 -14978074 -18085356 -20181247
4054 -20181247 -18661889 -15664143 -14362626 -14846934 -15298839 -15916724 -18195561 -20363092 -17930504
4045 -17930504 -10577361 -4520819 -5025943 -9616876 -12235454 -11698343 -11838505 -14573232 -17224539
4036a7224539M52480L640976N386936N501762K847113k715178p424439o883396
4028a6418285k161130R51410o11870l612203l462817R7946M036043O221274O149046
4019h810586L489711q45200l415673j825113Q43962n22273m821782n161351N06376
4010b0561929M902742J849542l937440l851196J495935M137807J986194J128177
4002a2850168M126908N236164P27820m134530l733998j071917j646164l500578
3994a6846463p83882N915538J0149600Q961342N020553M66322m652189p971392
3986B59429n829689r1302K278160j110951m209336j510568L772894M655798J49596
3977a635969m540980n728294m543185k949248o55525K863197O013402O332963
$$ plain form
4036 -17224539 -16772059 -13131083 -7744147 -2242385 604728 -2110450 -9534889 -16418285
4028 -16418285 -18579415 -17628005 -18239875 -21852078 -25314895 -25216949 -21180906 -14959632 -8810586
4019 -8810586 -5320875 -6166075 -9581748 -11406861 -10562899 -11085172 -15906954 -21068305 -20561929
4010 -20561929 -15659187 -13809645 -17747085 -21598281 -20102346 -15964539 -13978345 -12850168
4002 -12850168 -8723260 -3487096 -2759276 -6893806 -10627804 -11699721 -13345885 -16846463
3994 -16846463 -17630345 -11714807 -1565207 7396135 12416688 12883010 8230821 259429
3986 259429 -5570260 -5661562 -3383402 -4494353 -8703689 -10214257 -6441363 -1785565 -1635969
3977 -1635969 -6176949 -11905243 -16448428 -19397676 -20053201 -17190004 -11176602 -4843639
3969d843639K922876k908916q138699r069323m135771L202258O545404L550843
3961a2874967r18946j271577R37216k06888m924043o195740k97705O605920O738482
3952a2408248J446895j956797j270875o80859k144294k666538r24879J41777n22377
3943b0986195N77310M915435P967185N651686O63751j477814N32724M004801O268911
3934H117794N365561L03608n811009o480239K03888P369608P408767J353568m068781
3925A3762765n700033n257266l993001j704130M06380J041496J757642L872515
3917D186368M202463o09203o960431p783817k843084P33430j128246m359395l594670
3908a8156585Q91386N021525N845139L110769r32741k449433M16660M758878O401530
$$ plain form
3969 -4843639 -1920763 -4829679 -12968378 -22037701 -26173472 -22971214 -16425810 -12874967
3961 -12874967 -13793913 -15065490 -14128274 -14335162 -19259205 -25454945 -25752650 -19146730 -12408248
3952 -12408248 -10961353 -12918150 -14189025 -14869884 -17014178 -19680716 -20605595 -20463818 -20986195
3943 -20986195 -20408885 -15493450 -7526265 -1874579 -1210828 -2688642 -2155918 1848883 8117794
3934 8117794 13483355 13786963 7975954 1495715 1699603 9069211 16477978 17831546 13762765
3925 13762765 8062732 2805466 -1187535 -2891665 -2485285 -1443789 313853 4186368
3917 4186368 8388831 7779628 819197 -6964620 -9807704 -9074274 -10202520 -14561915 -18156585
3908 -18156585 -17265199 -12243674 -6398535 -3287766 -4220507 -6669940 -6253280 -1494402 4907128
3899D907128N134441L065378j77372n491613r403270p619347k544167k11813l37751
3890a2678386K425753P264744O995384J089213j565095K724080N440177J55907
3882A1851777n841554l458684K572443J292747o315267q942128k826663L614964
3874h052365L669006N31959p50261q51922k068322l316503l004135j993586p77281
3865a6613410J936296N419027O111366L116817L02913L23842P45226q47099k024842
3856a529864J66545L280639K532711j885082m895214l395608O29661L955362N890727
3847D749877P222555P537830N242351l9671n798387p971065m695774J253211M755474
3838A2256401L346002r42302m670250o401009o634810o047321m831674k775182
$$ plain form
3899 4907128 10041569 13106947 12929575 7437962 -1965308 -9584655 -12128822 -12340635 -12678386
3890 -12678386 -10252633 -2987889 4007495 5096708 3531613 6255693 11695870 11851777
3882 11851777 6010223 2551539 5123982 6416729 101462 -8840666 -11667329 -8052365
3874 -8052365 -4383359 -3851400 -4601661 -5453583 -7521905 -10838408 -13842543 -15836129 -16613410
3865 -16613410 -14677114 -9258087 -3146721 -29904 273009 596851 1342077 494978 -1529864
3856 -1529864 -1363319 1917320 4450031 2564949 -2330265 -5725873 -5096212 -1140850 4749877
3847 4749877 11972432 19510262 24752613 24712942 18914555 10943490 6247716 7500927 12256401
3838 12256401 15602403 14660101 9989851 3588842 -3045968 -9093289 -13924963 -16700145
3830a6700145N67268M613965O567402L673221k385064n728456k857274K781716
3822i467367N059980K677396j34585L18470L069834M491583K339838k408543o210441
3813b63835n645658j055834L063549L277651J845878L092705N943590M807681
3805A5065727j146826n040168j984373K937082J750239m418051p055606k986000
3797b877976J654460J330507j554490k158092n21621O56739J242985K069375J495693
3788A337580j501075l425372p45955L543878L415837j117144m130345k925134
3780e547730j320074k787061n448332n700062k730439K050945O355510O898931
3772h228312K200136l580542m359777p19014Q29006j356797j017564M804067R029933
$$ plain form
3830 -16700145 -16132877 -11518912 -4951510 -1278289 -3663353 -9391809 -12249083 -9467367
3822 -9467367 -4407387 -1729991 -1864576 -1546106 1523728 6015311 8355149 5946606 -263835
3813 -263835 -5909493 -6965327 -3901778 -624127 1221751 4314456 10258046 15065727
3805 15065727 13918901 8878733 6894360 9831442 11581681 7163630 108024 -2877976
3797 -2877976 -1223516 106991 -1447499 -3605591 -4127212 -3470473 -2227488 -158113 1337580
3788 1337580 -163495 -3588867 -4334822 -790944 2624893 1507749 -2622596 -5547730
3780 -5547730 -6867804 -9654865 -15103197 -20803259 -23533698 -21482753 -15127243 -8228312
3772 -8228312 -6028176 -9608718 -13968495 -14687509 -13858503 -15215300 -16232864 -11428797 -2398864
3763b398864N091432k039769l199246J068113K766276o1657j574768O15322J819076
3754B085915l43855j311004K132059N596184L549982k682733p514194q098694
3746f586340n215731n16521L419428L148760j491551n158338k680388M090247
3738a0990434Q320276O395890J151385k820300m265628m973377o242798o978050
3730b0403036n149887o19379M137031O559511O521667N307905L049449p95116
3722a391855m768188n722834k479996K538757N861427N862900L238128J83290
3714C321629j195002j279729k816249o271363p164963j920467N013821N394422
3706f917901j248738o215184l537631K481278M649481K628658J220936K870580
$$ plain form
3763 -2398864 2692568 652799 -2546447 -1478334 1287942 1226285 -348483 266839 2085915
3754 2085915 1742060 431056 2563115 8159299 11709281 9026548 1512354 -6586340
3746 -6586340 -11802071 -12318592 -8899164 -5750404 -7241955 -12400293 -15080681 -10990434
3738 -10990434 -2670158 3725732 4877117 2056817 -2208811 -7182188 -13424986 -20403036
3730 -20403036 -25552923 -26172302 -22035271 -15475760 -8954093 -3646188 -596739 -1391855
3722 -1391855 -6160043 -11882877 -14362873 -11824116 -5962689 -99789 3138339 3321629
3714 3321629 2126627 846898 -1969351 -8240714 -15405677 -17326144 -12312323 -6917901
3706 -6917901 -8166639 -14381823 -17919454 -15438176 -10788695 -8160037 -6939101 -4068521
3698d068521O046594Q154920O724728R51173m962829m355932K199546M920294
3690A5609973j948466j0045287p750180K628842P905967K894218l580323k730637
3682B984107L126955O696139N490288J473398l303165o615890o166399l340790
3674C44643k857546n687486o662725k315710L445497N309324L951853L164821
3666a307329L453792L205415K860943K944025R54792m377623q356064n813876
3658f435925M44053L036808R51832M27088M467176Q010910N613932j281422p296403
3649G938049r218739o807583j327074L993453N217092K351767L40384K677470
3641E164819O128844M773622j987376q287910q355919k363882M128095N489320
$$ plain form
3698 -4068521 1978073 10132993 16857721 17808894 12846065 8490133 10689679 15609973
3690 15609973 13661507 3616220 -4133960 -1505118 6400849 9295067 5714744 2984107
3682 2984107 6111062 12807201 18297489 19770887 16467722 9851832 3685433 344643
3674 344643 -2512903 -8200389 -14863114 -17178824 -13733327 -8424003 -4472150 -1307329
3666 -1307329 2146463 5351878 8212821 11156846 12111638 7734015 -622049 -6435925
3658 -6435925 -5991872 -2955064 -2003232 -1576144 2891032 10901942 16515874 15234452 7938049
3649 7938049 -1280690 -8088273 -9415347 -5421894 -204802 2146965 2487349 5164819
3641 5164819 11293663 16067285 14079909 5791999 -2563920 -4927802 -799707 4689613
3633D689613J133416m025541m698923q46299K856572K874125K00471k172738k660539
3624b649843j190267J487332L163533J203322l839784p375051n531280L15614
3616a4416424N164795N458470J656300k691573l601312k79980L084926J481249
3608d143549m138800p273779m399356O35473K922919K975588L334139K918101
3600g169264J07668j599499K386584R116249J0020633K227713p286518j0107599
3592b304033m835473L611158R089140P918480J467933m103932m136588j426927
3584E279758j897028n164482n261377p27071L132403L555530M236052O807517
3576I961302O270136J16704n026637k824038K188162J279201n078698q644579
$$ plain form
3633 4689613 5823029 1797488 -2901435 -3747734 -891162 1982963 2183434 10696 -2649843
3624 -2649843 -3840110 -2352778 810755 2014077 -1825707 -9200758 -14732038 -14416424
3616 -14416424 -9251629 -3793159 -2136859 -4828432 -8429744 -8709724 -5624798 -4143549
3608 -4143549 -8282349 -15556128 -19955484 -19320011 -16397092 -13421504 -10087365 -7169264
3600 -7169264 -7061596 -8661095 -6274511 2841738 12862371 15090084 7803566 -2304033
3592 -2304033 -7139506 -3528348 5560792 13479272 14947205 10843273 6706685 5279758
3584 5279758 3382730 -1781752 -7043129 -7770200 -4637797 -1082267 3153785 9961302
3576 9961302 16231438 16348142 11321505 8497467 10685629 11964830 6886132 -1758447
3568a758447n874486r55328K392451M410498M864760K431964r52690j762456j456893
3559A339373m694413j0094021j0038193k005122O563485P952992L092333k402306
3551a0285872n457403m959445M95673Q897147J2892697P484235k444815p327339
3543g05122m285111R79246K421598m59805m336615n679132k623581L551214Q492257
3534b645051Q743482N713740L668664M147808M636495K599565j435147n059358
3526B0370198o497520n699484m173807l634186l799281k202735K395119P172569
3518C930873P846627M032991M9832k36715K076756K652869m77248m370425m950516
3509A0555044k538914j570461m003423n560140j498542N445184P396833K003279
$$ plain form
3568 -1758447 -7632933 -8588261 -6195810 -1785312 3079448 5511412 4558722 2796266 1339373
3559 1339373 -3355040 -13449061 -23487254 -25492376 -18928891 -10975899 -7883566 -10285872
3551 -10285872 -15743275 -20702720 -20207047 -11309900 1582797 9067032 6622217 -705122
3543 -705122 -4990233 -4010987 -1589389 -2049194 -6385809 -12064941 -14688522 -11137308 -2645051
3534 -2645051 6098431 11812171 15480835 19628643 24265138 26864703 25429556 20370198
3526 20370198 13872678 8173194 3999387 365201 -3434080 -5636815 -3241696 3930873
3518 3930873 11777500 15810491 15860323 15623608 17700364 20353233 19875985 15505560 10555044
3509 10555044 8016130 6445669 2442246 -3117894 -4616436 828748 8225581 10228860
3501A0228860l947206l668881R26517K979614M7983m326560o611377o646276n460864
3492a6478190l312459m42891K461022M933441O520624O376374M480506K466673
3484G005100J679763J295678o2466j886036k604229j760145J22888K403718L581665
3475I775936J819174j778969k999577m81581J014408k630991p492553o551860
3467i326013o22640K325198q09800l816402j265599L217271L283457j75273j205985
3458h395786J455163K926933M14901k539226j918449P56405J521512O39950J931333
3449c207264N653458O474514Q66846o715855r045328n850605l331442l979386
3441a9135062k894503L154418Q664187O648624o03532m299830j264380K864353
$$ plain form
3501 10228860 6281654 2612773 3539290 6518904 6566887 2240327 -4371050 -11017326 -16478190
3492 -16478190 -19790649 -20233540 -17772518 -12839077 -6318453 57921 4538427 7005100
3484 7005100 8684863 9980541 9918075 8032039 5427810 3667665 3790553 6194271 9775936
3475 9775936 11595110 9816141 6816564 6334983 7349391 4718400 -2774153 -9326013
3467 -9326013 -9948653 -7623455 -8433255 -12249657 -13515256 -10297985 -7014528 -7189801 -8395786
3458 -8395786 -6940623 -4013690 -3598789 -6138015 -8056464 -7300059 -5778547 -5138597 -3207264
3449 -3207264 2446194 8920708 9787554 3071699 -5973629 -11824234 -15155676 -19135062
3441 -19135062 -22029565 -18875147 -10210960 -3562336 -4165868 -8465698 -9730078 -6865725
3433f865725K689950l72560k031665r61803J412454L535181M115696K482545j429
3424D002644j074704p95564j062708j717084o18027J758696J933326q19354k504746
3415h97521o62973J248077r92517n877588q452418o799837k660284K436398P577839
3406a5080824J0169524P693998K184787p11561J515110M949024M283385n85495
3398A4417948m865516m994115k444132r42314j509918j912918m11599K134924
3390e27640M193160N208252M485090J256767k471760k472861J472643L407852
3382A4551503n72171n454787m494792j27487J72849k915035j454765M961114O427110
3373A1093539j147894p778805m542003K070854P62092o200377o930005Q52743
$$ plain form
3433 -6865725 -4175775 -4548335 -6580000 -7541803 -6129349 -2594168 1521528 4004073 4002644
3424 4002644 2927940 2132376 1069668 -647416 -1265443 493253 2426579 1607225 -897521
3415 -897521 -1560494 -312417 -1304934 -7182522 -15634940 -22434777 -25095061 -22658663 -15080824
3406 -15080824 -4911300 2782698 4967485 4255924 5771034 10720058 15003443 14417948
3398 14417948 9552432 4558317 2114185 1171871 -338047 -2250965 -2662564 -527640
3390 -527640 3665520 8873772 13358862 14615629 12143869 9671008 11143651 14551503
3382 14551503 13979332 8524545 4029753 3902266 4075115 1160080 -294685 4666429 11093539
3373 11093539 9945645 2166840 -2375163 -304309 457783 -5742594 -12672599 -11819856
3365a1819856O529643L048939l726256n055821o90519L638178M296290J578491
3357b200911k381772m406409k062185L084010O572677O643686N756007N675438
3349A6680541M789632J929239p31139r65702p9924q83474l747703o316039n982875
3340D692556k079865K960034M764654J481272l251485m414809k139200p17161
3332A295996j565121j626009P48738L112233L469568K898684J940500p36317l784351
3323E753921k679536K628090M851935o87935p693599o955514K03125L933469J90563
3314d55481m562422l889880M53003L593735M809227N587543M794704P99858l909066
3305G221221n089312k960842j900562l796980n397677l359077R77020L640905
$$ plain form
3365 -11819856 -5290213 -2241274 -5967530 -11023351 -11713870 -8075692 -3779402 -2200911
3357 -2200911 -4582683 -8989092 -11051277 -7967267 -1394590 5249096 11005103 16680541
3349 16680541 21470173 23399412 22668273 21702571 21622647 20739173 16991470 10675431 4692556
3340 4692556 2612691 5572725 10337379 11818651 8567166 4152357 2013157 1295996
3332 1295996 -269125 -1895134 -1146396 1965837 5435405 8334089 10274589 9538272 5753921
3323 5753921 3074385 5702475 10554410 9866475 2172876 -4782638 -4579513 -646044 -455481
3314 -455481 -5017903 -8907783 -8454780 -4861045 -51818 5535725 10330429 11130287 7221221
3305 7221221 2131909 -828933 -2729495 -6526475 -11924152 -15283229 -14306209 -10665304
3297a0665304L065075J203235N22275J451705K566208K260617K69916j992511
3289a318784k756880j567343R13422M288361P897101Q995151M540683l486338
3281A7505373p647209l468707L664829M529777j823307p109851n525834r01818
3273g76747K17651k369194m297981l691367j765703J081493M855794P055075N043019
3264E352040Q77564o75497J069911K195380P26067q42914p51420j170065l680247
3255C100819n320530k849758J307093J656140k278847m713593j970133J540972
3247i527837m27400n444381m039994O256026J4535428R908488k880041r663627
3239a283338o887917m568539p535512o514766M672952J4497302Q953054n679228
$$ plain form
3297 -10665304 -7600229 -6396994 -5874719 -4423014 -1856806 403811 673727 -1318784
3289 -1318784 -4075664 -5643007 -4729585 -441224 7455877 16451028 20991711 17505373
3281 17505373 9858164 6389457 10054286 14584063 12760756 5650905 125071 -776747
3273 -776747 -559096 -2928290 -7226271 -10917638 -12683341 -11601848 -6746054 309021 5352040
3264 5352040 6229604 5554107 6624018 8819398 9545465 8702551 7951131 6781066 3100819
3255 3100819 -2219711 -5069469 -3762376 -2106236 -4385083 -9098676 -11068809 -9527837
3247 -9527837 -9955237 -15399618 -19439612 -13183586 1351842 11260330 8380289 -1283338
3239 -1283338 -8171255 -12739794 -20275306 -26790072 -22117120 -7619818 1333236 -4345992
3231d345992j0227596k33448R074214O683961j11837o71702K857900K675319q96377
3222D804442k268076j168599j408121k704451j474898K330908N280759N638171
3214I030135L848995R4685m459275o532916m765462k122672r52839N21795L148929
3205b188625L326888l31096j975718L113455R534984Q945082K851028l79506R19958
3196B3816450N16949l759291o227748l197015J425937K977331J955709N86514
3188A8094836p65530j408281J28673K251502J211991k288260l051917j54934L54669
3179A4372749n157037j1565587j2191421p384130j561756L511787P416419P467997
3171e090979K630937j959780p63845L728398M486704N67114k259704j143875M92934
$$ plain form
3231 -4345992 -14573588 -14807036 -5732822 951139 839302 167600 3025500 5700819 4804442
3222 4804442 2536366 1367767 -40354 -2744805 -4219703 -1888795 3391964 9030135
3214 9030135 12879130 12973815 8514540 1981624 -2783838 -4906510 -5859349 -5337554 -2188625
3205 -2188625 1138263 807167 -1168551 1944904 11479888 20424970 23275998 22896492 23816450
3196 23816450 24333399 20574108 14346360 11149345 12575282 15552613 17508322 18094836
3188 18094836 17329306 15921025 16049698 18301200 19513191 17224931 14173014 14018080 14372749
3179 14372749 9215712 -2349875 -14541296 -21925426 -23487182 -19975395 -12558976 -5090979
3171 -5090979 -2460042 -4419822 -5183667 -1455269 3031435 3598549 1338845 194970 687904
3162F87904L63468J159950M041893M507866m27481n681262m870168p37659j684727
3153b640216q359392j1148848l620399P598438J1112498N188111j580677k288215
3145e738700J277582L894089L966882L136780K345160J267004J93803K07252J692146
3136A2241998L470899L244900n63375o306647r419847p173823k108340J693844
3128d920391M150467P162845Q531600L680340o022725j2532839j0717082l847318
3120a4515103K146629M706415L280345j752946n970999l288433M749318Q665069
3112a979705M419248k06488J780129N540177L796932l27482K5711K175306r56713
3103A4267115o824627p033508k388326r07058k162830K021699J0329473J0405740
$$ plain form
3162 687904 1051372 2211322 6253215 10761081 10333600 4652338 -217830 -955489 -2640216
3153 -2640216 -10999608 -22148456 -25768855 -18170417 -7057919 -1869808 -3450485 -5738700
3145 -5738700 -4461118 -567029 3399853 6536633 8881793 10148797 10342600 10549852 12241998
3136 12241998 15712897 18957797 18394422 12087775 2667928 -4505895 -6614235 -4920391
3128 -4920391 -769924 6392921 14924521 18604861 12582136 49297 -10667785 -14515103
3120 -14515103 -12368474 -7662059 -4381714 -6134660 -12105659 -15394092 -10644774 -1979705
3112 -1979705 2439543 2233055 4013184 9553361 13350293 13022811 13048522 15223828 14267115
3103 14267115 7442488 408980 -1979346 -2886404 -5049234 -3027535 7301938 17707678
3095A7707678j260652j1600276r483635k49753N498264O972283Q503015Q692404
3087B4779328M037028k443309m873764k899268K0570K430020L609849J480852
3079B6141306l028174m922329l316866m143381r279507j0764962l207071N706984
3071f814000O181865J012527r46168J9917k304854o018409l512748L604789N065427
3062c711654j565260o742815l989221J247703J715831j196472j765375J657434
3054a4349829O637464J0259124R790974M148349k911775n046199p78877M595914
3046A2345145N597779J896152l020182n113378k374010K270748K320817l678624
3038A0244447p777448l063459M805053N177970p48966j679445N000941Q363965
$$ plain form
3095 17707678 16447026 4846750 -4636885 -4886638 611626 7583909 16086924 24779328
3087 24779328 28816356 26373047 21499283 18600015 18620585 21050605 24660454 26141306
3079 26141306 23113132 18190803 14873937 10730556 1451049 -9313913 -12520984 -6814000
3071 -6814000 -632135 380392 -565776 -545859 -2850713 -8869122 -12381870 -8777081 -3711654
3062 -3711654 -5276914 -12019729 -16008950 -14761247 -13045416 -14241888 -16007263 -14349829
3054 -14349829 -7712365 2546759 12337733 16486082 13574307 8528108 7749231 12345145
3046 12345145 17942924 19839076 16818894 11705516 9331506 11602254 13923071 10244447
3038 10244447 2466999 -596460 4208593 9386563 8637597 6958152 11959093 20323058
3030B0323058J386562q111230r987657n609839j909639J66749K852029L695097
3022B805130k35369m466322k391196L914886O172016J874462l470652n496496
3014a293541n536325n497591m110394n0473N056499Q216005P465570K736522l469417
3005C516855o930761n630177k041759N91303K622285N809159Q538456P241991
2997A3717352K145741k123290k235576K18569J462165r154k297201k449007J20408
2988H550007K370099R41018l093580n074094l140579o63773n49333p54282J325153
2979h9364L380945J692574k220826l687274k314693j657298j842976R40108O077017
2970B78213O406806j217097q486329n330780N305167R763022J591966r611387
$$ plain form
3030 20323058 21709620 13598390 3610733 -1999106 -3908745 -3741996 -889967 2805130
3022 2805130 2569761 -1896561 -4287757 -372871 5799145 7673607 4202955 -1293541
3014 -1293541 -6829866 -12327457 -16437851 -16488324 -11431825 -3215820 4249750 6986272 3516855
3005 3516855 -3413906 -9044083 -11085842 -10494539 -7872254 -2063095 6475361 13717352
2997 13717352 15863093 13739803 11504227 11722796 13184961 13175807 10878606 8429599 8550007
2988 8550007 10920106 11861124 8767544 3693450 552871 -110902 -660235 -1414517 -89364
2979 -89364 3291581 4984155 2763329 -923945 -3238638 -4895936 -6738912 -5798804 278213
2970 278213 6685019 5467922 -3018407 -8349187 -3044020 6719002 8310968 -1300419
2962a300419j0901204k247421N681071O752856M779953L944972K217469k176369
2954F750908m749068j348170L798395L489417j798522n613565n911746o098329
2946a1480680o461786k935312M339831R030830P714328M099958J452882k237899
2938C522152p905385j0931793p754148j484053L392867O485987P625358M119818
2930b929197k662231m745143J322606O988355L803007k578548q29581P592424
2922E961692J0406439L733368l051833l500277l289804q292531j3196383r496301
2914b0725630J160611R083844R000679M285861K28831j605719k043709j275056
2906a890288R13696L193682L027087L6736k093845J59781M102785L293430k350001
$$ plain form
2962 -1300419 -12201623 -14449044 -8767973 -2015117 2764836 6709808 8927277 6750908
2954 6750908 2001840 653670 4452065 7941482 6142960 529395 -5382351 -11480680
2946 -11480680 -17942466 -20877778 -16537947 -7507117 207211 4307169 5760051 3522152
2938 3522152 -4383233 -15315026 -23069174 -24553227 -21160360 -14674373 -7049015 -2929197
2930 -2929197 -5591428 -10336571 -9013965 -2025610 1777397 -801151 -1630732 5961692
2922 5961692 16368131 20101499 17049666 13549389 10259585 1967054 -11229329 -20725630
2914 -20725630 -19565019 -10481175 -1480496 2805365 3034196 1428477 -615232 -1890288
2906 -1890288 -976592 2217090 5244177 5280913 3187068 3346849 7449634 10743064 8393063
2897H393063m561670J024050O612284L346432m290117m989884J186799K870419
2889I591376l866612r014381m773980K882943N139465L334252K936362K312189
2881H541614k672007q044780o268932R73445M429343J256957j796064k24496J908926
2872a895994M61346j485860L24382L396463K552855j047402j134560L947200Q266932
2863A3385362O598077J355560j831654k499151m706113q840963r452820l373411
2855i365113M303338O304465K651426m73905J6095R56337q46502l926572n162264
2846e542695l975553j881964l38299j03218n57394O58474M753960Q597422P653734
2837I264467K215532k838257m553049m120342k613847M26014L416400L316500
$$ plain form
2897 8393063 3831393 4855443 11467727 14814159 10524042 5534158 6720957 9591376
2889 9591376 5724764 -3289617 -8063597 -5180654 -41189 3293063 6229425 8541614
2881 8541614 5869607 -2175173 -8444105 -7470660 -3041317 -1784360 -3580424 -3804920 -1895994
2872 -1895994 -1434648 -2920508 -2596126 800337 3353192 2305790 1171230 5118430 13385362
2863 13385362 19983439 21338999 19507345 17008194 12302081 3461118 -5991702 -9365113
2855 -9365113 -5061775 1242690 3894116 3420211 3436306 4392643 3546141 -380431 -5542695
2846 -5542695 -9518248 -11400212 -11738511 -11841729 -12399123 -11740649 -6986689 1610733 9264467
2837 9264467 11479999 8641742 4088693 -31649 -2645496 -2219482 1196918 4513418
2829D513418J307176K080321N377900M681250k325889q553781p526844k537164
2821b983613J04015J366910N527888R864109O944537l821753j4130848j6529565
2813a3658320j0997149k172777N100941P703972N857492K595816p27321n658268
2805a1955614j0397696p624716N049262J7111984J6448653N861324j293075k88643
2797A2911479J095995j938947m036059j429930N32161k369744n123193k941417
2789c299655m93706l092853n659541o64369P671338Q257255K57568n659813l722510
2780f406286k61842j476805l339521L42640O356324O182974j167981p546311o814430
2771a4131238j817263J440415J908645K359269L009173J086209l279680n236005
$$ plain form
2829 4513418 5820594 7900915 13278815 17960065 15634176 7080395 -446449 -2983613
2821 -2983613 -2879598 -1512688 4015200 13879309 20823846 17002093 2871245 -13658320
2813 -13658320 -24655469 -26828246 -21727305 -14023333 -8165841 -5570025 -6297346 -11955614
2805 -11955614 -22353310 -29978026 -24928764 -7816780 8631873 14493197 13200122 12911479
2797 12911479 14007474 12068527 8032468 6602538 7134699 4764955 -358238 -3299655
2789 -3299655 -3793361 -6886214 -12545755 -13210124 -5538786 2718469 2976037 -2683776 -6406286
2780 -6406286 -6668128 -8144933 -11484454 -11141814 -4785490 1397484 229503 -7316808 -14131238
2771 -14131238 -15948501 -14508086 -12599441 -10240172 -7230999 -6144790 -9424470 -14660475
2763a4660475j560809M163700N924259L014649j90562j148009j583812k853914
2755h894973l354239k229469j773812l411895m196541n80175O033190J0549818
2747g858096J0060288N954616J032673k882838m681758l724960o36630K606095
2739a30610L780764J828392j889335l859357j906266J148302O41n608721q987182
2730a5623372m867421K917331O034683K450832j787493j398229J895655L179487
2722g198527P99616l082371n939772o611180m981319j894689J227124L774866
2714b3906252O139212P800855O806914K719229j244058j382812J508125K804990
2706A246203K65840k783976k100335J449628L190166J416580l25539J137519L507239
$$ plain form
2763 -14660475 -16221284 -12057584 -6133325 -3118676 -3309238 -4457247 -6041059 -8894973
2755 -8894973 -12249212 -14478681 -16252493 -19664388 -23860929 -24441104 -18407914 -7858096
2747 -7858096 2202192 8156808 9189481 6306643 1624885 -2100075 -2736705 -130610
2739 -130610 3650154 5478546 3589211 -270146 -2176412 -1028110 -1027469 -6636190 -15623372
2730 -15623372 -20490793 -17573462 -11538779 -9087947 -10875440 -12273669 -10378014 -7198527
2722 -7198527 -6398911 -9481282 -15421054 -22032234 -27013553 -28908242 -27681118 -23906252
2714 -23906252 -17767040 -9966185 -3159271 -440042 -1684100 -3066912 -1558787 1246203
2706 1246203 1512043 -1271933 -3372268 -1922640 1267526 2684106 2358567 3496086 7003325
2697G003325K226796k572840n611554l263829J847038M307880K186122j705811
2689D417127l787860l316919k120968j848794k031025r14850J901252M312042
2681c389995L860108O45081k760526l954871k410766Q09283L695091M205386K281634
2672B980425P07493K180868N708445P770910O720155L726886j70402m666570p584147
2663A7374063n664111K90182M512807K994257j702061m915744o219697p683044
2655a013348q242963m733374J887486O022653M475813O14889n60879P18917j89695
2646a020501n060885q908918n335240M654128J1799705Q613913j284742p184223
2638c726763m350407R61072P94213m374682p768741n500477J20420M744085N926566
$$ plain form
2697 7003325 9230121 6657281 1045727 -2218102 -371064 3936816 6122938 4417127
2689 4417127 629267 -2687652 -4808620 -6657414 -8688439 -9603289 -7702037 -3389995
2681 -3389995 470113 1115194 -1645332 -5600203 -8010969 -7201686 -3506595 698791 2980425
2672 2980425 3687918 5868786 11577231 19348141 26068296 29795182 29624780 24958210 17374063
2663 17374063 11709952 12000134 16512941 19507198 17805137 12889393 6669696 -1013348
2655 -1013348 -9256311 -13989685 -12102199 -6079546 -1603733 -988844 -1549723 -830806 -1020501
2646 -1020501 -6081386 -14990304 -20325544 -15671416 -3871711 4742202 3457460 -3726763
2638 -3726763 -8077170 -7116098 -6321885 -10696567 -18465308 -23965785 -23845365 -19101280 -13174714
2629a3174714L811474P00861p71892j006767l274755p937204r529629l550728
2621c4733354N854547R947855O454224J627545J049543L300253M232318L270957
2613A003888K880159M272646N940950N455272J983853k043721k449055J565377
2605A8609369M902494K307177m145543p255408m368153m28424l84597k898459
2597F338456l688896j605690J146865K377901J395738r57128k355693j044955
2589A606598J324213J344555j046982k246260o84082Q16719N5825q61835P19669
2580A028420L731498N472748N211130L156984j338035p548444j1591177r971562
2572a1848438l649001L305144P349336O606054J435160m201774n276829j945759
$$ plain form
2629 -13174714 -9363240 -8662379 -9434271 -10441038 -13715793 -21652997 -31182626 -34733354
2621 -34733354 -28878807 -18930952 -12476728 -10849183 -9799640 -6499387 -2267069 1003888
2613 1003888 3884047 8156693 14097643 19552915 21536768 19493047 17043992 18609369
2605 18609369 23511863 25819040 21673497 14418089 10049936 9621512 9236915 6338456
2597 6338456 2649560 1043870 2190735 4568636 5964374 5007246 2651553 1606598
2589 1606598 2930811 4275366 3228384 982124 298042 1114761 1170586 308751 1028420
2580 1028420 4759918 10232666 15443796 18600780 17262745 9714301 -1876876 -11848438
2572 -11848438 -15497439 -12192295 -4842959 1763095 3198255 -1003519 -6280348 -8226107
2564h226107K07922j454570k572184K54569K587636q18285o082871m904973K447933
2555a8560930O590119K056120n606313p552622j612454P207268J2483312J1280697
2547F285197O133079K698119L265360L760438K78976l847764k845138J549144
2539A7277411K087888k278460m734740k279734p83483m522296q200822n266322
2531h700558J575754M897810L569561K184228J981226k77935m742981o464825
2523e977720k602317K977706M481853R22308l500630m232724q27852K617399J828140
2514d313837k145888l338271J633842Q387960R731937M410992k094557m560178
2506G712000k641433Q70320K989878J708682k524332o034696n510981k700826
$$ plain form
2564 -8226107 -8018185 -9472755 -12044939 -11790370 -9202734 -10021019 -16103890 -21008863 -18560930
2555 -18560930 -11970811 -9914691 -15521004 -23073626 -24686080 -17478812 -4995500 6285197
2547 6285197 12418276 15116395 18381755 22142193 22421169 18573405 15728267 17277411
2539 17277411 19365299 17086839 12352099 10072365 9288882 4766586 -3434236 -8700558
2531 -8700558 -7124804 -2226994 1342567 3526795 5508021 5230086 487105 -5977720
2523 -5977720 -8580037 -5602331 -1120478 -198170 -3698800 -7931524 -8759376 -6141977 -4313837
2514 -4313837 -6459725 -9797996 -8164154 223806 9955743 14366735 12272178 7712000
2506 7712000 5070567 5940887 8930765 10639447 8115115 2080419 -3430562 -6131388
2498f131388k385958n133496n873930j465172L987014M531522N61998k276335
2490a4185745j128038J329145K316913K814637L997634L348982j886971q871522
2482a2264965j1029267o200012O63531M301007N181016O208239O633900L658604
2474b847947j333965l198807k86108L015754K544458m21580k281475k329815k144684
2465i284169j980437p05686J728280L984244M877580L982660J808509J95141P24207
2456E330329J813073j33181n193478q339314n652466K55819L533573J752765k887674
2447i520554o618800o162450p36713N353286N657655L65123k194022K539890O895497
2438d421088J667998q584468j0577706j573146O638307M784596k381670n495197
$$ plain form
2498 -6131388 -8517346 -13650842 -19524772 -20989944 -17002930 -12471408 -11909410 -14185745
2490 -14185745 -15313783 -13984638 -11667725 -8853088 -4855454 -1506472 -3393443 -12264965
2482 -12264965 -23294232 -29494244 -28830713 -24529706 -19348690 -13140451 -6506551 -2847947
2474 -2847947 -4181912 -7380719 -7666827 -4651073 -2106615 -2528195 -4809670 -7139485 -9284169
2465 -9284169 -11264606 -11970292 -10242012 -6257768 -1380188 2602472 4410981 4606122 5330329
2456 5330329 7143402 7010221 1816743 -6522571 -12175037 -11919218 -8385645 -6632880 -9520554
2447 -9520554 -16139354 -22301804 -23038517 -17685231 -12027576 -11662453 -13856475 -11316585 -4421088
2438 -4421088 -2753090 -11337558 -21915264 -23488410 -16850103 -12065507 -14447177 -19942374
2430a9942374l276844m23141Q44538J181209N49636m03872J037372N125690P295273
2421h012513M654584J009365P88125J961858M76962j907523o51497L173522M168915
2412E661798J015506k530746m199039m801897l805951M63953N690174O450572
2404C944370J687097l389695m255311j921708K86795J023424P87018O44850J828704
2395F35544L953399M053662O67199k265291j33176M618130N090985J02748m458825
2386A2264375n074117m657258n502759n145798k299995m33388j535276k231855
2378a4616071l80331L41608k451714l771234J409118R234020J2150011R538573
2370A1453980O440037M672116K318851k46242j173943k331455o220197q936033
$$ plain form
2430 -19942374 -23219218 -23642359 -22797821 -21616612 -21066976 -21470848 -20433476 -15307786 -8012513
2421 -8012513 -3357929 -2348564 -1560439 401419 878381 -1029142 -1680639 1492883 5661798
2412 5661798 6677304 4146558 -52481 -4854378 -8660329 -8196376 -2506202 3944370
2404 3944370 5631467 2241772 -2013539 -3935247 -3648452 -2625028 -1838010 -1193160 635544
2395 635544 4588943 8642605 9309804 7044513 6911337 11529467 16620452 16723200 12264375
2386 12264375 7190258 2533000 -2969759 -8115557 -10415552 -10848940 -12384216 -14616071
2378 -14616071 -14996402 -14654794 -17106508 -20877742 -19468624 -10234604 1915407 11453980
2370 11453980 17894017 22566133 24884984 24638742 23464799 21133344 14913147 5977114
$$ [...]
##END NTUPLES=NMR SPECTRUM
##END=
