##TITLE=31Pdec_DE-80Wnk
 D2O, 64 sc
 29.1.2025
##JCAMPDX= 6.0         $$ Bruker NMR JCAMP-DX V2.0
##DATA TYPE= NMR SPECTRUM
##DATA CLASS= NTUPLES
##ORIGIN= UXNMR, Bruker Analytische Messtechnik GmbH
##OWNER= root
$$ XWIN-NMR		Version 3.5
$$ Thu Jan 30 15:14:28 2025 Russian Standard Time (UT+4h)  she@DPX200
##.OBSERVE FREQUENCY= 81.013821
##.OBSERVE NUCLEUS= ^31P
##.ACQUISITION MODE= SIMULTANEOUS
##.ACQUISITION SCHEME= undefined
##.AVERAGES= 64
##.DIGITISER RES= 17
##SPECTROMETER/DATA SYSTEM= spect
##.PULSE SEQUENCE= zgpg30
##.SOLVENT NAME= CDCl3
##.SHIFT REFERENCE= (INTERNAL, CDCl3, 0, 198.062)
##AUDIT TRAIL= $$ (NUMBER, WHEN, WHO, WHERE, WHAT)
$$ ##TITLE= Audit trail, XWIN-NMR		Version 3.5
$$ ##JCAMPDX= 5.01
$$ ##ORIGIN= Bruker BioSpin GmbH
$$ ##OWNER= she
$$ F:/spectra/data/she/nmr/P31/2/pdata/1/auditp.txt
$$ ##AUDIT TRAIL=  $$ (NUMBER, WHEN, WHO, WHERE, WHAT)
(   1,<2025-01-30 15:13:27.10 +0400>,<she>,<DPX200>,
      <created by zg, POWCHK disabled, PULCHK disabled
       configuration hash MD5:
       00 E9 B6 7A A2 85 ED C7 34 08 36 98 17 FE 4E 26
       data hash MD5: 32K
       79 3E 5A 36 E3 A5 D3 96 A1 2B BD 55 D5 A5 3A E2>)
(   2,<2025-01-30 15:13:30.06 +0400>,<she>,<DPX200>,
      <Start of raw data processing
       efp BC_mod = 2 LB = 1.5 FT_mod = 6 PKNL = 1 PHC0 = 1755.047 PHC1 = 15.69061 SI = 64K 
       data hash MD5: 64K
       AA D6 A4 82 E6 4D 8D 90 25 35 78 19 09 DD A6 F7>)
(   3,<2025-01-30 15:13:53.95 +0400>,<she>,<DPX200>,
      <pk PHC0 = -44.54713 PHC1 = 145 
       data hash MD5: 64K
       B2 E9 ED 19 5F 02 D2 AE BE 3A 38 EF C4 04 6B A8>)
(   4,<2025-01-30 15:14:02.15 +0400>,<she>,<DPX200>,
      <abs ABSG = 5 
       data hash MD5: 64K
       D7 B1 6B 3E C6 E7 0F 5A C7 55 C6 E6 FE E3 AF 56>)
$$ ##END=
$$ 
$$ hash MD5
$$ 8A 6D 62 6D 56 E5 C5 A0 BB AD 73 4F 16 D7 7F D1
##$RELAX= 
##$RELAX= 
##$RELAX= 
##$RELAX= 
##$RELAX= 
##$RELAX= 
##$RELAX= 
##$RELAX= 
$$ Bruker specific parameters
$$ --------------------------
##$DU= <F:/spectra>
##$EXPNO= 2
##$NAME= <P31>
##$PROCNO= 1
##$TYPE= <nmr>
##$USER= <she>
##$AMP= (0..31)
100 100 100 100 100 100 100 100 100 100 100 100 100 100 100 100 100 100 
100 100 100 100 100 100 100 100 100 100 100 100 100 100 
##$AQSEQ= 0
##$AQ_mod= 1
##$AUNM= <au_zg>
##$AUTOPOS= <>
##$BF1= 81.014009
##$BF2= 200.13
##$BF3= 200.13
##$BF4= 200.13
##$BF5= 200.13
##$BF6= 200.13
##$BF7= 200.13
##$BF8= 200.13
##$BYTORDA= 1
##$CFDGTYP= 0
##$CFRGTYP= 5
##$CHEMSTR= <none>
##$CNST= (0..31)
1 1 145 1 1 1 1 1 1 1 1 1 1 1 1 1 1 1 1 1 1 1 1 1 1 1 1 1 1 1 1 1 
##$CPDPRG= <waltz16>
##$CPDPRG1= <>
##$CPDPRG2= <waltz16>
##$CPDPRG3= <>
##$CPDPRG4= <mlev>
##$CPDPRG5= <mlev>
##$CPDPRG6= <mlev>
##$CPDPRG7= <mlev>
##$CPDPRG8= <mlev>
##$CPDPRGB= <>
##$CPDPRGT= <>
##$D= (0..31)
0 1 0 0 0 0 0 0 0 0.06 0 0.03 2e-05 3e-06 0 0 0.0002 0 0 0 0 0 0 0 0 0 
0 0 0 0 0 0 
##$DATE= 1738235606
##$DBL= (0..7)
120 120 120 11 120 120 24 19 
##$DBP= (0..7)
150 150 150 150 150 150 150 150 
##$DBP07= 0
##$DBPNAM0= <>
##$DBPNAM1= <>
$$ [...]
##$SUBNAM3= <"">
##$SUBNAM4= <"">
##$SUBNAM5= <"">
##$SUBNAM6= <"">
##$SUBNAM7= <"">
##$SUBNAM8= <"">
##$SUBNAM9= <"">
##$SW= 400.765351723535
##$SWIBOX= (0..15)
0 1 3 0 0 0 0 0 0 0 0 0 0 0 0 0 
##$SW_h= 32467.5324675325
##$TD= 32768
##$TD0= 1
##$TE= 0
##$TE2= 300
##$TE3= 300
##$TEG= 300
##$TL= (0..7)
0 120 53 12 22 120 120 120 
##$TP= (0..7)
150 150 150 150 150 150 150 150 
##$TP07= 0
##$TPNAME0= <>
##$TPNAME1= <>
##$TPNAME2= <>
##$TPNAME3= <>
##$TPNAME4= <>
##$TPNAME5= <>
##$TPNAME6= <>
##$TPNAME7= <>
##$TPOAL= (0..7)
0.5 0.5 0.5 0.5 0.5 0.5 0.5 0.5 
##$TPOFFS= (0..7)
0 0 0 0 0 0 0 0 
##$TUNHIN= 0
##$TUNHOUT= 0
##$TUNXOUT= 0
##$USERA1= <user>
##$USERA2= <user>
##$USERA3= <user>
##$USERA4= <user>
##$USERA5= <user>
##$V9= 5
##$VALIST= <valist>
##$VCLIST= <CCCCCCCCCCCCCCC>
##$VD= 0
##$VDLIST= <DDDDDDDDDDDDDDD>
##$VPLIST= <PPPPPPPPPPPPPPP>
##$VTLIST= <TTTTTTTTTTTTTTT>
##$WBST= 1024
##$WBSW= 4
##$XGAIN= (0..3)
0 0 0 0 
##$XL= 0
##$YL= 0
##$YMAX_a= 8773
##$YMIN_a= -10225
##$ZGOPTNS= <>
##$ZL1= 120
##$ZL2= 120
##$ZL3= 120
##$ZL4= 120
##$ABSF1= 198.0616
##$ABSF2= -202.7028
##$ABSG= 5
##$ABSL= 3
##$ALPHA= 0
##$AQORDER= 0
##$ASSFAC= 0
##$ASSFACI= 0
##$ASSFACX= 0
##$ASSWID= 0
##$AUNMP= <proc_1d>
##$AZFE= 0.1
##$AZFW= 0.5
##$BCFW= 0
##$BC_mod= 2
##$BYTORDP= 0
##$COROFFS= 0
##$CY= -3
##$DATMOD= 1
##$DC= 0
##$DFILT= <>
##$DTYPP= 0
##$F1P= 0
##$F2P= 0
##$FCOR= 1
##$FTSIZE= 65536
##$FT_mod= 6
##$GAMMA= 0
##$GB= 0
##$INTBC= 1
##$INTSCL= 9.790993e-09
##$ISEN= 30
##$LB= 1.5
##$LEV0= 0
##$LPBIN= 0
##$MAXI= 10000
##$MC2= 0
##$MEAN= 0
##$ME_mod= 0
##$MI= 50
##$NCOEF= 0
##$NC_proc= -8
##$NLEV= 6
##$NOISF1= 182.463
##$NOISF2= 159.3651
##$NSP= 0
##$NTH_PI= 0
##$NZP= 0
##$OFFSET= 198.0616
##$PC= 4
##$PHC0= 1710.5
##$PHC1= 160.6906
##$PH_mod= 1
##$PKNL= yes
##$PPARMOD= 0
##$PSCAL= 0
##$PSIGN= 0
##$REVERSE= no
##$SF= 81.0140089999434
##$SI= 65536
##$SIGF1= 159.3651
##$SIGF2= -187.1042
##$SINO= 113.3802
##$SIOLD= 16384
##$SREGLST= <1H.CDCl3>
##$SSB= 0
##$STSI= 65536
##$STSR= 0
##$SW_p= 32467.5324675325
##$SYMM= 0
##$S_DEV= 0
##$TDeff= 32768
##$TDoff= 0
##$TI= <>
##$TILT= no
##$TM1= 0
##$TM2= 0
##$TOPLEV= 0
##$USERP1= <user>
##$USERP2= <user>
##$USERP3= <user>
##$USERP4= <user>
##$USERP5= <user>
##$WDW= 1
##$XDIM= 65536
##$YMAX_p= 254949506
##$YMIN_p= -205245670
$$ End of Bruker specific parameters
$$ ---------------------------------
##NTUPLES= NMR SPECTRUM
##VAR_NAME=  FREQUENCY,     SPECTRUM/REAL,   SPECTRUM/IMAG
##SYMBOL=    X,             R,               I
##VAR_TYPE=  INDEPENDENT,   DEPENDENT,       DEPENDENT
##VAR_FORM=  AFFN,          ASDF,            ASDF
##VAR_DIM=   65536,         65536,           65536
##UNITS=     HZ,            ARBITRARY UNITS, ARBITRARY UNITS
##FACTOR=    0.49542278885378, 1,            1
##FIRST=     16045.7642231865, 0,            0
##LAST=      -16421.768244346, 0,            0
##MIN=       -16421.768244346, -205245670,   0
##MAX=       16045.7642231865, 254949506,    0
$$ Real data points
##PAGE= N=1
##DATA TABLE= (X++(R..R)), XYDATA
$$ [...]
42623C665244j627723l044505q38171J014008l48148k286727j419104J349166
42615c535960L073818L005165K174050J098976L6078l75294m25996j451876l214029
42606C84932l310163q52837J489501J178767m73091o10599Q40824J742538J390380
42597A780252R53185J003403R96977P13461J47001j373457l812893m953798k839388
42588g385257P45912J993482K82411j082664K57040K854011M308212M325209L560965
42579I859321J795761q39484k590339k110307n95057j0432k36159P82K08296j347225
42569D135157m216424n326913k928643P26062J988840J75289k007072k032595
42561i486299k88953J055868R70109M09259L94409L64471o38092j676868m40344
$$ y = [3665244, 2037521, -1006984, -1845155, -831147, -1179295, -3466022, -4885126, -3535960, -462142, 2543023, 4717073, 5816049, 5852127, 5476833, 5050837, 3598961, 384932, -2925231, -3778068, -2288567, -1109800, -1582891, -2193490, -1352666, 389872, 1780252, 2733437, 3736840, 4733817, 5447278, 5594279, 4220822, 407929, -4545869, -7385257, -6639345, -4645863, -4363452, -5446116, -5189076, -2335065, 1973147, 6298356, 9859321, 11655082, 10815598, 8225259, 6114952, 5519895, 5509463, 5273304, 5274086, 5482382, 4135157, -81267, -5408180, -8336823, -7610761, -5621921, -5446632, -7453704, -9486299, -9775252, -8719384, -7749275, -7340016, -6945607, -6581136, -7219228, -8896096, -9336440]
42552i336440L281344O005226M105068j376949n210715l802230P91088L600814
42544a942794K488200k47040j560865j230736j094987j950113k516226j324234
42536i378795J360109L775213M303883K711384K65003j153591o09799P97813R04883
42527B976103r08023k557725j612721J384754L089963J219075k694998n100665
42519d204237m312439j700266O04895J983627K959415L483111K626375J41185
42511A581666k349016k552036j57462K359078K392855M19463n87873Q36249K599977
42502D542901J953344p49648k773901k799331k007804j458650o29616O78702J131289
42493b112714J08184n01729J145083L579831L766580J639399J00946J75814p43636
$$ y = [-9336440, -6055096, -49870, 4055198, 2678249, -2532466, -6334696, -5543608, -1942794, 545406, 298366, -1262499, -2493235, -3588222, -5538335, -8054561, -9378795, -8018686, -4243473, 60410, 2771794, 3036797, 1883206, 1273407, 2071220, 2976103, 2068080, -489645, -2102366, -717612, 2372351, 3591426, 896428, -4204237, -8516676, -10216942, -9612047, -7628420, -4669005, -1185894, 1440481, 1581666, -767350, -3319386, -3476848, -1117770, 1275085, 1694548, 1106675, 1942924, 4542901, 6496245, 5746597, 2972696, 173365, -1834439, -3293089, -3922705, -3244003, -2112714, -2004530, -2506259, -1361176, 2218655, 5985235, 7624634, 7725580, 7901394, 7157758]
42484G157758m202529o959975m949542M21639L473108J859461m34086Q58341M133084
42475A357259M570025J286470j646156j325718K06631k25232j971878j979488
42467B71913J52848J443851j72876l295725n359094n330169l235483P37854M964310
42458i822571O120207K765259j747327k631215K92611K583235J440844r32300
42450a931257j341996j47676L80241J40500P52603K076841K185644P08471n15071
42441B308300n94653r23915k374398l354087k207614R3851J464291J738527K201112
42432a648586K778274J987193j49093j269264J94226K452678K365250n79538l661532
42423B469608m317562k922631j643187j451960j439893q79116n56135j273923
$$ y = [7157758, 2955229, -4004746, -8954288, -8532649, -5059541, -3200080, -3634166, -2775825, 1357259, 5927284, 7213754, 5567598, 4241880, 4448511, 4223279, 2251401, 271913, 424761, 1868612, 1695736, -1599989, -6959083, -12289252, -15524735, -14786881, -9822571, -3702364, -937105, -2684432, -5315647, -5023036, -2439801, -998957, -1931257, -3273253, -3420929, -3040688, -2900188, -2147585, -70744, 2114900, 2823371, 2308300, 1713647, 789732, -1584666, -4938753, -7146367, -7052516, -5588225, -3849698, -1648586, 1129688, 3116881, 2967788, 1698524, 1892750, 4345428, 6710678, 6131140, 2469608, -1847954, -4770585, -6413772, -7865732, -9305625, -10184741, -10740876, -12014799]
42415a2014799j970461p27394K415577M936267M605991J933786o85162j527119
42407c033314o72796O69725J156402J52462j513897j955165k17770K368530L632209
42398E86386L069598J980767J333349P03585m66249j682611k026508j263828J14879
42389B349368J413316J963252J387814k1093j545092k722565l336205k953390
42381c464595j437718J01748J24153j197658j865848p17973R80633J470259R43032
42372e063967R25028J972453L114073L137250J643569n89811j746627n10863J820878
42363D701983K235101J35532j247548N43206L082614K415023r00142k737219j761843
42354F466707o59875o91130M20922L458335M828044J701757l151541n063329l619444
$$ y = [-12014799, -13985260, -14712654, -12297077, -7360810, -2754819, -821033, -1506195, -3033314, -3706110, -3036385, -1879983, -1727521, -3241418, -5196583, -5414353, -3045823, 586386, 3655984, 5636751, 6970100, 7673685, 7207436, 5524825, 3498317, 2234489, 2349368, 3762684, 5725936, 7113750, 7092657, 5547565, 2825000, -511205, -3464595, -4902313, -4800565, -4676412, -5874070, -7739918, -8457891, -7477258, -6006999, -5063967, -4138939, -2166486, 947587, 4084837, 5728406, 5138595, 3391968, 2881105, 4701983, 6937084, 7072616, 5825068, 6368274, 9450888, 11865911, 10965769, 8228550, 6466707, 5806832, 5115702, 5536624, 8994959, 13823003, 15524760, 12373219, 7309890, 3690446]
42345C690446j692839m47890P18562P51490j975988n431363n210284q18473L159229
42336g257110L400688J882379J850832K927113K730901J107048j00293k68778
42328F272780m37980j063902j457636j327891j149039q89323J55152J813359K406832
42319D322352N03574k951431m967141l430413M60574L346843L391143J831010
42311B506511M81754o91554k154886k656683j016184R55097M64946j601065j575236
42302e287300R50831J900492q62116l730141k789811J99513J057479Q4631J109963
42293g366459M490973N786951K261941l034469n360221l860333j283240J2988
42285h351869j08556o75189q53396l48156M49600Q34450P96801J302965K990232
$$ y = [3690446, 1997607, 1549717, 2268279, 3019769, 1043781, -4387582, -9597866, -10416339, -7257110, -3856422, -1974043, -123211, 2803902, 5534803, 6641851, 6541558, 6272780, 5834800, 4770898, 3313262, 1985371, 836332, -52991, 102161, 1915520, 4322352, 4825926, 1874495, -3092646, -6523059, -6062485, -2715642, 675501, 2506511, 2988265, 2296711, 141825, -2514858, -3531042, -2575945, -2110999, -3712064, -5287300, -4336469, -2435977, -3298093, -7028234, -9818045, -9618532, -8561053, -8476422, -7366459, -2875486, 2911465, 5173406, 2138937, -3221284, -7081617, -8364857, -8351869, -8460425, -9135614, -9989010, -10337166, -9887566, -9053116, -8256315, -6953350, -3963118]
42276c963118M819143M786907K359302k75142l56826J771715K420888p58884m970803
42267E833182n436083j909924R74782L74424j161988m30565J386307J262079o51197
42258B41017j962349k162289k169574j182544J937390M854118L670897j060729
42250B165937m195890k706401Q74937K649926J802068j81703j686686j240990
42242b518802J498099L987655L016509l55506j531380O53408J735491j288767
42234E196707m760855l867548r4050J325352n69452j720129K82956L075671L533738
42225B402390J629841n50599j332660l76001J176214J261972q18405k842633k103967
42216a553848Q46477K825774K269738P68844J23460p5931j153455l122635m631741
$$ y = [-3963118, 856025, 5642932, 8002234, 7727092, 7370266, 9141981, 11562869, 10803985, 5833182, 397099, -1512825, -538043, -163619, -1325607, -1756172, -369865, 892214, 241017, -1721332, -3883621, -6053195, -7235739, -5298349, -444231, 3226666, 2165937, -2029953, -4736354, -3861417, -1211491, 590577, 408874, -1277812, -2518802, -1020703, 2966952, 5983461, 5627955, 4096575, 4749983, 6485474, 5196707, 435852, -3431696, -3525746, -2200394, -2769846, -4489975, -4207019, -1131348, 2402390, 4032231, 3481632, 2148972, 1772971, 2949185, 4211157, 3392752, 550119, -1553848, -707371, 2118403, 4388141, 5156985, 5280445, 5204514, 4051059, 928424, -3703317]
42207c703317m322129j848655J715711M308209M408546K312138m27494k429856
42199A3153k962073j878444l5911R63011M76558l99092o29639p13304j137014
42190f302755p55595J338512L402756K918209L68889j329835j065694o37577j245472
42181c308562j389101N92266L709837N407266M394868J402727k073544m837127
42173C898630o153775n535815k745205J443770M511919L761813j86397k867868
42165c872928r52909L147964M054750L57300l878385m657385k346899L17022J859974
42156e971496K255691J561956K14891n15056J13833J259934J785329J650678J151905
42147C507665l8166j851506k877270j920500P4117J101519Q34045Q49740J970474
$$ y = [-3703317, -8025446, -9874101, -8158390, -3850181, 558365, 2870503, 2443009, 13153, -2948920, -4827364, -4863275, -3900264, -3423706, -3822798, -4452437, -5165741, -6302755, -7058350, -5719838, -2317082, 601127, 970016, -359819, -1425513, -2063090, -3308562, -4697663, -4105397, -395560, 5011706, 9406574, 10809301, 8735757, 3898630, -2255145, -7790960, -10536165, -9092395, -4580476, -818663, -1005060, -3872928, -4825837, -1677873, 2376877, 2734177, -1144208, -5801593, -8148492, -7831470, -5971496, -3715805, -2153849, -1938958, -2454014, -2340181, -1080247, 705082, 2355760, 3507665, 3469499, 1617993, -1259277, -3179777, -3105660, -2004141, -1170096, -320356, 1650118]
42138A650118K739795J428300j188383k357942q60020J177371R35925j379141
42130B146023k970446k305542o77969L28135Q15838J183374R22751J60123L03908
42121i3805J483252J515135n15874k027293r86548K92211j003068k827237j430687
42112e593914J737230J846603j073488j792222J361079L491283J138843k268447
42104a153033k276964m2428Q26482K82860M31914R53649K31872q95841m46095
42095b087584J040976J510554P94026L7389q12884k042725k274486n92225R58609
42086c468350J35643j685845j671253p8422P09815L75461L70362O31822K40824
42077d439943K57492K051829L773626K587828l32190j405524o73591j404778l686345
$$ y = [1650118, 4389913, 5818213, 4629830, 2271888, 1411868, 2589239, 3525164, 2146023, -824423, -3129965, -3807934, -3479799, -2663961, -1480587, -557836, -397713, -93805, 1389447, 2904582, 2388708, 361415, -625133, -332922, -1335990, -4163227, -5593914, -3856684, -2010081, -3083569, -4875791, -3514712, -23429, 1115414, -1153033, -3429997, -3472425, -2645943, -2363083, -1931169, -977520, -745648, -1641489, -2087584, -1046608, 463946, 1257972, 1295361, 482477, -1560248, -3834734, -4426959, -3468350, -3332707, -5018552, -6689805, -6768227, -6058412, -5682951, -5312589, -4680767, -4439943, -4182451, -2130622, 1643004, 4230832, 3898642, 2493118, 1819527, 414749, -3271596]
42068c271596l645406r7852K979872K441837J49274q69453n49002Q5542J292180
42059a484604K730791K458224K11493j262261l99571O86344J78855k74753Q96936
42050C741454J799154N54337q53256j2371J334576L94877j325018o04860J279568
42041F308461L53785k805488l392601m17225J305397j020018l626272k462263
42033e756224L92742N81086j463119j887933o7268Q69422k53144q70587N52148
42024g902877J756987N03973j708086k052934n67967N66141O94832R66972J451657
42015f291302P32457j227739k220312q09067J618579K991745L156555K939181
42007H90097K049636j75533k713776l462986j776762R80269L187415M063749L434398
$$ y = [-3271596, -6917002, -7014854, -4034982, -1593145, -1443871, -2313324, -2862326, -2776784, -1484604, 1246187, 3704411, 3915904, 2653643, 2254072, 2940416, 3119271, 2844518, 3741454, 5540608, 6094945, 5241689, 5229318, 6563894, 6958771, 5633753, 5028893, 6308461, 6662246, 3856758, 464157, 46932, 1352329, 332311, -3293961, -5756224, -5363482, -4782396, -6245515, -8133448, -8200716, -7331294, -7584438, -8455025, -7902877, -6145890, -5641917, -7350003, -9402937, -9970904, -9404763, -8709931, -7742959, -6291302, -5558845, -6786584, -9006896, -9815963, -8197384, -5205639, -2049084, 890097, 2939733, 2764200, 50424, -3412562, -5189324, -4209055, -1021640, 3042109, 6476507]
41998F476507J808698L95467k76550j252687l153930m067140j751651K314150
41990D92864L871522J463200j555515j775028q8439N06683m89363j052200j98365
41981A175359Q18921Q34189M49349Q37856J881690K190613Q28797j339825k474592
41972E202357k076510j636160k147834k077243L50393L537043L854343Q35915
41964E842304j797750j353254K93511J26362j380273j475820N34050K645751L098579
41955F533460J970235L79128l83649L43718J366502L70490k618409m039956j242179
41946B679340L181692M223910R59174k614019l123947j471635m36275r97596k021503
41937C79141k059937o38770J316324K072786Q75764j155014k743977m077949n225114
$$ y = [6476507, 8285205, 8680672, 8404122, 7151435, 3997505, -69635, -1821286, 492864, 4364386, 5827586, 4272071, 2497043, 2408604, 2915287, 2425924, 1373724, 1175359, 1994280, 2828469, 3277818, 4115674, 5997364, 8187977, 9016774, 7676949, 5202357, 3125847, 1489687, -658147, -2735390, -2384997, 1152046, 5006389, 5842304, 4044554, 2691300, 2984811, 3111173, 1730900, 255080, 789130, 3434881, 6533460, 8503695, 8882823, 8499174, 8842892, 10209394, 10579884, 7961475, 3921519, 2679340, 5861032, 10084942, 11044116, 8430097, 5306150, 3834515, 3398240, 2400644, 379141, -1680796, -2319566, -1003242, 1069544, 1945308, 790294, -1953683, -6031632, -11256746]
41928a1256746m303111J18416N456054P114767M308755R48906J01141N18936j41389
41919B865729j513836j866503j151076n76177m08999L7311J067262K417635L473319
41910D344665K969873j9421l920874n304780k993411K14323J331014P47278K43346
41901b387987l40103j713470k206431J99497L637114L930562O99827j731363p06401
41892f18755Q65665p50551m113252m645201j543918R47855k27076k444509j165155
41883a3694897L486808O663466N223222J579727j14527M66280M05359j421019
41875B594419k897732k468778j462082j377120j328100j14674J144056Q87785
41867e022226K01662J168532K857419K092823j511942m192134k834722R95187
$$ y = [-11256746, -15559857, -15441441, -9985387, -2870620, 1438135, 2387041, 2488182, 3007118, 2865729, 1351893, -514610, -1665686, -2241863, -2650862, -2613551, -1546289, 871346, 4344665, 7314538, 7295117, 3374243, -1930537, -4923948, -4709625, -3378611, -2631333, -2387987, -2728090, -4441560, -6647991, -6448494, -2811380, 1119182, 1819009, 87646, -618755, 246910, -503641, -4616893, -9262094, -10806012, -9858157, -10085233, -12529742, -13694897, -10208089, -3544623, 1678599, 3258326, 3143799, 3610079, 4015438, 2594419, -303313, -2772091, -4234173, -5611293, -6939393, -7054067, -5910011, -5022226, -4820564, -3652032, -794613, 1298210, -213732, -4405866, -7240588, -6245401]
41859f245401L262336K284150l4368r82794K7923J059363j35517l152116m726535
41850h642959k680656O17099R53200j719085k929324j95808L345728L850137K330094
41841e071574K125062L009777K013811p05082j353676J304207L225278O51065
41833E198868m388477o679655m287395J041K771217L259071K737731K453597K553490
41824C619488K173899N06313j784917k727744j359476P56742J385923N01164K1952
41815C093344Q70297J741160J165057m18863j407460j099096j45318P15615J442412
41806E957148K031802J853937L72964j712820k933956k842432k429964k290107
41798a993428j531930L65327J790319J029518o49769m85053J274080J341575j319566
$$ y = [-6245401, -2983065, -698915, -733283, -1716077, -1688154, -628791, -764308, -3916424, -8642959, -11323615, -10706516, -9753316, -11472401, -14401725, -14597533, -11251805, -7401668, -5071574, -2946512, 63265, 2077076, 1371994, 18318, 1322525, 4547803, 5198868, 810391, -5869264, -10156659, -10155618, -7384401, -4125330, -1387599, 1065998, 3619488, 5793387, 6299700, 4514783, 1787039, 427563, 1184305, 2570228, 3071392, 3093344, 3963641, 5704801, 6869858, 6450995, 5043535, 3944439, 3799121, 4514736, 5957148, 7988950, 9842887, 10215851, 8503031, 5569075, 2726643, 296679, -1993428, -3525358, -3160031, -1369712, -340194, -989963, -1475016, -200936, 1140639, -178927]
41789a78927l407770k355036m75682j108174k959013k066720J833149M867443
41781e850730M696767K924156J494651J99256j271695j861762j108643k12398
41773i90398k6621p4576k29898r33323j160577Q16152L709159L703223J97094
41764E010235k617660k099935j107530k368367k952154P17769N326818M340501
41756D249677j853160n734278l158473J635436L224786K083078J621114K228043
41748D296223J936836N57751l46621l65923m50352j056303k033442l382986m455602
41739e300419l633837o47638K028312K129204Q57749R43612K347496K525872P17353
41730A967704o83013M60898L284973N259460M671623J345975l350423o512590
$$ y = [-178927, -3586697, -5941733, -6417415, -7525589, -10484602, -12551322, -10718173, -5850730, -1153963, 1770193, 3264844, 3464100, 2192405, 330643, -778000, -990398, -1017019, -1091595, -1321493, -2254816, -3415393, -2599241, 1109918, 4813141, 5010235, 2392575, 292640, -814890, -3183257, -6135411, -5417642, -90824, 4249677, 2396517, -3337761, -6496234, -4860798, -1636012, 447066, 2068180, 4296223, 6233059, 6790810, 6444189, 6078266, 5627914, 4571611, 2538169, -844817, -5300419, -8934256, -9581894, -7553582, -5424378, -4566629, -3623017, -1275521, 1250351, 1967704, 1284691, 1745589, 5030562, 10290022, 14961645, 16307620, 12957197, 6444607]
41722F444607n489541r36596L140313L603369J428974l85175q45255j041268j143917
41713D775511R445K004277K103480j022043m476619m149903N3764L935889M001483
41704G235284J080836j468346j710721l93095P26416O07765p25633k555893l829332
41695a032719l501599j099771K502525M940339M058623N31061k140683j457213
41687B800563J042009K078597J033711j99460r96054k393331l604114j995582
41679b233661K084441M267260K366347J23107J424176L866460K485447k199758
41671A2183819m898363l466382j125038o38696j022685r55555j088238j429681
41663b440819k85101K364953L786950K630260R80724N10641j3401j215389p94287
$$ y = [6444607, 955066, 18470, 3158783, 6762152, 8191126, 7805951, 6960696, 5919428, 4775511, 4784956, 6789233, 8892713, 7870670, 3394051, -755852, -702088, 3233801, 7235284, 8316120, 6847774, 5137053, 4743958, 5470374, 6078139, 5352506, 2796613, -1032719, -4534318, -5634089, -3131564, 1808775, 5867398, 6398459, 4257776, 2800563, 3842572, 5921169, 6954880, 6755420, 5759366, 3366035, -238079, -2233661, -149220, 4118040, 6484387, 6607494, 8031670, 11898130, 14383577, 12183819, 7285456, 3819074, 2694036, 2055340, 1032655, 77100, -1011138, -2440819, -2725920, -360967, 3425983, 6056243, 7036967, 7547608, 7534207, 6318818, 5524531]
41654E524531K113072L572288N7348n205352n756674q57547L538489K904030p62288
41645E127897k937314k300494o58419N42516J391508K071940K020973P28676j317722
41636D669561k799952k693148j182300O12631J567242R49456j340168l856913
41628d073591l766935N5408M363296M567306P94153k028314j128617M58064p08744
41619a467974k797064j919809J350828K908380J465068j99573k34809o5426r87697
41610a948076j714726p18518J268912K419514J932464J85376j827339k660210
41602c062603j432315Q10821J993006J585084J063746J602754K583985K666820
41594G811298J275548j054054k912872k931749j457756o17595j460263k156537
$$ y = [5524531, 7637603, 11209891, 11267239, 6061887, 305213, -552334, 2986155, 5890185, 5127897, 2190583, -109911, -768330, -225814, 1165694, 3237634, 5258607, 5987283, 4669561, 1869609, -823539, -2005839, -1393208, 174034, 1123490, -216678, -4073591, -7840526, -7785118, -3421822, 1145484, 1939637, -88677, -1217294, -759230, -1467974, -4265038, -6184847, -4834019, -1925639, -460571, -660144, -894953, -960379, -1948076, -3662802, -4381320, -3112408, -692894, 1239570, 1424946, -402393, -3062603, -4494918, -3684097, -1691091, -106007, 957739, 2560493, 5144478, 7811298, 9086846, 8032792, 5119920, 2188171, 730415, 112820, -1347443, -3503980]
41586c503980q98386P10727p0554k319198k348051O18576L222220L081629J626451
41577A19434N94509q06867l158971m271963k167440J401004L165325K685728J929485
41568e09756J650073Q85006m33264q93056J73259J662099K121768R95097j350759
41559D300467l536891l481240m84105K971935L310672L38700j999633n20338K795204
41550C694771L175995m76942l784630k637037J138835K264780n90528l078994
41542b93750j629759J518849K021962k24564j664891o96692Q68840J617920K209010
41533C726925K710202J622177j146273l106603k641319j429611j738299l102443
41525e105244l399179j799089Q34762L171015L712443J340701k821404n230854
$$ y = [-3503980, -4402366, -3691639, -3762193, -6081391, -8429442, -7810866, -4588646, -1507017, 119434, 713943, -92924, -3251895, -7523858, -9691298, -8290294, -5124969, -2439241, -509756, 1140317, 2025323, 1592059, 699003, 872262, 2534361, 4656129, 5651226, 4300467, 763576, -2717664, -3201769, -229834, 3080838, 3419538, 1419905, 899567, 3694771, 6870766, 6393824, 2609194, -27843, 1110992, 3375772, 2785244, -293750, -1923509, -404660, 1617302, 1392738, -272153, -968845, -100005, 1517915, 3726925, 6437127, 8059304, 6913031, 3806428, 1165109, -264502, -2002801, -5105244, -8504423, -10303512, -9468750, -6297735, -2585292, -1244591, -4065995, -9296849]
41517i296849l332610J352659M665522L856729l47018m738972o041630l398887
41509a7281056Q11260L440411L879815L598268K847226M97541k496677k808072
41501g511284M68956L671028L446088J257466M31808R75061M74209j392007k571933
41492g50608k181803j448268j334855j435836j008671M43070K840585M485170
41484c91216K989544r59099k933244m67366K826230K294461p03398j233792J177522
41475B599642K311470P90817N5489J586882J756284j853063n655714n271880k086721
41466e766794n87945j503220j703615L51720K980621M658788N544743N418580
41458I392878L244405k49805k057370n17212K088523K239352k76566k247551j572917
$$ y = [-9296849, -12629459, -11276800, -6611278, -2754549, -3101567, -7840539, -13882169, -17281056, -16469796, -13029385, -9149570, -5551302, -2704076, -2206535, -4703212, -7511284, -7042328, -3371300, 74788, 1332254, 1764062, 2739123, 3213332, 1821325, -750608, -2932411, -4380679, -5715534, -7151370, -8160041, -7716971, -4876386, -391216, 2598328, 1639229, -1294015, -1761381, 1064849, 3359310, 2655912, 1422120, 2599642, 4911112, 5701929, 5757418, 7344300, 9100584, 7247521, 1591807, -3680073, -5766794, -6354739, -7857959, -9561574, -9209854, -6229233, -1570445, 3974298, 9392878, 12637283, 12387478, 10330108, 9812896, 11901419, 14140771, 13864205, 11616654, 10043737]
41449A0043737k46679j467673m554777n000502m93480N049467N693494R35516
41441I959103l661537l533988k90259J354878k37797k453214k390999n2981K323019
41432A016225K710407Q14985j974125l750114l559821k043503p11667n81217j318343
41423i397173j590203n49133R37085J189780J47006k00150J323714K953458K274163
41414b911453k09576j683530p23704J579811L810951N269022M977441K314212
41406A2423174r25150j736738m4714Q81249q05788k976304l175437k087346j292279
41397B60667j85857K055171L543307K089444p77734j713534p82463j149857l563266
41388b24122m838372k787127N93629K432859K809485L273534L635788K617929
$$ y = [10043737, 9797058, 8329385, 3774608, -1225894, -1719374, 3330093, 9023587, 9959103, 6297566, 2763578, 2473319, 3828197, 3590400, 1137186, -1253813, -1306794, 1016225, 3726632, 4541617, 2567492, -1182622, -4742443, -6785946, -7497613, -8078830, -9397173, -10987376, -11536509, -10599424, -9409644, -9262638, -9462788, -8139074, -5185616, -2911453, -3121029, -4804559, -5528263, -3948452, -137501, 5131521, 10108962, 12423174, 11498024, 9761286, 9716572, 10597821, 9792033, 6815729, 3640292, 1552946, 260667, 74810, 2129981, 5673288, 7762732, 6984998, 5271464, 4489001, 3339144, -224122, -5062494, -7849621, -7255992, -4823133, -2013648, 1259886, 4895674, 7513603]
41380G513603N16136j004626j210735o40859K91602J271944J139950r41005l300893
41371C635117k878129P21662M032709L748569O12159k004094k277090j097393
41363D493510R2507N99110j82839k585780n224398n463535k352214J994599M711778
41354c917262M866333L268172J006177q16997j178994l02200J65526p37606j942359
41345D10790k129481j550741p98944O14195K592777L053605Q10875j428584j57910
41336A416582L469746M708527J772980k083541l529721k780759j294009P13980
41328B393785K693536K641776j77155l385258m255323k700609k29505K044981
41320i73772L059465J853670m11245r22042N40062N51543k538157n117320l365777
$$ y = [7513603, 8029739, 7025113, 5814378, 5173519, 5465121, 6737065, 7877015, 6936010, 3635117, 756988, 1478650, 5511359, 9259928, 9872087, 7867993, 5590903, 4493510, 4586017, 5185127, 5002288, 2416508, -2807890, -8271425, -10623639, -8629040, -3917262, 949071, 4217243, 5223420, 4406423, 3227429, 2925229, 3090755, 2353149, 410790, -1718691, -3269432, -4068376, -3454181, -861404, 2192201, 3003076, 1574492, 1416582, 4886328, 9594855, 11367835, 9284294, 5754573, 2973814, 1679805, 2393785, 5087321, 7729097, 7551942, 4166684, -88639, -2789248, -3018753, -973772, 2085693, 3939363, 3528118, 2606076, 3146138, 3697681, 1159524, -3957796, -7323573]
41311g323573P76327K484252J003296l74518p5970K76670k44929n29271j84746
41302d192462j73184l58271M38303J667838J400538l03852j390139j324165j389478
41293e624872j309410P45255M144047N625151M244028K691644K286879P39237
41285A3541959k996049n724763m832293k449435j375241l11612K610470M661685
41277C124721K263335j988166k048653K239579M595150J998755j012454k01087
41269H971180J681675K23255k793494k366092J063659J936216j452427m019304
41261C244668j889180J457778O45921l224074m351832j079990K015711J484196
41253a696802j49945Q00215L168008L378530J714216J745150L968821M415865
$$ y = [-7323573, -6547246, -4062994, -3059698, -3434216, -3510186, -3233516, -3478445, -4007716, -4192462, -4365646, -4723917, -4285614, -2617776, -1217238, -1521090, -2911229, -4235394, -5624872, -6934282, -6189027, -2044980, 3580171, 7824199, 10515843, 12802722, 13541959, 10545910, 4821147, -11146, -2460581, -3835822, -4147434, -1536964, 3124721, 5388056, 3399890, 1351237, 3590816, 8185966, 10184721, 9172267, 8971180, 10652855, 10876110, 8082616, 5716524, 6780183, 8716399, 7263972, 3244668, 1355488, 2813266, 3459187, 235113, -4116719, -5196709, -3180998, -1696802, -1846747, -1046532, 2121476, 5500006, 7214222, 8959372, 12928193, 17344058]
41245A7344058Q24039l402678l774216q55175R92290k59546k319059k551349j367797
41236D630567q05022j432049k013676j607924p83940n47599p54954l03619J101520
41227b516696K205662J898072J004135J144640K006888J392500j478390m279980
41219A376831m398316k344991q40621j057857j459531n23447Q71179P38016r24633
41210h563370j525600R85734M824453N593416J652879k956414k967595J144644
41202a811853L389551K77861m240703m095100P49121M602921L630570k20239l020209
41193g38080l406985k190790p7251K213381L130984J729824o41308j674262r02975
41184b557462M4349j27679q17073o16906P65110K113374K055981N53201j136094
$$ y = [17344058, 18168097, 14765419, 10991203, 10136028, 11128318, 10868772, 8549713, 5998364, 4630567, 3825545, 2393496, 379820, -1228104, -2012044, -2559643, -3314597, -3618216, -2516696, -311034, 1587038, 2591173, 3735813, 5742701, 7135201, 5656811, 1376831, -3021485, -5366476, -6207097, -7264954, -8724485, -9247932, -8376753, -7638737, -8563370, -10088970, -9103236, -4278783, 1314633, 2967512, 11098, -2956497, -1811853, 1577698, 1855559, -2385144, -6480244, -5731123, -1128202, 2502368, 2282129, -738080, -4145065, -6335855, -6413106, -4199725, -1068741, 661083, 19775, -1654487, -2557462, -2513113, -2640792, -3457865, -4074771, -3309661, -1196287, 859694, 1412895, 276801]
41175B76801j931431j880165j356456j68043J550666K342179J048200q35991n46237
41166a500477J876795L184243J504526j014839j656791q81568m49471n5264J122906
41157B130060J375405j067111l544785j686570L146939M205762j104238o754853
41149c299391o248496j226662K142073K190538K095104L065301K870829J052633
41141B641929K87986J404192J624772l58223j620124J76232K604706K169722m23856
41132H507336j952792j685700j303393j137353q2843J220734O22631j729432k775848
41123c16660p05794K508792L824101K656469O59536o17154p24994n737N76385
41114G854944j37630k288172m392811m554790k316081Q19090K629286K066612
$$ y = [276801, -1654630, -3534795, -4891251, -5059294, -3508628, -1166449, -118249, -954240, -1500477, 376318, 3560561, 5065087, 4050248, 2393457, 1511889, 1062418, 1007154, 2130060, 3505465, 2438354, -1106431, -2793001, 353938, 4559700, 3455462, -3299391, -9547887, -10774549, -8632476, -6441938, -4346834, -1281533, 1589296, 2641929, 2929915, 4334107, 5958879, 5600656, 3980532, 4156764, 6761470, 8931192, 8507336, 6554544, 4868844, 3565451, 2428098, 2345255, 3565989, 4188620, 2459188, -316660, -1022454, 1486338, 5310439, 7966908, 8626444, 8009290, 7284296, 7278559, 7854944, 7717314, 5429142, 1036331, -3518459, -5834540, -5015450, -2386164, -319552]
41106c19552J78150r59894m05751Q44041J387720J156335J129166J832785K709825
41097G552825K640390Q01597k361433m795296m512066k062561q0065K38802N12610
41088b065197J986747L008105J648747q43905j725620p07330M09931J122342K349536
41079E183356L705160L610399J993836J68376j650204l766913m510240k066056
41071B667714J260043R56328k787603m675854k320087J54150r10325k841417j628290
41062a0125341J216576J663280K16591O00364K940525L631046J613763k05722
41054A551082k77051o20712k539830l971987k865512k93831J538598K199375K423633
41045b856235K339880J586608K1762k232770m216505l803096o9959M007230L989052
$$ y = [-319552, -141402, -1101296, -1507047, -663006, 724714, 1881049, 3010215, 4843000, 7552825, 10193215, 10994812, 8633379, 3838083, -673983, -2736544, -2816609, -2577807, -2065197, -78450, 2929655, 4578402, 3734497, 2008877, 1301547, 1711478, 2833820, 5183356, 8888516, 12498915, 14492751, 14661127, 13010923, 9244010, 4733770, 2667714, 3927757, 4884085, 2096482, -2579372, -4899459, -4745309, -5655634, -8497051, -10125341, -8908765, -7245485, -7028894, -6428530, -3488005, 143041, 1756804, 1551082, 1274031, 653319, -1886511, -5858498, -8724010, -9017841, -7479243, -5279868, -2856235, -516355, 1070253, 1092015, -1140755, -5357260, -9160356, -9230315, -5223085, -1234033]
41036a234033j48007l263258j442245L308340O280915N667396L030022K49002
41028A2448132j549680j354478Q66419L065495K835256J50942k807232m113534
41020I541320l312009r91906J435266K135155M75963k058432l627384m054716
41012d56743l980703l044696p20197J721414K237063R21082r4540K36662Q37849
41003b342809Q83172J016858J410506Q07846j056596k002628l98578J730592R95290
40994A043653k546788n270929m667187j868243Q61678K801881L913698L491531
40986b240706J469118l85922n19733J67732M3224k60750J047480L351005L991905
40977F663353K430655J107377J204461N59027k250539m450343k804121Q91714
$$ y = [-1234033, -1382040, -4645298, -6087543, -2779203, 3501712, 9169108, 12199130, 12448132, 10898452, 9543974, 10410393, 13475888, 16311144, 16462086, 13654854, 9541320, 6229311, 5237405, 6672671, 8807826, 9283789, 7225357, 3597973, -456743, -4437446, -7482142, -8202339, -6480925, -4243862, -3322780, -3417320, -3180658, -2342809, -1459637, -442779, 967727, 1775573, 718977, -1283651, -1682229, 48363, 1043653, -1503135, -6774064, -11441251, -13309494, -12447816, -9645935, -5732237, -2240706, -771588, -1157510, -1677243, -1509511, -1466287, -1727037, -679557, 2671448, 6663353, 9094008, 10201385, 11405846, 11964873, 9714334, 5263991, 2459870, 3351584]
40969C351584J820378p08530k045830P76532M327280L635970n22718k664134l15546
40960G654986K813217K427981m91477j884758r29972p12322k572565l452639q09790
40951B042661K636360K306622j513369m003091k620971N8942R78060M87783P0828
40942D43825n68123j791829k044543l16247J445215J219418M74079J794371M358027
40933E014193N057150L196926Q02199j052515k806686l765397k562903l70767
40925C512200k1363j423930j390992J122163L108955K137125l57383j981978k602515
40916B102282k825752j978044L16578K651437L704143L712353K890592P75953
40908A1349542j599444j781883J50604P50663j585707l764287k959215j129156
$$ y = [3351584, 5171962, 4463432, 2417602, 3194134, 7521414, 11157384, 10634666, 7970532, 7654986, 10468203, 12896184, 12404707, 10519949, 9589977, 8877655, 6305090, 2852451, 2042661, 4679021, 6985643, 5472274, 1469183, -1151788, -1092846, -114786, 372997, 443825, -124298, -1916127, -3960670, -4276917, -2831702, -1612284, -1138205, 656166, 5014193, 10071343, 13268269, 14070468, 13017953, 10211267, 6445870, 3882967, 3512200, 3490837, 2066907, 675915, 1798078, 4907033, 7044158, 6686775, 4704797, 2102282, -723470, -2701514, -2384936, 266501, 3970644, 7682997, 10573589, 11349542, 9750098, 7968215, 8118819, 8869482, 7283775, 3519488, 560273, -568883]
40900e68883j202990j868510l82457J888787J508007j041801k222868j333773
40892e224488p61937q94105L32129K732463L531645K301070J710092K525936K342964
40883H595769L90810r06393o02922q88200k267854j846123J104298K620152L56407
40874F555944k119171j323935J66192j313388l366599j403570K981387M177792
40866D354652J778770P17908K281142K068476j614011m084781k035717P79164
40858D245603l39097l732533m759330l011867j272278K24415L176351O126150
40850F57414N359669J104114j871753j011165N86042p50565l875624m881369k517781
40841g201018Q00357K379289J698935p5326j486980j607659m06477J277435K224009
$$ y = [-568883, -1771873, -3640383, -4022840, -2134053, -626046, -1667847, -3890715, -5224488, -5986425, -6880530, -6548401, -3815938, -284293, 2016777, 3726869, 6252805, 8595769, 8986579, 8080186, 7477264, 6589064, 4321210, 2475087, 3579385, 6199537, 6555944, 4436773, 3112838, 3279030, 1965642, -1400957, -2804527, 176860, 4354652, 6133422, 6851330, 9132472, 11200948, 9586937, 5502156, 3466439, 4245603, 3906506, 173973, -4585357, -7597224, -8869502, -8645087, -5468736, 657414, 6017083, 7121197, 5249444, 4238279, 4824321, 4073756, 198132, -4683237, -7201018, -6400661, -4021372, -2322437, -2397763, -3884743, -5492402, -5898879, -4621444, -2397435]
40832b397435J535343n62137k324921j758661R43590L145246L001515J758059
40824C340599J260821P25639j326653l153265j657152J957617K727454p92441
40816C082619m057691l353241r36681m00285p76419O27109K583238K063978R9156
40807a068217L86978K924144L960324K074501m03029k038787l506087l802358
40799a472531o07801M241903N024382L26058l876931k475410J785405L296496
40791F241571J637780J41007m65366j806490l136443k084316N41178J378015o0414
40782B386522p73303M95912J295004k51559k428472k631973q20245R76100J102624
40773f49390l84214j693177p52402K077426L617604J986102k38095L62187K611279
$$ y = [-2397435, -862092, -1424229, -3749150, -5507811, -4564221, -1418975, 1582540, 3340599, 4601420, 5327059, 4000406, 847141, -810011, 1147606, 3875060, 3082619, -975072, -4328313, -5264994, -5665279, -6441698, -5814589, -3231351, -1167373, -1068217, -681239, 2242905, 6203229, 8277730, 7874701, 5835914, 2329827, -1472531, -2080332, 2161571, 7185953, 7512011, 3635080, 1159670, 2945075, 6241571, 7879351, 8020358, 7554992, 5748502, 2612059, 527743, 1068921, 2446936, 2386522, 1613219, 2109131, 3404135, 3152576, 724104, -1907869, -2728114, -1752014, -649390, -1033604, -2726781, -3479183, -1401757, 2215847, 4201949, 3963854, 4326041, 6937320]
40764F937320K626755L09896o03730Q38692J135700j287915k916175r99707J691507
40755G732343J450575n30920r26678j20598p96204k507750k368022l32301P64703
40746B365148L60798R25613K923505L271308L68376l008713l944662l401843l449499
40737c589969l135145l95482L527688N085637L378926J056566J90469J01591j33332
40728F086949J97414J424221J866694J86086k137870k753149j816354j242182
40720A811809j302748n43897R68858J101858p81527k181209r62360J424683K175490
40711A710957J148093M01986O11419M13830p77185j590831q66348O81712J635860
40702C369493J510968O84546l34442j138781j635184k117401k479824j790372
$$ y = [6937320, 9564075, 9873971, 9270241, 10108933, 11244633, 9956718, 7040543, 6040836, 7732343, 9182918, 8651998, 7725320, 7604722, 6808518, 4300768, 1932746, 1600445, 2365148, 2725946, 3651559, 6575064, 9846372, 10214748, 7206035, 3261373, -140470, -3589969, -6725114, -7120596, -3592908, 1492729, 4871655, 5928221, 6118690, 6220281, 6086949, 6284363, 7708584, 9575278, 9761364, 7623494, 4870345, 3053991, 1811809, 509061, -34836, 934022, 2035880, 1254353, -926856, -1889216, -464533, 1710957, 2859050, 3261036, 3872455, 4286285, 3509100, 1918269, 1051921, 1733633, 3369493, 4880461, 5565007, 5230565, 4091784, 2456600, 339199, -2140625, -3930997]
40694c930997K32799J905947J467057o7653j01150J464631J911337R7204j622554
40685A356621j308680n69263j446384k394519n49639L162545M657205K446590
40677E354476l13703l66441J502908K165470L01672k521703l905632k674641L73294
40668h4300K959086L212869J639646M67774O78910Q55778l42722j962106k261600
40659E163335j251822j25376Q17641J668040J220363j436894l841390k095908
40651A17989L057613N569937J861785l671093m344842k04093K946915K365320
40643G699531J146257J794357K207966J84419k364807k697327j479569o76112
40635E814715o5274R26003P16839j372322k183504P75614M143535L101621p57926
$$ y = [-3930997, -3698198, -1792251, -325194, -392847, -493997, 970634, 2881971, 2979175, 1356621, 47941, -521322, -1967706, -4362225, -4911864, -1749319, 2907886, 5354476, 5040773, 4674332, 6177240, 8342710, 8644382, 6122679, 2217047, -457594, -84300, 2874786, 6087655, 7727301, 8195075, 8873985, 9729763, 9387041, 7424935, 5163335, 3911513, 3786137, 4603778, 6271818, 7492181, 6055287, 2213897, 117989, 3175602, 8745539, 10607324, 6936231, 2591389, 2387296, 5334211, 7699531, 8845788, 10640145, 12848111, 13032530, 10667723, 7970396, 6490827, 5814715, 5749441, 6675444, 7392283, 6019961, 3836457, 4612071, 8755606, 11857227, 11099301]
40626A1099301j787789M62440J014431j279743j582156J789384L378670k49908
40618A2844630l835094j520608L431894L728202n92260l154781j864852r71476
40610H065655k340010j943235K581635O731528N298619J2477k940964j056607
40602A4409098K347304L380876K050158J014757J617068K278942P97341k375209
40594B5520335m156221k592084N73909K286092K023177J400585P52622j299242
40586B4509173m692660o788399n386584j348247K520632L966656K380685j006145
40578A4155111l470732k875523j08986J786221J314365j26371r26551j286500
40570H461034j629885j070923Q19430K213924J098141j540213k557795o73581
$$ y = [11099301, 9311512, 9773952, 10788383, 9508640, 7926484, 9715868, 13094538, 12844630, 9009536, 7488928, 10920822, 14649024, 14056764, 10901983, 9037131, 8065655, 5725645, 3782410, 6364045, 13095573, 18394192, 18406669, 15465705, 14409098, 16756402, 20137278, 22187436, 23202193, 24819261, 27098203, 27895544, 25520335, 21364114, 18772030, 19345939, 21632031, 23655208, 25055793, 25808415, 24509173, 19816513, 13028114, 7641530, 6293283, 8813915, 12780571, 15161256, 14155111, 10684379, 7808856, 7699870, 9486091, 10800456, 10674085, 9747534, 8461034, 6831149, 5760226, 6579656, 8793580, 9891721, 8351508, 5793713, 5120132]
40562E120132J865798J983224p74549l831710m242635j657992J303935J938808
40554A705011O13869J68351J959839L856943L166613L98749j521677j222521j54513
40545H970664K03724M51982J628073K928192K585364M14911j896880k859220k400534
40536A0026276j233791k89993o79685k564287l783546j621074L062433N552831
40528H469164K991932j429651k537456l0644K000334J627042J079284J745958
40520A3915963J488438j146063l708717l649894k502658l065019m513312l786778
40512f968040n76506K334788L029203K002504M70244l33745R05178L622457M328258
40503H814341N77161m785668o593469l991255o95192Q49810J642392K458455K264532
$$ y = [5120132, 6985930, 8969154, 8194605, 4362895, 120260, -1537732, -233797, 1705011, 2318880, 2487231, 4447070, 8304013, 11470626, 11869375, 10347698, 9125177, 8970664, 9174388, 9626370, 11254443, 14182635, 16767999, 17182910, 15286030, 12426810, 10026276, 8792485, 8502492, 7822807, 5258520, 1474974, -146100, 2916333, 8469164, 11461096, 10031445, 7493989, 7463345, 9463679, 11090721, 12170005, 13915963, 15404401, 14258338, 10549621, 6899727, 4397069, 1332050, -3181262, -6968040, -7544546, -5209758, -2180555, -178051, 292193, -41552, 863626, 4486083, 8814341, 9391502, 4605834, -1987635, -5978890, -6674082, -5824272, -4181880, -1723425, 541107]
40494E41107J151847R33030J589588Q09337j561840k375947l05348J555560M95016
40485B832350j802498k635824k428428k426273j270372K313868N553593M521599
40477D658015O1064k847416j428817K081297L911049K641570l76755k608728k410640
40468C680639q24770o77286k736703m075068j903294K354272M864579M125187
40460D807556J881746M37756J029757L568699N838645M428010j038257o067169
40452A4886743o473000l819216k412392k473666o18414L591624O377946N522078
40444A4581703L071218J266609j77070j366765p81805J470654K399213L71356
40436B0835113k364542l532003m130715n416407n681547l275102l00857L23278
$$ y = [541107, 1692954, 2625984, 4215572, 5024909, 3463069, 1087122, 781774, 2337334, 2832350, 1029852, -1605972, -4034400, -6460673, -7731045, -5417177, 136416, 4658015, 4719079, 1871663, 442846, 2524143, 6435192, 9076762, 8700007, 6091279, 3680639, 2855869, 2178583, -558120, -4633188, -6536482, -4182210, 682369, 4807556, 6689302, 7127058, 8156815, 11725514, 17564159, 21992169, 20953912, 14886743, 8413743, 4594527, 2182135, -291531, -909945, 2681679, 9059625, 14581703, 17652921, 18919530, 18742460, 17375695, 16593890, 18064544, 20463757, 20835113, 18470571, 14938568, 10807853, 5391446, -290101, -3565203, -3866060, -3542782]
40428c542782m02489M49740K437863K531721N27955m87152O89062J622365O14688
40419D440971n52403K53656K310004L584600L427362K308335P30849l54345r24
40410A6148105N96608j344286n765103q217726n277709L35751L038881J464882
40402I79403j010527j899548j905780j622672j6882K618487L717577K166139M7176
40393C073373r45629j701819k387251o24810L880617O333995K846080l025192
40385G449364m647500j530130J196163J438060K123750M337264M917065K563147
40377A7847183L42803k99501k117529n461487n290731L96973M822770J594570
40369A1835051m752296m992842Q33698M129864J458009j217728O58260L324678
$$ y = [-3542782, -3945271, -3495531, -1057668, 1474053, 2002008, 1514856, 2203918, 3826283, 4440971, 3888568, 4142224, 6452228, 10036828, 13464190, 15772525, 16503374, 16149029, 16148105, 16744713, 15400427, 9635324, 1417598, -3860111, -3524360, -485479, 979403, -31124, -1930672, -3836452, -5459124, -5476006, -2857519, 860058, 3026197, 3073373, 2127744, 425925, -1961326, -2586136, 1294481, 7628476, 10474556, 7449364, 2801864, 1271734, 2467897, 3905957, 6029707, 10366971, 15284036, 17847183, 18189986, 17890485, 15772956, 10311469, 5020738, 5417711, 10240481, 11835051, 7082755, 2089913, 2923611, 7053475, 8511484, 7293756, 7952016, 11276694]
40361A1276694J998386j468929k713425j861475j695778k174453j368313K65240
40353B257947O42369j77926l41192N50477J197743Q23077m18078k143289l100971
40344g09843j448178K329546M667185L479953J453573J849297L105288J548758
40336A6275579j961611k899598m06584J206725n58965k586302j672520J95976
40328G592700l90630k205637j460854J530789K399450m34146l164414k261574
40320A605684P08036K141932J568860Q27080P215k090598m126336k859329J566056
40311f51400M509321K845603p20224j711708M1719J294125O81949k78274p42911
40302E268200j561480k540216j917828M69198K121195J298038m35045m10914J737452
$$ y = [11276694, 13275080, 11806151, 9092726, 7231251, 5535473, 3361020, 1992707, 2257947, 2900316, 2722390, 2381198, 2931675, 4129418, 4952495, 4534417, 2391128, -709843, -2158021, 171525, 4838710, 8318663, 9772236, 11621533, 14726821, 16275579, 14313968, 11414370, 11007786, 12214511, 11655546, 9069244, 7396724, 7592700, 7202070, 4996433, 3535579, 5066368, 7465818, 7031672, 3867258, 1605684, 2313720, 4455652, 6024512, 6851592, 6858807, 4768209, 641873, -2217456, -651400, 3857921, 6703524, 5983300, 4271592, 4313311, 5607436, 6289385, 6011111, 5268200, 3706720, 1166504, -751324, -282126, 1839069, 3137107, 2702062, 2291148, 4028600]
40293D028600L901418L786666R82379k234600k340221J607991N870997N866586
40285B1469816J898854j554118k202802k218024l469456m289489k833727l79178
40277F421876J071552J691628J977467Q08855j880393l141926r17311K328771
40269H360519L150499K168054K067674K646353J867787J27821q70577k000107
40261A7518023m648993n998018k072111M621792O628475J975029k739706k001989
40253A3282502J234531J215782k056392m166232l070564l38416K321080L981081
40245A2403372L479057R07650j061703l77263J083618L71484j676717j816891
40237A3312607K20344J319320j42659k255759k772675j599486L25076K186343
$$ y = [4028600, 7930018, 11716684, 12699063, 10464463, 8124242, 9732233, 15603230, 21469816, 23368670, 21814552, 19611750, 17393726, 13924270, 9634781, 6801054, 6421876, 7493428, 9185056, 11162523, 11971378, 10090985, 6949059, 6031748, 8360519, 11511018, 13679072, 15746746, 18393099, 20260886, 20388707, 19518130, 17518023, 12869030, 6871012, 4798901, 9420693, 16049168, 18024197, 15284491, 13282502, 14517033, 15732815, 13676423, 9510191, 6439627, 6101211, 8422291, 12403372, 15882429, 16790079, 15728376, 15351113, 16434731, 16806215, 15129498, 13312607, 13532951, 14852271, 14709612, 12453853, 9681178, 8081692, 8406768, 10593111]
40229A0593111K919285J971696Q37293J604206L605473L834641J216035j911963
40221B4669777l293854l306652k982044j926000J91074K076009K583619K527035
40213B0538964K951976K941770J070491j874962l486880k564073M5564K783458
40205B2406308M225925L391760P94191j355950j454358m13816J50861O61332K347218
40196C0753471L940167K468359k141058n828224n102585j224794J726846J677232
40188B6269414m1367j228832j144542m01444K69621O60709P58005J72765j488133
40179B3826196l352588l298845m27577L094190M267260K998566J710393J409617
40171C0227212O20385j310804k526252j505664O56995K148398K436524J198237
$$ y = [10593111, 13512396, 15484092, 16321385, 17925591, 21531064, 25365705, 26581740, 24669777, 21375923, 18069271, 15087227, 13161227, 13352301, 15428310, 18011929, 20538964, 23490940, 26432710, 27503201, 25628239, 22141359, 19577286, 19622850, 22406308, 26632233, 30023993, 30818184, 29462234, 28007876, 27594060, 27744921, 28406253, 30753471, 34693638, 37161997, 35020939, 29192715, 24090130, 22865336, 24592182, 26269414, 26228047, 24999215, 23854673, 23453229, 23722850, 24383559, 25141564, 25314329, 23826196, 20473608, 17174763, 16747186, 19841376, 24108636, 27107202, 28817595, 30227212, 30847597, 29536793, 27010541, 25504877, 26161872, 28310270, 30746794, 31945031]
40163C1945031j987061n177630m564703j13109K602768p1527l652947j809336
40155A7171486L674456N532306K376786J31858J518203J775535k256374n717861
40147B4206395l162340K767706N494958L630656O14025j757037l777968l965212
40139B4051183o84575L310699L628005J283936J539358N303033P208433L775324
40131D9415396j464503l404803j930989k60623J47477K3990j80516l47513L46286
40122D2344202K160730L482484K732141Q04409k6285R51863K315445K364785O45028
40113E7774802j793058k964263j480664J887600M763962N467554M039478J322789
40105F9018200j484917k551252p33080K453313M131737L714833L135476L118996
$$ y = [31945031, 29957970, 24780340, 20215637, 20102528, 22705296, 22633769, 18980822, 17171486, 20845942, 26378248, 28755034, 28886892, 30405095, 32180630, 29924256, 24206395, 21044055, 23811761, 29306719, 32937375, 33551400, 31794363, 28016395, 24051183, 23366608, 26677307, 30305312, 31589248, 33128606, 38431639, 45640072, 49415396, 47950893, 44546090, 42615101, 42354478, 42501955, 42525945, 42345429, 41997916, 42344202, 44504932, 47987416, 50719557, 51523966, 51497681, 52449544, 54764989, 57129774, 57774802, 55981744, 53017481, 51536817, 53424417, 58188379, 63655933, 67695411, 69018200, 67533283, 64982031, 64248951, 66702264, 70834001, 74548834, 77684310, 80803306]
40097H0803306K050365l87841j481898N90017L597928M445519L547338L486344
40089I6651078M900802O344487P056735P332304P051867O189821N918905P008105
40081A48454104Q128435P984233P826051R163294J0339456Q760384N609548M529732
40073B10795237N975254O944526O446167O726481Q080798P184551K796492j206519
40065B53742987j624525j014443l079452o126877n995091l533100l660005p342632
40057B21366862r898670q353137n705527n746627p612213q405233q148085q633475
40049A58863895r371858q404974o229258n412370o432438o988202n744302l958453
40041A06322040k854749k162602k132322m051471p136257p717095m053932J66217
$$ y = [80803306, 82853671, 82465830, 80983932, 81573949, 85171877, 89617396, 93164734, 96651078, 101551880, 107896367, 114953102, 122285406, 129337273, 135527094, 141445999, 148454104, 156582539, 164566772, 172392823, 181556117, 191895573, 200655957, 206265505, 210795237, 216770491, 223715017, 230161184, 236887665, 244968463, 252153014, 254949506, 253742987, 252118462, 251104019, 248024567, 241897690, 235902599, 232369499, 228709494, 221366862, 211468192, 203115055, 197409528, 191662901, 184050688, 175645455, 167497370, 158863895, 149492037, 141087063, 134857805, 129445435, 123012997, 116024795, 110280493, 106322040, 103467291, 101304689, 99172367, 95120896, 87984639, 80267544, 76213612, 76379829]
40033G6379829K05624l217231n130456l346225p04892q4483p92670j139655j365195
40024F0804646j982293j804899j63827Q24159r24778l544029l161349N49795L637720
40015E4235145L132824N94474o04620K97837J117167j25083k853062m559312l467470
40006D7767900p45268M01316j414267l622151k994754l83343L66373j722083l163996
39997C4489727j574207M35702l69049k207301j003712K537322L219475q54196
39989C4673761n129304m997131j728403N43066Q31890J042918J757820J929222
39981B8923839J707895K034931J976684Q782k315707j910344L14533j48048m096397
39972B6496168o234994k822525K325724L362350P39862p73527k58700j183296
$$ y = [76379829, 76585453, 73368222, 68237766, 64891541, 64186649, 64102166, 63309496, 62169841, 60804646, 58822353, 57017454, 56853627, 57677786, 56753008, 53208979, 50047630, 50597425, 54235145, 57367969, 57962443, 57357823, 57655660, 58772827, 58647744, 55794682, 51235370, 47767900, 47022632, 47423948, 46009681, 42387530, 39392776, 39009433, 39375806, 37653723, 34489727, 32915520, 33351222, 32982173, 30774872, 29771160, 32308482, 35527957, 34673761, 29544457, 24547326, 22818923, 23361989, 24193879, 25236797, 26994617, 28923839, 30631734, 32666665, 34643349, 34652131, 32336424, 30426080, 30740613, 30592565, 26496168, 20261174, 17438649, 19764373, 23126723, 23866585, 23093058, 22834358, 21651062]
39964B1651062m250206n436284k506897J303573K413129J852795K248882K841176
39956B0117230J002425k834932n049272l340293Q15675M131694M478469K138180
39948B1459176p41115k093887j876799j519788j385794l29846J624474K219799
39940A7356220J08790k605318k929343q93882J109892J938388K374167K685826
39932A9144740J883131k77976k311723k613908j074636J085792K299981J662304
39924A9797705j24972j053911n323J638213J592514l00135j666145l33823L094207
39915B2638330N446383L827767j044724m493296k398031L570232P194698N082531
39907C9823890N03796j646437j048626m34904l02015Q31419K102524Q27129k374788
$$ y = [21651062, 17400856, 11964572, 9457675, 10761248, 13174377, 15027172, 17276054, 20117230, 21119655, 18284723, 13235451, 9895158, 10710833, 14842527, 19320996, 21459176, 20718061, 18624174, 16747375, 15227587, 13841793, 13511947, 15136421, 17356220, 17465010, 14859692, 11930349, 11036467, 12146359, 14084747, 16458914, 19144740, 21027871, 20749895, 18438172, 15824264, 14749628, 15835420, 18135401, 19797705, 19672733, 18618822, 18613499, 20251712, 21844226, 21544091, 19877946, 19544123, 22638330, 28084713, 31912480, 30867756, 26374460, 23976429, 27546661, 34741359, 39823890, 40327686, 38681249, 37632623, 37197719, 36895704, 37727123, 39829647, 40656776, 38281988]
39898C8281988l239682n1780L299916K441928j917213n630708o296088m621527
39890B2266834k088521M32685K243394K766251K081910Q17053l54987q98810o35226
39881B6630583J12919J119853K633016M250125M203180J478240j936091l188384
39873C5303441k700572l457348n964752p032173m587364p29117J534027J833888
39865A4200030R84358j160249l969715m711642j952947J580942K520938J573124
39857I064839J596782K570540K241906Q12641P75170K111810J814226r82849l196148
39848A6808917k558974q07768k33092j06948J022516K015870J062216p97378j090568
39839A5314791J40079O93999k8693m58880K9743J99772m55278p91906m92638r73631
$$ y = [38281988, 35042306, 34990526, 38290442, 40732370, 38815157, 33184449, 26888361, 22266834, 20178313, 20610998, 22854392, 25620643, 27702553, 28519606, 28164619, 27265809, 26630583, 26743502, 27863355, 30496371, 34746496, 38949676, 40427916, 38491825, 35303441, 32602869, 29145521, 23180769, 16148596, 11561232, 10832115, 12366142, 14200030, 15184388, 14024139, 10054424, 5342782, 3389835, 4970777, 7491715, 9064839, 10661621, 13232161, 15474067, 16286708, 17061878, 19173688, 20987914, 20005065, 16808917, 14249943, 13442175, 13209083, 13102135, 14124651, 16140521, 17202737, 16405359, 15314791, 15454870, 16148869, 16120176, 15661296, 15691039, 15890811, 15435533, 14643627, 14150989, 13177358]
39829A3177358k557302l100828j306193O54505K89873j012269o0733K607052K884415
39820A1575878o53696m038181l130440J002806M061435L915282J684971j020447
39812A3397608l148461l335511r84653J776388J890253m26120j712558k42810
39804G214136J474994N82380j812630k284307Q1415K661324K869450J020811o93868
39795A1113705q77265Q8523J116576J666225J757394J243355j83160k080887l091726
39786A0752740k298220k95991J649733K944948L503984L041484J596222J33112
39778B1028012n47506r12211j547427j808992j198858j078088k759004m560803
39770F615123l487624K42088L141149L246547K143000J562519R50335l08154r91498
$$ y = [13177358, 10620056, 7519228, 6213035, 6867540, 7157413, 6145144, 6084411, 8691463, 11575878, 10922182, 6884001, 3753561, 4756367, 8817802, 12733084, 14418055, 13397608, 10249147, 6913636, 5928983, 7705371, 9595624, 9169504, 7456946, 7214136, 8689130, 9271510, 7458880, 5174573, 5255988, 7917312, 10786762, 11807573, 11113705, 10236440, 10324963, 11441539, 13107764, 14865158, 16108513, 15925353, 13844466, 10752740, 8454520, 8158529, 9808262, 12753210, 16257194, 19298678, 20894900, 21028012, 20480506, 19568295, 18020868, 16211876, 15013018, 13934930, 11175926, 6615123, 3127499, 3369587, 6510736, 9757283, 11900283, 13462802, 14413137, 14104983, 13113485]
39761A3113485j79056Q41298N63237n61505j380934j729697j562890l35100J371278
39752A0140116J615190k297j245848n96447M95702M01260k9973L36745M34231
39743A1548679q71433k284354k238635j549611j426505j049532J35352J36173
39735B400134k244753m084713k240365J293999K098815o8821j697888j337867
39727e881459m43621P02314L084583N324802M772632K266399J136017J409190
39719A2370857N761k984999l732168j439890p0977j422145k020206L31145K112141
39710C149519j78820m181681n489490l744502j087711K166759O110553Q194171
39702D938798O021415J512153j473069k163358k238621j971177o47778N75807
$$ y = [13113485, 12934429, 13775727, 14338964, 13777459, 12396525, 10666828, 9103938, 8768838, 10140116, 11755306, 11753009, 10507161, 9910714, 10406416, 10807676, 10777703, 11114448, 11548679, 10677246, 8392892, 6154257, 4604646, 3178141, 2128609, 2263961, 2400134, 155381, -3929332, -6169697, -4875698, -2776883, -2845704, -4543592, -5881459, -6325080, -5622766, -2538183, 2786619, 7559251, 9825650, 10961667, 12370857, 12376618, 9391619, 5659451, 4219561, 4148584, 2726439, 706233, 1037378, 3149519, 2970699, -1210982, -6700472, -10444974, -11532685, -9365926, -3255373, 4938798, 10960213, 12472366, 10999297, 8835939, 6597318, 4626141, 3978363, 4554170]
39694D554170p0465j706725j951906n18902J071146K198660K833187J992633m26305
39685G975493j786390o5574K310028J647288j241730k470757j357595q67787k070551
39676B072425k623644j225906M99497J290259J691888J576648M7211j348694O06311
39667B585995N306389P480099L984117j765979m389652k828743O4743J607189
39659A2044158P26122k276185n077444m539389p50807K165632J398742o89335
39651C001494n46030J094643R81535j222722l008516l465912l784539l634752
39643a0584799j068423L229547N240206K909488n40594p60806K035844L812745
39635D273208K212890r26694k571967k133855j243603r42984m82628R64445K536391
$$ y = [4554170, 4483705, 2776980, 825074, 306172, 1377318, 3575978, 6409165, 8401798, 7975493, 6189103, 6123529, 8433557, 10080845, 8839115, 6368358, 5010763, 4142976, 2072425, -551219, -1777125, -1277628, 12631, 1704519, 3281167, 3328378, 1979684, 2585995, 7892384, 15372483, 19356600, 17590621, 13200969, 10372226, 10436969, 12044158, 12770280, 10494095, 5416651, 877262, 126455, 2292087, 3690829, 3001494, 2455464, 3550107, 4531642, 3308920, 300404, -3165508, -6950047, -10584799, -11653222, -8423675, -3183469, -273981, -814575, -1575381, 460463, 4273208, 6486098, 5559404, 2987437, 853582, -390021, -1333005, -1815633, -851188, 1685203]
39626A685203K621216J146635k63265n12599k13257k41690l72966j19812K25541
39617C955006L78236P80552J367079Q27427j285887k869826j877587K02256J83525
39608A660781j769738k137866K86447K157447Q18465j331509o61789J806639K135186
39599B964063o2921j085670P53109K548764J692447j78059l11336Q60921J255054
39590H436372Q69790J008748J243449K86257j057513j032039m32250j492435l411637
39581D418742k835462N11692K608398J123538j097701q88605L19387l64691k060806
39572A734492j986096o64580r16421k482991k036441J265871M208123M334479
39564C456436K892856J839450J081083J87220k2863N76275L57622j232361k076446
$$ y = [1685203, 4306419, 5453054, 5189789, 4677190, 4463933, 4222243, 3849277, 3729465, 3955006, 4333242, 5113794, 6480873, 7308300, 6022413, 3152587, 1275000, 1477256, 1660781, -108957, -2246823, -1960376, 197071, 1015536, -315973, -977762, 828877, 2964063, 2901142, 1815472, 2568581, 5117345, 6809792, 6631733, 6320397, 7181318, 8436372, 9306162, 10314910, 11558359, 11844616, 10787103, 9755064, 9322814, 7830379, 4418742, 1583280, 2094972, 4703370, 5826908, 4729207, 3840602, 4159989, 3795298, 1734492, -251604, -916184, -1832605, -4315596, -6352037, -5086166, -878043, 3456436, 6349292, 8188742, 9269825, 9457045, 9434182, 10010457, 10368079, 9135718, 7059272]
39555G059272q08193L51585j019450l007146j667345K711806N225007K912229
39547A1757765j312272k896052j560470o08335j493899k014732m10613J322799
39539B784191K44467k780164l907688j881487J30534n52691k074241j212998J465647
39530g784430K771117K009207J413670J822069J638291N79780P48938K622800
39522E821442L310157Q10445k669208l821513k471337o29443O09884J044482J80797
39513B185706j534084j889368L53488L259350M283507L461187K055269Q4221k262005
39504I997271k900399p86557J229086O1467k630023l065240j577997j567516k927429
39495d167337j839130K284439M849014K868319o98152j736140m41737N84659O57196
$$ y = [7059272, 6251079, 6602664, 5583214, 2576068, 908723, 3620529, 8845536, 11757765, 10445493, 7549441, 5988971, 5380636, 3886737, 1872005, 1461392, 2784191, 3028658, 248494, -3659194, -5540681, -5410147, -5962838, -8037079, -9250077, -7784430, -5013313, -3004106, -1590436, 231633, 1869924, 2449704, 3198642, 5821442, 9131599, 9942044, 7272836, 3451323, 979986, 350543, 960427, 2004909, 2185706, 651622, -1237746, -884258, 2375092, 6658599, 10119786, 12175055, 12259276, 9997271, 7096872, 6310315, 7539401, 7600868, 4970845, 1905605, 327608, -1239908, -4167337, -6006467, -3722028, 1126986, 3995305, 3297153, 1561013, 1119276, 1703935, 2361131]
39486B361131O61644O77848M33845L87748M99870j88607j218502l26355K777190
39477F065812M774194L162883l3978j515980j455879k129591l663745m292236
39469I11480l572619k381238p13697J737304L761334M089329L699640L907700
39461A1439233L273778k29151m580563n019257m90872M397805M935148J430093
39453A5156214k277148l482697k542144j282872o45232R1792J741625L257151
39445A0016689K776152P81905j58945K48652r03661m240127n345362j192482L951222
39436E934043M065997L53085j290617j26796r21109m662437o425303l959046j224402
39427h256585p69276M64835M008986N275670J335161k456882j1587N565720O449578
$$ y = [2361131, 3022775, 3700623, 4134468, 4522216, 5022086, 4833479, 3614977, 3288622, 6065812, 10840006, 14002889, 13968911, 12452931, 10997052, 8867461, 5203716, 911480, -2661139, -5042377, -5756074, -4018770, -257436, 3831893, 7531533, 11439233, 14713011, 14483860, 9903297, 4884040, 4393168, 8790973, 13726121, 15156214, 12879066, 9396369, 6854225, 5571353, 4926121, 5017913, 6759538, 10016689, 12792841, 13574746, 13415801, 13664453, 12760792, 8520665, 3175303, 1982821, 5934043, 10000040, 10353125, 9062508, 8935712, 8014603, 3352166, -3073137, -7032183, -8256585, -9025861, -8561026, -4552040, 723630, 2058791, -398091, -409678, 5156042, 11605620]
39418A1605620J617748k961059l863715l107211k228413j49052K471504K621013
39410F006435Q0414j527103k63101J549743J526047L24081o18173j044434n45186
39401E488723J382912K977647J424728k369565l819700j153802J556589R7424
39393E584956m003059n850184l452226P48402L315618K940736R88487P6545J400741
39384A750016L244026L308075K058595J619269J879460Q59036j041247r69421
39376A2707809J333457K373092M06711j733154j523562p45110j729497k979553
39368H110193k024505J4901L91539p84399j564865j827267k298447j623100J552580
39359e3370M719973M007113J67266k045982p09959R92813J92464j588514j435416
$$ y = [11605620, 13223368, 10262309, 6398594, 3291383, 1062970, 913918, 3385422, 6006435, 6086849, 4559746, 4296645, 5846388, 7372435, 7696516, 7078343, 6033909, 5488723, 6871635, 9849282, 11274010, 8904445, 5084745, 3930943, 5487532, 5584956, 1581897, -4268287, -7720513, -6972111, -3656493, -715757, 272730, 349275, 1750016, 4994042, 8302117, 10360712, 11979981, 13859441, 14718477, 13677230, 12707809, 14041266, 16414358, 16821069, 15087915, 13564353, 12819243, 11089746, 8110193, 6085688, 6100589, 6492128, 5707729, 4142864, 2315597, 17150, -1605950, -53370, 4666603, 8673716, 8840982, 6795000, 6085041, 7077854, 7270318, 5681804, 4246388]
39350D246388O00382K144816J861895M52219q08470j279476j105756q28613p23480
39341D559905n49004j70577J32041N23990J919960M414896O147512N003877J154760
39332B3137360k975506m899457l785813r15113J040496L59340j599401k050311
39324H311595q01571k91284j099867p97234J162284J284926k210377n065582k617081
39315b124191K933563N580798L883754J363506O5953r41828j509017m11773O96258
39306I537023j128135m217422l603699Q41627L339502J044597j639040k43852
39298C930601L278019M537899K962205O14204j642213l320359k720413L81133
39290H021076K892306K245607j70754j841969k672119l192404k294296K27282
$$ y = [4246388, 4846770, 6991586, 8853481, 9305700, 8497230, 7217754, 6111998, 5283385, 4559905, 4010901, 3840324, 3972365, 4496355, 6416315, 10831211, 16978723, 21982600, 23137360, 20161854, 15262397, 11476584, 10561471, 11601967, 11961307, 10361906, 8311595, 7510024, 7218740, 6118873, 5321639, 6483923, 7768849, 5558472, 492890, -2124191, 809372, 6390170, 10273924, 11637430, 11703383, 10761555, 9252538, 8840765, 9537023, 8408888, 4191466, 587767, 1429394, 4768896, 5813493, 4174453, 3930601, 7208620, 11746519, 14708724, 15322928, 13680715, 10360356, 7639943, 8021076, 10913382, 13158989, 12988235, 11146266, 8474147, 5281743, 2987447, 3214729]
39282C214729J779790Q98554K78419K362926M624133L247125p54452l337535l522236
39273H791453l372886l323540k013319n2771L04621q93777j319838k29428Q91343
39264a218142J255960J302172P62710o71703j308386O17073L379028L592747J459449
39255I170908O12165K390087L715642J708811k235638m206910k100117K327652
39247A1382600M835107K699411j782509l379312o85659J933077J230862J31315
39239A6364892J984585L644062L11617n298525n903083q53599L118630K736877
39231A6105456K098088M028118N037836K220824j282642j800623p84059q58892
39223B4764106j022945M1587L58404j217824j464031J883099N110777L952356
$$ y = [3214729, 4994519, 5893073, 6171492, 8534418, 13158551, 16405676, 15651224, 12313689, 8791453, 5418567, 2095027, 81708, 28937, 333558, -560219, -1880057, -2109485, -1218142, 37818, 1339990, 2102700, 1430997, 122611, 739684, 4118712, 7711459, 9170908, 9783073, 12173160, 15888802, 17597613, 15361975, 11155065, 9054948, 11382600, 16217707, 18917118, 17134609, 13755297, 13069638, 15002715, 16233577, 16364892, 18349477, 21993539, 22305156, 17006631, 11103548, 10249949, 13368579, 16105456, 18203544, 22231662, 27269498, 29490322, 28207680, 26407057, 25622998, 24764106, 23741161, 23782748, 24141152, 22923328, 21459297, 23342396, 28453173, 32405529]
39215C2405529O34115O9031J912340K218852P77272O66578J844239J307001p67332
39206D1067625q21846J824613L721702K971204J496680Q43676J41930p32974j77087
39197E0335523J645156K130495M90582p85640j22957P91309K96930p96688j603750
39188E2380960k867094m508482m469144k055269K15498K70192m30050K77223J567761
39179D0381595J351651o5798p55170m95946q31395k355582m024027m915106n091593
39170B3198629m852888m224326l026199r82046J603886L154401K216948n4711
39162A7033694o96446R57326K081077N90977j690354k081895j162524j184560
39154A3847295j931487j281196Q28060K091133J468396M14970K08378M84371Q74515
$$ y = [32405529, 33039644, 33108675, 35021015, 37239867, 38017139, 38683717, 40527956, 41834957, 41067625, 40245779, 42070392, 45792094, 48763298, 50259978, 51103654, 51245584, 50512610, 50335523, 51980679, 54111174, 54601756, 53816116, 53693159, 54484468, 54781398, 53984710, 52380960, 49513866, 45005384, 40536240, 38480971, 38696469, 38966661, 38536611, 38813834, 40381595, 41733246, 41667448, 40912278, 40416332, 39584937, 37229355, 33205328, 28290222, 23198629, 18345741, 14121415, 11095216, 10113170, 11717056, 14871457, 17088405, 17033694, 16337248, 17294574, 19375651, 19966628, 18276274, 16194379, 15031855, 13847295, 11915808, 10634612, 11462672, 13553805, 15022201, 15437171, 15645549, 16129920, 17004435]
39145A7004435J763964K664312J962928n80967k730758k380899j82989J390935
39137A8910961Q10064j292032k895003k270505L06186K497237K547591J626207
39129B0240706J895075K656688J059661k922661n289017l380262K61187J698774
39121A6220151R28152M60698M84616p97239k836773k794664k83076J597929R89639
39112A3969433k95823o05170j441988m141657o186565m237850M79943L290974
39104H31297K374494Q56653J937628M540993N335484L458526J302809R60932J485364
39095B3084180M19485k546457m622789l251479L82679K571647J694661j89107
39087A7542820q99992j163151k479983l808617k939015l36025J137606K96480
$$ y = [17004435, 18768399, 21432711, 23395639, 22814672, 20083914, 17703015, 17520026, 18910961, 19721025, 18428993, 15533990, 13263485, 13569671, 16066908, 18614499, 20240706, 22135781, 24792469, 25852130, 22929469, 17640452, 14260190, 14521377, 16220151, 17148303, 17609001, 18093617, 17296378, 14459605, 11664941, 11381865, 12979794, 13969433, 13673610, 13068440, 11626452, 7484795, 1298230, -2939620, -2459677, 831297, 3205791, 4062444, 6000072, 10541065, 15876549, 19335075, 20637884, 21598816, 23084180, 23503665, 20957208, 16334419, 13082940, 13465619, 16037266, 17731927, 17542820, 16642828, 15479677, 12999694, 9191077, 6252062, 5916037, 7053643, 7350123]
39079G350123j100163j496169j440856j515556q01670J077121K359104J515405
39071E947339j74251m93156K15262k39210j958241k219660N42135L963961M481605
39062A0065784J792410j098330j938917j521152j492946j659569q19083Q90205
39054D218402K262156K977804L335226K552259j37251k815448k509128j34659
39046I749361p6828l141087m102824M34868N657078M930156k74175k868836j001509
39037I306204L91999j114023j777025P36069K737140R52188j843000j737568J37327
39028G789311O41330J15900L82772M62735j042941k008427p5828K308322J148536
39019I721710k446358l868382k101636k38471L13820J109154K363328K243240
$$ y = [7350123, 6249960, 4753791, 3312935, 1797379, 995709, 2072830, 4431934, 5947339, 5773088, 5279932, 5495194, 5255984, 3297743, 1078083, 1620218, 5584179, 10065784, 11858194, 10759864, 8820947, 7299795, 5806849, 4147280, 3328197, 4218402, 6480558, 9458362, 12793588, 15345847, 15208596, 12393148, 9884020, 9749361, 9672533, 6531446, 2428622, 2863490, 8520568, 13450724, 13176549, 10307713, 9306204, 9698203, 8584180, 6807155, 7543224, 10280364, 11232552, 9389552, 7651984, 7789311, 8430641, 8546541, 8929313, 9392048, 8349107, 6340680, 6264852, 8573174, 9721710, 7275352, 3406970, 1305334, 1066863, 1380683, 2489837, 4853165, 7096405]
39011G096405P39091j66733m85618k020696l862417k736949J238250L653301K100456
39002E555090o57309j380349m74711K69025O01704O98521J68538k80082Q82025
38993E382452K835368K698343J64961j652200j374568j467285l280763l970694
38985f64386j130370K858645M147448K468091J49540j500377k319679k051624
38977A957288j190336q91732n01080J908557N095741M745092K63148k956977j268912
38968G160789J707931J313773r10860j241375p85289k311758l589605j051030
38960B92576K345927Q05600l895388m013036J690398N346137K018257l193059
38952A397412l640797l42920J793572J915149K272458K757467J526222o75624
$$ y = [7096405, 7835496, 7668763, 7183145, 5162449, 1300032, -1436917, -198667, 3454634, 5555090, 4897781, 3517432, 3042721, 3311746, 3913450, 4611971, 4780509, 4500427, 5382452, 8217820, 10916163, 11081124, 9428924, 8054356, 6587071, 3306308, -664386, -1794756, 1063889, 5211337, 7679428, 7828968, 6328591, 4008912, 1957288, 766952, -124780, -625860, 1282697, 6378438, 11123530, 11386678, 8429701, 7160789, 8868720, 10182493, 9271633, 8030258, 7244969, 4933211, 1343606, 292576, 2638503, 3444103, -451285, -4464321, -2773923, 2572214, 4590471, 1397412, -2243385, -2586305, -792733, 1122416, 3394874, 6152341, 7678563, 7002939]
38944G002939j159937L77574J383963R6062k497574m169970l631776j541610R4581
38935d045748J97569P7312J211115K288100J087554j174844j017816J492829K290110
38926B406181j10069j926926j99461K604795L064604K143741K359154K735549
38918A3077568Q46967k283695l634025l143068l160940l824831k871894K10187
38910d783731L202488M305325L570309J524950r97921k100013n93612J726781
38902E854576K046246L80163q77479o08668L47280J408889K340876J826542r32457
38893A1785968l617774l036412J77921K255339J542190j93396j505608k615012
38885D793216k902468j132512J168816P39445j931153k488202L08819K121549
$$ y = [7002939, 5843002, 6220576, 7604539, 7700601, 5203027, 1033057, -2598719, -4140329, -4045748, -3848179, -3770867, -2559752, -271652, 815902, -358942, -1376758, 116071, 2406181, 2296112, 369186, 169725, 2774520, 5839124, 7982865, 10342019, 13077568, 13924535, 11640840, 8006815, 4863747, 1702807, -2122024, -4993918, -4783731, -1581243, 2724082, 6294391, 7819341, 6821420, 4721407, 4127795, 5854576, 7900822, 8280985, 7403506, 6794838, 7142118, 8551007, 10891883, 12718425, 11785968, 8168194, 5131782, 5309703, 7565042, 9107232, 8913836, 7408228, 4793216, 1890748, 758236, 1927052, 2666497, 735344, -1752858, -1444039, 677510]
38877F77510R8346k179720n83703K636130K589916k86784j266322J009179L039819
38868E734371K468338R27009K45929j46254q34671q49070m6456k49327k215220
38859E034649l740057k758557o36416k71044j930599l006982j604845J248691
38851g665160L146356K960143J569603N00163K81861J72500o38212j860203k435323
38842c968272j864456p32302J52714P40387J603259K914432L804929L082267P67762
38833F500720j540067k429990k364392k602623k833242j515489J281041L312039
38825b192003L179124K018543J113968m3858j634496j738539N73324K185244l64681
38816C096626m894958n404115m13849M444342L885985k51493k255652k72344K307306
$$ y = [677510, 775856, -1403864, -1987567, 648563, 3238479, 2951695, 1685373, 2694552, 5734371, 8202709, 9129718, 9375647, 9229393, 8394722, 7545652, 7499196, 7249869, 5034649, 1294592, -1463965, -2100381, -2371425, -4302024, -7309006, -8913851, -7665160, -4518804, -1558661, 10942, 511105, 792966, 965466, 327254, -1532949, -3968272, -5832728, -6565030, -6412316, -5671929, -4068670, -1154238, 2650691, 5732958, 6500720, 4960653, 2530663, 166271, -2436352, -5269594, -6785083, -5504042, -2192003, 987121, 3005664, 4119632, 4075774, 2441278, 702739, 1276063, 3461307, 3096626, -1798332, -7202447, -7616296, -3171954, 714031, 462538, -1793114, -2065458, 241848]
38807B41848K252244L45627n72469M75018J660199Q24044j746318l427992k370057
38798b317856J67998J578076J423792J477273K381033K566189J217814J9833M04611
38789H918763Q96546p33298l717585m785936k144563K508255N831091N754609
38781A2527882K874065k94692j779118k145410l184528m610052l983216o99822
38773a294891K242842K168971L81652l38238p9145q01709k288945k373956p29707
38764c113126P34247J230936J800020K394759J417264r59078j914524J12639K912233
38755D615370L426594J420511j119087k628590k662702j375968K96432R65138
38747B937698L39329m53884o39573n48382j40077J343726L333701L576728J317410
$$ y = [241848, 2494092, 2839719, 2267250, 2742268, 4402467, 5226511, 3480193, 52201, -2317856, -2149858, -571782, 852010, 2329283, 4710316, 7276505, 8494319, 8514152, 8918763, 9815309, 9082011, 5364426, 578490, -1566073, 942182, 6773273, 12527882, 15401947, 15107255, 13328137, 11182727, 7998199, 3388147, -595069, -1294891, 947951, 3116922, 3498574, 3160336, 3081191, 2279482, -9463, -2383419, -3113126, -2378879, -1147943, 652077, 3046836, 4464100, 3505022, 1590498, 1703137, 4615370, 8041964, 9462475, 8343388, 5714798, 3052096, 1676128, 1972560, 2937698, 3277027, 2823143, 2183570, 1635188, 1495111, 2838837, 6172538, 9749266, 11066676]
38738A1066676r24509n61200J450249K058282J14647k845403m879373m948559
38730E30810k821729M65694K612800K210680M98179l87328j60327J44890N00058
38721C593727J564972K542979J650083j115818l531490l738179j791760J304620
38713D79134M341486N584121L734640q9160k929312l311507k651030k648281k772604
38704b62513j543400P45825K116473J503245P5614l70462L08119N99889l35081
38695B837709j136627p8472J865796J628067j480830l854480k124477J756644
38687e86670K735903m38438l562500k832472M56482K502078J987475M65112o45469
38678H1501j102476o67491Q10703K153237J604314p24959k592366k382813r45596
$$ y = [11066676, 10142167, 9580967, 11031216, 13089498, 13204145, 10358742, 5479369, 530810, -2290919, -1825225, 787575, 2998255, 3496434, 3109106, 2948779, 3093669, 3593727, 5158699, 7701678, 9351761, 8235943, 4704453, 966274, -825486, 479134, 4820620, 10404741, 14139381, 14050221, 11120909, 7809402, 5158372, 2510091, -262513, -1805913, -1060088, 1056385, 2559630, 2635244, 2264782, 2572901, 3172790, 2837709, 1701082, 1622610, 3488406, 5116473, 3635643, -218837, -2343314, -586670, 2149233, 1710795, -1851705, -4684177, -4227695, -1725617, 261858, 726970, 81501, -1020975, -1688466, -877763, 1275474, 2879788, 2154829, -437537, -2820350, -3765946]
38669c765946R6521Q21354K469579M811653N622961L435075k13439k366396k036640
38660H874722q49473n00150r51994j352565j199571L1505K780792N752332N928530
38651A8514128K031997l079861n402491m359196k418511j088281O0016Q72890
38643E130691L29573q33744l64484J628092K052408l84284k697746k074536j37863
38634B648107m104j312962j569365q58278j319420k548218j638286J660706L639439
38625a302381K005469n47925l36454J987945K648483J04937l134779l744198r82770
38616c301673K973628M940206L221172p65609l558228l109333q26374M36939l18752
38607c08024j815415k492860j666472N68167L049542L660835J402414j873233
$$ y = [-3765946, -3669425, -2848071, -378492, 4433161, 10056122, 13491197, 13277758, 10911362, 8874722, 8025249, 7525099, 6573105, 5220540, 4020969, 4052474, 6833266, 12585598, 18514128, 20546125, 17466264, 12063773, 7704577, 5286066, 4197785, 4257801, 5130691, 5460264, 4626520, 4262036, 5890128, 7942536, 7558252, 4860506, 2785970, 2648107, 2644003, 1331041, -238324, -1096602, -2416022, -4964240, -6602526, -4941820, -1302381, 703088, 155163, -181291, 1806654, 4455137, 4560074, 1425295, -2318903, -3301673, -328045, 4612161, 7833333, 7067724, 3509496, 400163, -426211, 10728, -308024, -2123439, -4616299, -6282771, -5714604, -2665062, 995773, 2398187, 524954]
38599E24954l397370k848307j978907j351460M194J645751J537263k81599r76054
38590g121535N90749J827422J055320P72587K967792M377218J108906m202008
38582A376451n362261j689759J702827K418648L124666M531689L124497j374317
38574G852441l161465N62730L755004N80112m833279m715497J46359K575072J070770
38565C832247R75213L889146M699247R96469k342138j255956J260758R33898j101634
38556A1887250j641750j074535j245753j092641J138530L792721L949111J801910
38548A7514843l97378j825353k550482j816544l3719r3169l198475n692576l857540
38539a950393L07837K296006J981594K396196L196527J153972l011500m162137
$$ y = [524954, -2872416, -5720723, -7699630, -9051090, -9046896, -7401145, -5863882, -6145481, -7121535, -6530786, -4703364, -3648044, -2875457, 92335, 4469553, 5578459, 1376451, -3985810, -5675569, -3972742, -1554094, 1570572, 6102261, 9226758, 7852441, 4690976, 5253706, 9008710, 9588822, 4755543, 40046, 186405, 2761477, 3832247, 4807460, 8696606, 13395853, 14392322, 12050184, 10794228, 12054986, 12988884, 11887250, 10245500, 9170965, 7925212, 6832571, 7971101, 11763822, 15712933, 17514843, 17117465, 15292112, 12741630, 10925086, 10891367, 10798198, 7599723, 1907147, -1950393, -1642556, 653450, 2635044, 5031240, 8227767, 9381739, 6370239, 2208102]
38531B208102m72794L368939K888160k93203j903591j123923k09118j19154L45526
38522D688944J736652K661961J600271j015257k886004k087801O40910K440789
38514G780465J680393k60758j454415k069109k801472k436642J70811K881550
38506C490823K507361j81774j290127K93971J551760N11083j006497j066910n16676
38497D293014n04703l36375K76593j09360j572728j426608J436445L609118J823291
38488G488687j709669k256539O57614L203348L176226K178352J846508J420632
38480A6005159k4896j598201j995497j056919Q76010L449741N353588M541059
38472B5550044O12286l942471n848143m002795r3324L017837L356263J236370
$$ y = [2208102, 1735308, 5104247, 7992407, 7699204, 5795613, 4671690, 4462572, 4343418, 4688944, 6425596, 9087557, 10687828, 9672571, 6786567, 4698766, 5339676, 7780465, 9460858, 9200100, 7745685, 5676576, 2875104, 438462, 609273, 3490823, 5998184, 5816410, 4526283, 4820254, 6372014, 6883097, 5876600, 4809690, 4293014, 3788311, 3451936, 3728529, 3619169, 2046441, 619833, 2056278, 5665396, 7488687, 5779018, 3522479, 4180093, 7383441, 10559667, 12738019, 14584527, 16005159, 15980263, 14382062, 12386565, 11329646, 12205656, 15655397, 21008985, 25550044, 26162330, 22219859, 16371716, 12368921, 12275597, 15293434, 18649697, 19886067]
38464A9886067r92497j290216j60685L06166m16466n85207Q20469K090753J245966
38455B0904350o98860j023027N74144J514514M28887p50531j88395N71818q21090
38446B0511810l133477k953805j23120J741697Q28406k68471P89346K080383P92804
38437B0265573j965487l054201k231512j647685j619223p22441M57656l54821
38429I127859k825304l714809j611462J297600K906211L397591K977349R03558
38421A2458593j889022k547870l87264J780234J975093J541035J602308O30529
38413A5163636k017865l636567k294127k67893k1918J03012K212075L836712J536783
38404A4613848k511943k935008P46657L677457L122648J301807L96955l16412
$$ y = [19886067, 18893570, 17603354, 17442669, 17748835, 17332369, 16747162, 17567631, 19658384, 20904350, 20205490, 19182463, 19756607, 21271121, 21700008, 20949477, 20761082, 21332900, 20511810, 17378333, 14424528, 14301408, 16043105, 16871511, 16603040, 17392386, 19472769, 20265573, 18300086, 15245885, 13014373, 11366688, 9747465, 9025024, 9482680, 9127859, 6302555, 2587746, 976284, 2273884, 5180095, 8577686, 11555035, 12458593, 10569571, 8021701, 7634437, 9414671, 11389764, 12930799, 14533107, 15163636, 13145771, 9509204, 7215077, 6947184, 6925266, 7028278, 9240353, 13077065, 14613848, 12101905, 9166897, 9913554, 13591011, 16713659, 18015466, 18412421, 18096009]
38396A8096009j266986j070376K10069L00410j131710j429167R4520R1113l362781
38387A0531101o742942n642559p08452L986184O164242N924024L352715q81604
38379A5982709m014105l749522j539926l67000k76155P22930K306962K157226
38371A1223119L00630q08687q49117k155650m609358m331060Q6536L832080K045174
38362D733667k833614m181988m07113L451512L360988J175569N02703J365625
38354G167349J425297N2613j492429k435602k640216j566654N73813J659110K06165
38345B949446j693852q30094K140616L340966J495048l35284J38897J010038j12751
38336H103030j864109j401322J031923K777052K762802J964504O79177j654580
$$ y = [18096009, 16829023, 15758647, 15968716, 16269126, 15137416, 13708249, 13802769, 13893882, 10531101, 3788159, -1854400, -2562852, 1423332, 7587574, 13511598, 16864313, 15982709, 11968604, 8219082, 6679156, 6312156, 6036001, 6758931, 9065893, 11223119, 11523749, 10715062, 9865945, 7710295, 3100937, -1230123, -1143587, 2688493, 4733667, 1900053, -2281935, -2689048, 762464, 4123452, 5299021, 5801724, 7167349, 8592646, 8645259, 7152830, 4717228, 2077012, 510358, 1084171, 2743281, 2949446, 1255594, 425500, 2566116, 5907082, 7402130, 7066846, 7205743, 8215781, 8103030, 6238921, 4837599, 5869522, 8646574, 11409376, 13373880, 14053057, 12398477]
38328A2398477m032044m113846j517153J227605J754509L43925j192346j643821
38320C225306q41030P36591K042385J980331M22285j672703l137020l126509j286886
38311a657250J601549L518496K980964Q53403o42287n17401M22270J208061J552994
38302I320799J284067L58187n64684q26337r46455j822245k997986l253108k753469
38293b201231k847935l570439l159768o42158K559661M228157L502049J164493
38285i67171j048956j283858R25080L652193M301393K545944L59161q60399j624845
38276E998542k629169l400767l282364k432102j307994k07431N24160R51086J990539
38267c795500L879881M605514K050480k314614m431969k882813o05553m80711
$$ y = [12398477, 8366433, 4252587, 2735434, 3963039, 5717548, 6061473, 4869127, 3225306, 2384276, 3120867, 5163252, 7143583, 7565868, 5893165, 2756145, -370364, -1657250, -55701, 3462795, 6443759, 7297162, 6654875, 6137474, 6559744, 7767805, 9320799, 10604866, 10963053, 10398369, 9572032, 8625577, 6803332, 3805346, 552238, -2201231, -5049166, -8619605, -11779373, -12421531, -9861870, -5633713, -2131664, -967171, -2016127, -3299985, -2374905, 1277288, 5578681, 8124625, 8483786, 7623387, 5998542, 3369373, -31394, -3313758, -5745860, -7053854, -7261285, -6737125, -5786039, -3795500, 84381, 4689895, 6740375, 4425761, -6208, -2889021, -3494574, -3975285]
38259c975285j642958j565348K41231K202700K916563K197098J025151R55862
38251B355014K142746K136113q89152l940111k071688L765717O368297K101831
38243A1968767l479878l589002K46383J642048o05831k068100r70252m75503k076412
38234E92220k562625K47340L274926K572988j099826l860683l795268k072316
38226f703244m44139K76191J78939K53805J645886L818390M390342J865219k313439
38217B967950n328082n778599m161966j594690Q83095K425012K859055K800685
38209d927540K716082K242326Q99535q87792j903550j179622J009251K942356
38201I11046K708119L53922j705237j409587K99586Q42414m24918j702461j729430
$$ y = [-3975285, -5618243, -7183591, -6942360, -4739660, -1823097, 374001, 1399152, 2355014, 4497760, 6633873, 5744721, 1804610, -267078, 3498639, 9866936, 11968767, 8488889, 4899887, 5146270, 6788318, 6182487, 4114387, 3144135, 2668632, 592220, -1970405, -1723065, 1551861, 4124849, 3025023, -835660, -4630928, -6703244, -7147383, -6871192, -6692253, -6438448, -4792562, -974172, 3416170, 5281389, 2967950, -2360132, -8138731, -12300697, -13895387, -13012292, -10587280, -7728225, -4927540, -2211458, 30868, 930403, 42611, -1860939, -3040561, -2031310, 911046, 3619165, 3973087, 2267850, 858263, 1157849, 2000263, 1575345, -127116, -1856546]
38192a856546j323600j473615j711362j274368m70027P4301M33415Q85539J392662
38183e323601K123507L303516M029651K758111j70580k093739j381315J93810
38175C439360k4081j923000l315537l313527k864036k357298r78062J287304K952318
38166g096559L050420K396671K061868J796194Q51023n91830j760428k326942
38158a619583k155622p09267K039429M436962M373047K003511O252L89025J995408
38149A0759162K177126K08769k279951l830755m383175l853651j570865J710786
38141a062554L045157O95073k591112k256116J994830N284336L711020p50675
38133H069959l229141k202824l58573L1454k59242P6453K76728r62630k948525
$$ y = [-1856546, -3180146, -4653761, -6365123, -7639491, -8109518, -8035217, -7601802, -6716263, -5323601, -3200094, 103422, 4133073, 6891184, 6720604, 4626865, 3245550, 3439360, 3415279, 1492279, -1823258, -5136785, -8000821, -10358119, -11336181, -10048877, -7096559, -4046139, -1649468, 412400, 2208594, 3059617, 2467787, 707359, -1619583, -3775205, -4484472, -2445043, 1991919, 6364966, 8368477, 8374729, 8763754, 10759162, 12936288, 13145057, 10865106, 7034351, 2651176, -1202475, -2773340, -1062554, 1982603, 2677676, 86564, -2169552, -174722, 5109614, 8820634, 8069959, 4840818, 2637994, 2279421, 2310875, 2051633, 2128086, 2404814, 1442184, -1506341]
38124a506341l905647l577089k988875k133646q8914K517996L568134K734327
38116e380055K351073L572249L938979J115010k734851l447141r19414P83093
38108g21057m63364k040302j004477J653288K939253J838014m73491k614233l405212
38099d291581j852671J394960L742215L390477J306352o86445k113838k799076
38091a909607j748186Q43215K422839J321631o10346j056475q50282j564678j772384
38082d924273L10322K346569Q99121k227974k119807J090884K145011n43139k301294
38073e324580m23602J333894m9202j067026J881026N089744K853717k957044n337052
38064d000125k642390N608l29647n28171K078005M993351N063854L380802K467508
$$ y = [-1506341, -5411988, -8989077, -11977952, -14111598, -14200512, -11682516, -8114382, -5380055, -3028982, 543267, 4482246, 5597256, 2862405, -584736, -1504150, -721057, -1184421, -3224723, -4229200, -2575912, 363341, 2201355, 1727864, -886369, -4291581, -6144252, -4749292, -1007077, 2383400, 3689752, 3003307, 889469, -1909607, -3657793, -2814578, -391739, 929892, 319546, -736929, -1587211, -3151889, -4924273, -4613951, -2267382, -1368261, -3596235, -5716042, -4625158, -2480147, -3023286, -5324580, -5748182, -4414288, -4463490, -5530516, -3649490, 1440254, 4293971, 1336927, -4000125, -6642515, -6636907, -6966554, -7494725, -5416720, -423369, 4640485, 8021287, 10488795]
38055A0488795J719769q47500m264322n464053l694882j222743J89719J078069
38047b017148K236117K988629K523376J587826J478327J895428J257032p04983
38039A1244604k091370j483728k82491p98755k677664l339667j934633m00341
38031a764045J0364N10332J685439J507643j068470l045353j387887J690768J614813
38022b46396j256488j924940J302573L992385K433084j007526k144520j055219
38014I2953l86281k45042J123439L053298L021129J051675k52356j89095p34343
38005F535377k132917j548069K018788M746459K841454j763047l839642j955731
37997D902672K05709m08381k313848k384325k29460J975618K498391J206924j220004
$$ y = [10488795, 12208564, 11361064, 7096742, 1632689, -2062193, -3284936, -3095217, -2017148, 218969, 3207598, 5730974, 7318800, 8797127, 10692555, 11949587, 11244604, 9153234, 7669506, 7387015, 6588260, 3910596, 570929, -1363704, -1764045, -1753681, -1243349, 442090, 1949733, 881263, -2164090, -3551977, -1861209, -246396, -1502884, -3427824, -2125251, 1867134, 4300218, 3292692, 1148172, 92953, -293328, -538370, 585069, 3638367, 6659496, 7711171, 7458815, 7269720, 6535377, 4402460, 2854391, 4873179, 9619638, 12461092, 10698045, 6858403, 4902672, 5108381, 4700000, 2386152, 1827, -227633, 1747985, 4246376, 5453300, 4233296]
37988D233296l483064l693223j090768K277651L242265J226270j068840j159421
37980D84166L42222J099464J27619j635064l029825l557257k800442l81923L029295
37971f321745N518694N478883L258115Q95529Q1759M20665o6206k422271m967159
37962A876264m832230j578788J659479J628307r93394k367526m11665K536865
37954b482688K839018K09665k268015k388609j219046o63004m07683R78299K830591
37945b571472K651788o2131k414034j781189O79703J892987J121739K99589O15181
37936D32161J041091N50143k07687k33043L34884R17813J427331J624506P23915
37927F611114j309396k977711k880285j539169o31634q25135j220536p13521O78256
$$ y = [4233296, 750232, -2942991, -4033759, -1756108, 1486157, 2712427, 1643587, 484166, 826388, 1925852, 2053471, 418407, -2611418, -6168675, -8969117, -9351040, -6321745, -803051, 4675832, 7933947, 8829476, 8911235, 9331900, 9265694, 6843423, 1876264, -2955966, -4534754, -2875275, -1246968, -2240362, -4607888, -5019553, -2482688, 356330, 565995, -1702020, -4090629, -5309675, -5972679, -6380362, -5402063, -2571472, 80316, 18185, -2395849, -4177038, -3497335, -1604348, -482609, -183020, 432161, 1473252, 2023395, 1815708, 1582665, 1917549, 2835362, 4262693, 5887199, 6611114, 5301718, 2324007, -556278, -2095447, -2727081, -3552216, -4772752, -5486273, -4808017]
37918d808017J721893J097024r45213k219640q76300K029646L605517K889273
37910B494183J752818J492389P42249j718116m046068l522139n37039J958257
37902a383466K447095K068867K029596J963206J213452j0185j297142k518004
37894D513419l162868k350525p0785K343794L393308K628610P59463q82609j219505
37885E952302m75303j19579j099737k524822k835488j710832P3735J938536L417675
37876B616487L493353J613188r65913k398018k534895k402278j799866L64710
37868b013232L120009L277995l97359m556749m711056p50382K734477K049399
37860a246898r56018j240160K550906N578346K964086k988819n191418j530389
$$ y = [-4808017, -3086124, -1989100, -2934313, -5153953, -6030253, -4000607, -395090, 2494183, 4247001, 5739390, 6481639, 4763523, 717455, -2804684, -3341723, -1383466, 1063629, 3132496, 5162092, 7125298, 8338750, 8328565, 7031423, 4513419, 1350551, -999974, -1070759, 1273035, 4666343, 7294953, 8054416, 7171807, 5952302, 5476999, 5357420, 4257683, 1732861, -1102627, -2813459, -2739724, -801188, 2616487, 6109840, 7723028, 6757115, 4359097, 1824202, -578076, -2377942, -2013232, 1106777, 4384772, 3987413, -569336, -5280392, -6030774, -3296297, -1246898, -2202916, -3443076, -892170, 4686176, 7650262, 4661443, -529975, -2060364]
37852b060364K107277P51900k057895l5562N630678P844237M228815k99096k104198
37843A4005792l321784n474380n033194K04973N295714M414115k30259j792369
37835H068608P16392J765562j061938l292544j316367J621237P66136k584880
37827D682206l239247J7095K998963K440994J46737l14928J389765K483784J115632
37818A1721001j454991k703282j808396l31863k58933j726662k919101k337288
37810a819515q12684m98819j821669k623083j138083J336513K304291J788822
37802c284227J938172L041987K721746L1931k368878k041253m49474k92381j026520
37793a728897k19604J825472K416840J150746N84394J669097J916571n34009l780200
$$ y = [-2060364, 46913, 798813, -1259082, -1294644, 4336034, 12180271, 16409086, 16109990, 14005792, 10684008, 5209628, 176434, 381407, 5677121, 10091236, 9860977, 8068608, 8785000, 10550562, 9488624, 6196080, 4879713, 6500950, 7267086, 4682206, 1442959, 1460054, 4459017, 6900011, 7046748, 6731820, 8121585, 10605369, 11721001, 10266010, 7562728, 5754332, 5422469, 5163536, 3436874, 517773, -1819515, -2632199, -3131018, -4952687, -7575770, -8713853, -7377340, -5073049, -3284227, -1346055, 1695932, 4417678, 4449609, 2080731, 39478, -409996, -702377, -1728897, -1948501, -123029, 2293811, 3444557, 4028951, 5698048, 7614619, 7080610, 3300410]
37784C300410m792235l200261r23815M14686M51734j81916j37052J354993K942435
37775g71021K541746O27009j9343J505726K719111J541410p90058k044984k059156
37766C250440j866795j696977j368394r44453J34327K469863M333805K793448
37758G105264j331048l053475p3366L436593K974878K19695n88650L18983j84358
37749H824516j715932j172892J110060J677770L49120P22402L502724M663483
37741A7961251J968761j403845k044803j084534j218787k380948l093906l302292
37733E400897l204334j743118J120446K890344J984115O78414J773258M042967
37725A2942989M088208J521240q50673j452607j568456k483021l518154l409004
$$ y = [3300410, -1491825, -4692086, -5615901, -5201215, -4749481, -4931397, -5068449, -3713456, -771021, 1770725, 2397734, 2378391, 3884117, 6603228, 8144638, 7354580, 5309596, 3250440, 1383645, -313332, -1681726, -2626179, -2491852, -21989, 4311816, 7105264, 5774216, 2720741, 2647375, 6083968, 9058846, 9278541, 8689891, 9008874, 8824516, 7108584, 5935692, 7045752, 8723522, 9072642, 9795044, 13297768, 17961251, 19930012, 18526167, 16481364, 15396830, 14178043, 11797095, 8703189, 5400897, 2196563, 453445, 1573891, 4464235, 6448350, 7126764, 8900022, 12942989, 17031197, 18552437, 17701764, 16249157, 14680701, 12197680, 8679526, 5270522]
37717E270522j852740O39897K997892L663492J956606n23199j400390o59757p06095
37708I386228k789442m912610m310872r68627K488872L832578L073231J586128
37700G385486N64612N03812J195702J639994O12032j927222m306542m721161l136044
37691b189331j033098L32251N98775k04579j461556j629710J11163J950168J376054
37682b149863p46523q05508J925664L539764J427888j304285o27604J950205K039195
37673E248933l42810j145121P48661K179696J663812J375878J896438L03770l948049
37664G981208o092426k685293K602248M000645J588536j66910L66925R87429O57688
37655I240050O48324Q57567m39008k554399k353749M37495J800176o17375l523304
$$ y = [5270522, 3417782, 4057679, 7055571, 10719063, 12675669, 12152470, 10752080, 10092323, 9386228, 6596786, 1684176, -2626696, -3595323, -1106451, 2726127, 5799358, 7385486, 7950098, 8453910, 9649612, 11289606, 11901638, 9974416, 5667874, 946713, -2189331, -3222429, -2890178, -2291403, -2495982, -3957538, -5587248, -5476085, -3525917, -2149863, -2896386, -3701894, -1776230, 1763534, 3191422, 1887137, 1259533, 3209738, 5248933, 4906123, 3761002, 4509663, 6689359, 8353171, 9729049, 11625487, 11929257, 7981208, 1888782, -796511, 1805737, 5806382, 7394918, 7228008, 7594933, 8582362, 9240050, 9888374, 10745941, 10306933, 7752534, 5398785, 5836280, 7636456, 7019081, 3495777]
37646C495777k888319j75324J13041k261393k731063Q97953M715587M286751J078915
37637F531925R922J966480K729787k02018l531709l093704j12909P24362j861667
37628C160469m293105l505768o42193J442033J851163J537671J287164J160190
37620A997624R17938J57165j195466k260081k058840r06400L18264J809822L803402
37611B583428M432457J515588l291771n369710l207648n35007q69733k902942
37603g645338l330630j594803O02229K253479K999832K038540m22086k208717
37595g307494j883464p45692k27186M63811J833104J958628k0203r21368J979939
37586d869925N615594M935694O71961j718934l40763J051676l36608k549397l024284
$$ y = [3495777, 607458, 432134, 545175, -1716218, -4447281, -3549328, 1166259, 5453010, 6531925, 6541847, 8508327, 11238114, 11036096, 7504387, 4410683, 4297774, 5022136, 3160469, -1132636, -4638404, -5280597, -3838564, -1987401, -449730, 837434, 1997624, 2915562, 3072727, 1877261, -382820, -2441660, -3348060, -3029796, -1219974, 2583428, 7015885, 8531473, 5239702, -130008, -3337656, -3872663, -4742396, -7645338, -10975968, -12570771, -11968542, -9715063, -6715231, -4676691, -5098777, -7307494, -9190958, -9936650, -10163836, -9700025, -7866921, -5908293, -5928496, -6849864, -4869925, 745669, 5681363, 6353324, 4634390, 4293627, 5345303, 5008695, 2459298, -564986]
37577e64986k306950j797290j146525K56592J778144K840590L468888K979358
37569E507821Q31318j002059k3198J982934M32143m498925o526597j997059M378454
37560i15168N923584K422943j687937m157811n288215m147139M7834L937604K949862
37551i14443j599960l305340M14990M680700M260629M35309j939621j318058o3522
37542F50684K95954Q97570K501468L367921J552901j929653l789756k275711P99663
37533B071041K397692J775243N45563k45278j225852k528668k642804q44659R67079
37524B69357Q99546K01910J210296L000955K302090j104884l294821j794263P98215
37515B488401R89071l74203j73891J335187Q66430k088994l718780j468508K001121
$$ y = [-564986, -2871936, -4669226, -5815751, -5559159, -3781015, -940425, 2528463, 5507821, 6339139, 5337080, 5313882, 7296816, 7728959, 3230034, -3296563, -5293622, -915168, 5008416, 7431359, 5743422, 1585611, -3702604, -7849743, -7801909, -3864305, -914443, -2514403, -5819743, -5404753, -724053, 3536576, 3971885, 2032264, 714206, 650684, 946638, 1844208, 4345676, 7713597, 9266498, 7336845, 3547089, 1271378, 2071041, 4468733, 6243976, 6789539, 6544261, 5318409, 2789741, 146937, -697722, 269357, 1168903, 1370813, 2581109, 5582064, 7884154, 6779270, 3484449, 1690186, 2488401, 3477472, 3103269, 2929378, 4264565, 5130995, 3042001, -676779, -2145287, -144166]
37506a44166K615063L59017j627468j832746j309185o89469N49596J817141J461380
37497A199163j83035n39624J300292K930660K273546M02871r23698j888346k503451
$$ y = [-144166, 2470897, 2829914, 1202446, -630300, -1939485, -2628954, -2079358, -262217, 1199163, 1016128, 476504, 1776796, 4707456, 6981002, 7383873, 6460175, 4571829, 2068378]
$$ [...]
##END NTUPLES=NMR SPECTRUM
##END=
