##TITLE=31Pdec_DE-80Wk
 D2O, 24 sc
 27.1.2025
##JCAMPDX= 6.0         $$ Bruker NMR JCAMP-DX V2.0
##DATA TYPE= NMR SPECTRUM
##DATA CLASS= NTUPLES
##ORIGIN= UXNMR, Bruker Analytische Messtechnik GmbH
##OWNER= root
$$ XWIN-NMR		Version 3.5
$$ Mon Jan 27 16:23:20 2025 Russian Standard Time (UT+4h)  she@DPX200
##.OBSERVE FREQUENCY= 81.013821
##.OBSERVE NUCLEUS= ^31P
##.ACQUISITION MODE= SIMULTANEOUS
##.ACQUISITION SCHEME= undefined
##.AVERAGES= 24
##.DIGITISER RES= 17
##SPECTROMETER/DATA SYSTEM= spect
##.PULSE SEQUENCE= zgpg30
##.SOLVENT NAME= CDCl3
##.SHIFT REFERENCE= (INTERNAL, CDCl3, 0, 198.062)
##AUDIT TRAIL= $$ (NUMBER, WHEN, WHO, WHERE, WHAT)
$$ ##TITLE= Audit trail, XWIN-NMR		Version 3.5
$$ ##JCAMPDX= 5.01
$$ ##ORIGIN= Bruker BioSpin GmbH
$$ ##OWNER= she
$$ F:/spectra/data/she/nmr/P31/2/pdata/1/auditp.txt
$$ ##AUDIT TRAIL=  $$ (NUMBER, WHEN, WHO, WHERE, WHAT)
(   1,<2025-01-27 16:21:17.20 +0400>,<she>,<DPX200>,
      <created by zg, POWCHK disabled, PULCHK disabled
       configuration hash MD5:
       00 E9 B6 7A A2 85 ED C7 34 08 36 98 17 FE 4E 26
       data hash MD5: 32K
       46 96 C9 55 AB B2 DA 94 8F 6F E0 DD 25 B2 B1 81>)
(   2,<2025-01-27 16:21:19.78 +0400>,<she>,<DPX200>,
      <Start of raw data processing
       efp BC_mod = 2 LB = 1.5 FT_mod = 6 PKNL = 1 PHC0 = 2107.995 PHC1 = 165.2872 SI = 64K 
       data hash MD5: 64K
       85 EF 33 A9 3A 0A 31 E3 43 DC 42 1B DA F5 04 03>)
(   3,<2025-01-27 16:21:38.39 +0400>,<she>,<DPX200>,
      <pk PHC0 = -44.95295 PHC1 = 0 
       data hash MD5: 64K
       4B 0D 14 1F 8D D8 ED 81 9F 18 C8 C1 53 F9 78 08>)
(   4,<2025-01-27 16:21:41.20 +0400>,<she>,<DPX200>,
      <abs ABSG = 5 
       data hash MD5: 64K
       5C 22 5E 35 78 FC B5 6C 34 F5 A4 23 D2 2B 8A 3C>)
$$ ##END=
$$ 
$$ hash MD5
$$ 51 A5 AF 9E D5 3A 54 27 BB B5 7A F3 20 80 D1 B6
##$RELAX= 
##$RELAX= 
##$RELAX= 
##$RELAX= 
##$RELAX= 
##$RELAX= 
##$RELAX= 
##$RELAX= 
$$ Bruker specific parameters
$$ --------------------------
##$DU= <F:/spectra>
##$EXPNO= 2
##$NAME= <P31>
##$PROCNO= 1
##$TYPE= <nmr>
##$USER= <she>
##$AMP= (0..31)
100 100 100 100 100 100 100 100 100 100 100 100 100 100 100 100 100 100 
100 100 100 100 100 100 100 100 100 100 100 100 100 100 
##$AQSEQ= 0
##$AQ_mod= 1
##$AUNM= <au_zg>
##$AUTOPOS= <>
##$BF1= 81.014009
##$BF2= 200.13
##$BF3= 200.13
##$BF4= 200.13
##$BF5= 200.13
##$BF6= 200.13
##$BF7= 200.13
##$BF8= 200.13
##$BYTORDA= 1
##$CFDGTYP= 0
##$CFRGTYP= 5
##$CHEMSTR= <none>
##$CNST= (0..31)
1 1 145 1 1 1 1 1 1 1 1 1 1 1 1 1 1 1 1 1 1 1 1 1 1 1 1 1 1 1 1 1 
##$CPDPRG= <waltz16>
##$CPDPRG1= <>
##$CPDPRG2= <waltz16>
##$CPDPRG3= <>
##$CPDPRG4= <mlev>
##$CPDPRG5= <mlev>
##$CPDPRG6= <mlev>
##$CPDPRG7= <mlev>
##$CPDPRG8= <mlev>
##$CPDPRGB= <>
##$CPDPRGT= <>
##$D= (0..31)
0 1 0 0 0 0 0 0 0 0.06 0 0.03 2e-05 3e-06 0 0 0.0002 0 0 0 0 0 0 0 0 0 
0 0 0 0 0 0 
##$DATE= 1737980476
##$DBL= (0..7)
120 120 120 11 120 120 24 19 
##$DBP= (0..7)
150 150 150 150 150 150 150 150 
##$DBP07= 0
##$DBPNAM0= <>
##$DBPNAM1= <>
##$DBPNAM2= <>
$$ [...]
##$SUBNAM3= <"">
##$SUBNAM4= <"">
##$SUBNAM5= <"">
##$SUBNAM6= <"">
##$SUBNAM7= <"">
##$SUBNAM8= <"">
##$SUBNAM9= <"">
##$SW= 400.765351723535
##$SWIBOX= (0..15)
0 1 3 0 0 0 0 0 0 0 0 0 0 0 0 0 
##$SW_h= 32467.5324675325
##$TD= 32768
##$TD0= 1
##$TE= 0
##$TE2= 300
##$TE3= 300
##$TEG= 300
##$TL= (0..7)
0 120 53 12 22 120 120 120 
##$TP= (0..7)
150 150 150 150 150 150 150 150 
##$TP07= 0
##$TPNAME0= <>
##$TPNAME1= <>
##$TPNAME2= <>
##$TPNAME3= <>
##$TPNAME4= <>
##$TPNAME5= <>
##$TPNAME6= <>
##$TPNAME7= <>
##$TPOAL= (0..7)
0.5 0.5 0.5 0.5 0.5 0.5 0.5 0.5 
##$TPOFFS= (0..7)
0 0 0 0 0 0 0 0 
##$TUNHIN= 0
##$TUNHOUT= 0
##$TUNXOUT= 0
##$USERA1= <user>
##$USERA2= <user>
##$USERA3= <user>
##$USERA4= <user>
##$USERA5= <user>
##$V9= 5
##$VALIST= <valist>
##$VCLIST= <CCCCCCCCCCCCCCC>
##$VD= 0
##$VDLIST= <DDDDDDDDDDDDDDD>
##$VPLIST= <PPPPPPPPPPPPPPP>
##$VTLIST= <TTTTTTTTTTTTTTT>
##$WBST= 1024
##$WBSW= 4
##$XGAIN= (0..3)
0 0 0 0 
##$XL= 0
##$YL= 0
##$YMAX_a= 8303
##$YMIN_a= -6401
##$ZGOPTNS= <>
##$ZL1= 120
##$ZL2= 120
##$ZL3= 120
##$ZL4= 120
##$ABSF1= 198.0616
##$ABSF2= -202.7028
##$ABSG= 5
##$ABSL= 3
##$ALPHA= 0
##$AQORDER= 0
##$ASSFAC= 0
##$ASSFACI= 0
##$ASSFACX= 0
##$ASSWID= 0
##$AUNMP= <proc_1d>
##$AZFE= 0.1
##$AZFW= 0.5
##$BCFW= 0
##$BC_mod= 2
##$BYTORDP= 0
##$COROFFS= 0
##$CY= -3
##$DATMOD= 1
##$DC= 0
##$DFILT= <>
##$DTYPP= 0
##$F1P= 0
##$F2P= 0
##$FCOR= 1
##$FTSIZE= 65536
##$FT_mod= 6
##$GAMMA= 0
##$GB= 0
##$INTBC= 1
##$INTSCL= 9.790993e-09
##$ISEN= 30
##$LB= 1.5
##$LEV0= 0
##$LPBIN= 0
##$MAXI= 10000
##$MC2= 0
##$MEAN= 0
##$ME_mod= 0
##$MI= 50
##$NCOEF= 0
##$NC_proc= -10
##$NLEV= 6
##$NOISF1= 182.463
##$NOISF2= 159.3651
##$NSP= 0
##$NTH_PI= 0
##$NZP= 0
##$OFFSET= 198.0616
##$PC= 4
##$PHC0= 2063.042
##$PHC1= 165.2872
##$PH_mod= 1
##$PKNL= yes
##$PPARMOD= 0
##$PSCAL= 0
##$PSIGN= 0
##$REVERSE= no
##$SF= 81.0140089999434
##$SI= 65536
##$SIGF1= 159.3651
##$SIGF2= -187.1042
##$SINO= 113.3802
##$SIOLD= 16384
##$SREGLST= <1H.CDCl3>
##$SSB= 0
##$STSI= 65536
##$STSR= 0
##$SW_p= 32467.5324675325
##$SYMM= 0
##$S_DEV= 0
##$TDeff= 32768
##$TDoff= 0
##$TI= <>
##$TILT= no
##$TM1= 0
##$TM2= 0
##$TOPLEV= 0
##$USERP1= <user>
##$USERP2= <user>
##$USERP3= <user>
##$USERP4= <user>
##$USERP5= <user>
##$WDW= 1
##$XDIM= 65536
##$YMAX_p= 300617087
##$YMIN_p= -158044483
$$ End of Bruker specific parameters
$$ ---------------------------------
##NTUPLES= NMR SPECTRUM
##VAR_NAME=  FREQUENCY,     SPECTRUM/REAL,   SPECTRUM/IMAG
##SYMBOL=    X,             R,               I
##VAR_TYPE=  INDEPENDENT,   DEPENDENT,       DEPENDENT
##VAR_FORM=  AFFN,          ASDF,            ASDF
##VAR_DIM=   65536,         65536,           65536
##UNITS=     HZ,            ARBITRARY UNITS, ARBITRARY UNITS
##FACTOR=    0.49542278885378, 1,            1
##FIRST=     16045.7642231865, 0,            0
##LAST=      -16421.768244346, 0,            0
##MIN=       -16421.768244346, -158044483,   0
##MAX=       16045.7642231865, 300617087,    0
$$ Real data points
##PAGE= N=1
##DATA TABLE= (X++(R..R)), XYDATA
$$ [...]
42416D099340Q298423M585657n120364j3548752j1659595O87649J2114225J2644871
42408A2101454N513348L18778r49244k645532l952111J37604O650011N211705
42400B2386013o028459j5279975j2915214l697778K698317N265775P914304Q754742
42392I097725L197575n232543p143961p08041N048359K186113o806653j3649355
42384a4010781j3470259p134820J618521Q490964J0546369Q454880N773118M755097
42376E023089M178811K155400p49326k709988l569420m560607n446510l915157
42368i593708J176762O975016Q839188N768942J830381P16939O97303k095309
42360A4315514o527219p162243k808418N68581j804170o457088o969484l064806
$$ plain form
42416 4099340 12397763 16983420 11863056 -1685696 -13345291 -12657642 -543417 12101454
42408 12101454 17614802 17933580 16984336 14338804 10386693 10524297 17174308 22386013
42400 22386013 16357554 1077579 -11837635 -15535413 -12837096 -7571321 342983 9097725
42392 9097725 12295300 7062757 -81204 -789245 4259114 6445227 -361426 -14010781
42384 -14010781 -27481040 -34615860 -32997339 -24506375 -13960006 -5505126 267992 5023089
42376 5023089 9201900 11357300 10607974 7897986 4328566 -232041 -5678551 -9593708
42368 -9593708 -8416946 -1441930 7397258 13166200 14996581 15713520 16410823 14315514
42360 14315514 7788295 626052 -2182366 -1613785 -3417955 -9875043 -16844527 -19909333
42352a9909333M08778J448237K524315N014073P007811O816170M483378j02068
42344G691361o249375r715404o054413K270747P107048M776727N05989M24900
42336G57580L439727M112903J77052o009393j0760628j0961108n363944K946500
42328b1661311P642662N676995R00202j209551j05516J168048J263293J020281
42320e304897O05307k34977k87417J543889L788546M439835M338511N561985P247622
42311B1698404N928552n5637q219548j3536891j1807020l530877M629232N447159
42303E53374n9033l089926J337205P606411P678114J431478n545941r839735j0541354
42294a0469407o442844M67845K909050k826837r546175q435659j629620L288105
$$ plain form
42352 -19909333 -19500555 -18052318 -15528003 -10513930 -3506119 3310051 7793429 7691361
42344 7691361 1441986 -8273418 -14327831 -12057084 -4950036 -173309 332680 757580
42336 757580 4197307 8310210 8487262 2477869 -8282759 -19243867 -24607811 -21661311
42328 -21661311 -14018649 -8341654 -7441452 -8651003 -8756519 -7588471 -6325178 -5304897
42320 -5304897 -4699590 -4934567 -5221984 -3678095 110451 4550286 8888797 14450782 21698404
42311 21698404 27626956 27571319 19351771 5814880 -5992140 -9523017 -4893785 553374
42303 553374 494341 -2595585 -1258380 6348031 14026145 15457623 9911682 71947 -10469407
42294 -10469407 -16912251 -16444406 -13535356 -16362193 -25908368 -34344027 -35973647 -32685542
42286c2685542O529173J2334382J6019627R372637k283716m459178L553769O729852
42278A5111004q51574o828591l226033k34327o181220j0616605k442303R244630
42270f025019R937518L934901M586744R319814N574502m019386m955453K435430
42262B0789051K331514q408461j3505261m643162M683460J903507n534429n118690
42254g502471Q99341K779911n82821m187751o644626p468178l237532M421930
42246b1522197O093121q27651m528027L476151J2896173J0023187j97274k802253
42238B611230K670796L188540m814038j0207858o068648Q01044K581325P35769
42230h501840l80529m98366j31375J842994M252389M021196K266272L272971O415262
$$ plain form
42286 -32685542 -26156369 -13821987 2197640 11570277 9286561 4827383 8381152 15111004
42278 15111004 14259430 7430839 4204806 3970479 -2210741 -12827346 -15269649 -6025019
42270 -6025019 3912499 7847400 12434144 21753958 27328460 23309074 18353621 20789051
42262 20789051 23120565 14712104 1206843 -3436319 1247141 3150648 -2383781 -7502471
42254 -7502471 -6603130 -3823219 -4406040 -8593791 -15238417 -22706595 -25944127 -21522197
42246 -21522197 -15429076 -16256727 -20784754 -17308603 -4412430 5610757 5413483 2611230
42238 2611230 5282026 8470566 3656528 -6551330 -12619978 -11818934 -9237609 -8501840
42230 -8501840 -8882369 -9380735 -9512110 -7669116 -3416727 604469 2870741 6143712 12558974
42221A2558974O322505J916023k259176m322427o549805q057014n207113o10942
42213f208975j638575p335133p281655K186748J0657698Q293754j053843p600741
42205i980722q268190m984481J526028Q527355R082024J572779m666925j764589
42197h956721M456721L887295j710839k787217J616039L507426N67320q10150
42189b30126J904596K871732r81260m005128j583746K150207J935322L93076K830452
42180E285125P072197N582958l165311j1286980j0871410l227740L559700M579151
42172b472310K546562J966506K389734R08191r44780J265949O154050O233877
42164A8047779p14131o749810n239370q91892j325754m151142j796174M307183
$$ plain form
42221 12558974 18881479 20797502 18538326 14215899 7666094 -390920 -5598033 -6208975
42213 -6208975 -7847550 -15182683 -22464338 -20277590 -9619892 -1326138 -2379981 -9980722
42205 -9980722 -18248912 -23233393 -21707365 -13180010 -4097986 -2525207 -7192132 -8956721
42197 -8956721 -4500000 -612705 -2323544 -5110761 -3494722 12704 580024 -230126
42189 -230126 1674470 4546202 3564942 -440186 -2023932 126275 2061597 2454673 5285125
42180 5285125 12357322 17940280 14774969 3487989 -7383421 -10611161 -7051461 -2472310
42172 -2472310 74252 2040758 4430492 5338683 4393903 5659852 11813902 18047779
42164 18047779 17333648 10583838 5344468 4452576 3126822 -1024320 -2820494 1486689
42156A486689N220231n38586m413087j874319J051987j195656n132669n402957
42148a0798367k990785j037160J075558L983398M347215L16086l755865l525989
42140a2385909j242148q85392j369412l64036k19747l230087n063441p30118N954350
42131a9535940P291354L978795L228427N365364K712859n980385j0072603j561359
42123a4573488J2156623J6970481R352734j463192o286085m859152k282647j619936
42115G395338j747730j89384L421112O384013N495900O41436n044323q584385
42107G771977r168707o844332j961315L068816M521774K114243N29103L343077
42099C374636P380625O502166j58660p233918r743885p157446j348160N187736
$$ plain form
42156 1486689 6706920 6168334 1755247 -119072 932915 -262741 -5395410 -10798367
42148 -10798367 -13789152 -14826312 -13750754 -9767356 -5420141 -5104055 -8859920 -12385909
42140 -12385909 -13628057 -14513449 -15882861 -16246897 -16466644 -19696731 -24760172 -25490290 -19535940
42131 -19535940 -12244586 -8265791 -5037364 328000 3040859 -2939526 -13012129 -14573488
42123 -14573488 -2416865 14553616 23906350 22443158 16157073 11297921 9015274 7395338
42115 7395338 5647608 5458224 8879336 15263349 20759249 21400685 16356362 7771977
42107 7771977 -1396730 -8241062 -10202377 -7133561 -2611787 -497544 31559 3374636
42099 3374636 10755261 17257427 17098767 9864849 120964 -7036482 -8384642 -3196906
42091c196906Q581430N810224l93245l178816q00674L27433m157011q011818k764481
42082g783864Q327574J3285507Q113680J370743j5703O5841l180839n665510k739270
42073A1778159K57778l475539q443368m371168N226248O516371j899096n283094
42065C06291L268236J0506308M161512o946749p279416R65800L761986n21192
42057H222776n01357O096067P486314j742652j0987761j0736040n933414m121405
42049a2217472j969723N771530J2886571R685000n87605n250753j46580O303343
42041A4474311O563748K194391k162327m651554m209125J51761N467909N955841
42033B3784955M84001n841664r194308j0768935j1114134p096814J552401Q298685
$$ plain form
42091 -3196906 5384524 11194748 10801503 7622687 6822013 7149446 2992435 -5019383 -7783864
42082 -7783864 543710 13829217 21942897 23313640 23297937 23363778 20182939 14517429 11778159
42073 11778159 12035937 8560398 117030 -4254138 972110 7488481 5589385 306291
42065 306291 3574527 14080835 18242347 11295598 4016182 4981982 8743968 8222776
42057 8222776 7721419 13817486 21303800 19561148 8573387 -2162653 -8096067 -12217472
42049 -12217472 -14187195 -8415665 4470906 14155906 13568301 8317548 8170968 14474311
42041 14474311 21038059 23232450 21070123 16418569 12209444 12361205 17829114 23784955
42033 23784955 24268956 18427292 9232984 -1535951 -12650085 -19746899 -18194498 -9895813
42025i895813P836446L880297K964896L949867J090121m336479m458394J778659
42017B809600M537855k672861j1740950j0442761L1358O974223M398488j19935
42009f224983J054817M329733K672013k291789l930906k318706l373210p492183
42001a7575214p953045k141165L503166L194898K02555J058474N903937R318784
41993d487610P795771K347867l891109p209300n093337q225J312836l774306q982785
41984b1990198p214547q95579J674982j071708j759996M577408J2806072J4121491
41976B47925O519009l824109r454301p995671l042038m6515q12962k304819j618862
41967b2332343j94872o25832j487128L37913L439614L502039J266086K564206
$$ plain form
42025 -9895813 -2059367 1820930 4785826 8735693 9825814 5489335 1030941 2809600
42017 2809600 7347455 4674594 -7066356 -17509117 -17477759 -10503536 -6105048 -6224983
42009 -6224983 -5170166 -840433 1831580 -460209 -4391115 -6709821 -10083031 -17575214
42001 -17575214 -25528259 -27669424 -24166258 -20971360 -20768805 -19710331 -13806394 -4487610
41993 -4487610 3308161 5656028 1764919 -5444381 -10537718 -10545943 -9233107 -13007413 -21990198
41984 -21990198 -29204745 -30100324 -28425342 -29497050 -31257046 -26679638 -13873566 247925
41976 247925 6766934 2942825 -6511476 -14507147 -17549185 -17595700 -18408662 -20713481 -22332343
41967 -22332343 -22527215 -23153047 -24640175 -24302262 -20862648 -17360609 -16094523 -13530317
41959a3530317Q217541J0116501K084425r726615j3330964n899575L629884O816487
41951a1622633M898851L642691L680215O84686o098543j0487760o872125J590384
41943b0584234O062044L045927j549238q85162L880824O433136M419157J101511
41935A923965j018677k954738m889259m173086j28932L153568K273802L8235J571641
41926d203481O271428P786482K497894n180959p725396l179283K990813M487974
41918C745472R08812l025823l610493j400515J257631K907268K289465j602449
41910A469368o411701o650729p43902M948267L917910r93534j996973J209240
41902e252054J262669l879815o566200j893982L503876J735273l334163j948306
$$ plain form
41959 -13530317 -5312776 4803725 6888150 -2838465 -16169429 -22069004 -18439120 -11622633
41951 -11622633 -6723782 -3081091 599124 1283810 -4814733 -15302493 -22174618 -20584234
41943 -20584234 -14522190 -11476263 -13025501 -13910663 -10029839 -3596703 822454 1923965
41935 1923965 905288 -2049450 -6938709 -11111795 -11240727 -8087159 -5813357 -5775122 -4203481
41926 -4203481 2067947 9854429 12352323 7171364 -554032 -3733315 -742502 3745472
41918 3745472 4654284 1628461 -1982032 -3382547 -2124916 782352 3071817 1469368
41910 1469368 -4942333 -11593062 -12336964 -7388697 -3470787 -4464321 -6461294 -5252054
41902 -5252054 -3989385 -7869200 -14435400 -16329382 -12825506 -11090233 -14424396 -16372702
41894a6372702N808528R611189M533714j617268j30191N797022N664451l728582
41886I566161j3799349j4483376n160588O165599J1850473J0141064L388576m928407
41878B740153j0207563p956299R71008Q416847O879198j010934n463958k129067
41870g760615L242935L900432N18146k315808l368856m321142n156096m377076
41862a9638080k166082K14939K840258N966428P935501P189117N095340L981835
41854A1419256L533957J785713j371742m046687m683521k723081J398826M984118
41846A0296839M050061j779729p312351p452322l019254J623914M392325N772711
41838F572194N671796L920647K343798K477136K491640J01963k793015k493934
$$ plain form
41894 -16372702 -10564174 -952985 3580729 1963461 1833270 7630292 13294743 9566161
41886 9566161 -4233188 -18716564 -23877152 -17711553 -5861080 4279984 7668560 2740153
41878 2740153 -7467410 -15423709 -14452701 -6035854 843344 -167590 -5631548 -7760615
41870 -7760615 -4517680 -617248 -99102 -2414910 -5783766 -10104908 -15261004 -19638080
41862 -19638080 -21804162 -21589223 -18748965 -12782537 -4847036 2342081 7437421 11419256
41854 11419256 14953213 16738926 15367184 11320497 6636976 3913895 5312721 10296839
41846 10296839 14346900 12567171 5254820 -2197502 -5216756 -3592842 799483 6572194
41838 6572194 12243990 16164637 18508435 20985571 23477211 23579174 20786159 18292225
41830A8292225L35930J205016j544640m541011m456855k091580m10256o62779
41822F126050j362881k37665K825799M701232K231963l411366p887883r136470
41814f151221q131269m363031L695341J2267603J3500951O508419J05138j38386
41806A7293545J85249m208560p377945k416836M470379K429810n945334q107974
41798c677666j021053N981608P178746O045006M072355k293924j0584169j1300375
41790e599472k864003M061781K623133q00746P87690L734612K441019l48061k39499
41781C796454N0132l003287n902357m790760l127750m384209l747698L652650
41773a7456825J1942614J1773513M257533j772941l063828l236393l385249p68183
$$ plain form
41830 18292225 18628155 19833171 18288531 13747520 9290665 7199085 6788829 6126050
41822 6126050 4763169 4525504 7351303 12052535 14284498 10873132 2985249 -6151221
41814 -6151221 -14282490 -18645521 -14950180 -2682577 10818374 17326793 17431931 17293545
41806 17293545 17478794 13270234 5892289 3475453 7945832 10375642 4430308 -3677666
41798 -3677666 -4698719 1282889 8461635 14506641 18578996 16285072 5700903 -5599472
41790 -5599472 -8463475 -4401694 -1778561 -2579307 -1791617 1942995 4384014 4035953 3796454
41781 3796454 3846586 843299 -5059058 -9849818 -12977568 -17361777 -21109475 -17456825
41773 -17456825 -5514211 6259302 10516835 8743894 5680066 2443673 -941576 -1709759
41765a709759L993073O483181N236847K816057R62515j45607L20469J705602K40236
41756A9902614n134119q846486o725910l939108p362654j3391787j1952196r17326
41748c8366972J1519339J7711411J6524211J0032960J852563k519691j095678
41741A5658143K71196l862566q490656n209159K977932M748911j861687o295354
41733b063240k091042M095029M162669L7062j787103l3268K304840L468143L204670
41724A1297760J669681Q35194K787866M941467K031295n501568j0740431r756240
41716b434976o039680l551534j581341R82305K505351K701077L940666N591493
41708B113361L292143k871403o104679k964211R22070L49787o15005M007619J0929220
$$ plain form
41765 -1709759 2283314 8766495 14003342 16819399 17781914 17636307 17956776 19662378 19902614
41756 19902614 14768495 5922009 -803901 -4743009 -12105663 -25497450 -37449646 -38366972
41748 -38366972 -26847633 -9136222 7387989 17420949 19273512 16753821 15658143
41741 15658143 15929339 12066773 3576117 -1633042 1344890 6093801 4232114 -2063240
41733 -2063240 -4154282 -59253 4103416 4140478 2353375 2320107 4624947 8093090 11297760
41724 11297760 12967441 13802635 16590501 21531968 23563263 18061695 7321264 -2434976
41716 -2434976 -8474656 -12026190 -13607531 -12625226 -10119875 -7418798 -3478132 2113361
41708 2113361 5405504 2534101 -3570578 -6534789 -5612719 -5262932 -5877937 -1870318 9058902
41699I058902J1602474M762576k447800m977511m855857n084586m225583K47901
41691D080516O163666P500584J487251o729534q905747l827044N69022k026504
41683a687790o823204m576142M496421J0493213P470539J91538m146739m309705
41675A108131k944332k033793k867875n388803n922026j079383N141242N131037
41667h855802r8731r45825N589844R954839M428803n062296q202273m134882J110752
41658f215571M590733O149067L844707k045373m941292l7251P160361P986405
41650A6491786K697026k207272m793511p110887p004153m07707R188661J2799914
41642A9653857P912083O73361m122965p616383j0596669j0140916m966482J276147
$$ plain form
41699 9058902 20661376 25423952 22976152 17998641 13142784 8058198 3832615 4080516
41691 4080516 10244182 17744766 19232017 12502483 3596736 -230308 338714 -1687790
41683 -1687790 -8510994 -13087136 -8590715 1902498 9373037 9564575 5417836 1108131
41675 1108131 -1836201 -3869994 -6737869 -12126672 -18048698 -19128081 -13986839 -8855802
41667 -8855802 -8954533 -9900358 -4310514 5644325 10073128 5010832 -3191441 -7326323 -6215571
41658 -6215571 -1624838 4524229 8368936 6323563 1382271 1345020 8505381 16491786
41650 16491786 19188812 16981540 12188029 5077142 -1927011 -2334718 6853943 19653857
41642 19653857 27565940 28239301 24116336 16499953 5903284 -4237632 -9204114 -7927967
41634g927967M288009L090663q43756m755158n052863m93680N369455Q247238
41626A921941Q299862P689158N385259o13637p910631j1974082j2115993j0096520
41618a9414643n292937K521766Q158000O369020P31173o89267K550591M020486
41610a045811K701932M536901J0010567J0298783M46322j1508206j4406824p782932
41602f749268n91959L61751l547382o140227l019040L885623P748051M783006
41594c269445m10769j045486K256420L710674K544523L161124N211688K553281
41586A4712010n358027r615114m117138M945732P158557P58932p055069q894354
41578g464471k715119P658852J4429348J1759948K263506n824289q875904j0267856
$$ plain form
41634 -7927967 -3639958 -549295 -1393051 -6148209 -11201072 -11694752 -6325297 1921941
41626 1921941 10221803 17910961 23296220 22682583 14771952 2797870 -9318123 -19414643
41618 -19414643 -24707580 -22185814 -14027814 -7658794 -6927621 -7616888 -5066297 -1045811
41610 -1045811 1656121 6193022 16203589 26502372 26948694 15440488 1033664 -6749268
41602 -6749268 -7341227 -6979476 -10526858 -16667085 -19686125 -15800502 -8052451 -3269445
41594 -3269445 -3680214 -4725700 -2469280 1241394 3785917 6947041 12158729 14712010
41586 14712010 9353983 -261131 -4378269 567463 7726020 8484952 1429883 -7464471
41578 -7464471 -10179590 -2520738 11908610 23668558 25932064 20107775 11231871 964015
41570I64015j1835262j0099733l700717K606814N240444O435018P737528O137427
41562C485534J430084l22345L188596M818905j20895l969966J484130R852584
41554A9846627Q746657n40394n000082l62229L566485j94399n750202n696523
41546A4615940k441643j957273l723791l591832j428984L99811K394676N830756
41538A0097660Q013779N377592j63144l257043k973504l616238p074190q940609
41530b535697m541323M063469R907734Q749488K629995l475144o173913m837740
41522C786869r34353K492696K610628q1109j652925M95277M064318M980593K559778
41513A8321772r08319l900967n498005l262520L728721J0396873R932009L141597
$$ plain form
41570 964015 -10871247 -20970980 -24671697 -22064883 -16824439 -10389421 -2651893 3485534
41562 3485534 4915618 4593273 7781869 12600774 12479879 8509913 9994043 19846627
41554 19846627 28593284 28052890 23052808 22690579 26257064 26062665 20312463 14615940
41546 14615940 12174297 10217024 6493233 2901401 1472417 1872228 4266904 10097660
41538 10097660 18111439 23489031 23325887 20068844 17095340 13479102 6404912 -2535697
41530 -2535697 -7077020 -3013551 6894183 15643671 18273666 14798522 8624609 3786869
41522 3786869 2852516 5345212 7955840 7874731 6221806 6717083 10781401 15761994 18321772
41513 18321772 17413453 13512486 8014481 4751961 8480682 18877555 28809564 31951161
41505C1951161k289644l014244l758054p283765q178028k089141N132993N033240
41497A5504518n82582k365829K630870P279638M880074k868987r473433j0468544
41489D535725n705632J203939M930502L121723p42181j974924j147704k118751
41481B102697m747877m651207k88681M706786O966532O384962K998387l583699
41473I887900r776504q874683j05138P738612O477854q12733m577799k185349
41465b227840m35601m254735q677026n459472N378419J4628834J4001675M249007
41457A7203261p030704j3011626j1899246o084676K23625L347933K775125J692259
41449a2784049L126203N741928N605198J935640j693443k411234j406666j069341
$$ plain form
41505 31951161 29661517 26647273 22889219 15605454 7427426 5338285 10471278 15504518
41497 15504518 14921936 12556107 15186977 22466615 27346689 24477702 15004269 4535725
41489 4535725 -1169907 34032 4964534 8086257 7344076 5369152 4221448 2102697
41481 2102697 -2645180 -7296387 -7585068 -2878282 4088250 10473212 13471599 9887900
41473 9887900 111396 -8763287 -8868425 -1129813 5348041 4535308 -42491 -2227840
41465 -2227840 -2663441 -6918176 -15595202 -21054674 -15676255 -1047421 12954254 17203261
41457 17203261 10172557 -2839069 -14738315 -20822991 -20599366 -17251433 -14476308 -12784049
41449 -12784049 -9657846 -3915918 1689280 3624920 1931477 -479757 -1886423 -2955764
41441b955764j465571j352902n84067K06646P19015O08720m01886j391672j168794
41432g786275m47797l97960O56317M860545Q960459O540284k083004q409487p378103
41423e485021l930410l281521j608101N990694J3707988J1126258r76888j0510906
41415E032093r914879l583507J665026N068189P639468O585735o21113j0270035
41407A600977j5148538j2029532m018343L453950P355403Q382330Q481982P692934
41399E771163M929646J661604J052456J918053j446224r602469j3378091n365476
41391a4459338P697962J1763277L004134q678032j2570066o728657L962410J1848891
41383d159419R786897j520454j0200848n740769N975439R864693L267975j643292
$$ plain form
41441 -2955764 -4421335 -5774237 -6358304 -6151658 -5432643 -4823923 -5225809 -6617481 -7786275
41432 -7786275 -8234072 -8632032 -7975715 -3115170 5845289 12385573 10302569 1893082 -5485021
41423 -5485021 -9415431 -12696952 -14305053 -8314359 5393629 16519887 15542999 5032093
41415 5032093 -4882786 -8466293 -6801267 -1733078 5906390 12492125 11871012 1600977
41407 1600977 -13547561 -25577093 -29595436 -26141486 -18786083 -10403753 -1921771 5771163
41399 5771163 10700809 12362413 13414869 15332922 13886698 4284229 -9093862 -14459338
41391 -14459338 -6761376 5001901 8006035 -671997 -13242063 -19970720 -16008310 -4159419
41383 -4159419 5627478 4107024 -6093824 -11834593 -5859154 4005539 7273514 5630222
41375E630222J491726L955498j461089p791327o401675j346304r58431l482484
41367a0363864j993755K584897M257127L204498L826208M930496K016287l032849
41359E429045m310832k397766l080380o370000n997973j43849N649102O996257
41351d226396M784254N57003m694877o879524k049958N456582O096999j552771
41343b508688q074323o450562p10557K109247J670289J464894K230817L446356
41335f822527O576445J1295909J2271910N629469l746305p176206l524667l22663
41327A4181365l188732q571068q922240k571579L965172L326488m378817j1555904
41319a7715315j1242616l741393N436183J1673351J2819892P449508l162593j1801953
$$ plain form
41375 5630222 7121948 11077446 9616357 1825030 -4576645 -5922949 -6881380 -10363864
41367 -10363864 -12357619 -9772722 -5515595 -2311097 1515111 6445607 8461894 5429045
41359 5429045 1118213 -1279553 -4359933 -10729933 -16727906 -16871755 -11222653 -4226396
41351 -4226396 557858 1114861 -3580016 -10459540 -12509498 -7052916 -955917 -2508688
41343 -2508688 -10583011 -17033573 -17744130 -15634883 -13964594 -12499700 -10268883 -6822527
41335 -6822527 -246082 11049827 23321737 28951206 25204901 18028695 14504028 14181365
41327 14181365 10992633 2421565 -6500675 -9072254 -5107082 -1780594 -6159411 -17715315
41319 -17715315 -28957931 -32699324 -27263141 -15589790 -2769898 4679610 1517017 -10284936
41311a0284936j0220198N00953R421029Q651664K490233j05885K072346L205299
41303E730505R06977q76473N21205K189510R16339k059618m240283n809751p021290
41294i742879n089334J598677Q011894O659582k346731j0074119r217669j981469
41286b2182048M525540P047115P080696N957543L407836J8064k569991l664736
41278c79981l271227j065075J711960J522386k387003m584293n38890N034195
41270c957928M108091j516113k010928M710673R260451O118191J869944J945634
41262B0528015Q7561r014642j5974086r068146N559679J1156195N297009J684087
41254A0255672O303340Q490237J146064n693458j465996O805354N708413l153162
$$ plain form
41311 -10284936 -20505134 -20004181 -10583152 -1931488 558745 452860 2525206 5730505
41303 5730505 6637482 5761009 6282214 8471724 9388063 7328445 3088162 -2721589 -9742879
41294 -9742879 -14832213 -13233536 -5221642 1437940 -908791 -10982910 -20200579 -22182048
41286 -22182048 -17656508 -10609393 -3528697 2428846 5836682 5854746 3284755 -379981
41278 -379981 -3651208 -4716283 -3004323 -1481937 -3868940 -8453233 -8992123 -3957928
41270 -3957928 150163 -1365950 -3376878 1333795 10594246 16712437 18582381 20528015
41262 20528015 20615576 11600934 -4373152 -13441298 -7881619 3274576 8571585 10255672
41254 10255672 16559012 25049249 26195313 20501855 19035859 25841213 31549626 28396464
41246B8396464o783052k069993L54684n935618j3371081j2417456m520625K269362
41238a4077315M557334M756464M661719L603544J756194O55992L97704j39820
41230F171816L2038L407500Q561336R062350J477815p788459q774898r62803N488641
41221A6675336L208415l295663n589819k929832j83599J435964L874186N058486
41213A8253474J040179n150300n759024m97703K519007K20293o64296L605562
41205A3567192O127804J186906n246682n714996m312965q534513j3759956r051066
41197b5738276L630544R587457K566018o225287m628192M735240J0989264R625337
41189D542105M177904j209723m502075m544686k455287j805038l588072l996869
$$ plain form
41246 28396464 21613412 19543419 19898103 13962485 591404 -11826052 -16346677 -14077315
41238 -14077315 -9519981 -4763517 -101798 3501746 5257940 5913932 6311636 6171816
41230 6171816 6203854 9611354 18172690 27235040 28712855 20924396 12149498 11186695 16675336
41221 16675336 19883751 16588088 10998269 8068437 7884838 9320802 13194988 18253474
41213 18253474 19293653 14143353 8384329 7886626 10405633 10625926 9961630 13567192
41205 13567192 19694996 20881902 15635220 9920224 5607259 -2927254 -16687210 -25738276
41197 -25738276 -22107732 -12520275 -9954257 -16179544 -20807736 -16072496 -5083232 4542105
41189 4542105 8720009 7510286 3008211 -1536475 -3991762 -5796800 -9384872 -13381741
41181a3381741p19192K381449J352856q24914J043398N440967O352354K897277
41173D542454L5668j44200r56145l567803l612479J317119O240874N550711J363406
41164A0769605k87902P83432q31560o483906j0479038q767322m980543l775773
41156b4053007k694577L189466J0913538J1684053M217925j513012K263659J0019329
41148A4027374J0989715L856078l562785o286890n810206l128198K673349P702297
41140B0460734M510146o081590j2696922q479643j103724p14458m539205k912429
41132a1557091L876346N967241J81056m993474k663873L391450O393603N718798
41124F314056M152151K259381J80275O2066K101470K266502j712735n803449n313023
$$ plain form
41181 -13381741 -14100933 -11719484 -10366628 -11191542 -10148144 -4707177 1645177 4542454
41173 4542454 4578122 4433922 3477777 -90026 -3702505 -2385386 3855488 9406199 10769605
41164 10769605 10481703 11265135 10433575 3949669 -6529369 -15296691 -20277234 -24053007
41156 -24053007 -26747584 -23558118 -12644580 -960527 3257398 1744386 4008045 14027374
41148 14027374 25017089 28873167 25310382 19023492 13213286 10085088 12758437 20460734
41140 20460734 24970880 18889290 6192368 -2287275 -3390999 -4105457 -8644662 -11557091
41132 -11557091 -7680745 -1713504 -1532448 -6525922 -9189795 -5798345 595258 6314056
41124 6314056 10466207 12725588 12905863 12967929 15069399 17335901 15623166 9819717 4506694
41115D506694j510399J612794L477222M901415L479287k874225r794277j0273479
41107f474968m205190J458699K461240K119445N092138J0155083J1352016M841780
41099B6800243o159261j2839474q694861K534179R075199L835951p255208j2577706
41091e280938q048224P14346P031904R114845Q611063P914544Q534198Q716568
41083C7308306M152457n409721j2887530j2053126o315789l460245m319828l931940
41075f917416j761192j928970l912282k502132K063365L440142O39110M18155
41067a0461220M817200O011763j063515r468773j0123191m136231J121396K513509
41059b0789062J573923m61528k188857q71557L444033O838979P759306Q516624
$$ plain form
41115 4506694 2996295 4609089 8086311 12987726 16467013 13592788 3798511 -6474968
41107 -6474968 -10680158 -9221459 -6760219 -4640774 451364 10606447 21958463 26800243
41099 26800243 20640982 7801508 -893353 1640826 10716025 14551976 7296768 -5280938
41091 -5280938 -13329162 -12614816 -5582912 3531933 12142996 20057540 28591738 37308306
41083 37308306 41460763 36051042 23163512 11110386 4794597 1334352 -2985476 -6917416
41075 -6917416 -8678608 -10607578 -14519860 -17021992 -14958627 -11518485 -10879375 -10461220
41067 -10461220 -5644020 367743 -695772 -10164545 -20287736 -24423967 -23302571 -20789062
41059 -20789062 -19215139 -19676667 -21865524 -22737081 -19293048 -12454069 -4694763 3821861
41051C821861P912418R33812r858779j2958089m977711J501743l294797j0152608
41043b7072150n865659M878645P881445K838984J210334M648290L864282j610005
41035i225834j060958P122539J0223723K066784o369676m970309M29906M10292
41027a373533j895493J949912J0108907J3048707P406916j394908p549786r224703
41019A1076019o998679l380292k152049m627586q196223r778049p665028m66570
41011c2188457J0005074J5339896Q502389l667113n890371M402190J2018892N604291
41003A4126791o449125j0021433n706328m092312o939044n534329L893189J3594381
40995g128210J4334670N437169o039497j1886010q709895m72031N553460O522184
$$ plain form
41051 3821861 11734279 12668091 2809312 -10148777 -15126488 -13624745 -16919542 -27072150
41043 -27072150 -32937809 -28059164 -20177719 -17338735 -16128401 -11480111 -7615829 -9225834
41035 -9225834 -10286792 -3164253 7059470 9126254 2756578 -2213731 -1783825 -1373533
41027 -1373533 -3269026 -1319114 8789793 21838500 29245416 27850508 20300722 11076019
41019 11076019 4077340 697048 -1455001 -6082587 -14278810 -24056859 -31721887 -32188457
41011 -32188457 -22183383 -6843487 1658902 -2008211 -7898582 -3496392 8522500 14126791
41003 14126791 7677666 -2343767 -8050095 -12142407 -19081451 -24615780 -20722591 -7128210
40995 -7128210 7206460 12643629 6604132 -5281878 -13991773 -14463804 -8910344 -2388160
40987b388160N138281K884913k158029q904115j1435825p068210R932O241860
40979a7679353J2373445J6128685J0737311l050732j2747403r883481j677902
40972e799430J320811K86173Q56640J73773n817198r673168k178618R965482J1748693
40963H83158K702388l338025o38508J935948j415867m229309n89446N413114Q221052
40954H944505Q457216P303946K594437m814875r023826p640641n006259l867813
40946c053310j662350K095474L117987M10988j101495N60169J093714j122109
40938C39068j361843J987112L070719j085800m181366q34477M113684L369945
40930E417042j637436m255055k785060p71594j93409M55771L173088Q186588J2297800
$$ plain form
40987 -2388160 2750121 5635034 3477005 -5427110 -16862935 -23931145 -23921213 -17679353
40979 -17679353 -5305908 10822777 21560088 18509356 5761953 -4121528 -5799430
40972 -5799430 -4478619 -4192446 -3335806 -3162033 -8979231 -18652399 -20831017 -10865535 883158
40963 883158 3585546 247521 -390987 1544961 129094 -4100215 -4689661 723453 8944505
40954 8944505 17401721 24705667 27300104 22485229 13461403 5820762 814503 -3053310
40946 -3053310 -4715660 -2620186 497801 908789 -192706 367463 1461177 339068
40938 339068 -1022775 964337 4035056 2949256 -1232110 -2066587 2047097 5417042
40930 5417042 3779606 -475449 -3260509 -4032103 -4225512 -3769741 -596653 7589935 19887735
40921A9887735R464975j796070j2071350j0168380O97084N869048Q02162k283631
40913A0401573N175518J3420231R677472j970690p813897m635091n57062l34911
40905B3363143j395294j955183k666682j752009K310019M761373j6820q320321
40897A4328226j0762717n241791J452925L900186K360726j763825o804443q271484
40889a0802197l576771J543395l93484o440315o577743J072927Q141861R813760
40881g218567J0203912J1405634P948999k432310j1438851j0593182k804560K955440
40873a973485L623808K424990J305215l93501j785967o21080L019059O703248
40865A2302287Q248328O172382J98991o086796o574322l84913N014810L061833
$$ plain form
40921 19887735 29352710 27556640 15485290 5316910 6013994 11883042 12685204 10401573
40913 10401573 15577091 28997322 38674794 36704104 28890207 24255116 23698054 23363143
40905 23363143 21967849 20012666 17345984 15593975 17903994 22665367 22648547 14328226
40897 14328226 3565509 -1676282 -223357 3676829 6037555 4273730 -2530713 -10802197
40889 -10802197 -14378968 -12835573 -13229057 -19669372 -26247115 -25174188 -17032327 -7218567
40881 -7218567 2985345 14390979 22339978 19907668 8468817 -2124365 -4928925 -1973485
40873 -1973485 1650323 4075313 5380528 4987027 3201060 2579980 5599039 12302287
40865 12302287 20550615 26722997 26921988 20835192 14260870 13875957 18890767 21952600
40857B1952600k572060l573359M73499K297140q51258l232823j110653K72791
40849A3655877m777262j2244284j3229982o178707K072368O147920O715133N480167
40841b358770K426686m73915N52418M184119L558272k973166o778605q79705Q331564
40832E588898R521086K935906j259554K78423j0389o151080j0817475p071066
40824f985251N11548L118360J22798k656260k854718k777116l078837j463047
40816a6062523K923943P974211J0943335R921035M831043j029272l276651k280207
40808A3944914k991552o747385q233778m090181Q92671J090654j487707j907128
40800i529492p88540j205088j145339K882476P309275N051768l208819r044221
$$ plain form
40857 21952600 19380540 15807181 16280680 18577820 17726562 14493739 13383086 13655877
40849 13655877 8878615 -3365669 -16595651 -22774358 -20701990 -14554070 -7838937 -2358770
40841 -2358770 67916 -405999 146419 4330538 7888810 4915644 -1862961 -2742666 5588898
40832 5588898 15109984 18045890 16786336 17064759 17054370 10903290 85815 -6985251
40824 -6985251 -6473703 -3355343 -3232545 -5888805 -8743523 -11520639 -14599476 -16062523
40816 -16062523 -13138580 -5164369 5778966 15700001 20531044 19501772 16225121 13944914
40808 13944914 10953362 4205977 -4027801 -8117982 -7225311 -6134657 -7622364 -9529492
40800 -9529492 -10318032 -11523120 -12668459 -9785983 -2476708 2575060 -633759 -9677980
40792i677980p703154k672736J465228M074273N375230M373416J670437l0035
40784c125321O07546K757528N595430P751087O321213J020019k789994r40707
40776A7196801J742406k429156j1245320j4042334o535813L375480O365976J786025
40768c785935m618372p090565k614786O721862J2883021R452743R27174k293418
40760I581724J095303J784031m345776q442722k298169Q111777J0309862J831104
40752A7627134q081082j0562800m950280L623168R201526Q400742K863075j829423
40744A6292060j930160N23186P79883l139279q937453j2125134r259590j610240
40736a9406727M473587M087392L01656P0683M215807O968256N433184K811241
$$ plain form
40792 -9677980 -17381134 -20053870 -18588642 -14514369 -9139139 -4765723 -3095286 -3125321
40784 -3125321 -2517775 239753 5835183 13586270 19907483 20927502 18137508 17196801
40776 17196801 18939207 16510051 5264731 -8777603 -15313416 -11937936 -5571960 -3785935
40768 -3785935 -8404307 -15494872 -18109658 -11387796 1495225 10947968 11875142 9581724
40760 9581724 10677027 12461058 8115282 -327440 -2625609 5486168 15796030 17627134
40752 17627134 9546052 -1016748 -5967028 -2343860 6857666 15258408 18121483 16292060
40744 16292060 14361900 14885086 15664969 12525690 3588237 -8536897 -17796487 -19406727
40736 -19406727 -14933140 -10845748 -10544092 -10473409 -6257602 710654 6143838 8955079
40728H955079J121871j851520n822377n697626K5763N313233N560772M092202
40720A1697397M681505M156309r83961o024714l697730M955940J2102349J2938795
40712C9825890Q268319K17453q489404j3313417j1937453p961247n813794m419076
40704c622729p67585L427173M557188L769597M394700N167271K768900r90977
40696A8703538j829862j201916l919771q309865p263607Q9383N996449N349363
40688G613712J751583k53400j540987l354980l071807q7286K64893n067112r696322
40679a3441706o207907J679915L715624j414796m254540K79011M914565K194453
40671a2535381k776710n7917Q668528J1482456M238892k877875q93523M454939
$$ plain form
40728 8955079 10076950 8225430 2403053 -3294573 -3268810 2044423 7605195 11697397
40720 11697397 16378902 20535211 19551250 13526536 9828806 14784746 26887095 39825890
40712 39825890 48094209 48311662 39822258 26508841 14571388 6610141 796347 -3622729
40704 -3622729 -4390314 -963141 3594047 7363644 11758344 16925615 19694515 18703538
40696 18703538 16873676 15671760 11751989 3442124 -3821483 -3732100 2264349 7613712
40688 7613712 9365295 9111895 7570908 4215928 1144121 1056835 1321728 -3745384 -13441706
40679 -13441706 -19649613 -17969698 -14254074 -15668870 -19923410 -19644399 -14729834 -12535381
40671 -12535381 -15312091 -15370008 -6701480 4780976 9019868 6141993 5248470 9703409
40663I703409K112162p105976j1852614o689749J471466L824800m18939n878919
40655a4834360p321542l130718L098605M672246J7226l137706J937262R317846
40647i381141Q282212P94986j066379M462523N445969k626498p598127r98124
40639b684579O443360J919374q147031q659093J97964N226731J794510k294571
40631f203335k452016k157240k133491J767401Q153279R481986M326359n5411
40623A0727532L71496J584235N87699k78324n11523l503714q395724q671801k324561
40614a0414685M420926O551194N808360M177670J467n984423q384090m741197
40606h564778J015597N302424Q228144Q517237L509050l261008l667337K229428
$$ plain form
40663 9703409 11815571 4709595 -7143019 -13832768 -12361302 -8536502 -8955441 -14834360
40655 -14834360 -22155902 -25286620 -22188015 -17515769 -17498543 -20636249 -18698987 -9381141
40647 -9381141 -1098929 -303943 -1370322 3092201 8538170 5911672 -1686455 -2684579
40639 -2684579 3758781 5678155 -2468876 -11127969 -10930005 -5703274 -3908764 -6203335
40631 -6203335 -8655351 -10812591 -12946082 -11178681 -3025402 6456584 10782943 10727532
40623 10727532 11099028 12683263 13270962 12992638 12481115 8977401 581677 -8090124 -10414685
40614 -10414685 -5993759 557435 6365795 10543465 10544932 4560509 -3823581 -8564778
40606 -8564778 -7549181 -2246757 5981387 14498624 18007674 14746666 11079329 13308757
40598A3308757M436482j400909o432344k680796M641009O478275L514997K070526
40590B3935997L146492M001171M971854O549289M830222j994405p432877n154438
40582C2853305P89223K375961j72474j253149p48765k412851m626508l017103
40574B3787639l82240l455522j0162723j0625778k477396M280594R73931q496891
40566f558386j3619094r128189J786453J1677397J4143667Q622914J231966j988560
40558F168168k066919l546240n726478l657976K502299O198838M134851R73569
40550D980112J808113N090614O069205L374906n03741k393127l38398M833875
40542B2921559Q744761P243013J674251k774134m132460n095037p173754q143057
$$ plain form
40598 13308757 17745239 16344330 9911986 7231190 11872199 18350474 21865471 23935997
40590 23935997 27082489 31083660 36055514 42604803 47435025 45440620 38007743 32853305
40582 32853305 33642528 36018489 35846015 34592866 33844101 31431250 26804742 23787639
40574 23787639 23405399 19949877 9787154 -838624 -3316020 964574 1938505 -6558386
40566 -6558386 -20177480 -29305669 -27519216 -15841819 -1698152 6924762 8156728 6168168
40558 6168168 4101249 555009 -5171469 -8829445 -6327146 -128308 4006543 4980112
40550 4980112 6788225 11878839 17948044 21322950 20819209 18426082 18087684 22921559
40542 22921559 31666320 38909333 40583584 37809450 33676990 28581953 21408199 13265142
40534A3265142o332435k802267J906130Q151284J2889077J0867749K961719k388065
40526C8518334j40619L950891J846035n195121r446458q030321m821296k607017
40518A4074428j58480K574414K561712j056586m512902m581247k550161o70242
40510E680936J887262O318617J0141401R825097O042594K310121q07240n500547
40502C5898241j0450046j0278930l873309J887148J425906p00640K888773Q823032
40494B5620175N948777o990786j6285975j1146777R29516M540431k662829q603288
40486h650756m750350L796652P844472O058943L389743K464319J424926j232520
40478A0345429l319723j435617L853867O697228K303802n240786o083982J778436
$$ plain form
40534 13265142 6932707 4130440 6036570 14187854 27076931 37944680 40906399 38518334
40526 38518334 38377715 42328606 44174641 38979520 29533062 21502741 16681445 14074428
40518 14074428 13915948 16490362 19052074 17995488 13482586 8901339 6351178 5680936
40510 5680936 7568198 13886815 24028216 33853313 39895907 42206028 41398788 35898241
40502 35898241 25448195 15169265 11295956 13183104 14609010 13908370 16797143 25620175
40494 25620175 31568952 24578166 8292191 -2854586 -1925070 2615361 -47468 -8650756
40486 -8650756 -13401106 -9604454 -1759982 4298961 7688704 10153023 11577949 10345429
40478 10345429 7025706 5590089 9443956 16141184 18444986 13204200 7120218 8898654
40470H898654P505977J877201q199850q558793J708833R575909P774311L059374
40462B3641616J893831M26849m701565p088476j893152K885932j550072q427668
40454E187295m906761O149218R226691N41247o325428k622788K752708J43092
40446A0145274m159229N27082R896909J0249094l81624r325674p504376m4179
40438I403277L485590J162492k328719k972747l48591K957599L107597l67253
40430A4099245j607630M651122J2811458J0460587m230870j6556939j2634416
40423F992557K764486J2818365R298161j196757r288504j2140577j0281778l834120
40415d868167M430868Q216243M230034l682787r574750j1166019q605380k169403
$$ plain form
40470 8898654 16404631 18281832 10081982 1523189 3232022 12807931 20582242 23641616
40462 23641616 25535447 25962296 21260731 14172255 12279103 15165035 13614963 5187295
40454 5187295 280534 6429752 15656443 16197690 9872262 7249474 10002182 10145274
40446 10145274 5986045 6513127 16410036 26659130 26277506 16951832 9447456 9403277
40438 9403277 12888867 14051359 11722640 8749893 8401302 11358901 14466498 14099245
40430 14099245 12491615 17142737 29954195 40414782 36183912 19626973 6992557
40423 6992557 9757043 22575408 31873569 30676812 21388308 9247731 -1034047 -4868167
40415 -4868167 -437299 7778944 12008978 8326191 -1248559 -12414578 -21019958 -23189361
40407b3189361N163024P093315J173971n848298n161196K791464R145501Q426715
40399d04865M366911K865234L897654L306552k08228l259299k270239K349379
40391A0643099O586862O385822J101606n653407q698043n698204O49024N015721
40383A0332480M199863n41798n595950q401471q123362m433324J666041N870630
40375e026891L309480m484162q808213l957195M533253P155291M100846M379989
40367A202398J0798718J4178172O670846n943123j1526555o891372O14936M094322
40359A3198342L148181K86830k377657k711721r0057K032944n10281o038347p911833
40350i73599k892851M891197R202297P864677L130410j128842k048976k77393
$$ plain form
40407 -23189361 -18026337 -10933022 -9759051 -15607349 -20768545 -17977081 -8831580 -404865
40399 -404865 3962046 6827280 10724934 14031486 13823258 10563959 8293720 10643099
40391 10643099 17229961 23615783 24717389 19063982 10365939 4667735 5316759 10332480
40383 10332480 14532343 13990545 8394595 -6876 -8130238 -12563562 -10897521 -5026891
40375 -5026891 -1717411 -6201573 -15009786 -18966981 -14433728 -7278437 -3177591 1202398
40367 1202398 12001116 26179288 32850134 26907011 15380456 8489084 9104020 13198342
40359 13198342 16346523 16633353 14255696 11543975 11453918 13486862 12976581 6938234 -973599
40350 -973599 -3866450 1024747 10227044 18091721 21222131 20093289 18044313 17766920
40342A7766920K7637l559261p002519m115361M326997J0092477P317137q73101
40334B3980926p017301p207481k687666L115188O735655O057783J933441k400024
40326B2510521m328479l298067K34686M816495P132322M380509j688843n874068
40318B3885076n402544k186181Q97665K617068J976017j617224n513237n414316
40310I242324j866965j030536o014942j1089640q433922J579120J0589680J1596956
40302D572075N178015k716952o527242m860905l39392L833188O733706Q256018
40294A4128511O557610P10011m832765l985452J520507K667204l657786q379803
40286D728037k855966P445545R717515J453116p202792q173057l949180J73941
$$ plain form
40342 17766920 17794557 14235296 7232777 3117416 7444413 17536890 24854027 23980926
40334 23980926 16963625 9756144 7068478 10183666 16919321 22977104 24910545 22510521
40326 22510521 18182042 14883975 15118661 19935156 27067478 31447987 29759144 23885076
40318 23885076 18482532 16296351 17194016 19811084 21787101 20169877 14656640 9242324
40310 9242324 7375359 6344823 329881 -10759759 -19193681 -17614561 -7024881 4572075
40302 4572075 9750090 7033138 505896 -4355009 -4694401 -861213 5872493 14128511
40294 14128511 20686121 21396132 16563367 12577915 14098422 16765626 13107840 4728037
40286 4728037 1872071 9317616 19035131 20488247 13285455 5112398 1163218 1337159
40278A337159L975205Q091556Q588495K245418o181814q377664l063974L007557
40270I621938M279518J688691j608517m557831o123796l544510L328966Q753257
40262A1837716O697588j368825q247178r664425o862811j466361O111728J2089798
40254I127230J0135761P51268n979562k689184M743454N675333R8402k744212
40246A9118490O36535L819680K297445K32338J917740M370390L493508J305974
40238C7192100J129281N96640l788679q522490o842631O03831N651903L820577
40230B9840532r8502K96481M060538M862163r2111o352342p761856l761133L36582
40221B1330352j49428m426189q431147r470761o787998n8110R026872J5125748
$$ plain form
40278 1337159 5312364 13403920 21992415 24237833 18056019 9678355 6614381 9621938
40270 9621938 13901456 15590147 13981630 9423799 3300003 -244507 3084459 11837716
40262 11837716 18535304 17166479 8919301 -745124 -7607935 -9074296 -2962568 9127230
40254 9127230 19262991 20014259 14034697 11345513 16088967 21764300 21862702 19118490
40246 19118490 19755025 23574705 25872150 26104488 28022228 32392618 35886126 37192100
40238 37192100 38321381 38918021 35129342 26606852 19764221 20368052 26019955 29840532
40230 29840532 29742030 30038511 34099049 38961212 38869101 32516759 24754903 20993770 21330352
40221 21330352 21180924 16754735 8323588 -1147173 -7935171 -7993281 1033591 16159339
40213A6159339J3679611O974966J880254J400746K257303P92844k904757o849643
40205C3390663q806204o296432J67065M358544Q73346n814171n961468J382810
40197A3294153P201854O630944M599037M478844J926229m340509o245681Q55059
40189B8399930Q120592N665536k423184n865029m363249m516478n906592l013026
40181A6098500K033471J404751m635324p628850m648566j189206J29491K956847
40173D521114P830714R465083N681205M29678l691942p600202r576233o057809
40165A001608L00487K702114J401570K764873O117636L479297m699800o473077
40157F594708L226555J3170495J2351516N142960J227317L34752k455017m406162
$$ plain form
40213 16159339 29838950 36813916 38694170 40094916 42352219 43145063 40240306 33390663
40205 33390663 24584459 18288027 18455092 22813636 23686982 17872811 11911343 13294153
40197 13294153 20496007 27126951 31725988 36204832 38131061 33790552 27544871 28399930
40189 28399930 36520522 42186058 39762874 33897845 29534596 25018118 19111526 16098500
40181 16098500 18131971 19536722 14901398 7272548 2623982 1434776 1564267 4521114
40173 4521114 12351828 21816911 27498116 27927794 24235852 16635650 7059417 1001608
40165 1001608 1302095 4004209 5405779 8170652 14288288 17767585 13067785 6594708
40157 6594708 9821263 22991758 35343274 40486234 41713551 42048303 39593286 35187124
40149C5187124k24979N796299M795912k061608m926263m32428M050701J958108
40141D4142866m540861r488504r967241o628925j918343J153558J415726Q05812
40133A4974088J380815K524275K876432K397958P00735k752540m621763M32683
40125A7912683R929351J2263111J823575j0395292r950222J412150R145879O692239
40117C8833474J946125K288866L968849P33211n051326o187702j391317L276626
40109C8416806K340677l252839q030010q023725m675301k658492l855501n202184
40101E059431l607372n37646P48434K92031N05380J796546K556738K400920K262799
40092A1477261K190307J716998J198775N03855j585425m210547l597684J311108
$$ plain form
40149 35187124 34962145 40758444 45554356 43492748 38566485 38134057 42184758 44142866
40141 44142866 39602005 30113501 20146260 13517335 11598992 12752550 14168276 14974088
40133 14974088 16354903 18879178 21755610 24153568 24854303 22101763 17480000 17912683
40125 17912683 27842034 40105145 41928720 31533428 21583206 22995356 32141235 38833474
40117 38833474 40779599 43068465 47037314 47770525 42719199 36531497 35140180 38416806
40109 38416806 40757483 37504644 29474634 21450909 16775608 14117116 10261615 5059431
40101 5059431 1452059 914413 1662847 1954878 2460258 4256804 6813542 9214462 11477261
40092 11477261 13667568 15384566 16583341 17087196 15501771 11291224 7693540 9004648
40084I004648N589389M870315K043032K526383N764939O932797M519961M15325
40076D1666789m749148r572676q185472K582186J3690082J1696657k641774j3350365
40068C1136279r967372o1426M014320K316130L295197Q212929R324929K925749
40060E1196735l896948k506088N593894J0255560N174403m317355p896121k983306
40052E0620774L071475L881648J868836K089747L393709J630499j845502k132353
40044F2578833M16378P02091k375676m953239n818471p172572p208592o78713
40036C5490039J0631921J6457098J1378873K649937O609L712049P616107Q600308
40028I6542941P590807N648812M318424O203493J0472603J1280458N189158l139905
$$ plain form
40084 9004648 14594037 19464352 21507384 24033767 29798706 36731503 41251464 41666789
40076 41666789 36917641 27344965 19159493 21741679 35431761 47128418 44486644 31136279
40068 31136279 21168907 21107481 25121801 27437931 30733128 38946057 48270986 51196735
40060 51196735 47299787 44793699 50387593 60643153 65817556 61500201 53604080 50620774
40052 50620774 53692249 57573897 59442733 61532480 64926189 66556688 64711186 62578833
40044 62578833 62995211 63697302 61321626 56368387 50549916 43377344 36168752 35490039
40036 35490039 46121960 62579058 73957931 76607868 76614477 80326526 87942633 96542941
40028 96542941 104133748 109782560 114100984 120304477 130777080 142057538 147246696 144106791
40020A44106791o914042n496065k556516M30974M105165P630622R799503J1280099
40012A62386531J2113784J0162347N715346L684358O800621J0661956J0391219
40005B21916162P894800O906364N474548N62425l732682r84613O670863J0757593
39997B55465460Q534838N061868M001656M272971N403573P892187Q128199J856335
39989C00617087o240368n946846K842435P449106j44663j2116149j7133348j5737666
39981B53589588j5523061j7527400j6989909j3800052j2421455j2917253j1137450
39974A53273008p664733p659691j0513848q658813k97990M851334j360641j2732153
39966A09236473j6621552j1069307n644794o260247p862179m275630K305037O059157
$$ plain form
40020 144106791 137192749 131696684 129140168 129571142 133676307 141306929 151106432 162386531
40012 162386531 174500315 184662662 190378008 194062366 200862987 211524943 221916162
40005 221916162 229810962 236717326 242191874 242754299 239021617 238037004 244707867 255465460
39997 255465460 264000298 269062166 273063822 277336793 282740366 290632553 298760752 300617087
39989 300617087 294376719 288429873 291272308 298721414 298576751 286460602 269327254 253589588
39981 253589588 238066527 220539127 203549218 189749166 177327711 164410458 153273008
39974 153273008 145608275 137948584 127434736 118775923 118477933 123329267 121968626 109236473
39966 109236473 92614921 81545614 75900820 69640573 61778394 57502764 59807801 65866958
39958F5866958O126746M999258K339400l399142r408752j0681410o811620j501442
39950D7529996L261361O761398N407794k730968r950122n823620N847078Q407317
39942E8710234l978158j5612191j1428171O27162K717798m983902o540825K174410
39934B1686357O818187q07881q606847l574922P969616J1270788M989810o38902
39926C9106206j693171l211797o141103m597905K371709P193087N389834J959168
39918D0376028J694906R55166m661552j0401055q227227M5268L828475j335062
39910B2274947p142463m262732M423074P869439K181646m252788k410342N442625
39902B4123406R398776N028414k056675m819760l293303k122635k971541l275457
$$ plain form
39958 65866958 71993704 76992962 79332362 75933220 66524468 55843058 49031438 47529996
39950 47529996 50791357 57552755 62960549 60229581 50279459 44455839 50302917 58710234
39942 58710234 54732076 39119885 27691714 28318876 31036674 26052772 19511947 21686357
39934 21686357 28504544 27696663 19089816 15514894 23484510 34755298 39745108 39106206
39926 39106206 37413035 34201238 28060135 23462230 25833939 33027026 38416860 40376028
39918 40376028 42070934 43026100 38364548 27963493 19736266 19781534 23610009 22274947
39910 22274947 15132484 10869752 15292826 23162265 25343911 21091123 18680781 24123406
39902 24123406 33522182 38550596 36493921 31674161 28380858 26258223 23286682 20011225
39894B0011225j505397K35154k08255j679125j858649j163920k042159m644254
39886G144620n679188k749179J808098L311668M14901l371610l690104P21989
39878b088805P707760J3018882J2115438M016242n440094p726940j622349L937150
39870B3917284N30353q617572j2640594o813356K737317Q122692Q303288O861966
39862B2401378N500412L108487n85677l397089k895647N76916L381576K036293
39854C0126649k100736l422518Q39694O267157O836330K688742j363028k837591
39846C7034699k342733M59294N437174P958554L560441l733151n655765k390020
39838D0328493j834785n123510m112276K920275N455170j825956p520964p03619
$$ plain form
39894 20011225 18505828 18740982 18532727 16853602 14994953 13831033 11788874 7144620
39886 7144620 1465432 -1283747 524351 3836019 4250920 879310 -2810794 -2088805
39878 -2088805 5618955 18637837 30753275 34769517 29329423 21602483 19980134 23917284
39870 23917284 24447637 15830065 3189471 -3623885 -886568 7236124 15539412 22401378
39862 22401378 27901790 31010277 30424600 27027511 24131864 24708780 28090356 30126649
39854 30126649 28025913 24603395 25443089 31710246 38546576 41235318 39872290 37034699
39846 37034699 34691966 35151260 40588434 48546988 52107429 48374278 42718513 40328493
39838 40328493 38493708 33370198 29257922 32178197 37633367 35807411 28286447 27582828
39830B7582828R879923P974984m958056j2262511p256454j03465J164037J120602
39822B3141888M332767N838963J136417m568915m470636l2068L432740M444302
39814C3255458L370699m46102m419241k821520L137932L198653o708743j4917463
39806A3649673r383385L614859P660834m36341p783663n513780K76960P64074
39798B849231k413692j973994L204139P230525N612810J72581l855535l562225
39790G263840j201962j315739m740628p254929n614122k124186k69058J075258
39782a4181526M430996P290575M948805j208758m383478j586812L211093N518226
39774D039121M684265J493992l094251o025491m322993l6308K217336K855837
$$ plain form
39830 27582828 37462751 45437735 40479679 28217168 20960714 20857249 22021286 23141888
39822 23141888 27474655 33313618 34450035 29881120 25410484 25378416 28811156 33255458
39814 33255458 36626157 36180055 31760814 28939294 32077226 35275879 28567136 13649673
39806 13649673 4266288 7881147 15541981 15105640 7321977 1808197 2085157 2849231
39798 2849231 435539 -1538455 1665684 8896209 14509019 14681600 10826065 7263840
39790 7263840 6061878 4746139 5511 -7249418 -12863540 -14987726 -15256784 -14181526
39782 -14181526 -9750530 -2459955 2488850 1280092 -3103386 -4690198 -1479105 4039121
39774 4039121 8723386 10217378 7123127 1097636 -3225357 -3261665 -1044329 1811508
39766A811508O036533J0247307Q273310r18869q412793p631550k849684l53915
39758F201847J312336N423868Q141397M190740l051199o005494m387868l576757
39750H248870l832487n94599N029291N644423q09749o960981o484114k168727
39742a928073k11286j672914l054819j524280L306918R746136J3979613J2434527
39734C1075822N944568p16629m287289n521786o158173o635856p089007p325015
39726g13365n879304k574057j158487m653610q851856o619930J101597N566904
39718b3782108K952076m75210J273374N471480O683492M881871K924649J529776
39710A459400J352871M404098Q545076O732706k381676r373180o705730m15096
$$ plain form
39766 1811508 7848041 18095348 26368658 25449789 17036996 9405446 6555762 6201847
39758 6201847 7514183 12938051 21079448 25270188 22218989 16213495 11825627 8248870
39750 8248870 4416383 3821784 8851075 14495498 13685749 6724768 240654 -1928073
39742 -1928073 -2139359 -3812273 -6867092 -8391372 -5084454 4661682 18641295 31075822
39734 31075822 37020390 36303761 32016472 26494686 20336513 13700657 6611650 -713365
39726 -713365 -6592669 -9166726 -10325213 -14978823 -23830679 -30450609 -29349012 -23782108
39718 -23782108 -20830032 -21305242 -20031868 -14560388 -7876896 -2995025 -70376 1459400
39710 1459400 2812271 7216369 15761445 22494151 20112475 10739295 4033565 3618469
39702C618469m63854m882696m208867J888789M508494J124374p95780K602857
39694C391786N384407K555925k647904o179110r020908j1006752p333503K653258
39686b2202801J0353775Q530892J557345j774459j006412k175076o400083p994915
39678b1111734l291980M473342R273402P715361J277342m038302k316764N093912
39670b925421R904808P588826L579676L931949M553086k381720j3984179j8146979
39662g879954j0049191J630550P544897Q671636J0012830J0312209N101101l774731
39654B1569347r171988q558704o677714p314550p765031m257818J094861L086448
39646a7995149J393419R29910L838437N889356L395964l25247J03022L242351
$$ plain form
39702 3618469 3154615 -1728081 -5936948 -4048159 460335 1584709 788929 3391786
39694 3391786 8776193 11332118 8684214 2505104 -6515804 -17522556 -24856059 -22202801
39686 -22202801 -11849026 -3318134 -1760789 -3535248 -4541660 -6716736 -13116819 -21111734
39678 -21111734 -24403714 -19930372 -10656970 -2941609 -1664267 -5702569 -8019333 -2925421
39670 -2925421 6979387 14568213 18147889 22079838 26632924 24251204 10267025 -7879954
39662 -7879954 -17929145 -16298595 -8753698 -82062 9930768 20242977 25344078 21569347
39654 21569347 12397359 3838655 -2839059 -10153609 -17918640 -22176458 -21081597 -17995149
39646 -17995149 -16601730 -15671820 -11833383 -5944027 -2548063 -2873310 -2770288 472063
39638D72063K685536k781454o985812n515708j236860J652667L432690N242440
39630c034438M914599J069192k932572m008843m263970n666147m412018K406603
39622a5927594Q389417M909894n136934r862112m745764K431290M387736L294239
39614a2259828L866863N356874M934190L201185K005402J230244R35641K178372
39606A1448943L287491O99048l975232m071082J472433M494196l67936o690885
39598F296976n783433M37836L539099J289377j421908j392342O03392M093716
39590G662713Q353880R314673L891592l914797p528411o697670n513524l905475
39582A662981J085596P048559P809787L297862k36628k17238m966o85216Q29389
$$ plain form
39638 472063 3157599 376145 -6609667 -12125375 -13362235 -11709568 -8276878 -3034438
39630 -3034438 1880161 2949353 16781 -3992062 -8256032 -13922179 -18334197 -15927594
39622 -15927594 -7538177 -2628283 -7765217 -17627329 -22373093 -19941803 -15554067 -12259828
39614 -12259828 -8392965 -3036091 1898099 5099284 7104686 8334930 9270571 11448943
39606 11448943 14736434 15435482 11460250 7389168 8861601 13355797 12987861 6296976
39598 6296976 513543 951379 4490478 5779855 4357947 2965605 3568997 7662713
39590 7662713 16016593 25331266 29222858 25308061 17779650 11081980 5568456 1662981
39582 1662981 2748577 9797136 17606923 20904785 20668157 20450919 20445953 19760737 20590126
39573B0590126L976823L363072k122447o849698p491249o534431m527782J825210
39565B229624J0110877J0742050J088811p957130o933327j281932j438850o586931
39557b6808q146120m231769k97517J399211L134138M474277K829475J53527Q02031
39548I0445L481025L007378p52933l184450l148479l229229k721495J432266P008942
39539A983470P988083L836733m59847l337345p127247r867252o422297J148989
39531a2256713M284282R15483k070481j411096j604171l461125p45414O521046
39523i828189P984673o4908n797981r2337P598533M455587m210488m295464K694781
39514a555793K155960q557356j4932463p755891M130670Q764405O687293N028861
$$ plain form
39573 20590126 24566949 27930021 25807574 18957876 11466627 4932196 404414 2229624
39565 2229624 12340501 23082551 24171362 16214232 9280905 7998973 6560123 -26808
39557 -26808 -8172928 -12404697 -12702214 -11303003 -8168865 -3694588 -865113 -711586 90445
39548 90445 3571470 6578848 5825915 2641465 -507014 -3736243 -6457738 -5025472 1983470
39539 1983470 9971553 13808286 13348439 10011094 2883847 -6983405 -13405702 -12256713
39531 -12256713 -7972431 -7056948 -9127429 -10538525 -12142696 -15603821 -16349235 -9828189
39523 -9828189 -1843516 -1908424 -7706405 -7798742 -200209 4255378 44890 -4250574 -1555793
39514 -1555793 600167 -7957189 -22889652 -30645543 -26514873 -17750468 -11063175 -6034314
39506f034314N261711M172697J036530k375321n189287o846625o404669m607228
39498b0986506k983657j25049O138563J2501740J2713294P425312M062479M950573
39490B3696749L913617j979215o189453l716201j53708k526570p798438q740097
39482c493316o029976n611972p487279o191886q53098L526082M503735M736104
39474a6901606N874827O257051N202878M092620K728774k72199l216287k635338
39466A130720O19587J649719j198540m052473l746519j903861j126185q90977
39458i518529P75824M119263P431353Q165706M425569k208944o183082l722293
39450C284867J685981L588992J539825P45247L020833M214502J896928o34834
$$ plain form
39506 -6034314 -772603 3400094 4436624 2061303 -3127984 -9974609 -16379278 -20986506
39498 -20986506 -23970163 -24095212 -17956649 -5454909 7258385 14683697 18746176 23696749
39490 23696749 27610366 25631151 19441698 15725497 15571789 13045219 5246781 -3493316
39482 -3493316 -9523292 -15135264 -22622543 -28814429 -29667527 -26141445 -21637710 -16901606
39474 -16901606 -11026779 -4769728 433150 4525770 7254544 6982345 3766058 1130720
39466 1130720 1750307 3400026 2201486 -1850987 -5597506 -7501367 -8627552 -9518529
39458 -9518529 -8742705 -4623442 2807911 10973617 15399186 13190242 7007160 3284867
39450 3284867 4970848 8559840 10099665 10844912 13865745 18080247 19977175 19342341
39442A9342341p73666j235872m231074n898218j876013M761026O848111L047970
39434A9984605q80208p77179P54025l86863k923813k035279K749214N094126l46984
39425B1231644r349628j1434944k816994Q031555J0658644M713717k623772p481838
39417A0928384j0593444j0062948k225347Q963540J2596079N137271l362569k838245
39409H542721L216534M192786k514126j0043556j2476461r465875k483151O260002
39401a4771126J1577061Q669951j45787o727814n881211N09554P352474J0285130
39393A0868232O851117j209275p186843n948264j135779o70692n260078p595080
39385a1286662l857879Q97333J600997Q99597L446732P488759P792586L871904
$$ plain form
39442 19342341 18568675 17332803 13101729 7203511 5327498 10088524 16936635 19984605
39434 19984605 19104397 18327218 19081243 18694380 15770567 13735288 16484502 21578628 21231644
39425 21231644 11882016 447072 -2369922 5661633 16320277 21033994 18410222 10928384
39417 10928384 334940 -9728008 -11953355 -2989815 9606264 14743535 11380966 8542721
39409 8542721 11759255 15952041 13437915 3394359 -9082102 -18547977 -21031128 -14771126
39401 -14771126 -3194065 5475886 5330099 -1397715 -7278926 -6769372 583102 10868232
39393 10868232 17719349 16510074 9323231 3374967 2239188 1568496 -3691582 -11286662
39385 -11286662 -15144541 -14247208 -12646211 -11746614 -8299882 -811123 6981463 10853367
39377A0853367l33816l226946o406531r167224p671348j256472M570547M394357
39369h244066K2389j780874J736092N579068L666146k714100o013801k098516
39361i847662M218903N284249J75293m817417m513607l77449K883990L458881
39353c534819L314494M305917N554039N101853K907103N97913j793294o307269
39345A0145937j2086335j2619337l144264R860160J3414273M292491o324789q097114
39337d558978l954841j381650O77775O352176J0502615M981299n184615n952450
39329A481331M338481J1461625O813446q48221j318123J780824L58051l944339
39321B0123075n304669n275544p635438p969950q0811J1286263J5358932J0445257
$$ plain form
39377 10853367 10519551 7292605 886074 -8281150 -15952498 -17208970 -12638423 -8244066
39369 -8244066 -8221677 -10002551 -8266459 -2687391 978755 -1735345 -7749146 -9847662
39361 -9847662 -5628759 -344510 -169217 -4986634 -9500241 -9877690 -6993700 -3534819
39353 -3534819 -220325 4085592 9639631 14741484 17648587 18246500 16453206 10145937
39345 10145937 -1940398 -14559735 -17703999 -7843839 5570434 9862925 3538136 -4558978
39337 -4558978 -8513819 -9895469 -9217694 -2865518 7637097 12618396 7433781 1481331
39329 1481331 5819812 17281437 24094883 23246662 21928539 23709363 24067414 20123075
39321 20123075 14818406 9542862 1907424 -6062526 -6143337 5142926 20501858 30947115
39313C0947115L949691k21134l761060n391747j545921M381847M205138k446860
39305C0117069p346994o627210m777506m229407j375925M020825N687727J686331
39297A7154910q21044K808516O501611L243717l786797o548920l322273J495593
39289A6725313M252694L470971r66066n159427k849232N034509Q090947J39880
39281B8739589j0179517j0395457j668771L666872o4351n550571m241890L280810
39273C586714J0381264J2093975P954213J293558k842337k007339Q93774J412427
39265C2766249p44391k588015k968448l205645l681259l603713l557881m791101
39257G625796o363454n906817k618403K561379P938007J0126154N422512m419166
$$ plain form
39313 30947115 34896806 34675672 30914612 25522865 23976944 28358791 32563929 30117069
39305 30117069 22770075 16142865 11365359 7135952 5760027 9780852 15468579 17154910
39297 17154910 16333866 19142382 25643993 28887710 25100913 18551993 15229720 16725313
39289 16725313 20978007 24448978 23482912 18323485 15474253 20508762 28599709 28739589
39281 28739589 18560072 8164615 6495844 10162716 10098365 4547794 305904 3586714
39273 3586714 13967978 26061953 34016166 35309724 32467387 30460048 31353822 32766249
39265 32766249 32021858 29433843 26465395 23259750 19578491 15974778 12416897 7625796
39257 7625796 1262342 -4644475 -7262878 -4701499 3236508 13362662 18785174 14366008
39249A4366008j1296924j0049027n099861k886277k067390J741726N581547K876078
39241f834120m359354p051797k813614J616331K577955L874108O568476N078364
39233a343651j783358n610482q15789N908571N962862J731591P75054K654356
39225G479154Q77549n083780q677317o293957j189314K420044L451213K526897
39217d489511J301945K437686O036850P763793M800992J028631J057517K359539
39209B2297442K09759k600216J3335N023134K830747o512901j0697717l076489
39201G487094O918443Q037685L207433K200113M861695K938666m166244p236469
39193B4248416k088686L527050J814836m081521o379013m231385k482580k142000
$$ plain form
39249 14366008 3069084 -6979943 -12079804 -14966081 -17033471 -15291745 -9710198 -6834120
39241 -6834120 -11193474 -18245271 -21058885 -19442554 -16864599 -12990491 -6422015 -1343651
39233 -1343651 -3127009 -8737491 -9553280 -3644709 2318153 4049744 4824798 7479154
39225 7479154 8356703 3272923 -5404394 -11698351 -12887665 -10467621 -7016408 -4489511
39217 -4489511 -3187566 -749880 5286970 13050763 17851755 18880386 19937903 22297442
39209 22297442 22507201 19906985 19920320 24943454 27774201 21261300 10563583 7487094
39201 7487094 14405537 22443222 25650655 27850768 32712463 35651129 31484885 24248416
39193 24248416 22159730 25686780 27501616 23420095 17041082 12809697 10327117 8185117
39185H185117P50892O868881J0224460N512417m351453j0685490q024755Q73088
39177I353157Q523252J0090707P021888L793195K267095Q84209q37828j54927
39169D0940748M364371Q599859P112466J036145k416444O55888N529660N034118
39161G0856811j471638p788923q221952l165637K047027K610259j089055m034010
39153D9742882k541559J209175K703364J825166J933197K639210n92100p946446
39145D8972889j2665728j0614837o532979n650779m787085J099635Q014844P447849
39137B5283809l07251o188012n316348j731458Q4883L52402l36194k623652m077146
39128E141033q77391M399154M532731p16336l283032q8302J637105k955727p610983
$$ plain form
39185 8185117 8936009 15804890 26029350 31541767 27190314 16504824 8480069 9353157
39177 9353157 17876409 27967116 34989004 38782199 41049294 41933503 41095675 40940748
39169 40940748 45305119 53904978 61017444 62053589 59637145 60293033 65822693 70856811
39161 70856811 69385173 61596250 53374298 50208661 52255688 54865947 53776892 49742882
39153 49742882 47201323 48410498 51113862 52939028 54872225 57511435 56919335 48972889
39145 48972889 36307161 25692324 19159345 13508566 8721481 9821116 17835960 25283809
39137 25283809 24976558 18788546 13472198 11740740 11825623 12178025 11841831 9218179 5141033
39128 5141033 4263642 8662796 13195527 12479191 9196159 9107857 10744962 7789235 178252
39119A78252n623595q45388N8089r12846J404158M393089K538753j186043J70592
39110A75061M321745K557255m724082o813963P76270Q738990P246939j036024
39102A1242191o511044n699653l070818k662834k993972m92594M527369O964050
39094A302695L058117l257483l711219L213264R245903P879918L738611M475133
39086B5944939Q065963O700354O16366j927071J498882L594477l24621n007155
39078C9162134m522501j574353k175750o069824p898158n063847k05898K549117
39070A4200920J312225k030208k937357Q93095N529052M994571l88570m053213
39062A7520515k227410J698501L057005J422165j518431m968434p509495o658004
$$ plain form
39119 178252 -5445343 -6290731 -6232642 -7145488 -5741330 -1348241 1190512 4469 175061
39110 175061 4496806 7054061 2329979 -4483984 -3707714 5031276 12278215 11242191
39102 11242191 4731147 -968506 -4039324 -6702158 -9696130 -10188724 -5661355 1302695
39094 1302695 4360812 1103329 -2607890 605374 9851277 17731195 21469806 25944939
39086 25944939 34010902 40711256 41327622 39400551 40899433 44493910 44169289 39162134
39078 39162134 34639633 33065280 30889530 24819706 16921548 11857701 11651803 14200920
39070 14200920 15513145 13482937 10545580 11438675 16967727 21962298 21573728 17520515
39062 17520515 15293105 16991606 20048611 21470776 19952345 14983911 7474416 816412
39054H16412k635124N57666N2099k490196l767602k495661N01294L023795K429895
39045d007422q19940j563247L542424R348408Q334756K261214l53142J692784
39037A8435835O09149n714007q065282n18672Q609915Q191586j23342n943765
39029A5481417m934738j564587k04376p95905j848042k207495r63877R74591J468284
39020E405272J428011M048467P375875M338744n355000j0807056m359623O139380
39012H214070Q064684J696765k543240q10726Q20217j545002m236749l627881
39004F032138j053352J261667K823289K543425o43359m404458n195671l615944
38996b252265k968930l579762l484043l106209l690590k972853J297590N322613
$$ plain form
39054 816412 -1818712 -1261046 -1208947 -3699143 -7466745 -9962406 -9461112 -6437317 -4007422
39045 -4007422 -4827362 -6390609 -2848185 6500223 14834979 17096193 16743051 18435835
39037 18435835 19044984 13330977 5265695 4747023 13356938 21548524 21425182 15481417
39029 15481417 10546679 8982092 8777716 7981811 6133769 3926274 2962397 3936988 5405272
39020 5405272 6833283 10881750 18257625 22596369 17241369 6434313 2074690 8214070
39012 8214070 16278754 17975519 15432279 14621553 15441770 13896768 9660019 6032138
39004 6032138 4978786 6240453 9063742 11607167 10963808 6559350 1363679 -2252265
38996 -2252265 -5221195 -8800957 -12285000 -15391209 -19081799 -22054652 -20757062 -15434449
38988a5434449L736146j256250k661998L28814K087595Q60434P74248K765218
38980h800242K182927k311175n315027l229590N05144J870645J928261K843889
38972a0325168L721743L622890M019895N407305N728499M396194L548978L496515
38964B3616851J665381j989447l529579j360969P24964o03784l643223n222707
38956I657487m640185k129489J879819L928173n96676r552280j3231707n888037
38948b0572895N831784J0559127N475027k471892o434827n999716m136958k115152
38940a9865502O65930L418921L092829j677521o771420o106832P5442M443915
38932b2724238K556325q99996K3148L166050K995578P96750K240434O979193Q900924
$$ plain form
38988 -15434449 -11698303 -12954553 -15616551 -15287737 -13200142 -12339708 -11565460 -8800242
38980 -8800242 -6617315 -8928490 -14243517 -17473107 -16967963 -15097318 -13169057 -10325168
38972 -10325168 -6603425 -2980535 1039360 6446665 12175164 16571358 20120336 23616851
38964 23616851 25282232 23292785 19763206 18402237 19127201 18523417 14880194 9657487
38956 9657487 5017302 2887813 4767632 8695805 8099129 -1453151 -14684858 -20572895
38948 -20572895 -14741111 -4181984 1293043 -1178849 -7613676 -13613392 -17750350 -19865502
38940 -19865502 -19199572 -15780651 -12687822 -14365343 -21136763 -27243595 -27168153 -22724238
38932 -22724238 -20167913 -21067909 -21044761 -17878711 -14883133 -14086383 -11845949 -4866756 4034168
38923D034168N860122J445197k117623n020526m961572O6884M708663J394468
38915E409781p412302j1818233r404886o846648o307663k700889L525560M557606
38907c0997674L64013J560217J0532650J3862792L380423p893007l550012J1757522
38899i83076J9227733J1361510k131352j0149226j0456345o098926j324427l61568
38891i15677l230911m233932J33734N062451M478175j3905k681225j499267K712218
38882a88339R241577J4167747J1032207J156507m421841o36575K616143l798557
38874B9168869j2618126j1798518l777180J71696j382063j041769K258325L220389
38866D201623K119523L249018M279612M67723l689345j139790K569941l349840
$$ plain form
38923 4034168 9894290 11339487 9221864 4201338 -760234 -693350 4015313 5409781
38915 5409781 -2002521 -13820754 -23225640 -30072288 -36379951 -39080840 -35555280 -30997674
38907 -30997674 -30633661 -29073444 -18540794 -4678002 -1297579 -9190586 -12740598 -983076
38899 -983076 18244657 29606167 27474815 17325589 6869244 770318 -554109 -915677
38891 -915677 -4146588 -8380520 -8246786 -3184335 1293840 1279935 -1401290 -2900557 -188339
38882 -188339 9053238 23220985 34253192 35409699 30987858 30351283 32967426 29168869
38874 29168869 16550743 4752225 975045 1146741 -235322 -1277091 981234 4201623
38866 4201623 6321146 9570164 13849776 14317499 10628154 9488364 12058305 8708465
38858H708465j4349756j4507647j474872R638069R348083M055706L10225l896587
38850b168314p277599k020433J0110424J4150852L410341r114510r875446k528115
38842e312800K705718M737156O069519L249017n179111j0708441o655615K33457
38834a0861100R43560j305395P81184M051099J534260l094142j564937L248815
38826f266656J763416n082249p091028k282597O01518j957241k828317J987452
38818b1155702N685540K293547k822074q98101P044625J1396580O351335l405734
38810D490016q434946m931692J435950K473271k350320n260466o18190P467385
38802e728992J0451476N318860l547034r585626q319795K81164J0113602J2611297
$$ plain form
38858 8708465 -5641291 -20148938 -21623810 -11985741 -2637658 1418048 1728273 -2168314
38850 -2168314 -9445913 -11466346 -1355922 12794930 16205271 7090761 -2784685 -5312800
38842 -5312800 -2607082 2130074 8199593 11448610 6269499 -4438942 -11094557 -10861100
38834 -10861100 -9917540 -11222935 -10441751 -6390652 -4856392 -7950534 -9515471 -6266656
38826 -6266656 -4503240 -9585489 -16676517 -18959114 -18357596 -20314837 -23143154 -21155702
38818 -21155702 -15470162 -13176615 -15998689 -16896790 -9852165 1544415 7895750 4490016
38810 4490016 -3944930 -8876622 -7440672 -4967401 -7317721 -12578187 -13196377 -5728992
38802 -5728992 4722484 10041344 6494310 -3091316 -11411111 -11129947 -1016345 11594952
38794A1594952N929534k159079l931733r20240N50962q22110j628487j214911
38786G398888k441736n644654p396122n748614k503388M18044L570106P894093
38778d453383J1904491J2025292N997352l466688r658858q962265n654482n760539
38770h029080p705639n162430J599402N354507M007336L932958Q099775J0070197
38762A2167026M814709l003473p202391q147602o596780J078832J3332638J8301478
38754B4744437Q736823n265589r480861n042907l142283o280073p864705o126917
38746i722075m793006k553810M691083J2612238J2530577N832865J719503J711974
38738B2029349k53552l322629l78202O152148N015484m607472j0320886p185290
$$ plain form
38794 11594952 17524486 15365407 11433674 10513434 11064396 10242286 8613799 7398888
38786 7398888 4957152 -687502 -8083624 -13832238 -16335626 -15917582 -12347476 -4453383
38778 -4453383 7451108 19476400 25473752 22007064 12348206 3385941 -2268541 -8029080
38770 -8029080 -15734719 -20897149 -19297747 -13943240 -9935904 -6002946 2096829 12167026
38762 12167026 16981735 13978262 6775871 -1371731 -7968511 -6889679 6442959 24744437
38754 24744437 33481260 28215671 18734810 13691903 10549620 4269547 -3595158 -9722075
38746 -9722075 -14515081 -17068891 -12377808 234430 12765007 18597872 20317375 22029349
38738 22029349 21775797 18453168 18074966 24227114 29242598 24635126 14314240 7128950
38730G128950n147345r680434j1183586k724720O461659O389933K364359L219968
38722c171216M847437o72161q547009q520990k014318K226349M140572R286013
38714b425323J3845579Q560401l539742q833054l785311O39724j812360l517701
38706h67787J181166M336639k037319j0820705r567956N18309O801728L781058
38698f674867j350157j891344l46026p18107m33866L934045Q107759M856564m315562
38689A168439r466983n267121K369501N308992L437778J642019J034863p79143
38681e51655l169940k882575m55047M7885j710472j360246K498999N533858M906849
38672B857656L574835L983958K776151l397828j0667880j2060926o852777q75509
$$ plain form
38730 7128950 1981605 -7698829 -18882415 -21607135 -15145476 -8755543 -6391184 -3171216
38722 -3171216 1676221 1004060 -7542949 -16063939 -18078257 -15851908 -11711336 -2425323
38714 -2425323 11420256 19980657 16440915 7607861 3822550 4462274 2649914 -867787
38706 -867787 313379 4650018 2612699 -8208006 -17775962 -17257653 -10455925 -6674867
38698 -6674867 -8025024 -9916368 -10262394 -10980501 -11414367 -7480322 627437 5484001 1168439
38689 1168439 -8298544 -13565665 -11196164 -5887172 -2449394 -807375 227488 -551655
38681 -551655 -3721595 -6604170 -7059217 -7011332 -8721804 -10082050 -7583051 -2049193 2857656
38672 2857656 6432491 10416449 13192600 9794772 -873108 -12934034 -19786811 -20662320
38664b0662320J615908K020849L289486N359691N872289L631373K30333j687049
38656c29440j738236k534509n830645r082462q446293m325117l21247K711113
38648b9896836O689404J0192566Q528685K087396j568251K087644P507455P035557
38640A2663620J325424l668138n935375p023343n642200K97412O299135M328861
38632B645396n162286j1511167p491857J021624L576851p94363l777414m28260
38624b1921476M408740L886468j033987l196930J065777P809611J1343579J0646870
38616A3008652Q047315M371162j234683p708435j1528728j0126291m260848K586862
38608f844994O108518M171828k49355j420646J488791K271105l042303q510065
$$ plain form
38664 -20662320 -19046412 -17025563 -13736077 -8376386 -2504097 1127276 1357609 -329440
38656 -329440 -2067676 -4602185 -10432830 -19515292 -27961585 -32286702 -32607949 -29896836
38648 -29896836 -23207432 -13014866 -4486181 -2398785 -3967036 -1879392 5628063 12663620
38640 12663620 13989044 10320906 4385531 -2637812 -8280012 -7982600 -1683465 2645396
38632 2645396 -2516890 -14028057 -21519914 -20498290 -16921439 -17715802 -21493216 -21921476
38624 -21921476 -17512736 -13626268 -14660255 -17857185 -16791408 -8981797 2361782 13008652
38616 13008652 21055967 25427129 24192446 16484011 4955283 -5171008 -9431856 -6844994
38608 -6844994 -736476 3435352 3185997 1765351 3254142 5525247 2482944 -6027121
38600f027121n880478K905034Q254963O610487L426129K617626J826374l04659
38592A3428355p93329R52311R98566j371497j490564J799410L096406Q9307k128108
38583A4580857q49886q95206m384144m861389J033136N335531J384395l778546
38575G564748l84305P821272J0125796N896563K541354R18240l802265r406676
38567B1274727q557557k729170r61449m164858l662709K857215O825289L655490
38559A4536978J3921J237166K336612k153015q365091r956644p721696n875578
38551a5947347m304129m99781M719782P959154O765108M51097q367897j2410984
38543b1634997o328606M079519O921141O14904l464315J846936R313880R944080
$$ plain form
38600 -6027121 -11907599 -9002565 -747602 5862885 9289014 11906640 13733014 13428355
38592 13428355 12635026 13587337 14585903 13214406 11723842 13523252 16619658 16708965 14580857
38583 14580857 13730971 12835765 8451621 3590232 4623368 9958899 11343294 7564748
38575 7564748 7180443 15001715 25127511 31024074 33565428 34483668 30681403 21274727
38567 21274727 12717170 9988000 9026551 4861693 1198984 4056199 10881488 14536978
38559 14536978 14550899 15788065 18124677 15971662 7606571 -2350073 -10071769 -15947347
38551 -15947347 -20251476 -20751257 -16031475 -8072321 -1307213 -856116 -9224013 -21634997
38543 -21634997 -27963603 -23884084 -16962943 -16348039 -19812354 -17965418 -8651538 1292542
38535A292542O324650N088508M093027k314712j0224700r692438q6393P772318
38527B252802N828184k095870p083266n641608j323073R36738K25389N1587L131993
38518c717124O398026M455159j557533l726329J576173P875003P836461K971193
38510B2111029j179635m279320q438671j0407819n570929J885340K253018n198999
38502h825986r652694l878522N294556O690523j37191n708603l965149J626022
38494a8557044N463678P319922R434477J0407314P322419K338260P60899J627878
38486B6117803k641759j3248397j8832505r961479N485839J1730551P028110L846224
38478I524387P176970P164613j776341q710052l040577P314980P436800j985187
$$ plain form
38535 1292542 7617192 12705700 16798727 14484015 4259315 -5433123 -5519516 2252802
38527 2252802 8080986 5985116 -1098150 -6739758 -8062831 -7126093 -6900704 -6849117 -3717124
38518 -3717124 2680902 7136061 5578528 1852199 3428372 11303375 19139836 22111029
38510 22111029 20931394 16652074 8213403 -2194416 -7765345 -5880005 -3626987 -8825986
38502 -8825986 -18478680 -22357202 -17062646 -10372123 -10509314 -16217917 -20183066 -18557044
38494 -18557044 -13093366 -5773444 3661033 14068347 21390766 23729026 24489925 26117803
38486 26117803 23476044 10227647 -8604858 -18566337 -13080498 -1349947 5678163 9524387
38478 9524387 16701357 23865970 22089629 13379577 10339000 17653980 25090780 23105593
38470B3105593p349539l738887L23300n18451o61613M109945P679189L245086
38462B6194623n407390q926263m797658O83925J132095l089262o466356m790301
38454e466587M89641M498098N140293M889765N528083M487591q44443q044679
38446A0677762j2090000j0556769m153780M121169P949060J907460q754015r889121
38438b0788234K574163J2991820O185807r185634j1897438P70679J0427193O740692
38430b180952P70196L234727P060270K771491k856596J822646J2504038J4754522
38422C7880342N672979m382478q998470j1081553j1619060o319295L934400J0233356
38414A5320221P547794J441868j008505j92107k9715j046100j514897r36403J072532
$$ plain form
38470 23105593 15756054 12017167 12340467 11822016 11160403 15270348 22949537 26194623
38462 26194623 20787233 11860970 7063312 7747237 8879332 5790070 -676286 -5466587
38454 -5466587 -4976946 -478848 4661445 9551210 15079293 19566884 18722441 10677762
38446 10677762 -1412238 -11969007 -16122787 -12001618 -4052558 -2145098 -10899113 -20788234
38438 -20788234 -18214071 -5222251 963556 -8222078 -20119516 -19348837 -8921644 -2180952
38430 -2180952 -1410756 1823971 8884241 11655732 8799136 10621782 23125820 37880342
38422 37880342 43553321 39170843 30172373 19090820 7471760 1152465 5086865 15320221
38414 15320221 22868015 24309883 23301378 23109271 23079556 22033456 20518559 19582156 20654688
38405B0654688N169059Q720475O620776q53401n864825l237217J546064K86171
38397C3041790n483204p144063k591549P68975k013711n794203l754774J843522
38389H872783L210521j190730m606229j836147M209826P603156O822416M169657
38381B7255253R31128k884464n529338m582410j190395N06595p19883j126969
38373A2659517K232098O429915O331372J854710j904257j945252j505509m968164
38365A9184430j0527744j1229492m007043N118041P671798L384340J88867K642883
38357A2426080M909969p72223j1626202j6291749r241225K307031P715312M569515
38349f003492j712076n789814n903221k296949L062243O166641M557442J132835
$$ plain form
38405 20654688 25823747 34544222 41164998 40311597 34446772 31209555 32755619 33041790
38397 33041790 27558586 20414523 17822974 18591949 16578238 10784035 7029261 8872783
38389 8872783 12083304 10892574 6286345 4450198 8660024 16263180 23085596 27255253
38381 27255253 28186381 25301917 19772579 15190169 13999774 14506369 13786486 12659517
38373 12659517 14891615 21321530 27652902 29507612 27603355 25658103 24152594 19184430
38365 19184430 8656686 -2572806 -6579849 -1461808 6209990 9594330 9783197 12426080
38357 12426080 17336049 16563826 4937624 -11354125 -20595350 -18288319 -10573007 -6003492
38349 -6003492 -7715568 -13505382 -19408603 -21705552 -18643309 -12476668 -7919226 -6786391
38341f786391P93038L208499K798758k929541q665539p587310l12091N569679
38333a3910898M605946m76294k844337J4575M046181M739146L024373L042285
38325B240977N405467O097650K643212k010329l827091l197937l182354m166054
38317C541l810532j364404J531997L909836N804395N872564K822074n65659L25005
38308A4528817M406340M844240q19675n943966m598783j049823k921302q534393
38300h8545r402774m101651m42891k275883l127240K643520R938587J0587551
38292C730674N538523K159674K722092K896420O0676l768958o720877q539650
38284a921426p464279j774704N108269O920516K807718k095470m739353o637237
$$ plain form
38341 -6786391 -5993353 -2784854 13904 -2915637 -11581176 -19168486 -19480577 -13910898
38333 -13910898 -9304952 -9781246 -12625583 -12611008 -8564827 -3825681 -801308 2240977
38325 2240977 7646444 13744094 16387306 14376977 10549886 7351949 4169595 3541
38317 3541 -3806991 -5171395 -3639398 270438 6074833 11947397 14769471 14203812 14528817
38308 14528817 18935157 23779397 22959722 17015756 12416973 11367150 8445848 -88545
38300 -88545 -9491319 -13592970 -14035861 -16311744 -19438984 -16795464 -6856877 3730674
38292 3730674 9269197 11428871 14150963 17047383 17108059 13339101 6618224 -1921426
38284 -1921426 -9385705 -11160409 -6052140 868376 3676094 1580624 -3158729 -9795966
38276i795966p512690l825000L787348Q589926P022319L692509L189904L275301
38268H423651R59409j135905n67067j214137o311132j0368398o372658K573504
38260a4012733P331914N820858L500865K874390J545813l23565J16802J109484
38252G963828k081781p647623q418118l708093n63549j301775K7473N172630O099998
38243d457010j910002j0328114q314447K537866J1697197J3118689Q551896J832974
38235A2729049l444979l973310m66772J507254q19845k884170p41676J611832
38227C517383o64487l796380j139496N078192O418670Q47479n388086p459162
38219b585887o048670k649718J727586L601363J38574m774578m489084O05789
$$ plain form
38276 -9795966 -17308656 -21133656 -17346308 -8756382 -1734063 1958446 5148350 8423651
38268 8423651 9383060 8247155 7680088 6465951 154819 -10213579 -16586237 -14012733
38260 -14012733 -6680819 -859961 2640904 5515294 7061107 6737542 6854344 7963828
38252 7963828 5882047 -1765576 -10183694 -13891787 -14455336 -15757111 -15729638 -10557008 -4457010
38243 -4457010 -6367012 -16695126 -25009573 -22471707 -10774510 2344179 10896075 12729049
38235 12729049 9284070 5310760 4843988 6351242 5531397 2647227 1905551 3517383
38227 3517383 2852896 -943484 -2082980 2995212 9413882 10261361 4873275 -2585887
38219 -2585887 -8634557 -11284275 -9556689 -5955326 -5816752 -10591330 -15080414 -14474625
38211a4474625M202338M291245M235223M007931k26336o582681p337361j167948
38203a3052214M027920M330578N832857J1790440J3750911M325636q869972j2465498
38195I670658n730809O40559J166568L57043J561033J437924k244209n538953
38187A319814m516817p41707K435436M322280N008784L371267k56014k954138
38179G988905l242721l000446l245529j720452K396781M887756J600925n035645
38171F29574q575739o365476j339095K751477M167034K205630k183910m783132
38163a3493637j811586L581605L410785l946692r484080n267417L315311M010312
38155a9685399m662699j0320103l727114Q372580J2845559P318276M89132j628673
$$ plain form
38211 -14474625 -10272287 -5981042 -1745819 2262112 2035776 -4546905 -11884266 -13052214
38203 -13052214 -9024294 -4693716 1139141 12929581 26680492 31006128 22136156 9670658
38195 9670658 3939849 4580408 5746976 6104019 7665052 9102976 6858767 1319814
38187 1319814 -3197003 -3938710 -1503274 2819006 7827790 11199057 10943043 7988905
38179 7988905 4746184 1745738 -1499791 -3220243 -823462 4064294 5665219 629574
38171 629574 -7946165 -14311641 -15650736 -12899259 -8732225 -6526595 -8710505 -13493637
38163 -13493637 -15305223 -11723618 -8312833 -12259525 -21743605 -27011022 -23695711 -19685399
38155 -19685399 -24348098 -34668201 -38395315 -30022735 -17177176 -9858900 -9369768 -10998441
38147a0998441j042883M17304N118281J1862033J2455238K860363p764772p383960
38139E523163K483901R189842O661861J359685o24504k338862p011468r207774
38131F035844l185202N631470O973852O39980m332513m118427l740861n603043
38123a698900n004554n71650R92332l322060n265122K057887J1121356R776912
38115H086201n11825p281548n523093k036525j532302j69985M278528O371458
38107A680909K035109m458355p456812o927634m219435J623730Q087856P468130
38099b166502k058271j0196172p329033J736170N150716O97234l869784l835005
38091b1870647j500347R40088L393828L724193K99472k025125K656489J0251671
$$ plain form
38147 -10998441 -12041324 -11624020 -6505739 5356294 17811532 20671895 12907123 5523163
38139 5523163 8007064 17196906 23858767 25218452 24593948 22255086 15243618 6035844
38131 6035844 2850642 8482112 15455964 16095944 11763431 7645004 3904143 -1698900
38123 -1698900 -6703454 -7275104 -6282772 -9604832 -14869954 -12812067 -1690711 8086201
38115 8086201 7574376 292828 -5230265 -7266790 -8799092 -8969077 -4690549 1680909
38107 1680909 3716018 -742337 -8199149 -15126783 -19346218 -17722488 -9634632 -2166502
38099 -2166502 -4224773 -14420945 -21749978 -20013808 -14863092 -14165858 -18035642 -21870647
38091 -21870647 -23370994 -22430906 -19037078 -15312885 -15013413 -17038538 -14382049 -4130378
38083d130378J0630748L250623j414325J749100N182062J995465l313843l913234
38075A0036218k031240l336360o108450m647307L32067K941272J710952N67176
38067e35672J130392P23530j714468l457004k842046j789154j891273j359437
38059a1735132K073748O889232Q253294L035717n733622j0273831n638379M224203
38051h904770J0299384Q516085K918438j449705m327329o809117o737043j761136
38043h255193N544835R660120P897474J577730o254903j1185023q417058J678388
38035g753630J0358027Q113341l948349j4310102j3612217l898559N604706Q798556
38027a0648227O817611L935848K312807J257362K3572n98921j2849M30527q20760
$$ plain form
38083 -4130378 6500370 9750993 8336668 10085768 15267830 17263295 13949452 10036218
38075 10036218 8004978 4668618 -1439832 -6087139 -5755072 -2813800 -1102848 -535672
38067 -535672 594720 1318250 -396218 -3853222 -6695268 -8484422 -10375695 -11735132
38059 -11735132 -9661384 -2772152 5481142 8516859 2783237 -7490594 -13128973 -8904770
38051 -8904770 1394614 9910699 12829137 11379432 7052103 242986 -6494057 -8255193
38043 -8255193 -2710358 6949762 14847236 16424966 10170063 -1014960 -9432018 -7753630
38035 -7753630 2604397 10717738 6769389 -7540713 -21152930 -25051489 -19446783 -10648227
38027 -10648227 -3830616 105232 2418039 3675401 3698973 3100052 3087203 3517730 2696970
38018B696970k798268l220649k059353j435076k011918k188776j143748J7686
38010a2143132M80439M49395k98516j656916j579958R06125J929789k683094r385819
38001b3981687r950953l227330L468014O205471R035908J3484948J3107401M725809
37993A2867581l595088l887387k76684p26435l520399k334536Q66555j86880l157958
37984c951231q53130M310117K902719m584106o898955k59495N478508L008633
37976h46940j852108j473308J994046L044546K231421K150103J216089j715260
37968D748589k822542J2175J856015j454386n753293n451059k481287j198319
37960a2544107K26743N010819R016274O322902N22601L45766N227295N638885
$$ plain form
38018 2696970 -101298 -3321947 -5381300 -6816376 -8828294 -11017070 -12160818 -12143132
38010 -12143132 -11662693 -11213298 -11511814 -13168730 -14748688 -13842563 -11912774 -14595868 -23981687
38001 -23981687 -33932640 -37159970 -33691956 -27486485 -18450577 -4965629 8141772 12867581
37993 12867581 9272493 5385106 5108422 4381987 861588 -1472948 -606393 -793273 -3951231
37984 -3951231 -4804361 -494244 2408475 -2175631 -9074586 -9334081 -3855573 -846940
37976 -846940 -2699048 -4172356 -2178310 866236 3097657 5247760 6463849 4748589
37968 4748589 1926047 1938222 3794237 2339851 -3413442 -8864501 -11345788 -12544107
37960 -12544107 -12317364 -7306545 1709729 8032631 8555232 8900998 14128293 19767178
37952A9767178j220173o289218k866761K822116J464451m930501o095366J310652
37944C962378Q845055P787684K86328m335459j854471K489892K060239k711942
37936A6529704o385374o273197m281311k295764k61810J018100k70966l049420
37928e270038l375881k19377K442787J327129j698199k830241p05054M163738
37920f165136J0391491J4052938J0480408Q22086p351718r267951q312204q508188
37912c858274p174045r95361N417155N063628Q0755p85531M248914P301953L190073
37903A2489267l079655m601651k393880k126329m704345n472099j932984K258028
37895i563648K514039r8873m99541K378479K893683l092649j0096411q630146
$$ plain form
37952 19767178 18547005 12257787 9391026 12213142 13677593 8747092 2651726 3962378
37944 3962378 12807433 20595117 20881445 16545986 14691515 17181407 19241646 16529704
37936 16529704 10144330 3871133 -410178 -2705942 -2967752 -1949652 -2220618 -5270038
37928 -5270038 -8645919 -8865296 -6422509 -5095380 -6793579 -9623820 -10328874 -6165136
37920 -6165136 4226355 18279293 28759701 29581787 22230069 12962118 4649914 -3858274
37912 -3858274 -11032319 -12027680 -6610525 -1546897 -1466142 -2251673 1997241 9299194 12489267
37903 12489267 9409612 4807961 2414081 287752 -4416593 -9888692 -11821676 -9563648
37895 -9563648 -7049609 -7148482 -7648023 -5269544 -2375861 -5468510 -15564921 -24195067
37887b4195067J367070R110515O958285l66142m062940k819733r03337L05782
37879a4605567K416591M861839N704822N305593M243150Q59221l890348l568742
37871A326559M736651J2735639J0866085K600690r74629J403804L88057p532499
37863B5550357j4386372j3615669q058484k069354M263386R290515Q055036J230325
37855A0259740l137582j793087j244255n279316p256177k023998L806867K501002
37847d166806j976881j777473J264679J002410m1489M351447J0104478P372900
37839A6133265k310704o876956k624427O70522l369527p827070m863894K095370
37831h973421N155177K995715j426908p221141j2570951j1623491k439939O593511
$$ plain form
37887 -24195067 -22827997 -13717482 -6759197 -7125339 -11188279 -14008012 -14911349 -14605567
37879 -14605567 -12188976 -7327137 -1622315 3683278 7926428 8785649 4895301 1326559
37871 1326559 6063210 18798849 29664934 32265624 31290995 32694799 33082856 25550357
37863 25550357 11163985 -2451684 -10510168 -12579522 -8316136 974379 9029415 10259740
37855 10259740 7122158 5329071 4084816 -1194500 -8450677 -10474675 -6667808 -4166806
37847 -4166806 -6143687 -7921160 -6656481 -5654071 -5695560 -1344113 8760365 16133265
37839 16133265 13822561 6945605 4321178 4991700 1622173 -6204897 -11068791 -8973421
37831 -8973421 -3818244 -822529 -2249437 -9470578 -22041529 -33665020 -36104959 -29511448
37823b9511448O796621K209962L356412R978259J0652522R67458q390476o764241
37815a0704931J497969M606165L37871l423393k600846j638713l392496l615744
37807a8934118K26464K312517k569659q620418n913139M634140J1598654Q331292
37799h934267J26634n021552n128166j226620O448510J4595422J5881303Q134172
37791B4875436l74030j374149J718788j19197o797347r054077k619468N811520
37783A2067476Q471181N592027J811758r45210l176081m062003k188538J160915
37775A8731525K125518k084570r916499j5429488j2683350k081874Q633671J2017465
37767f87602Q412083L258988r70578n530802r153288p214030J027004R093938
$$ plain form
37823 -29511448 -22714827 -20504865 -17148453 -7170194 3482328 4449786 -3940690 -10704931
37815 -10704931 -9206962 -4600797 -4262926 -7686319 -10287165 -11925878 -15318374 -18934118
37807 -18934118 -18707654 -16395137 -18964796 -27585214 -33498353 -28864213 -17265559 -8934267
37799 -8934267 -8807633 -13829185 -18957351 -20183971 -13735461 859961 16741264 24875436
37791 24875436 24501406 23127257 24846045 24726848 17929501 8875424 6255956 12067476
37783 12067476 20538657 26130684 27942442 26997232 23821151 19759148 17570610 18731525
37775 18731525 20857043 18772473 8855974 -6573514 -19256864 -21338738 -12705067 -687602
37767 -687602 7724481 10983469 10012891 4482089 -4671199 -11885229 -10858225 -1764287
37759a764287J0146410M420384k335614n616841n506972m906049n773991o466576
37751a7803536l438763K874615O105197J828038m533310l829950L140616N729008
37743i928085o07660o323989j013865J1420529J7741571J2021660N20051q038864
37735A5791348j0267570o780792K00473O289549O906997K142023l276174o028915
37727D976939p146528p849827o337151j551280K654319J278419m336076o586143
37719b4897328p12904Q672817J2709403Q757774K624512K04728O54531J07005
37711H120538j049516J000202O288629R219388N240094l376618r778881r129234
37703F534602k732764K988825K270440l496320o639355l226228N63988k889115
$$ plain form
37759 -1764287 8382123 12802507 10466893 4850052 -656920 -5562969 -11336960 -17803536
37751 -17803536 -21242299 -18367684 -12262487 -10434449 -14967759 -18797709 -15657093 -9928085
37743 -9928085 -10535745 -16859734 -17873599 -6453070 11288501 23310161 23830212 15791348
37735 15791348 5523778 -1257014 -1056541 5233008 12140005 14282028 11005854 4976939
37727 4976939 -2169589 -10019416 -16356567 -17907847 -15253528 -13975109 -18311185 -24897328
37719 -24897328 -25610232 -16937415 -4228012 4529762 7154274 7359002 8013533 8120538
37711 8120538 7071022 8071224 14359853 23579241 28819335 25442717 15663836 6534602
37703 6534602 3801838 6790663 9061103 5564783 -1074572 -4300800 -3736812 -6625927
37695f625927j0091412j0271524j434831O530663P034760N537022Q188519J0861082
37687I728352P346850J237925k0679K006136J41444n129757o404503k318920O17648
37678G204496l92905r80133O49357K17826l499349n287970l094256k050139m007804
37669a1240877k183646O729974J3472480Q679299j718147m373538J886917N838236
37661A7090698J912995l462816n082966o608661j0172745r096071O30232R458297
37653e331037N709016o031247r495540L71278J0326947Q209163o06511l441636
37645b89567K14588r4840p521813j1860676m680718P700140J2119555N047974
37637F34643m686169p812344m005479Q16793K534701K278962L255852N655256
$$ plain form
37695 -6625927 -16717339 -26988863 -28423694 -21893031 -14858271 -9321249 -1132730 9728352
37687 9728352 17075202 18313127 18292448 20298584 20440028 15310271 8905768 6586848 7204496
37678 7204496 6811591 5831458 6480815 6698641 3199292 -2088678 -5182934 -7233073 -11240877
37669 -11240877 -13424523 -6694549 6777931 15457230 13739083 9365545 11252462 17090698
37661 17090698 19003693 15540877 10457911 3849250 -6323495 -15419566 -14789334 -5331037
37653 -5331037 377979 -5653268 -15148808 -14777530 -4450583 3758580 3152069 -289567
37645 -289567 -74979 -169819 -7691632 -19552308 -24233026 -16532886 -4413331 634643
37637 634643 -4051526 -11863870 -15869349 -15052556 -12517855 -10238893 -6983041 -1327785
37629a327785N698153P23404n693247o761705j411566L267091Q88305n781782
37621a0399132q481760l665616M245958Q602035O575499N73524l777566k296262
37613h623320K815826M668854P22517l124106j308554K450516J222408l194029
37605d369888k899573K359079L838419j603143n228340q1384P272630O639096
37597E926896K38724q58171N678865R492635L285292n828177o214107J890840
37589A3612797O939834K094863o242571q627751n677191m898618p302060n772833
37581a5873530J802725O700304K259309m527787k785372N603810R303902N286295
37573G769656J954479L672857L642424l526179j1791598j2495189o213517K97132
$$ plain form
37629 -1327785 4370368 5093772 -599475 -7361180 -8772746 -5505655 -4617350 -10399132
37621 -10399132 -18880892 -22546508 -18300550 -9698515 -3123016 -2549492 -6327058 -8623320
37613 -8623320 -5807494 -1138640 -416123 -3540229 -4848783 -2398267 -1175859 -4369888
37605 -4369888 -7269461 -4910382 -1071963 -2675106 -7903446 -7984830 -712200 5926896
37597 5926896 6165620 5307449 10986314 20478949 23764241 17936064 11721957 13612797
37589 13612797 20552631 22647494 16404923 7777172 2099981 -2798637 -10100697 -15873530
37581 -15873530 -14070805 -7370501 -5111192 -9638979 -12424351 -6820541 2483361 7769656
37573 7769656 9724135 13396992 17039416 13513237 1721639 -10773550 -16987067 -16689935
37565a6689935L408983L289376L96491l188074l463843l93317P82194j476113
37557a7334238j017406N254422R574315M203036n706021r169582m618640J357567
$$ plain form
37565 -16689935 -13280952 -9991576 -9595085 -12783159 -16247002 -16640319 -15858125 -17334238
37557 -17334238 -18351644 -13097222 -3522907 680129 -5025892 -14195474 -18814114 -17456547
$$ [...]
##END NTUPLES=NMR SPECTRUM
##END=
