##TITLE=31Pdec_DE-80WM
 D2O, 24 sc
 28.1.2025
##JCAMPDX= 6.0         $$ Bruker NMR JCAMP-DX V2.0
##DATA TYPE= NMR SPECTRUM
##DATA CLASS= NTUPLES
##ORIGIN= UXNMR, Bruker Analytische Messtechnik GmbH
##OWNER= root
$$ XWIN-NMR		Version 3.5
$$ Tue Jan 28 13:46:08 2025 Russian Standard Time (UT+4h)  she@DPX200
##.OBSERVE FREQUENCY= 81.013821
##.OBSERVE NUCLEUS= ^31P
##.ACQUISITION MODE= SIMULTANEOUS
##.ACQUISITION SCHEME= undefined
##.AVERAGES= 24
##.DIGITISER RES= 17
##SPECTROMETER/DATA SYSTEM= spect
##.PULSE SEQUENCE= zgpg30
##.SOLVENT NAME= CDCl3
##.SHIFT REFERENCE= (INTERNAL, CDCl3, 0, 198.062)
##AUDIT TRAIL= $$ (NUMBER, WHEN, WHO, WHERE, WHAT)
$$ ##TITLE= Audit trail, XWIN-NMR		Version 3.5
$$ ##JCAMPDX= 5.01
$$ ##ORIGIN= Bruker BioSpin GmbH
$$ ##OWNER= she
$$ F:/spectra/data/she/nmr/P31/2/pdata/1/auditp.txt
$$ ##AUDIT TRAIL=  $$ (NUMBER, WHEN, WHO, WHERE, WHAT)
(   1,<2025-01-28 13:45:12.48 +0400>,<she>,<DPX200>,
      <created by zg, POWCHK disabled, PULCHK disabled
       configuration hash MD5:
       00 E9 B6 7A A2 85 ED C7 34 08 36 98 17 FE 4E 26
       data hash MD5: 32K
       E6 B6 50 08 0C 2D 64 45 F2 02 3A 86 5B 82 A3 38>)
(   2,<2025-01-28 13:45:16.92 +0400>,<she>,<DPX200>,
      <Start of raw data processing
       efp BC_mod = 2 LB = 1.5 FT_mod = 6 PKNL = 1 PHC0 = 2063.042 PHC1 = 165.2872 SI = 64K 
       data hash MD5: 64K
       C9 4D 22 C8 DA CE 2D 04 26 A1 98 3A EE 91 EB 93>)
(   3,<2025-01-28 13:45:39.07 +0400>,<she>,<DPX200>,
      <pk PHC0 = -4.607431 PHC1 = 43.39999 
       data hash MD5: 64K
       9E 1F 40 98 08 12 5B D2 53 4A F8 78 33 92 FF 02>)
(   4,<2025-01-28 13:45:44.98 +0400>,<she>,<DPX200>,
      <abs ABSG = 5 
       data hash MD5: 64K
       86 CC E8 DC 18 B0 03 8D 89 36 1F F1 9C 78 2E D9>)
$$ ##END=
$$ 
$$ hash MD5
$$ F9 28 25 A2 C6 38 0B 8D BE 58 B5 2B 87 2E C2 A4
##$RELAX= 
##$RELAX= 
##$RELAX= 
##$RELAX= 
##$RELAX= 
##$RELAX= 
##$RELAX= 
##$RELAX= 
$$ Bruker specific parameters
$$ --------------------------
##$DU= <F:/spectra>
##$EXPNO= 2
##$NAME= <P31>
##$PROCNO= 1
##$TYPE= <nmr>
##$USER= <she>
##$AMP= (0..31)
100 100 100 100 100 100 100 100 100 100 100 100 100 100 100 100 100 100 
100 100 100 100 100 100 100 100 100 100 100 100 100 100 
##$AQSEQ= 0
##$AQ_mod= 1
##$AUNM= <au_zg>
##$AUTOPOS= <>
##$BF1= 81.014009
##$BF2= 200.13
##$BF3= 200.13
##$BF4= 200.13
##$BF5= 200.13
##$BF6= 200.13
##$BF7= 200.13
##$BF8= 200.13
##$BYTORDA= 1
##$CFDGTYP= 0
##$CFRGTYP= 5
##$CHEMSTR= <none>
##$CNST= (0..31)
1 1 145 1 1 1 1 1 1 1 1 1 1 1 1 1 1 1 1 1 1 1 1 1 1 1 1 1 1 1 1 1 
##$CPDPRG= <waltz16>
##$CPDPRG1= <>
##$CPDPRG2= <waltz16>
##$CPDPRG3= <>
##$CPDPRG4= <mlev>
##$CPDPRG5= <mlev>
##$CPDPRG6= <mlev>
##$CPDPRG7= <mlev>
##$CPDPRG8= <mlev>
##$CPDPRGB= <>
##$CPDPRGT= <>
##$D= (0..31)
0 1 0 0 0 0 0 0 0 0.06 0 0.03 2e-05 3e-06 0 0 0.0002 0 0 0 0 0 0 0 0 0 
0 0 0 0 0 0 
##$DATE= 1738057511
##$DBL= (0..7)
120 120 120 11 120 120 24 19 
##$DBP= (0..7)
150 150 150 150 150 150 150 150 
##$DBP07= 0
##$DBPNAM0= <>
##$DBPNAM1= <>
$$ [...]
##$SUBNAM3= <"">
##$SUBNAM4= <"">
##$SUBNAM5= <"">
##$SUBNAM6= <"">
##$SUBNAM7= <"">
##$SUBNAM8= <"">
##$SUBNAM9= <"">
##$SW= 400.765351723535
##$SWIBOX= (0..15)
0 1 3 0 0 0 0 0 0 0 0 0 0 0 0 0 
##$SW_h= 32467.5324675325
##$TD= 32768
##$TD0= 1
##$TE= 0
##$TE2= 300
##$TE3= 300
##$TEG= 300
##$TL= (0..7)
0 120 53 12 22 120 120 120 
##$TP= (0..7)
150 150 150 150 150 150 150 150 
##$TP07= 0
##$TPNAME0= <>
##$TPNAME1= <>
##$TPNAME2= <>
##$TPNAME3= <>
##$TPNAME4= <>
##$TPNAME5= <>
##$TPNAME6= <>
##$TPNAME7= <>
##$TPOAL= (0..7)
0.5 0.5 0.5 0.5 0.5 0.5 0.5 0.5 
##$TPOFFS= (0..7)
0 0 0 0 0 0 0 0 
##$TUNHIN= 0
##$TUNHOUT= 0
##$TUNXOUT= 0
##$USERA1= <user>
##$USERA2= <user>
##$USERA3= <user>
##$USERA4= <user>
##$USERA5= <user>
##$V9= 5
##$VALIST= <valist>
##$VCLIST= <CCCCCCCCCCCCCCC>
##$VD= 0
##$VDLIST= <DDDDDDDDDDDDDDD>
##$VPLIST= <PPPPPPPPPPPPPPP>
##$VTLIST= <TTTTTTTTTTTTTTT>
##$WBST= 1024
##$WBSW= 4
##$XGAIN= (0..3)
0 0 0 0 
##$XL= 0
##$YL= 0
##$YMAX_a= 2937
##$YMIN_a= -2971
##$ZGOPTNS= <>
##$ZL1= 120
##$ZL2= 120
##$ZL3= 120
##$ZL4= 120
##$ABSF1= 198.0616
##$ABSF2= -202.7028
##$ABSG= 5
##$ABSL= 3
##$ALPHA= 0
##$AQORDER= 0
##$ASSFAC= 0
##$ASSFACI= 0
##$ASSFACX= 0
##$ASSWID= 0
##$AUNMP= <proc_1d>
##$AZFE= 0.1
##$AZFW= 0.5
##$BCFW= 0
##$BC_mod= 2
##$BYTORDP= 0
##$COROFFS= 0
##$CY= -3
##$DATMOD= 1
##$DC= 0
##$DFILT= <>
##$DTYPP= 0
##$F1P= 0
##$F2P= 0
##$FCOR= 1
##$FTSIZE= 65536
##$FT_mod= 6
##$GAMMA= 0
##$GB= 0
##$INTBC= 1
##$INTSCL= 9.790993e-09
##$ISEN= 30
##$LB= 1.5
##$LEV0= 0
##$LPBIN= 0
##$MAXI= 10000
##$MC2= 0
##$MEAN= 0
##$ME_mod= 0
##$MI= 50
##$NCOEF= 0
##$NC_proc= -10
##$NLEV= 6
##$NOISF1= 182.463
##$NOISF2= 159.3651
##$NSP= 0
##$NTH_PI= 0
##$NZP= 0
##$OFFSET= 198.0616
##$PC= 4
##$PHC0= 2058.435
##$PHC1= 208.6872
##$PH_mod= 1
##$PKNL= yes
##$PPARMOD= 0
##$PSCAL= 0
##$PSIGN= 0
##$REVERSE= no
##$SF= 81.0140089999434
##$SI= 65536
##$SIGF1= 159.3651
##$SIGF2= -187.1042
##$SINO= 113.3802
##$SIOLD= 16384
##$SREGLST= <1H.CDCl3>
##$SSB= 0
##$STSI= 65536
##$STSR= 0
##$SW_p= 32467.5324675325
##$SYMM= 0
##$S_DEV= 0
##$TDeff= 32768
##$TDoff= 0
##$TI= <>
##$TILT= no
##$TM1= 0
##$TM2= 0
##$TOPLEV= 0
##$USERP1= <user>
##$USERP2= <user>
##$USERP3= <user>
##$USERP4= <user>
##$USERP5= <user>
##$WDW= 1
##$XDIM= 65536
##$YMAX_p= 310996414
##$YMIN_p= -103935939
$$ End of Bruker specific parameters
$$ ---------------------------------
##NTUPLES= NMR SPECTRUM
##VAR_NAME=  FREQUENCY,     SPECTRUM/REAL,   SPECTRUM/IMAG
##SYMBOL=    X,             R,               I
##VAR_TYPE=  INDEPENDENT,   DEPENDENT,       DEPENDENT
##VAR_FORM=  AFFN,          ASDF,            ASDF
##VAR_DIM=   65536,         65536,           65536
##UNITS=     HZ,            ARBITRARY UNITS, ARBITRARY UNITS
##FACTOR=    0.49542278885378, 1,            1
##FIRST=     16045.7642231865, 0,            0
##LAST=      -16421.768244346, 0,            0
##MIN=       -16421.768244346, -103935939,   0
##MAX=       16045.7642231865, 310996414,    0
$$ Real data points
##PAGE= N=1
##DATA TABLE= (X++(R..R)), XYDATA
$$ [...]
6588h848250P315369J668814j609662M04851J317514k312363m632325l10559P057322
$$ -8848250 -1532881 135933 -1473729 -1068878 248636 -2063727 -6696052 -7006611 50711
6579E0711J0907649R629915M380105m447023j3616716j5897520q286251K778366
$$ 50711 10958360 20588275 24968380 20521357 6904641 -8992879 -17279130 -14500764
6571a4500764Q987953Q820123N036243q37148o553292p145500j176176M991696
$$ -14500764 -5512811 3307312 8343555 7506407 953115 -6192385 -7368561 -2376865
6563b376865N057070J250421p26861j080493l378788o065058m450803M56993K817631
$$ -2376865 2680205 3930626 3203765 2123272 -1255516 -7320574 -11771377 -11314384 -8496753
6554h496753J234083L1674R85642Q24028j508776j656092L062038Q349317Q383256
$$ -8496753 -7262670 -7230996 -6245354 -5421326 -6930102 -8586194 -5524156 2825161 11208417
6545A1208417L383987j502434k674209n60752K659537M763089L559993j695073
$$ 11208417 14592404 13089970 10415761 9855009 12514546 17277635 20837628 19142555
6537A9142555q165137j0810212p531225j887703J077753R25395J166579K817513
$$ 19142555 10977418 167206 -7364019 -9251722 -8173969 -7248574 -6081995 -3264482
6529c264482K525202j379669n156269n060029k473432M70998N761046J3532978
$$ -3264482 -739280 -2118949 -7275218 -12335247 -14808679 -14337681 -8576635 4956343
6521D956343J5581875M624806j1437993j5689862m381511P776618Q180995J491470
$$ 4956343 20538218 25163024 13725031 -1964831 -6346342 1430276 9611271 11102741
6513A1102741j744593j226725k489811m406286k264139J315529l88822o146674
$$ 11102741 9358148 8131423 5641612 1235326 -1028813 286716 -102106 -6248780
6505f248780q014714l930396J79210J110294K289247N373276O181590K267722
$$ -6248780 -14263494 -18193890 -18014680 -16904386 -14615139 -9241863 -3060273 -792551
6497g92551j943126j571121J756540L166796J502552n55015j297468j643609k559806
$$ -792551 -2735677 -4306798 -2550258 616538 2119090 1564075 266607 -1377002 -3936808
6488c936808l214753k339135m37097N52198J51319M32113K541973L815966J705398
$$ -3936808 -7151561 -9490696 -9927793 -9375595 -9224276 -8792163 -6250190 -2434224 -728826
6479g28826p82718J164565N166044L295499n309522j0944868o763253J091941
$$ -728826 -1511544 -346979 4819065 8114564 2805042 -8139826 -14903079 -13811138
6471a3811138K740549j746100m894692l548871m26598K874291O743540R195039
$$ -13811138 -11070589 -12816689 -17711381 -21260252 -21686850 -18812559 -12069019 -2873980
6463b873980P526679L407980R07714R17305J940553L457292L877202m11924q136739
$$ -2873980 4652699 8060679 8968393 9885698 11826251 15283543 19160745 18748821 10612082
6454A0612082j0559892l184965N431129N381005K54835m26506J900704j015882
$$ 10612082 52190 -3132775 2298354 7679359 7934194 7507688 9408392 8392510
6446H392510o969069n714543K170841M865440o78929m130887o26490J457427l149773
$$ 8392510 1423441 -4291102 -2120261 2745179 2066250 -2064637 -2691127 -1233700 -4383473
6437d383473p675598p326842p173135q061004n36787J6019492K3556441R776751
$$ -4383473 -12059071 -19385913 -26559048 -34620052 -35156839 -19137347 4419094 14195845
6429A4195845r943821j2442122M43675P650933J750411l922128j94995M828827
$$ 14195845 4252024 -8190098 -7746423 -95490 1654921 -2267207 -2462202 2366625
6421B366625J792659n564602q290174m339379K221389O583577M769690l105047
$$ 2366625 4159284 -1405318 -9695492 -14034871 -11813482 -5229905 -460215 -3565262
6413c565262r501947o812208J099694L183158k029894l929458L316797J1901039
$$ -3565262 -13067209 -19879417 -18779723 -15596565 -17626459 -21555917 -18239120 -6338081
6405f338081J3140417R304298O091297J982370o299370j3974623j3380699n852284
$$ -6338081 6802336 16106634 22197931 24180301 17880931 3906308 -9474391 -15326675
6397a5326675j53107n61932l364645l994726j292547M436331J1163835J3121177
$$ -15326675 -15479782 -16041714 -19406359 -23401085 -24693632 -20257301 -9093466 4027711
6389D027711N699235o319532j1516397n510675L091967L964046j789063m534836
$$ 4027711 9726946 3407414 -8108983 -13619658 -10527691 -6563645 -8352708 -12887544
6381a2887544J23257O182103O385085J695265j288263K08006K032428n72744o462489
$$ -12887544 -12764287 -6582184 -197099 1498166 209903 417909 2450337 1877593 -4584896
6372d584896r875147p037787k05119M601660L354943k020985n136418j431208
$$ -4584896 -14460043 -21497830 -21702949 -17101289 -13746346 -15767331 -20903749 -22334957
6364b2334957O390137J0218338N091953m659806r422794m607371M562962R316739
$$ -22334957 -15944820 -5726482 -634529 -5294335 -14717129 -19324500 -14761538 -5444799
6356e444799O906565K108841o6544j22019j205275l295094l627286j756171j11082
$$ -5444799 1461766 3570607 3504063 3382044 2176769 -1118325 -4745611 -6501782 -6612864
6347f612864O86506K698038N597363N442825J133899k560958k177745j080927
$$ -6612864 -5926358 -3228320 2369043 7811868 8945767 6384809 4207064 3126137
6339C126137k801019l696141N69711N182879K064049o395787r797223n868004
$$ 3126137 325118 -3371023 -2801312 2381567 4445616 -1950171 -11747394 -17615398
6331a7615398l111290n353966n229648K162483R841031R965060M993769L94628
$$ -17615398 -20726688 -26080654 -31310302 -29147819 -19306788 -9341728 -4347959 -3953331
6323c953331m673212j0417990r148472L177684J4848099J1497609k235387p906333
$$ -3953331 -8626543 -19044533 -28193005 -25015321 -10167222 1330387 -905000 -8811333
6315h811333R31819J1448862J1192361K607927n047784p352361m249040K670917
$$ -8811333 -7879514 3569348 14761709 17369636 12321852 4969491 720451 3391368
6307C391368Q062667N993212j013655l660546M39596L397243Q70167o43244L938891
$$ 3391368 11454035 17447247 16433592 12773046 13212642 16609885 17480052 16836808 20775699
6298B0775699Q346843N233800j675305m765878n098596p707782r787350n065150
$$ 20775699 29122542 34356342 32681037 27915159 22816563 15108781 5321431 256281
6290B56281L060307M702401o75690l169330J068886L273768l513331j2732848
$$ 256281 3316588 8018989 7343299 4173969 5242855 8516623 5003292 -7729556
6282g729556j3689385o268303J000300L591790M222358N063598L994914j38018
$$ -7729556 -21418941 -27687244 -26686944 -23095154 -18872796 -13809198 -9814284 -9952302
6274i952302l871105l395386N72963M618971P139271Q423695P780729L952023
$$ -9952302 -13823407 -17218793 -16645830 -12026859 -4887588 3536107 11316836 15268859
6266A5268859j562612m744407l948662k215069k883583m868588m705753j857877
$$ 15268859 13706247 8961840 5013178 2798109 -85474 -4954062 -9659815 -11517692
6258a1517692R01885J608950O26016j446412l997994m576462p29816N291175P426620
$$ -11517692 -10615807 -9006857 -8380841 -9827253 -13825247 -18401709 -19131525 -13840350 -6413730
6249f413730L315879k250567l586031r21408J539862J574107k61974l520456p692230
$$ -6413730 -3097851 -5348418 -8934449 -9855857 -8315995 -6741888 -7003862 -10524318 -18216548
6240a8216548j0235115q412470k908261L140589Q192586J2498843J4836653J2681238
$$ -18216548 -28451663 -36864133 -39772394 -36631805 -28439219 -15940376 -1103723 11577515
6232A1577515O271319n36680m456917n267004l458717J163879O511772P135158
$$ 11577515 17848834 17312154 12855237 7588233 4129516 5293395 11805167 18940325
6224A8940325Q4850r408908j2334146o514026Q02253K569265P49340K086027P191908
$$ 18940325 19025175 9616267 -2717879 -9231905 -8429652 -5860387 -5111047 -3025020 4166888
6215D166888Q973242K937960n428816p201890j850837J816927k897835j1612758
$$ 4166888 13140130 16078090 10649274 3447384 1596547 3413474 515639 -11097119
6207a1097119j3755690n143346O968584J1979045P153123j047262n723427o385323
$$ -11097119 -24852809 -29996155 -23027571 -11048526 -3895403 -4942665 -10666092 -17051415
6199a7051415o142972n719982l787072j157585p1237J45291K097017M972281N227285
$$ -17051415 -23194387 -28914369 -32701441 -33859026 -33930263 -33784972 -31687955 -26715674 -21488389
6190b1488389L268213L686954P148856Q354157M989035K004475K681130K484628
$$ -21488389 -18220176 -14533222 -7384366 969791 5958826 7963301 10644431 13129059
6182A3129059j950683m542380J013899R063391Q960645P52966o346952q690532
$$ 13129059 11178376 6635996 7649895 16713286 25673931 26426897 20079945 11389413
6174A1389413j0378848j1944925q748119j581588K552969K340143L781611P376306
$$ 11389413 1010565 -10934360 -19682479 -21264067 -18711098 -16370955 -12589344 -5213038
6166e213038N370258l958512j0806012q508763l099418j625267j264098K236231
$$ -5213038 157220 -3801292 -14607304 -23116067 -26215485 -27840752 -29104850 -26868619
6158b6868619N212541M119124L804608P970969R806055K971397n610327n751644
$$ -26868619 -21656078 -17536954 -13732346 -5761377 4044678 7016075 1405748 -4345896
6150d345896l75480N30833l118025l819488j498595k164475m225469o21130O345890
$$ -4345896 -4721376 -4190543 -7308568 -11128056 -12626651 -14791126 -19016595 -19637725 -13291835
6141a3291835O855143Q54323r79902M223733O430072L72462n334460l076027J768361
$$ -13291835 -6436692 -5582369 -6562271 -2338538 4091534 4463996 -870464 -3946491 -2178130
6132b178130J326765k334460l328267k010087q60359K214357Q103792J0487178
$$ -2178130 -851365 -3185825 -6514092 -8524179 -9384538 -7170181 933611 11420789
6124A1420789M493628l617417m490115O7294k387p292273j2838320q831417J235396
$$ 11420789 15914417 12297000 7806885 7874179 7871792 579519 -12258801 -21090218 -19854822
6115a9854822P788269O658707K426379J486332M129544N080833J581767k315610
$$ -19854822 -12066553 -5407846 -2981467 -1495135 2634409 7715242 9297009 6981399
6107F981399j930749R79037J964131J697095L488650N207192K078242l191684
$$ 6981399 5050650 6029687 7993818 9690913 13179563 18386755 20464997 17273313
6099A7273313k786100K674988L376917l902178r820626p219073j680367q10924
$$ 17273313 14487213 17162201 20539118 16636940 6816314 -402759 -2083126 -2894050
6091b894050k476021j701154o24725k226214j688924N368081J1907449P973551
$$ -2894050 -5370071 -7071225 -7695950 -9922164 -11611088 -6243007 5664442 13637993
6083A3637993l729357j1534700j1139799p637576l594143L520937J2185362J5659051
$$ 13637993 9908636 -1626064 -12765863 -20403439 -23997582 -20476645 -8291283 7367768
6075G367768J1614091M905920r3157k786458k441984J045126K856969j762426
$$ 7367768 18981859 23887779 23794622 21008164 18566180 19611306 22468275 20705849
6067B0705849q229606p320136L74016M415330N73391l313399r65419K733673J259047
$$ 20705849 12476243 5156107 5530123 9945453 10518844 7205445 6240026 8973699 10232746
6058A0232746k680542k488863K038437O166187P536970O401091K226712m572123
$$ 10232746 7552204 5063341 7101778 13267965 20804935 27206026 29432738 24860615
6050B4860615j0130860j0794315p349820k671875K111369O280127P561639M941274
$$ 24860615 14729755 3935440 -3414380 -6086255 -3974886 2305241 9866880 14808154
6042A4808154J037793j243803k292120l758562n359435n879537n189739l694803
$$ 14808154 15845947 14602144 12310024 8551462 3192027 -2687510 -7877249 -11572052
6034a1572052k015754j836486l856681m665683k27840O792464Q858098M452215
$$ -11572052 -13587806 -15424292 -19280973 -23946656 -24174496 -17382032 -8523934 -4071719
6026d071719P65841K342142L742361j145378q064742p693189R45824Q985742Q726648
$$ -4071719 -3305878 -963736 2778625 1633247 -6431495 -14124684 -13178860 -4193118 4533530
6017D533530J221893o721667r519086p035216l890763l783769m369494r38180
$$ 4533530 5755423 -966244 -10485330 -17520546 -21411309 -25195078 -29564572 -30502752
6009c0502752M955820O570729L323365L236367R503009J2711694M323513q517905
$$ -30502752 -25546932 -18976203 -15652838 -12416471 -2913462 9798232 14121745 5603840
6001E603840j1721058m104882K123461m75577o327516p676234m191888Q89529
$$ 5603840 -6117218 -10222100 -8098639 -8574216 -14901732 -22577966 -26769854 -25880325
5993b5880325O212040J0141149R377079L774963j757768l287767k186660j248741
$$ -25880325 -19668285 -9527136 -150057 3624906 1867138 -1420629 -3607289 -4856030
5985d856030l86318J256192K277473R56713j835994l646311l087549q61507O36626
$$ -4856030 -5242348 -3986156 -1708683 -751970 -2587964 -6234275 -9321824 -10183331 -9546705
5976i546705n90449k818005j484883L763367O201821J180061n245861m203564
$$ -9546705 -10137154 -12955159 -14440042 -10676675 -4474854 -3294793 -8540654 -12744218
5968a2744218J923191K913054k273584l256652M254250J0328319O356417j458954
$$ -12744218 -10821027 -7907973 -10181557 -13438209 -9183959 1144360 7500777 6041823
5960F041823k798647O90830L17050m304977n961890k846965R8736J657275N331973
$$ 6041823 3243176 3934006 4251056 -53921 -6015811 -8862776 -8764040 -7106765 -1774792
5951a774792R292310O181564l817833r445804l479828O087896O879333r73967
$$ -1774792 7517518 13699082 9881249 435445 -3044383 3043513 9922846 8948879
5943H948879o329445k868321M076227O623996L890233J94446j767206k430821
$$ 8948879 2619434 -248887 3827340 10451336 14341569 14536015 12768809 10337988
5935A0337988k210698n18157K051613L247261J984912q997p73431j047763k611173
$$ 10337988 8127290 7609133 9660746 12908007 14892919 14883922 14110491 13062728 10451555
5926A0451555m420050l249726J143577M211610J894388l980826p794573o653192
$$ 10451555 6031505 2781779 3925356 8136966 10031354 6050528 -1744045 -8397237
5918h397237k534664J578261M972203P713683Q106125M121100k645378o725907
$$ -8397237 -10931901 -9353640 -4381437 3332246 11438371 15559471 12914093 6188186
5910F188186m441130R77669K610051j272335m718975k612411J621674J096259
$$ 6188186 1747056 2724725 5334776 4062441 -656534 -3268945 -1647271 -551012
5902e51012l752023n229563M63596P663002Q765909L046640m192196p658677n402691
$$ -551012 -4303035 -9532598 -9069002 -1406000 7359909 10406549 6214353 -1444324 -6847015
5893f847015K73356L523147L46434n417582o147565j725482l15567n175638q384256
$$ -6847015 -6573659 -3050512 -2704078 -8121660 -14269225 -15994707 -16310274 -21485912 -29870168
5884b9870168l010333N788223R150825P579649O739332N761329O50101m302397
$$ -29870168 -32880501 -27092278 -17941453 -10361804 -3622472 2138857 2788958 -1513439
5876a513439j039066P026973O981292m179124j3647732j0560409K35025P417360
$$ -1513439 -2552505 4474468 11455760 7276636 -6371096 -16931505 -16696480 -9279120
5868i279120P682688M900430J754560j128667k491541k467158l553840n688339
$$ -9279120 -1596432 3303998 5058558 3929891 1438350 -1028808 -4582648 -10270987
5860a0270987m958680r31600L25313m550306r165449n415510N095360J3097283
$$ -10270987 -15229667 -16161267 -15835954 -20386260 -29551709 -34967219 -29871859 -16774576
5852a6774576J2411910M541175m411485p880954l520805L117996L818793j023137
$$ -16774576 -4362666 178509 -4232976 -12113930 -15634735 -12516739 -8697946 -9721083
5844i721083k587626K002852M267727j012513n514044r97864N536575K691211
$$ -9721083 -12308709 -10305857 -6038130 -7050643 -12564687 -13562551 -8025976 -5334765
5836e334765n874077p319104j143026J171984k504380r05454R430346J4811460
$$ -5334765 -11208842 -18527946 -19670972 -18498988 -21003368 -21908822 -12478476 2332984
5828B332984M740543j0464765j3073123j423493J0218577J0954540L431425l252285
$$ 2332984 7073527 -3391238 -16464361 -17887854 -7669277 3285263 6716688 3464403
5820C464403l537127J440435N947229M917519n40116m170772k448815J300216
$$ 3464403 -72724 1367711 7314940 12232459 11692343 7521571 5072756 6372972
5812F372972K183886l76001m139745p666412r664806q044835k647475L462148
$$ 6372972 8556858 8180857 4041112 -3625300 -13290106 -21334941 -23982416 -20520268
5804b0520268P497500R218800Q565830M811159k66140k606347j580776j381354
$$ -20520268 -13022768 -3803968 4761862 9573021 9306881 6700534 5119758 3738404
5796C738404m250391o592881m746402m99360K370349L264204L285641K294070
$$ 3738404 -511987 -7104868 -11851270 -12350630 -9980281 -6716077 -3430436 -1136366
5788a136366O22508K10781J121149O04648j818315k797676j492927k314506p608230
$$ -1136366 -513858 -303077 818072 1422720 -395595 -3193271 -4686198 -7000704 -14608934
5779a4608934j2689577j2392720p651295j433030O115808J3419444J4674326Q032956
$$ -14608934 -27298511 -39691231 -47342526 -48775556 -42659748 -29240304 -14565978 -6533022
5771f533022J072191O72628K604775n17127n864398m989322J489217M535541Q57096
$$ -6533022 -5460831 -4788203 -2183428 -2700555 -8564953 -13554275 -12065058 -7529517 -6672421
5762f672421l699372m829935m281112k969048J219895O956090Q804582N159916
$$ -6672421 -10371793 -15201728 -19482840 -22451888 -21231993 -14275903 -5471321 -311405
5754c11405L21090k375822l130301j515728K823920N477702J600679m826360n029670
$$ -311405 9685 -2366137 -5496438 -7012166 -4188246 1289456 2890135 -1936225 -6965895
5745f965895P47575L386317K7247k048656O18760J643033k478673n094793j364107
$$ -6965895 -6218320 -2832003 -2804756 -4853412 -4234652 -2591619 -5070292 -10165085 -11529192
5736a1529192L136547L189910L000573N934258N541485k500226q851281l724410
$$ -11529192 -8392645 -5202735 -2202162 3732096 9273581 6773355 -2077926 -5802336
5728e802336N772835N690598k707937o344693k913781l458093j1343439j4794762
$$ -5802336 -29501 5661097 2953160 -3391533 -6305314 -9763407 -21106846 -35901608
5720c5901608n684620P356696J1880851P752911K831250M69873o32405J69289
$$ -35901608 -41586228 -34229532 -22348681 -14595770 -11764520 -11294647 -11927052 -11757763
5712a1757763M075393P947536P527252L794242J006840J65324r00868k480818
$$ -11757763 -7682370 265166 7792418 11586660 12593500 12758824 11857956 9377138
5704I377138k753225j952259k433212m343249m834778k462922N28494J754384
$$ 9377138 6623913 4671654 2238442 -2104807 -6939585 -9402507 -8874013 -7119629
5696g119629K297281M401390O471333L629789n112279j2771122j1289180k046136
$$ -7119629 -4822348 -420958 6050375 9680164 4567885 -8203237 -19492417 -21538553
5688b1538553M977692L579901k057790n516758o882242q044099m945433O476709
$$ -21538553 -16560861 -12980960 -15038750 -20555508 -27437750 -35481849 -40427282 -33950573
5680c3950573J9077980J9681358O825019n984372p979189l452317j470098j604424
$$ -33950573 -14872593 4808765 11633784 5649412 -2329777 -5782094 -7252192 -8856616
5672h856616J996750P798452P861609L17657p344012q329350l740877J569847
$$ -8856616 -6859866 938586 8800195 9117852 1773840 -6555510 -10296387 -8726540
5664h726540N139981O778662O155362L064753j619710o300491q711391o364468
$$ -8726540 -3586559 3192103 9347465 12412218 10792508 4492017 -4219374 -10583842
5656a0583842K89496N809811M822802o16571l152085o21923R49599k262459m291164
$$ -10583842 -10294346 -4484535 338267 -278304 -3430389 -4052312 -3102713 -5365172 -9656336
5647i656336J681319J0563787J0157765j135022j0075119n946026M731715P351540
$$ -9656336 -7975017 2588770 12746535 11611513 1536394 -4409632 322083 7673623
5639G673623j170278r974213j0335448n775857l739988m175649j652455M928333
$$ 7673623 6503345 -3470868 -13806316 -19582173 -23322161 -27497810 -29150265 -24221932
5631b4221932J0450525J0568225O439046K310901J107832K562136L755214J558626
$$ -24221932 -13771407 -3203182 3235864 5546765 6654597 9216733 12971947 14530573
5623A4530573l904806q495446q080109l018859K189362L074465j189748o605280
$$ 14530573 10625767 2130321 -5949788 -8968647 -6779285 -3704820 -4894568 -11499848
5615a1499848o674054R31939R197364P872670k675246r146337k004447J0360794
$$ -11499848 -18173902 -17241963 -8044599 -171929 -2847175 -11993512 -13997959 -3637165
5607c637165J1876115L35947j0497148j0090318k883308J553187J259322L7082
$$ -3637165 8238950 8574897 -1922251 -12012569 -14895877 -13342690 -12083368 -12046286
5599a2046286k69732R6296J722311L946796L612070J60167k010601l72883J226986
$$ -12046286 -12316018 -12219722 -10497411 -6550615 -2938545 -2778378 -4788979 -5161862 -3934876
5590c934876l57875j364816J640361L663631r49759o722352l718324N606924Q122808
$$ -3934876 -4292751 -5657567 -4017206 -353575 -1303334 -8025686 -11744010 -6137086 1985722
5581A985722P3651o634891l112693K562157j480909j1924352j5224540p446930
$$ 1985722 2059373 -4575518 -7688211 -5126054 -6606963 -18531315 -33755855 -41202785
5573d1202785J764691M419853L537839N184395R137380J1474643J1085682R342655
$$ -41202785 -39438094 -35018241 -31480402 -26296007 -17158627 -5683984 5401698 14744353
5565A4744353O644822K996698j20880j358728j412978j437284j541021k479219
$$ 14744353 21389175 24385873 24264993 22906265 21493287 20056003 18514982 16035763
5557A6035763o000135j1074166j2729498q107114j323715J680406J261394K455679
$$ 16035763 10035628 -1038538 -13768036 -21875150 -23198865 -21518459 -20257065 -17801386
5549a7801386O437908Q811024O568391J918187j614288k520205j47621M880107
$$ -17801386 -11363478 -2552454 4015937 5934124 4319836 1799631 1652010 6532117
5541F532117Q096225M617699k988740o299732l314708k257471q202581j2934655
$$ 6532117 14628342 19246041 16257301 9957569 6642861 4385390 -3817191 -16751846
5533a6751846o251579P389349J3411355O805586k250886l351652J957879N443040
$$ -16751846 -23003425 -15614076 -2202721 4602865 2351979 -999673 958206 6401246
5525F401246K832235l977086j0307121j1535149o543867j50308J650235n09085
$$ 6401246 9233481 5256395 -5050726 -16585875 -23129742 -23280050 -21629815 -22138900
5517b2138900r06245J948973L863697L533717M783820P802630O486486r23557
$$ -22138900 -23045145 -21096172 -17232475 -13698758 -8914938 -1112308 5374178 4450621
5509D450621o413039l606221K272265L120730M83710O81571K373500q10254p775145
$$ 4450621 -1962418 -5568639 -3296374 -175644 308066 989637 3363137 2552883 -5222262
5500e222262j0560909p117539l663180l138980q69641N131503Q224299L034258
$$ -5222262 -15783171 -22900710 -26563890 -29702870 -30572511 -25441008 -17216709 -14182451
5492a4182451m725628m689418M738858J4522905J5459473P008232l774363r560667
$$ -14182451 -18908079 -23597497 -18858639 -4335734 11123739 18131971 14357608 4796941
5484D796941q743604n115232k202588N09893M292299O470768L244092l250785
$$ 4796941 -3946663 -9061895 -11264483 -10754590 -6462291 8477 3252569 1784
5476A784n626321o55291N947468O693700J409784l722454m362156k166791j181850
$$ 1784 -5624537 -6279828 -332360 6361340 7771124 4048670 -313486 -2480277 -3662127
5467c662127k589106l964030k750943P64016M325440O502893P048949N084095
$$ -3662127 -6251233 -10215263 -12966206 -12202190 -7876750 -1373857 5675092 10759187
5459A0759187k01257o379624q686216o058218l207256m067806o145734m544181
$$ 10759187 10557930 4178306 -4507910 -10566128 -13773384 -17841190 -23986924 -28531105
5451b8531105J238655Q038303J3479476J5578202J1254915O83851r440807j2726092
$$ -28531105 -27292450 -19254147 -5774671 9803531 21058446 21742297 12301490 -424602
5443d24602j0853055q733474n284311K884979J1158129J0599697K054545l766000
$$ -424602 -11277657 -20011131 -25295442 -22410463 -11252334 -652637 1401908 -2364092
5435b364092k079045K69180j977693l876769j78503N174226N839823K063273k961320
$$ -2364092 -4443137 -4173957 -6151650 -10028419 -10206922 -5032696 807127 2870400 -90920
5426i0920q290622j0879650m587605Q467612J3905144K965543j2105974j2613786
$$ -90920 -8381542 -19261192 -23848797 -15381185 -1476041 1489502 -10616472 -23230258
5418b3230258J000761J1095382Q203054N61936k817791m749776j0120857j4468717
$$ -23230258 -22229497 -11134115 -2931061 -2369125 -5186916 -9936692 -20057549 -34526266
5410c4526266j0410536O70121J0488555J3966744J2157106P750783K495723k059507
$$ -34526266 -44936802 -44266681 -33778126 -19811382 -7654276 96507 2592230 532723
5402E32723m686331n176027l684826m25803L428976O104711O774439N315819J391985
$$ 532723 -4153608 -9329635 -13014461 -13440264 -10011288 -3906577 2867862 8183681 9575666
5393I575666l829812o510479m475447j504417k441892m890088k096229N405447
$$ 9575666 5745854 -764625 -5240072 -6744489 -9186381 -14076469 -16172698 -10767251
5385a0767251Q471169K567521m621772l722200L667091Q700471P477259K951224
$$ -10767251 -2296082 271439 -4350333 -8072533 -4405442 4295029 11772288 14723512
5377A4723512k291588p672266j0269200o739517n47156K60103m632414m796187
$$ 14723512 12431924 4759658 -5509542 -12249059 -12796215 -12536112 -17168526 -21964713
5369b1964713O304849J9357367J9853916Q099889p49779K223554P928888L813651
$$ -21964713 -15659864 3697503 23551419 31651308 30901529 33125083 41053971 44867622
5361D4867622p336499j1939605n273390L356491N047755J415590k166535m588783
$$ 44867622 37531123 25591518 20318128 23674619 28722374 30137964 27971429 23382646
5353B3382646n602945k200430N072365Q486702L463732k688092j240324L002793
$$ 23382646 17779701 15579271 20651636 29138338 32602070 29913978 28673654 31676447
5345C1676447j758332j4444537k0095966j1073744K011643N800651J209143k283504
$$ 31676447 29918115 15473578 -4622388 -15696132 -13684489 -7883838 -6674695 -8958199
5337h958199k016233k608232m930668m122971J391258O207139N130414m50435
$$ -8958199 -10974432 -13582664 -18513332 -22636303 -21245045 -15037906 -9907492 -10357927
5329a0357927n006618m613982O92633P449295J0506167O717825j449451p449194
$$ -10357927 -15364545 -19978527 -19285894 -11836599 -1330432 5387393 3937942 -3511252
5321c511252p214942l213611o86335r16263m89831K776398O247189O814002O030437
$$ -3511252 -10726194 -13939805 -14626140 -15542403 -16032234 -13255836 -7008647 -194645 5835792
5312E835792O766863O492491L69063q244434q478564K254444J0782684M826075
$$ 5835792 12602655 19095146 19464209 11219775 2741211 4995655 15778339 20604414
5304B0604414q339306j1053442r14088N878043o74244r152384m175272J0249349
$$ 20604414 12265108 1211666 297578 6175621 5501377 -3651007 -7826279 2423070
5296B423070J5888168N109494r916211j3612159m892570M492026N029989j319232
$$ 2423070 18311238 23420732 13504521 -107638 -5000208 -508182 4521807 3202575
5288C202575o084986m859041m17891L363191O042276P220219L889671l761783
$$ 3202575 -2882411 -7741452 -8159343 -4796152 1246124 8466343 12356014 8594231
5280H594231q357795m586394R20186j479714p772174m846934P626891J4135360
$$ 8594231 236436 -4349958 -3429772 -4909486 -12681660 -17528594 -9901703 4233657
5272D233657O902600j802901K76455O220035L463095m050185l055963N805366
$$ 4233657 11136257 9333356 9609811 15829846 19292941 15242756 12186793 17992159
5264A7992159Q514168k92690j0694390j3504815r895008l607302M184107R757855
$$ 17992159 26506327 26213637 15519247 2014432 -7880576 -11487878 -7303771 2454084
5256B454084P879731J172332j599754P11135J56605m986962n389562L130364J0034219
$$ 2454084 10333815 11506147 9906393 10617528 10774133 5787171 397609 3527973 13562192
5247A3562192N206889n381215q867360l813964N31926j061068n279666p973686
$$ 13562192 18769081 13387866 4520506 706542 1238468 177400 -5102266 -13075952
5239a3075952q048134m945100O77926M630938L646749J115728K537300O381310
$$ -13075952 -21124086 -26069186 -25391260 -20760322 -17113573 -15997845 -13460545 -7079235
5231g079235N846456m13641n631105m215479J493477N546057N279347J913269
$$ -7079235 -1232779 -1646420 -7277525 -11493004 -9999527 -4453470 825877 2739146
5223B739146k322110n281628n370481l113395j058949o62826l64508J787210M484214
$$ 2739146 417036 -4864592 -10235073 -13348468 -14407417 -15070243 -15434751 -13647541 -9163327
5214i163327M198227K46824l151184j739986K983521N757799N095487M665586
$$ -9163327 -4965100 -4718276 -7869460 -9609446 -6625925 -868126 4227361 8892947
5206H892947N884157M497653j609286o639860n415197l007468o685069j1374822
$$ 8892947 14777104 19274757 17665471 11025611 5610414 2602946 -4082123 -15456945
5198a5456945n390182Q828334J3500573N89299j4207167j1941493M223512J5307677
$$ -15456945 -20847127 -12018793 1481780 2071079 -12136088 -24077581 -19854069 -4546392
5190d546392J2160718L002001j672424j81636M206815Q250714Q039776R63672
$$ -4546392 7614326 10616327 8943903 8762267 12969082 21219796 29259572 30223244
5182C0223244r328502j5240787j3749898q449780l501891l32563M60302o80727
$$ 30223244 20894742 5653955 -8095943 -16545723 -20047614 -20380177 -19919875 -20600602
5174b0600602o08366K896603O712938O662508M352746L666898K847639j961799
$$ -20600602 -21208968 -18312365 -11599427 -4936919 -584173 3082725 5930364 3968565
5166C968565p020023m462878M496011R871174P706496M225425K961608p05882
$$ 3968565 -3051458 -7514336 -3018325 6852849 14559345 18784770 21746378 21040496
5158B1040496p487541q422647Q92167J0134881Q014865j335728n909885l713943
$$ 21040496 13552955 5130308 6022475 16157356 24172221 22836493 16926608 13212665
5150A3212665k287504m709859p171656p867166p684997m013478N197520J2443438
$$ 13212665 10925161 6215302 -956354 -8823520 -16508517 -20521995 -15324475 -2881037
5142b881037P784958m364284q144868R74367Q878730M193957m764826l820682
$$ -2881037 4903921 539637 -7605231 -6630864 2247866 6441823 1676997 -2143685
5134b143685N304984Q943066K383063n335292o648564m564629m318712m629711
$$ -2143685 3161299 12104365 14487428 9152136 2503572 -2061057 -6379769 -11009480
5126a1009480j722360L277604N588187L026050j942664n093236l960491J85037
$$ -11009480 -12731840 -9454236 -3866049 -839999 -2782663 -7875899 -11836390 -11651353
5118a1651353L310060L052593J748524K546009L425607m46627p937361j1024473
$$ -11651353 -8341293 -5288700 -3540176 -994167 2431440 1984813 -5952548 -16977021
5110a6977021n482442K322756L787260l54719k328277R54764M773743N039497
$$ -16977021 -22459463 -20136707 -16349447 -16704166 -19032443 -18077679 -13303936 -8264439
5102h264439L700390L962669N060759M505176K099856o77120k452555j438659
$$ -8264439 -4564049 -601380 4459379 8964555 11064411 10387291 7934736 6496077
5094F496077L258200P748415N277783m322470j1403424p877015J596307N954708
$$ 6496077 9754277 17502692 22780475 18458005 7054581 -822434 773873 6728581
5086F728581K525864k062971m125758o625558r556685o895077K088723P561123
$$ 6728581 9254445 7191474 3065716 -3559842 -13116527 -20011604 -17922881 -10361758
5078a0361758K744259m212011j436670Q336376J1602591M287031l545164m162526
$$ -10361758 -7617499 -11829510 -13266180 -4929804 6672787 10959818 7414654 3252128
5070C252128j678902j100178J024805P587985J1623210O132729k734649l681403
$$ 3252128 1573226 473048 1497853 9085838 20709048 26841777 24107128 20425725
5062B0425725J618798N94691r732109j6495580r432089M411396J0987872P045194
$$ 20425725 22044523 22639214 12907105 -3588475 -13020564 -8609168 2378704 9423898
5054I423898K65953l257463l796519k943682j091169P44719J801487L251335M865655
$$ 9423898 9689851 6432388 2635869 -307813 -1398982 -654263 1147224 4398559 9264214
5045I264214K693309m431496r079783l538234P541569J1361033M176768m360427
$$ 9264214 11957523 7526027 -1553756 -5091990 2449579 13810612 17987380 13626953
5037A3626953n753430k674291r72691k36930K150667M473301M389498L639975
$$ 13626953 7873523 5199232 4226541 3989611 6140278 10613579 15003077 18643052
5029A8643052L265812j79718p292480j0705671n263166K039259J632212l507174
$$ 18643052 21908864 21729146 14436666 3730995 -1532171 507088 2139300 -1367874
5021a367874l162422K681782M227564p62033l336447K56801J634463m538046j0056441
$$ -1367874 -4530296 -1848514 2379050 1617017 -1719430 -1462629 171834 -4366212 -14422653
5012a4422653o089978K789435O994671O835627Q423368J0386123O767763K90680
$$ -14422653 -20512631 -17723196 -10728525 -3892898 4530470 14916593 21684356 21975036
5004B1975036r564N244764M488013o465406j5627301j1047952K053447Q646938
$$ 21975036 21965472 27210236 31698249 25232843 9605542 -1442410 611037 9257975
4996I257975L688259m124528o538393n035146m588087n437531n164792m335916
$$ 9257975 12946234 8821706 2283313 -2751833 -7339920 -12777451 -17942243 -22278159
4988b2278159m922659n168261j217554O067235J0432115P938964J905308k022714
$$ -22278159 -27200818 -32369079 -33586633 -27519398 -17087283 -9148319 -7243011 -9265725
4980i265725k740672k596447j861158J367858O268069Q490606N427774l35879
$$ -9265725 -12006397 -14602844 -16464002 -15096144 -8828075 -337469 5090305 4754426
4972D754426l898160k652021K177281O620640O623834J897846k995198l868597
$$ 4754426 856266 -1795755 381526 7002166 13626000 15523846 12528648 8660051
4964H660051k637517m296338q530941r334419m316530Q89669Q15385j573424N22351
$$ 8660051 6022534 1726196 -6804745 -16139164 -20455694 -19566025 -18750640 -20324064 -19801713
4955a9801713P422516J2331989J0412472M132121j237612m227670p242798j1202106
$$ -19801713 -12379197 -47208 10365264 14497385 13259773 9032103 1789305 -9412801
4947i412801j2498077p132000K474350Q126473N765581J583882L458049Q626225
$$ -9412801 -21910878 -29042878 -26568528 -18442055 -12676474 -11092592 -7634543 991682
4939I91682P176389k236927q821521m891429L369583N698715J486197k878341
$$ 991682 8168071 5931144 -2890377 -7781806 -4412223 1286492 2772689 -105652
4931a05652m572463m450475j240462N350327Q597204J473084j1259353j6693377
$$ -105652 -4678115 -9128590 -10369052 -5018725 3578479 5051563 -6207790 -22901167
4923b2901167j0163318K21850O350730Q682399R681018P693074K483848l02719
$$ -22901167 -33064485 -32842635 -26491905 -17809506 -8128488 -435414 2048434 1745715
4915A745715L079107O920434L248020o000252j0829229o715139m3058J505094
$$ 1745715 4824822 11745256 14993276 8993024 -1836205 -8551344 -8594402 -7089308
4907g089308j171693k004115P8939r3123m654780p782997l972788K671647L691475
$$ -7089308 -8261001 -10265116 -10186177 -10279300 -14934080 -22717077 -26689865 -24018218 -20326743
4898b0326743r38517l064567J23098J771042k180563n393466k087527K607187
$$ -20326743 -21265260 -24329827 -24206729 -22435687 -24616250 -30009716 -32097243 -29490056
4890b9490056J294716l663805n765736n475211n604686k221298P604330J4976853
$$ -29490056 -28195340 -31859145 -37624881 -43100092 -48704778 -50926076 -43321746 -28344893
4882b8344893J0524192J568050J453525O039391O63019j2099976j5800590j1868696
$$ -28344893 -17820701 -16252651 -14799126 -8759735 -8096716 -20196692 -35997282 -47865978
4874d7865978j8346024k9071610q652327N0202351R5160770P4435719R449327
$$ -47865978 -66212002 -95283612 -103935939 -53733588 41427182 115862901 125312228
4867A25312228l1177876k1114053R16657j598993j5487915j2925944J472865M825288
$$ 125312228 94134352 73020299 73936956 72337963 56850048 43924104 45396969 50222257
4859E0222257m597439r721100n510552l188228p800159j1371426q216580k165932
$$ 50222257 45624818 35903718 30393166 27204938 19404779 8033353 -183227 -2349159
4851b349159K275323M762317M899808K365035O68640K849451N094196K451676
$$ -2349159 -73836 4688481 9588289 11953324 12621964 15471415 20565611 23017287
4843B3017287j739610q72995L209059L499019Q17544K239916O923252N751389
$$ 23017287 21277677 20404682 23613741 27112760 27930304 30170220 37093472 42844861
4835D2844861k663354p639391k948356K912376j31795q787989j2668924r403009
$$ 42844861 40181507 32542116 29593760 32506136 32374341 23586352 10917428 1514419
4827A514419n142960l844791l808722k858633o10142K968386O320802N886535
$$ 1514419 -3628541 -7473332 -11282054 -14140687 -14750829 -11782443 -5461641 424894
4819D24894J679017k8641M490506Q627419M396963l712340m088778L352982N695910
$$ 424894 2103911 2075270 6565776 15193195 19590158 15877818 11789040 15142022 20837932
4810B0837932k749973j0578798o671270K585593L775954k695884m590121K125066
$$ 20837932 18087959 7509161 837891 3423484 7199438 4503554 -86567 2038499
4802B038499P813161M924584j806996m685339l664801k524030j456953N37387
$$ 2038499 9851660 14776244 12969248 8283909 4619108 2095078 638125 1175512
4794A175512R68354k307739n952951n348571j358250J926496L495528M383673
$$ 1175512 2143866 -163873 -6116824 -11465395 -12823645 -10897149 -7401621 -3017948
4786c017948L036099k117463p046839n791167L47732L777157J773218K70532M075635
$$ -3017948 18151 -2099312 -9146151 -14937318 -14589586 -10812429 -9039211 -8768679 -4693044
4777d693044R147251Q686467K597984l878175p971727j0408603j0092035m008674
$$ -4693044 4454207 13140674 15738658 11860483 3888756 -6519847 -16611882 -20620556
4769b0620556N936074J1070119N266329n812936r463093p45027J1185113J4023807
$$ -20620556 -14684482 -3614363 1651966 -4160970 -13624063 -14369090 -3183977 10839830
4761A0839830O839948l73928m87604K636449J269395n429864j1167095j0487257
$$ 10839830 17679778 17305850 16818246 19454695 20724090 15294226 4127131 -6360126
4753f360126l738889M361724Q421285O139351R59552n90905L382270P154561M967221
$$ -6360126 -10099015 -5737291 2683994 8823345 9782897 9191992 12574262 19728823 24696044
4744B4696044r49545l960257k476753q37203j920438m169313n610011n532990
$$ 24696044 23746499 19786242 17309489 16472286 14551848 10382535 4772524 -760466
4736g60466k141758N638809J2971866J1810907J443023q737863j0292516n405121
$$ -760466 -2902224 2736585 15708451 27519358 28962381 20224518 9932002 4526881
4728D526881j961903k666516l504838j039659K995369M237090N98515n176152
$$ 4526881 2564978 -101538 -3606376 -4646035 -1650666 2586424 3184939 -1991213
4720a991213p303274k820705M104480O383869K964013k20185M58265R26210l233873
$$ -1991213 -9294487 -12115192 -8010712 -1626843 1337170 1116985 1575250 2501460 -732413
4711g32413q288831o668325K109679J0260672J1480871P396977L299912J197253
$$ -732413 -9021244 -15689569 -13579890 -3319218 8161653 15558630 18858542 20055795
4703B0055795n57361k735458l332378q03443K479574K125174k606814p170169
$$ 20055795 19498434 16762976 13430598 12627155 15106729 17231903 14625089 7454920
4695G454920p276911m012253j073504O70834K016035J136448l648183p724086
$$ 7454920 178009 -3834244 -4907748 -4236914 -2220879 -1084431 -4732614 -12456700
4687a2456700m035842N684390J0907054O490010j58598l98095L902579N773397
$$ -12456700 -16492542 -10808152 98902 6588912 6430314 6032219 9934798 15708195
4679A5708195M324186L163277K045238j805919o650622q244516p080537o193047
$$ 15708195 20032381 23195658 25240896 23434977 16784355 8539839 1459302 -4733745
4671d733745l652416M124760J2378379J1166433L23964q031260n739542Q63903
$$ -4733745 -8386161 -4261401 8116978 19283411 19607375 11576115 5836573 6700476
4663F700476J923115j609068j863522K502055M980600J758801l575888o165072
$$ 6700476 8623591 7014523 5151001 7653056 12633656 14392457 10816569 4651497
4655D651497m997137r85019M750583Q587227N292441m693185j1947946p443516
$$ 4651497 -345640 -1330659 3419924 12007151 17299592 12606407 658461 -6785055
4647f785055N281109J2737271P907023j111692k759672K198843L402356k539645
$$ -6785055 -1503946 11233325 19140348 18028656 15268984 17467827 20870183 18330538
4639A8330538p056281l429637K593429J751925m842651q230089n188741j504384
$$ 18330538 11274257 7844620 10438049 12189974 7347323 -882766 -6071507 -7575891
4631g575891j746909k761970K72133N976378Q319484M278903k375744n175276
$$ -7575891 -9322800 -12084770 -11812637 -5836259 2483225 6762128 4386384 -788892
4623g88892k522943j79555m046740j0915141j0850105m78885J1260349J4354742
$$ -788892 -3311835 -3491390 -7538130 -18453271 -29303376 -29782261 -18521912 -4167170
4615d167170R746614M922686K309351n76146k809832q67248L068083K240968m179826
$$ -4167170 5579444 10502130 12811481 12235335 9425503 8558255 11626338 13867306 9687480
4606I687480r077320p396691j838638K664207L923081R56317n775206j1099686
$$ 9687480 610160 -6786531 -8625169 -5960962 -2037881 -1081564 -6856770 -17956456
4598a7956456q958551j447462K772739J047622P8679L878217O860063L993072
$$ -17956456 -26915007 -28362469 -25589730 -24542108 -24463429 -20585212 -13725149 -9732077
4590i732077Q1875J884733O689504O532803M63729m688316m435491j642089j408701
$$ -9732077 -9650202 -7765469 -1075965 5456838 5920567 1232251 -3203240 -4845329 -6254030
4581f254030m643755p046888l416692N895528J3335753J2248370N707200J929603
$$ -6254030 -10897785 -17944673 -21361365 -15465837 -2130084 10118286 15825486 17755089
4573A7755089J924325j89115m324931k758275N205169Q461602Q58466p872351
$$ 17755089 19679414 19490299 15165368 12407093 17612262 26073864 26932330 19059979
4565A9059979o908917n77358Q32604j975669j878553R6155j585379m000663q39348
$$ 19059979 12151062 11573704 12406308 10430639 8552086 8648241 7062862 3062199 2222851
4556B222851L553726N63245n070688j069375R583236J0459672p79914o218348
$$ 2222851 5776577 6339822 1269134 199759 9782995 20242667 19462753 13244405
4548A3244405L513730J2780338N360344j0038082j4021877n181241K272527K563101
$$ 13244405 16758135 29538473 34898817 24860735 10838858 5657617 7930144 10493245
4540A0493245K683503N237102L571596l963841q525947m060402L983748Q051461
$$ 10493245 13176748 18413850 21985446 18021605 9495658 5435256 9419004 17470465
4532A7470465Q520087Q964379P750978R84441r078724j4344666r747085R84890
$$ 17470465 25990552 34954931 42705909 43690350 34611626 20266960 10519875 11504765
4524A1504765Q807196P741736P2390o463197o738294k741204L32305L84270j114325
$$ 11504765 20311961 28053697 28126087 21662890 14924596 12183392 12515697 12899967 11785642
4515A1785642k887719m734381n513452l837602r51845J78238q38098j289710J07958
$$ 11785642 8897923 4163542 -1349910 -5187512 -6139357 -5961119 -6799217 -8088927 -7980969
4506g980969J012973p51059l531991l949793j181443K824832O476981R707729
$$ -7980969 -6967996 -7719055 -11251046 -15200839 -16382282 -13557450 -7080469 2627260
4498B627260J2076176J1800822P834198J821959l450080p172039j0430484j2879458
$$ 2627260 14703436 26504258 34338456 36160415 32710335 25538296 15107812 2228354
4490B228354j1719130n618983J934822N734576M836881L072760L633904N642628
$$ 2228354 -9490776 -15109759 -13174937 -7440361 -2603480 469280 4103184 9745812
4482I745812O546610N368691K505485j358749m452567l884389J303739P644412
$$ 9745812 16292422 21661113 24166598 22807849 18355282 14470893 15774632 23419044
4474B3419044R630350M916625l370982r373424r394721m634292M93113K595583
$$ 23419044 33049394 37966019 34595037 25221613 15826892 11192600 11685713 14281296
4466A4281296J481325j451321m907149o792118m257973K543886Q459487Q505205
$$ 14281296 15762621 14311300 9404151 2612033 -1645940 897946 9357433 17862638
4458A7862638M158922J134564J699348K934783K019491r50713n136731r396376
$$ 17862638 22021560 23156124 24855472 27790255 29809746 28859033 23722302 14325926
4450A4325926j0519237o063529L74352J891265k623052p290363q127147p034008
$$ 14325926 3806689 -2256840 -1882488 8777 -2614275 -9904638 -18031785 -25065793
4442b5065793n328985n36508O920833J0858308Q056359L682285K673096J930706
$$ -25065793 -30394778 -30931286 -24010453 -13152145 -5095786 -1413501 1259595 3190301
4434C190301k458114o354570m189089L47600l40960m770211m645447J240138N371975
$$ 3190301 732187 -5622383 -9811472 -9463872 -9804832 -14575043 -19220490 -17980352 -12608377
4425a2608377M126912K349125L342960L314194m84122l600159j280951L826523
$$ -12608377 -8481465 -6132340 -2789380 524814 40692 -3559467 -4840418 -1013895
4417a013895N635390K671620j670104m090727l470928k88616L491935N565763
$$ -1013895 4621495 7293115 5623011 1532284 -1938644 -2227260 1264675 6830438
4409F830438N709960N437336N057936L607329J521449Q2458j596610n120311q568846
$$ 6830438 12540398 17977734 23035670 26642999 28164448 28246906 26650296 21529985 12961139
4400A2961139q447859o006576o014769q312001o938295r2904N459391M080405
$$ 12961139 4513280 -1493296 -7508065 -15820066 -22758361 -22851265 -17391874 -13311469
4392a3311469q2006M59354N278637P303520L557425j080804j161012K433138M355360
$$ -13311469 -13393475 -12934121 -7655484 -351964 3205461 2124657 963645 3396783 7752143
4383G752143J567128l374420n876570n243268n040279o802172o678659j569571
$$ 7752143 9319271 5944851 68281 -5174987 -10215266 -17017438 -23696097 -25265668
4375b5265668M567571N810625L368129K961531M677130L553743j00034n90912
$$ -25265668 -20698097 -14887472 -11519343 -8557812 -3880682 -326939 -426973 -1017885
4367a017885J608571r76221q325629r050604K028074J3064112J1660784L200988
$$ -1017885 590686 -385535 -8711164 -17761768 -15733694 -2669582 8991202 12192190
4359A2192190Q98755M573444L333120m451333q915684o314912m359448o756394
$$ 12192190 13090945 17664389 20997509 16546176 7630492 1315580 -3043868 -9800262
4351i800262n530411M777318J5359663J4040272K116546p370030n542451L645282
$$ -9800262 -15330673 -10553355 4806308 18846580 20963126 13593096 8050645 11695927
4343A1695927R328846M848202o181807j3406012j0584152k540098J578513N52469
$$ 11695927 21024773 25872975 19691168 6285156 -4298996 -6839094 -5260581 -4708112
4335d708112R60415N027100O472915J633285k747159Q76359Q283802Q230103j655250
$$ -4708112 -3747697 1279403 7752318 9385603 6638444 7514803 15798605 24028708 22373458
4326B2373458j0841038r399680m76451M374972J80879n658985m123986K524762
$$ 22373458 11532420 2132740 1656289 6031261 6212140 553155 -3570831 -1046069
4318a046069L896013k849395p721535k403942O557036O960610q15825n063280
$$ -1046069 2849944 549 -7720986 -10124928 -3567892 3392718 2576893 -2486387
4310b486387j204649K384279l70468l156919J336419Q563459Q908883J887173
$$ -2486387 -3691036 -1306757 -1677225 -4834144 -3497725 5065734 13974617 15861790
4302A5861790m682061o384476n361162l582886l47920L465745M574156J862771
$$ 15861790 11179729 4795253 -565909 -4148795 -4496715 -1030970 3543186 5405957
4294E405957j958776l876283l199236r67673J140028K152436L543771P506458
$$ 5405957 3447181 -429102 -3628338 -4596011 -3455983 -1303547 2240224 9746682
4286I746682J1854640J0344938J419529p161155p407797k065339p33142o602996
$$ 9746682 21601322 31946260 33365789 26204634 18796837 16731498 15998356 9395360
4278I395360j3077780j3253191o989511K037259J0757163J6263044J5479488Q392729
$$ 9395360 -3682420 -16935611 -23925122 -21887863 -11130700 5132344 20611832 29004561
4270B9004561m22699n558263n292758k138227k10893j906791n742667p847538
$$ 29004561 28581862 23023599 17730841 15592614 15381721 13474930 7732263 -115275
4262a15275o618228m445926l368347j602689K475708N253372J498661p476695
$$ -115275 -6733503 -11179429 -14547776 -16150465 -13674757 -8421385 -6922724 -14399419
4254a4399419j3746096j1590754l240499M574004O929545L470239j988985l934872
$$ -14399419 -28145515 -39736269 -42976768 -38402764 -31473219 -28002980 -29991965 -33926837
4246c3926837K19965P200114J1189238J0000658O302107L514805K806213L495794
$$ -33926837 -33706872 -26506758 -15317520 -5316862 985245 4500050 7306263 10802057
4238A0802057L909402K134736j873600n301357n406106k774490k00880M09713
$$ 10802057 14711459 16846195 14972595 9671238 4265132 1490642 1289762 1699475
4230A699475j193589l696136l728081J239247P356837O374701l023804j0737875
$$ 1699475 505886 -3190250 -6918331 -5679084 1677753 8052454 5028650 -5709225
4222e709225p714821J389716N044514J068970k108224J149296P164910R781966
$$ -5709225 -13424046 -12034330 -6989816 -5920846 -8029070 -6879774 285136 10067102
4214A0067102O740526p76783q692353j0735503m916012J898899K423660m63799
$$ 10067102 16807628 16030845 7338492 -3397011 -8313023 -6414124 -3990464 -4454263
4206d454263K66130K325969k108143j0489762j0971943j036303P969164Q439075
$$ -4454263 -4188133 -1862164 -3970307 -14460069 -25432012 -26468315 -18499151 -10060076
4198a0060076N976258O373440N886211J460038j212671J478677K608092l266804
$$ -10060076 -4083818 2289622 8175833 9635871 8423200 9901877 12509969 9243165
4190I243165q666307m238483N900051J0194203N490726k370452q547281j0991055
$$ 9243165 576858 -3661625 2238426 12432629 17923355 15552903 7005622 -3985433
4182c985433p343949J198029P234181O117376L097360M790956R210127J1094625
$$ -3985433 -11329382 -10131353 -2897172 3220204 6317564 11108520 20318647 31413272
4174C1413272J0386282P951467N70770j1187844j7998649j4149147p050901m932006
$$ 31413272 41799554 49751021 50321791 39133947 21135298 6986151 -64750 -4996756
4166d996756m187262L64885L261869l13662j889134N778325J1961623M242816
$$ -4996756 -9184018 -8819133 -5557264 -5870926 -7760060 -1981735 9979888 14222704
4158A4222704p924446p097929K529125L078560m906654m241347O979793J1840180
$$ 14222704 6298258 -799671 1729454 4808014 -98640 -4339987 2639806 14479986
4150A4479986M412808k404747j705003m85949j49252N237736R146963k56714j0941203
$$ 14479986 18892794 16488047 14783044 14297095 14147843 19385579 28532542 28275828 17334625
4141A7334625J140127K6587066L0242441J5184505K8773341P8350649R3379531
$$ 17334625 18474752 45061818 75304259 90488764 119262105 197612754 290992285
4134B90992285K0004129q5960113j21516143p0601284j2325239k974759j6008812
$$ 290992285 310996414 225036301 103520158 32918874 20593635 17618876 1610064
4127A610064r871905O730294O744226l968305m269379J800030l197529j5115452
$$ 1610064 -8261841 -1531547 5212679 1244374 -3025005 -1224975 -4422504 -19537956
4119a9537956j5054644j420543R249337Q091119J796597j525979j31419M368348
$$ -19537956 -34592600 -36013143 -26763806 -18672687 -16876090 -18402069 -18533488 -14165140
4111a4165140P549115M055356l901076o584389j155958L087221N459l992920l236334
$$ -14165140 -6616025 -2560669 -6461745 -13046134 -14202092 -11114871 -11109412 -15102332 -18338666
4102a8338666l005091o985671p238633J372400Q454954L758885m264929r04528
$$ -18338666 -21343757 -28329428 -35568061 -34195661 -25740707 -21981822 -26246751 -27151279
4094b7151279J1141386J6249439R434429N34070k718714k378991j915823j496055
$$ -27151279 -16009893 239546 9673975 10208045 7489331 5110340 3194517 1698462
4086A698462j459806j828157K35148N191529O846153J024236o050789o531660
$$ 1698462 238656 -1589501 -1354353 3837176 10683329 11707565 5656776 -874884
4078h74884k829901j336585k76484M854148R264921N472512j982198k358100L160439
$$ -874884 -3704785 -5041370 -5317854 -463706 8801215 14273727 12291529 9933429 13093868
4069A3093868L534619k925521o279608k894023j076285n640199j0117763q868055
$$ 13093868 16628487 13702966 7423358 4529335 3453050 -2187149 -12304912 -21172967
4061b1172967n361598l551849j394566K121188L074599P51817R00546N986201
$$ -21172967 -26534565 -30086414 -31480980 -29359792 -26285193 -25533376 -24632830 -18646629
4053a8646629J0392700R871726P621405O487597L644604j750202m049637m88263
$$ -18646629 -8253929 1617797 9239202 15726799 19371403 17621201 13571564 13083301
4045A3083301K580113l67964m617924l105319J969107L186983m51099l354763
$$ 13083301 15663414 15295450 10677526 7572207 9541314 12728297 12277198 8922435
4037H922435k462762m01389p39399m078621p423757n532814L749103J3960319
$$ 8922435 6459673 6058284 5318885 1240264 -6183493 -11716307 -7967204 5993115
4029E993115J4969556N777190l599524n828712m568474m928380m128529J148238
$$ 5993115 20962671 26739861 23140337 17311625 12743151 7814771 3686242 4834480
4021D834480N480424K211921m630476n614103j15435L984808K904790K78189j151801
$$ 4834480 10314904 12526825 7896349 2282246 2166811 6151619 9056409 9334598 8182797
4012H182797k415485k926752n37169K277712J96223n565076p233970k099450K969170
$$ 8182797 5767312 2840560 2303391 4581103 4777326 -787750 -8021720 -10121170 -7152000
4003g152000J781368k741326m348558k344997j24645J113815K404595L501374
$$ -7152000 -5370632 -8111958 -12460516 -14805513 -14930158 -13816343 -11411748 -7910374
3995g910374L772875M688487P155493P732393K216427o850653j0902628n756803
$$ -7910374 -4137499 550988 7706481 15438874 17655301 10804648 -97980 -5854783
3987e854783K056746L046874k777781o051789j449790M481290K990819l637504
$$ -5854783 -3798037 -751163 -3528944 -9580733 -11030523 -6549233 -3558414 -7195918
3979g195918n576407o38002K675831r37622n387420l775546M49639L07735k418665
$$ -7195918 -12772325 -13410327 -10734496 -11672118 -17059538 -20835084 -20385445 -20077710 -22496375
3970b2496375o36544N607504R356546P898596M676001P45558n956635j1972814
$$ -22496375 -23132919 -17525415 -8168869 -270273 4405728 5151286 -805349 -12778163
3962a2778163r241002K011770J0577907R176122L689274K085038K621435N59045
$$ -12778163 -22019165 -20007395 -9429488 -253366 3435908 5520946 8142381 8701426
3954H701426j179403J972484N173576O94950p423351p509280J114975O167705
$$ 8701426 7522023 9494507 14668083 15363033 7939682 430402 1545377 7713082
3946G713082J875123j850720L950276J2062703J0165772j74647o944631o252048
$$ 7713082 9588205 7737485 11687761 23750464 33916236 33741589 26796958 20544910
3938B0544910n364636p575650o254156K180670R641527P686652L61129k413359
$$ 20544910 15180274 7604624 1350468 3531138 13172665 20859317 21220446 18807087
3930A8807087K28503P18883l255685n094958q90347L390258O57021o660379r910095
$$ 18807087 19035590 19754473 16498788 11403830 10513483 13903741 14560762 7900383 -2009712
3921b009712n493833J721716N109754K648517l063283p903443q658703m535297
$$ -2009712 -7503545 -5781829 -672075 1976442 -1086841 -8990284 -17648987 -22184284
3913b2184284K323639P986457Q914607M109479l467803q168971o725162k173495
$$ -22184284 -19860645 -11874188 -2959581 1149898 -2317905 -10486876 -17212038 -19385533
3905a9385533j445k90689J984271P357329Q300431J8452r794823r445397L22302
$$ -19385533 -19386978 -19677667 -17693396 -10336067 -2035636 -2017184 -11812007 -21257404 -20935102
3896b0935102O774683L165836k171333R01220Q909076J0089977J739908o242602
$$ -20935102 -14160419 -10994583 -13165916 -12264696 -3355620 6734357 8474265 2231663
3888B231663n715137p62358q3907m018773n067822K58277O299756O716333L295275
$$ 2231663 -3483474 -4245832 -4329739 -8348512 -13416334 -13158057 -6858301 -141968 3153307
3879C153307K086714L327733J134121o018575j0368194m685685O410020J0905782
$$ 3153307 5240021 8567754 9701875 3683300 -6684894 -11370579 -4960559 5945223
3871E945223M677317l724276n582456l641269o064064j2124781j1592140J98819
$$ 5945223 10622540 6898264 1315808 -2325461 -8389525 -20514306 -32106446 -31907627
3863c1907627J3320373J4489332L929175n492240n441841j288819j311367l506784
$$ -31907627 -18587254 -4097922 -168747 -5660987 -11102828 -12391647 -13703014 -17209798
3855a7209798j65174P734988R804219J416344q208591p880573P01999O051036
$$ -17209798 -17374972 -9639984 164235 1580579 -6628012 -14508585 -13806586 -7755550
3847g755550K280573n000395p999173n949365k765986J47052M622802J0465471
$$ -7755550 -5474977 -10475372 -18474545 -24423910 -27189896 -27042844 -22420042 -11954571
3839a1954571J3221596Q869835m97889p710122p848614l165307N70891J133167
$$ -11954571 1267025 10136860 9638971 1928849 -5919765 -9085072 -8514181 -7381014
3831g381014P22378Q37343K17962j481841k026156m32919J055166R25876O69694
$$ -7381014 -6658636 -5821293 -5603331 -7085172 -9111328 -9544247 -8489081 -7563205 -6893511
3822f893511P10261j527600n846020o323407L17589P397445O479118K25480j251700
$$ -6893511 -6183250 -7710850 -13556870 -19880277 -19562688 -12165243 -5686125 -5460645 -6712345
3813f712345M028909P104629K204966n285821q612588r217738j0751421j0093100
$$ -6712345 -2683436 4421193 6626159 1340338 -7272250 -16489988 -27241409 -37334509
3805c7334509k225236R196725J4091175Q824154R51476m39620M693732Q580598
$$ -37334509 -39559745 -30363020 -16271845 -7447691 -6496215 -6935835 -2242103 6338495
3797F338495N641798j042567m032169j256871J509138l23197k326404K303966
$$ 6338495 11980293 10937726 6905557 5648686 7157824 6834627 4508223 6812189
3789F812189J0197646R979826j367574j2442888j2236001m093286J324901J228107
$$ 6812189 17009835 26989661 25622087 13179199 943198 -3150088 -1825187 -597080
3781e97080Q98948K656838L636671L144652L581883L869292R3689n978823o921315
$$ -597080 301868 2958706 6595377 9740029 13321912 17191204 17284893 11306070 4384755
3772D384755r34482M000512J272875n014167o662871k576242J957496L533121
$$ 4384755 3450273 7450785 8723660 3709493 -2953378 -5529620 -3572124 -39003
3764c9003K578571m13689m750249o875252l546854K327501M114127M00999l107600
$$ -39003 2539568 2125879 -2624370 -9499622 -13046476 -10718975 -6604848 -6203849 -9311449
3755i311449j826472K083424M271489M057982K757440o409m112921n837400k018176
$$ -9311449 -11137921 -9054497 -4783008 -725026 2032414 2026005 -2086916 -7924316 -9942492
3746i942492L901486N175216R68609k872665k771241j280668j57168L692575J0656139
$$ -9942492 -6041006 -865790 102819 -2769846 -5541087 -6821755 -6978923 -3286348 7369791
3737G369791J2823161L651441r940436j3915931n263361M605995O033637K193257
$$ 7369791 20192952 23844393 13903957 -11974 -5275335 -669340 5364297 7557554
3729G557554L50245K82560j772638l520178K27579P108764Q458250J463536o907182
$$ 7557554 7907799 8190359 6417721 2897543 3125122 10233886 18692136 20155672 13248490
3720A3248490r806827q365548o938683n679023k182355K535912M568879K985294
$$ 13248490 3441663 -4923885 -11862568 -17541591 -19723946 -17188034 -12619155 -9633861
3712i633861J305903K399455M629531M541849J632095j580601l450832m666283
$$ -9633861 -8327958 -5928503 -1298972 3242877 4874972 3294371 -156461 -4822744
3704d822744n402670l861458K51457L124447J308621k395318k025591K473047
$$ -4822744 -10225414 -14086872 -13835415 -10710968 -9402347 -11797665 -13823256 -11350209
3696a1350209M475377P23095l283969j765344K163039J558428k972964l863417
$$ -11350209 -6874832 -6151737 -9435706 -11201050 -9038011 -7479583 -10452547 -14315964
3688a4315964J787389P765081P824627L973180K283041L776514L638714j307648
$$ -14315964 -12528575 -4763494 3061133 7034313 9317354 13093868 16732582 15424934
3680A5424934p738766r565534n008928J700902N600876O044115N069569K721030
$$ 15424934 7686168 -1879366 -6888294 -5187392 413484 6457599 11527168 14248198
3672A4248198k413003q447342j0610489p772390m135366k269263O17195N909718
$$ 14248198 11835195 3387853 -7222636 -14995026 -19130392 -21399655 -20782460 -14872742
3664a4872742Q265654K879487n494177p481646j265290O352021R679861Q786211
$$ -14872742 -6607088 -3727601 -9221778 -16703424 -17968714 -11616693 -1936832 6849379
3656F849379N599967J981868J170625M537151P158514L414956l416820n014310
$$ 6849379 12449346 14431214 15601839 20138990 27297504 30712460 27295640 22281330
3648B2281330j468106j439788p089432r355720k945537L916035J998822m764746
$$ 22281330 20813224 19373436 12284004 2928284 -17253 3898782 5897604 1132858
3640A132858o402193k201246N95853m96661j364930k87625J31503l64726J051012
$$ 1132858 -5269335 -7470581 -6874728 -7371389 -8736319 -9023944 -8892441 -9257167 -8206155
3631h206155L964161M612970K790158K319327L641588K433991k512506o204343
$$ -8206155 -4241994 370976 3161134 5480461 9122049 11556040 9043534 2839191
3623B839191n106764k476755k289917k423704J108833N970150N428639j482028
$$ 2839191 -2267573 -4744328 -7034245 -9457949 -8349116 -2378966 3049673 1567645
3615A567645o815867l381592N274247Q528220K081273o558221q288637m308849
$$ 1567645 -5248222 -8629814 -3355567 5172653 7253926 695705 -7592932 -11901781
3607a1901781k835061o061622p559246l596188O37808K10087p68448L913754J1218240
$$ -11901781 -14736842 -20798464 -28357710 -31953898 -31316090 -31106003 -31874451 -27960697 -16742457
3598a6742457J2146567M689120l569440n678430k250344K145457M136703K260557
$$ -16742457 -4595890 93230 -3476210 -9154640 -11404984 -9259527 -5122824 -2862267
3590b862267k766877p225828p338223l644481M77951L921349P540734R699378
$$ -2862267 -5629144 -12854972 -20193195 -23837676 -23359725 -19438376 -11897642 -2198264
3582b198264P360990J900033j326549k49047J647231J350333Q8412j62250M70429
$$ -2198264 5162726 7062759 5736210 5487163 7134394 8484727 8573139 8410889 8881318
3573H881318J758055L920197M787084R28418o528162j1484570j0377347o186264
$$ 8881318 10639373 14559570 19346654 20275072 13746910 2262340 -8115007 -14301271
3565a4301271l034001r06871J945576N255957P893085R334479P983923J932999
$$ -14301271 -17335272 -18242143 -16296567 -11040610 -3147525 6186954 14170877 16103876
3557A6103876o340407j0254277p045977j618464M83026m820L86381J286530j3070
$$ 16103876 9763469 -490808 -7536785 -9155249 -8672223 -8677043 -8290662 -7004132 -7017202
3548g017202l034220m456676k742677O21131L237820L117677k00940m106887m782076
$$ -7017202 -10051422 -14508098 -17250775 -16629644 -13391824 -10274147 -10475087 -14581974 -19364050
3539a9364050j922344J256806L395197N992116P999425N362575j376408n233192
$$ -19364050 -21286394 -20029588 -16634391 -10642275 -2642850 2719725 1343317 -3889875
3531c889875k455976J928126K701099K177442L687310L903454r06152o456118
$$ -3889875 -6345851 -4417725 -1716626 460816 4148126 8051580 7145428 689310
3523F89310o436942k410915L76488K346732N857048P112940K446618j634270K943864
$$ 689310 -5747632 -8158547 -7782059 -5435327 421721 7534661 9981279 8347009 11290873
3514A1290873J0119472O560867o565056j3450912o932637K619464N093603K933999
$$ 11290873 21410345 27971212 21406156 7955244 1022607 3642071 8735674 11669673
3506A1669673O06986l831360r401860p969359J767244Q426547N589577K656805
$$ 11669673 12276659 8445299 -956561 -8925920 -7158676 1267871 6857448 9514253
3498I514253O894258Q015759m027740j7374822j3495118L105085J0936843M142003
$$ 9514253 16408511 24424270 20396530 3021708 -10473410 -7368325 3568518 7710521
3490G710521j825033K134607O103648J437439m699159l727089K50640M56612n60985
$$ 7710521 5885488 8020095 14123743 15561182 10862023 7134934 7385574 7842186 7281201
3481G281201J170826J485554l411742p577427m592807J329701L313493L469461
$$ 7281201 8452027 9937581 6525839 -1051588 -5644395 -4314694 -1001201 2468260
3473B468260N964598N689631l331749j3383420j1177247J502783R312989N813222
$$ 2468260 8432858 14122489 10790740 -2592680 -13769927 -12267144 -2954155 2859067
3465B859067O93143J893174L912861k2735n388170m485072O51039K458442j00903
$$ 2859067 3552210 5445384 9358245 9335510 3947340 -537732 113307 2571749 2470846
3456B470846k343177l383952o053273q559196n152922L281387P189925J308629
$$ 2470846 127669 -3256283 -9309556 -17868752 -23021674 -19740287 -12550362 -11241733
3448a1241733o019365l084355Q196973J3495315N805965l804958j307466R713042
$$ -11241733 -17261098 -20345453 -12148480 1346835 7152800 3347842 2040376 11753418
3440A1753418J2355782N08075j2430099j2919116n012890o67989r39100J258328
$$ 11753418 24109200 24617275 12187176 -731940 -5744830 -6412819 -7351919 -6093591
3432f093591M821595J478339p219605q681928Q57485Q480439L844978m893916
$$ -6093591 -1271996 206343 -7013262 -15695190 -14837705 -6357266 -2512288 -7406204
3424g406204m263540L948834O975127Q73816n886066o791869m276008j969308
$$ -7406204 -11669744 -7720910 -745783 128033 -5758033 -12549902 -16825910 -18795218
3416a8795218M01930K382863J024157l367175n863904m017165j141778n5925J510593
$$ -18795218 -18393288 -16010425 -14986268 -18353443 -24217347 -28234512 -29376290 -29432215 -27921622
3407b7921622O111077J1034898J1127368N349481j765071m487222j366500K764635
$$ -27921622 -21810545 -10775647 351721 5701202 3936131 -551091 -1917591 847044
3399H47044J487890m815069p934145k443769O176088R425210Q122994Q758261
$$ 847044 2334934 -2480135 -10414280 -12858049 -6681961 2743249 10866243 19624504
3391A9624504J0057826M215137p752511j3886344q869061k595456m276422q082590
$$ 19624504 29682330 33897467 26144956 12258612 3389551 794095 -3482327 -11564917
3383a1564917m216703L840055N123375n36885k756707K050601N482608J236010
$$ -11564917 -15781620 -11941565 -6818190 -7355075 -10111782 -8061181 -2578573 -1342563
3375a342563n366716n738463Q10885P863765R280415L541202n360932j0092957
$$ -1342563 -6709279 -12447742 -11636857 -3773092 5507323 9048525 3687593 -6405364
3367f405364o857021n20956J259395j369305j252735M341675R704247R613478
$$ -6405364 -13262385 -13783341 -12523946 -13893251 -15145986 -10804311 -1100064 8513414
3359H513414N865160K429317O8065j270018m45731J009534j428934p773960j1171311
$$ 8513414 14378574 16807891 16875956 15605938 15160207 16169741 14740807 6966847 -4204464
3350d204464p741391l281244m068462n969873q52143Q955193J1919339L680725
$$ -4204464 -11945855 -15227099 -19295561 -25265434 -26117577 -17162384 -5243045 -1562320
3342a562320o063939o450947O34307M481038N67101l650989J093009J2941382
$$ -1562320 -7626259 -14077206 -13442899 -8961861 -8394760 -12045749 -10952740 1988642
3334A988642J9288245J0884710o576858j7865832j4782466l860347L190640K613634
$$ 1988642 21276887 32161597 25584739 7718907 -7063559 -10923906 -7733266 -5119632
3326e119632l55348m9442L986605Q197788Q398366K961984m654967p776840l471478
$$ -5119632 -5474980 -5524422 -1537817 6659971 15058337 18020321 13365354 5588514 2117036
3317B117036L539965O176971K650475l211996o861634n594998Q02056Q185484
$$ 2117036 5657001 11833972 14484447 11272451 4410817 -1184181 -382125 7803359
3309G803359R513392K734280m925971n374754k57366K314909l46271l635965m784182
$$ 7803359 17316751 20051031 15125060 9750306 9492940 11807849 11461578 7825613 3041431
3300C041431o147953q233534o786067O5080P243272Q613395L668941l613137q770614
$$ 3041431 -3106522 -11340056 -18126123 -18061043 -10817771 -2204376 1464565 -2148572 -10919186
3291a0919186q589585l393032J401557J063651n96339M226978J3941700J7375138
$$ -10919186 -19508771 -22901803 -21500246 -20436595 -21032934 -16805956 -2864256 14510882
3283A4510882J0210554K093182J324734J886909m907822j3447665j0971627J744401
$$ 14510882 24721436 26814618 28139352 30026261 25118439 11670774 699147 2443548
3275B443548R636982L907465p312096j1261363n019588N181312J1920875J0703598
$$ 2443548 12080530 15987995 8675899 -2585464 -7605052 -2423740 9497135 20200733
3267B0200733K176669o393491o623248J125905P320717M712218l738772j0044418
$$ 20200733 22377402 15983911 9360663 10486568 17807285 22519503 18780731 8736313
3259H736313j0202992o312213l303586m648644p956979n477578N954046J6764990
$$ 8736313 -1466679 -7778892 -11082478 -15731122 -23688101 -29165679 -23211633 -6446643
3251f446643J4309527R26452p355487k726971M482527L168556k276259k121864
$$ -6446643 7862884 8789336 1433849 -1293122 3189405 6357961 4081702 1959838
3243A959838J722061J122321k311148o33467M196222K243792n863715o983547
$$ 1959838 3681899 4804220 2493072 1859605 6055827 8299619 2435904 -4547643
3235d547643L840401J3800365J0634040m21m596618j533752k45157m887398r312807
$$ -4547643 -707242 13093123 23727163 23726742 19130124 17596372 17351215 12463817 3151010
3226C151010p691293j684349M023710O921833N979247J118141m588764o184242
$$ 3151010 -4540283 -6224632 -2200922 4720911 10700158 11818299 7229535 1045293
3218A045293k323820L247548O803063Q202983Q307281O389755K296735j780664
$$ 1045293 -1278527 1969021 8772084 16975067 25282348 31672103 33968838 32188174
3210C2188174m349327o896707j0009044r748071k747111O074771P017850j341136
$$ 32188174 27838847 20942140 10933096 1185025 -1562086 4512685 11530535 10189399
3202A0189399q256779m226715O091309J0561922O467414K566461M044316M610064
$$ 10189399 1932620 -2294095 3797214 14359136 20826550 23393011 27437327 32047391
3194C2047391k012858j0508813j1496672n901609l009990o040577q480619n270609
$$ 32047391 30034533 19525720 8029048 2127439 -882551 -6923128 -15403747 -20674356
3186b0674356N71688M657580P156922Q566028O130142o46224n926480m360686
$$ -20674356 -20102668 -15445088 -8288166 277862 6408004 5761780 -164700 -4525386
3178d525386J446629N170681N468010N445265N990618N204772L223793K332602
$$ -4525386 -3078757 2091924 7559934 13005199 18995817 24200589 27424382 29756984
3170B9756984K434896P53926l725539q817565j1931648j1534557o868641N36411
$$ 29756984 32191880 32945806 29220267 20402702 8471054 -3063503 -9932144 -9395733
3162i395733O138917O498433K930488j841416p788228j3741445j3277453k519829
$$ -9395733 -3256816 3241617 6172105 4330689 -3457539 -17198984 -30476437 -32996266
3154c2996266R633518R248117k934690r750544m50498J3939142J5840616M633140
$$ -32996266 -23362748 -14114631 -17049321 -26799865 -27250363 -13311221 2529395 7162535
3146G162535m984640m272669O55606J038615l112799o533098o454234l104545
$$ 7162535 2177895 -2094774 -1439168 -400553 -3513352 -10046450 -16500684 -19605229
3138a9605229K506743P549650P653009J766960n320457p750578m252685K116916
$$ -19605229 -17098486 -9548836 -1895827 -128867 -5449324 -13199902 -17452587 -15335671
3130a5335671P351139Q378009M699308k432q53320J831772K601907p40718l451967
$$ -15335671 -7984532 393477 5092785 5090353 4237033 6068805 8670712 7929994 4478027
3121D478027j964513l00796k452019l317808L797751J3345786J2363651R5170
$$ 4478027 2513514 2212718 -239301 -3557109 240642 13586428 25950079 26045249
3113B6045249q782530m954496K518073J635024l971556l256955K449438K108880
$$ 26045249 17262719 12308223 14826296 16461320 12489764 9232809 11682247 13791127
3105A3791127n175241q035162k339839J558834l351441q433732l836007M836469
$$ 13791127 8615886 580724 -1759115 -200281 -3551722 -11985454 -15821461 -10984992
3097a0984992N677047k19778j188258N820142J0599750N420103m441376r165958
$$ -10984992 -5307945 -5527723 -6715981 -895839 9703911 15124014 10682638 1516680
3089A516680o404057j169360J529272O29448j615691k082855o0906J847302J706541
$$ 1516680 -4887377 -6056737 -4527465 -3898017 -5513708 -7596563 -7657469 -5810167 -4103626
3080d103626J366695K708514L460198J339452m05174K127017N292573K487583
$$ -4103626 -2736931 -28417 3431781 4771233 4366059 6493076 11785649 14273232
3072A4273232m064422n338089k10503J856993l779466q564782l783116N891715
$$ 14273232 10208810 4870721 4660218 6517211 2737745 -5827037 -9610153 -3718438
3064c718438R384911M356595k007389l638817m42899M611391P369126L881683
$$ -3718438 5666473 10023068 8015679 4376862 3933963 8545354 15914480 19796163
3056A9796163m883107j1968112j2254618q234530m124508P92656P279627J0028214
$$ 19796163 14913056 2944944 -9309674 -17544204 -21668712 -20876056 -13596429 -3568215
3048c568215M649605k929366l276679K318644L948232j092764m441165l15919
$$ -3568215 1081390 -1847976 -5124655 -2806011 1142221 49457 -4391708 -4707627
3040d707627N964555O666534J816668l288381n358861m165975n93447K998448
$$ -4707627 1256928 7923462 9740130 6451749 1092888 -3073087 -3666534 -668086
3032f68086L670828J585970k6229Q5254m53484l047469n481120n175627j938311
$$ -668086 3002742 4588712 4562483 4647737 4194253 1146784 -4334336 -9509963 -11448274
3023a1448274L071897P592356P684868J751713m657703l754878L679121Q386461
$$ -11448274 -8376377 -784021 6900847 8652560 3994857 239979 3919100 12305561
3015A2305561N362029J79576l58338K277777K501456p71328m541189p101492q442616
$$ 12305561 17667590 17847166 17488828 19766605 22268061 21496733 16955544 9854052 1411436
3006A411436q007652n862506l824376k606514n02655K852656M913250M769222
$$ 1411436 -6596216 -12458722 -16283098 -18889612 -19392267 -16539611 -11626361 -6857139
2998f857139N128805O939306O640493K442524j260712k64004K736577K672036
$$ -6857139 -1728334 5210972 11851465 14293989 13033277 12769273 15505850 18177886
2990A8177886l23357l020986n448901r404442j2889660j1564703m664565M457401
$$ 18177886 17854529 14833543 9384642 -19800 -12909460 -24474163 -29138728 -24681327
2982b4681327J1911272J4264022R327655J38700n328318l113720J493753K195882
$$ -24681327 -12770055 1493967 10821622 10960322 5632004 2518284 4012037 6207919
2974F207919M68140K28467q48189o188789j0609309o001126M965602J1067004
$$ 6207919 6676059 6904526 6056337 -132452 -10741761 -16742887 -11777285 -710281
2966g10281Q368071L951429K835908J129971m841045j1160076j2029591o613298
$$ -710281 7657790 11609219 14445127 15575098 10734053 -426023 -12455614 -19068912
2958a9068912K343306J0709115J2597375N221943m369582n749016k37795J08207
$$ -19068912 -16725606 -6016491 6580884 11802827 7433245 1684229 1446434 1554641
2950A554641q107947j2549744m025240Q369152J0765342M553556J061301K239931
$$ 1554641 -6553306 -19103050 -23128290 -14759138 -3993796 559760 1621061 3860992
2942C860992J26704o661193r295115l290413M333997O118841L870850L047619
$$ 3860992 3987696 -2673497 -11968612 -15259025 -10925028 -4806187 -935337 2112282
2934B112282M192108M657448L879549K419965m93211m369307n650628k791025
$$ 2112282 6304390 10961838 14841387 17261352 16768141 12398834 6748206 3957181
2926C957181m56884l609106q775211p047451L209540J2137575J0499815K165752
$$ 3957181 3500297 -108809 -8884020 -15931471 -12721931 -584356 9915459 12081211
2918A2081211j216534L369336O394485L75421q740578j0610920n713146k940177
$$ 12081211 10864677 14234013 20628498 21003919 12263341 1652421 -4060725 -7000902
2910g000902m198184j612791Q059763J5785725J2293997R57225p558293q773383
$$ -7000902 -11199086 -12811877 -4752114 11033611 23327608 24284833 16726540 7953157
2902G953157o347868m110666k575599j634153j285868n40378O60267J50060k525289
$$ 7953157 1605289 -2505377 -5080976 -6715129 -8000997 -8541375 -7881108 -7731048 -10256337
2893a0256337l717190j148500J564791O85320q15002J894560O829943Q115242
$$ -10256337 -13973527 -15122027 -13557236 -12871916 -13686918 -11792358 -4962415 3152827
2885C152827N290411K521006M00031l489206p018968n473060j195084j786159
$$ 3152827 8443238 10964244 11364275 7875069 856101 -4616959 -5812043 -7598202
2877g598202o991639p282531P22954P099166L154637m975786n553836J495729
$$ -7598202 -14589841 -21872372 -21149418 -14050252 -10895615 -15871401 -21425237 -19929508
2869a9929508N695928J822845m059901m447317O37222O055137Q067253O469551
$$ -19929508 -14233580 -12410735 -16470636 -20917953 -20280731 -14225594 -6158341 311210
2861C11210L234293O92335l59104j219630k977922m244142k761395J133021M144425
$$ 311210 3545503 4237838 3878734 2659104 -318818 -4562960 -7324355 -6191334 -2046909
2852b046909L025882k665888r919292j3610521r833088N48284J1858528J7744289
$$ -2046909 978973 -1686915 -11606207 -25216728 -35049816 -34501532 -22643004 -4898715
2844d898715J5548179P802720P67407k9712M485555O817337J819718n812599p817921
$$ -4898715 10649464 18452184 19219591 19189879 23675434 30492771 32312489 26499890 18681969
2835A8681969m655671m193569p729425o649257K847307J0635182N957661o406669
$$ 18681969 14026298 9832729 2103304 -4545953 -1698646 8936536 14894197 8487528
2827H487528j2263543o651202K479062P010148O114800J734945m425608q418901
$$ 8487528 -3776015 -10427217 -7948155 -938007 5176793 6911738 2486130 -5932771
2819e932771o558633k108825k239080o655065p043609m21984N438823M570123
$$ -5932771 -12491404 -14600229 -16839309 -23494374 -30537983 -30959967 -25521144 -20951021
2811b0951021K481764N923778R728828M096298p989860j1832580j228499J1668576
$$ -20951021 -18469257 -12545479 -2816651 1279647 -6710213 -18542793 -19771292 -8102716
2803h102716J1613293p30524j1349451j1214828n017905j493467j721399q74423
$$ -8102716 3510577 2780053 -8569398 -19784226 -24802131 -26295598 -28016997 -28891420
2795b8891420K555061N208218N713043O959884R574713Q613314J177859o618613
$$ -28891420 -26336359 -21128141 -15415098 -8455214 1119499 9732813 10910672 4292059
2787D292059o448478J68123L246640j892743q700775r228036l956728J613464
$$ 4292059 -2156419 -1988296 1258344 -634399 -9335174 -18563210 -22519938 -20906474
2779b0906474N139711P448414P931077N344605J628782K47936J357393K308848
$$ -20906474 -15766763 -8318349 -387272 4957333 6586115 6834051 8191444 10500292
2771A0500292K180121K146370K002678K23947k480750l265783j265776J350681
$$ 10500292 12680413 14826783 16829461 17053408 14572658 11306875 10041099 11391780
2763A1391780K609353K027760j113353o872995j1447274r333648q25250O417849
$$ 11391780 14001133 16028893 14915540 8042545 -3404729 -12738377 -13563627 -7145778
2755g145778O302864J980627J120483N473615R126328O703255k37773n803066
$$ -7145778 -842914 1137713 2258196 7731811 16858139 23561394 23323621 17520555
2747A7520555o460177m015888k832360m592008n947432k602823L813730N697471
$$ 17520555 11060378 7044490 4212130 -379878 -6327310 -8930133 -5116403 581068
2739E81068j055042r901692j0603061k496093M823694N066741L064388N350246
$$ 581068 -473974 -10375666 -20978727 -23474820 -18651126 -13584385 -10519997 -5169751
2731e169751R030921O989645N55642j837972J701443L250367j999660p919890
$$ -5169751 3861170 10850815 11406457 9568485 11269928 14520295 12520635 4600745
2723D600745p683643m717151o061917j0004520r395648m505282k468879m077483
$$ 4600745 -3082898 -7800049 -13861966 -23866486 -33262134 -37767416 -40236295 -44313778
2715d4313778j718545O547932J0882902L817622p271790r878725l345382K566815
$$ -44313778 -46032323 -39484391 -28601489 -24783867 -32055657 -41934382 -45279764 -42712949
2707d2712949K867511J716688K391877K346239M68580J273626P491755J3912978
$$ -42712949 -39845438 -38128750 -35736873 -33390634 -32922054 -31648428 -24156673 -10243695
2699a0243695J3437916O120929j718929n061761l481363J102267O346386R819332
$$ -10243695 3194221 9315150 7596221 2534460 -946903 155364 6501750 16321082
2691A6321082J0004941O995565J486540n397973j0456065r376172j890215N907893
$$ 16321082 26326023 33321588 34808128 29410155 18954090 9577918 7687703 13595596
2683A3595596P343359K412163l139476n064234m152452k747690p81327L085845
$$ 13595596 20938955 23351118 20211642 15147408 10994956 8247266 7465939 10551784
2675A0551784P581213Q195879J956860p233655j0491535l725112N995047P828210
$$ 10551784 18132997 26328876 28285736 21052081 10560546 6835434 12830481 20658691
2667B0658691N54266o455491o532951l732629m258724o160266l761422K006334
$$ 20658691 21212957 14757466 8224515 4491886 233162 -5927104 -9688526 -7682192
2659g682192N238467M732327M314310M492311J955780j974881q84930N828257
$$ -7682192 -2443725 2288602 6602912 11095223 13051003 11076122 10191192 16019449
2651A6019449R108189K100176r669967j5292103j1837099n652243l009248m349473
$$ 16019449 25127638 27227814 17557847 2265744 -9571355 -15223598 -18232846 -22582319
2643b2582319o393965n867073j633771M209304P986072Q491436P711204O794747
$$ -22582319 -28976284 -34843357 -36477128 -32267824 -24281752 -15790316 -8079112 -1284365
2635a284365M571735J372236k5569L46937j722849p241134j0361497o974934j935424
$$ -1284365 3287370 4659606 4634037 4980974 3258125 -3983009 -14344506 -21319440 -23254864
2626b3254864j417397k667164N95476O026190N691887J27150j107887N374806
$$ -23254864 -24672261 -27339425 -26743949 -20717759 -15025872 -14898722 -16006609 -10631803
2618a0631803J0776055P395085m9745k046895K269528N259938J488047o311551
$$ -10631803 144252 7539337 7489592 5442697 7712225 12972163 14460210 8148659
2610H148659j0753638p130388J332835N460835L93016p090444o757913M68034
$$ 8148659 -2604979 -9735367 -8402532 -2941697 -2548681 -9639125 -16397038 -15929004
2602a5929004L978292K37139k058162K447962N716407k55105q807100p996069
$$ -15929004 -11950712 -11713573 -13771735 -11323773 -5607366 -5862471 -14669571 -22665640
2594b2665640J299221P917320P343808M527779J750446m059930j1127381j1598902
$$ -22665640 -21366419 -13449099 -6105291 -1577512 172934 -3886996 -15014377 -26613279
2586b6613279l813908L820699N233393M530219O933102R731989Q107526L847088
$$ -26613279 -30427187 -26606488 -21373095 -16842876 -9909774 -177785 7929741 11776829
2578A1776829J996830L000001L596419K354591j2677k655774l428950J86146N307615
$$ 11776829 13773659 16773660 20370079 22724670 22711993 20056219 16627269 16813415 22121030
2569B2121030L885716o138181j4907131j2654528l563527N04540k536281l368509
$$ 22121030 26006746 19868565 4961434 -7693094 -11256621 -10752081 -13288362 -16656871
2561a6656871K905356R120192P577110J303782j531291R07812M084299N218109
$$ -16656871 -13751515 -4631323 2945787 4249569 2718278 3626090 7710389 12928498
2553A2928498N533133N680420M239887J100092j787049l892271o821764j0148797
$$ 12928498 18461631 24142051 28381938 29482030 27694981 23802710 16980946 6832149
2545F832149r941788m281539K006398J985559m436610r917898q867446l638940
$$ 6832149 -3109639 -7391178 -5384780 -3399221 -7835831 -17753729 -26621175 -30260115
2537c0260115M35814K686916N976164J0108332J1245861P785589K625462r78128
$$ -30260115 -29824301 -27137385 -21161221 -11052889 192972 7978561 10604023 9625895
2529I625895k136952o02085L297196N966082K691419n241180j0064711p024726
$$ 9625895 7488943 6886858 10184054 16150136 18841555 13600375 3535664 -3489062
2521c489062j40526M482180O145651O264512L083248l914642q709116n741857
$$ -3489062 -3629588 852592 6998243 13262755 16346003 12431361 3722245 -2019612
2513b019612O05808J972297n83523J040936O711750O605337k285605r599567p261624
$$ -2019612 -1413804 558493 -25030 1015906 7727656 14332993 12047388 2447821 -4813803
2504d813803j339484j37754K07762O908607J4047821R152156n711106j3866423
$$ -4813803 -6153287 -6291041 -6083279 825328 14873149 24025305 18314199 4447776
2496D447776p557054J419726L75327o120844n769560J810485O316609L955425
$$ 4447776 -3109278 -1689552 -1314225 -7435069 -13204629 -11394144 -5077535 -1122110
2488a122110J721096M054347N785671K364311j131907K173916Q959319R103267
$$ -1122110 598986 4653333 10439004 12803315 11671408 13845324 22804643 31907910
2480C1907910j50842j0073387j1618006n586391O63110K550046P77050k704610
$$ 31907910 31757068 21683681 10065675 4479284 5142394 7692440 8469490 5764880
2472E764880o468742p776537l570455M824480J0877246R276494J927100m428959
$$ 5764880 -703862 -8480399 -12050854 -7226374 3650872 12927366 14854466 10425507
2464A0425507n639025l290310j204879j099433j893459j457672J516190O076611
$$ 10425507 4786482 1496172 291293 -808140 -2701599 -4159271 -2643081 3433530
2456C433530R043932P722719K955581j719748m108586m905395m883349l002262
$$ 3433530 12477462 20200181 23155762 21436014 17327428 12422033 7538684 4536422
2448D536422R37840L694754J507200m673321r258064p909463k008357L056221
$$ 4536422 5474262 9169016 10676216 6002895 -3255169 -11164632 -13172989 -10116768
2440a0116768L019860j758794o689668o856893j732078M130742O212225N075635
$$ -10116768 -7096908 -8855702 -15545370 -22402263 -24134341 -20003599 -13791374 -8715739
2432h715739M418846N104516M521198J943619K85891Q82437Q17927j442400j879564
$$ -8715739 -4296893 807623 5328821 7272440 7558331 8440768 9258695 7816295 5936731
2423E936731K640071O755302K248130r180147j5866004j0969715j234714K641404
$$ 5936731 8576802 15332104 17580234 8400087 -7465917 -18435632 -19670346 -17028942
2415a7028942n44287l587201k040525J510667L258049K979852K352278K119129
$$ -17028942 -17573229 -21160430 -23200955 -21690288 -18432239 -15452387 -13100109 -10980980
2407a0980980J967290R80901j927598n980960p594498m258354J289522M155653
$$ -10980980 -9013690 -8032789 -9960387 -15941347 -23535845 -27794199 -26504677 -22349024
2399b2349024L986720M229526M756569J153956o333546r134255p68124J2834981
$$ -22349024 -18362304 -14132778 -9376209 -8222253 -14555799 -23690054 -24458178 -11623197
2391a1623197J9406285J4855979N838366j162965o398998j1166276j2314039o861864
$$ -11623197 7783088 22639067 28477433 27314468 20915470 9749194 -2564845 -9426709
2383i426709J733050O639658N421969J346550j686430k313418r77593O01085j99300
$$ -9426709 -7693659 -1054001 4367968 5714518 4028088 1714670 737077 1338162 1138862
2374A138862l930723o939111n464717j513652o71570l581437m128545J685192
$$ 1138862 -2791861 -9730972 -15195689 -16709341 -17380911 -20962348 -25090893 -23405701
2366b3405701Q986793R899055M042509q43759J444502Q256218J1136937M896606
$$ -23405701 -14418908 -4519853 -477344 -1321103 123399 8379617 19516554 24413160
2358B4413160o623566j3567590r772062K85854O165783L659509q73279k62161
$$ 24413160 17789594 4222004 -5550058 -5264204 901579 4561088 3687809 3425648
2350C425648L435393L210188j401009l619764j38648M024596L743659J505828
$$ 3425648 6861041 10071229 8670220 5050456 4911808 8936404 12680063 14185891
2342A4185891K832338P248663Q473404K753977o541316j2996966j3623758j0597164
$$ 14185891 17018229 24266892 32740296 35494273 28952957 15955991 2332233 -8264931
2334h264931p698585o010914l556971J052164O109421R039809R569600Q649714
$$ -8264931 -15963516 -21974430 -25531401 -24479237 -18369816 -9330007 239593 8889307
2326H889307N721776M2133o213642r513412r046379o053910o22297O185751Q682641
$$ 8889307 14611083 14653216 8439574 -1073838 -10120217 -16174127 -16796424 -10610673 -1928032
2317a928032K157494p623235q689791Q83977R163592O914167k19842k181627P19347
$$ -1928032 229462 -7393773 -16083564 -15199587 -6035995 878172 658330 -1523297 -803950
2308h03950J998753J587321L739490O240864K969805m048787o038657j509705
$$ -803950 1194803 2782124 6521614 12762478 15732283 11683496 5644839 4135134
2300D135134J262333k323944o847712p049977n417661n176734l648637J715679
$$ 4135134 5397467 3073523 -3774189 -10824166 -16241827 -21418561 -25067198 -23351519
2292b3351519O866819O772824L071784O79153L57933k81606j368886j224349j58961
$$ -23351519 -16484700 -9711876 -6640092 -5960939 -5603006 -5884612 -7253498 -8477847 -8636808
2283h636808J82201m23622j621832l797788n806244m225254J828606P621348P855334
$$ -8636808 -8454607 -8878229 -10500061 -14297849 -20104093 -24329347 -22500741 -14879393 -7024059
2274g024059K810360l162583o753164o680746k661795L204811O580865N729408
$$ -7024059 -4213699 -7376282 -14129446 -20810192 -23471987 -20267176 -13686311 -7956903
2266g956903L837778L663251L116906j34636l099960j449840L281935N650513
$$ -7956903 -4119125 -455874 2661032 2526396 -573564 -2023404 1258531 6909044
2258F909044M009777J403094j65167j450394k452794j907193m48264j39187n42220
$$ 6909044 10918821 12321915 12156748 10706354 8253560 6346367 5898103 5758916 5216696
2249E216696P81687L233746K572238k984952q916005q949024k436888M487767
$$ 5216696 5998383 9232129 11804367 8819415 -96590 -9045614 -11482502 -6994735
2241f994735N468656J029144k337855j059365J64793m223949r896319o499672
$$ -6994735 -1526079 -496935 -2834790 -3894155 -3729362 -7953311 -17849630 -24349302
2233b4349302O464342J5744690J1206759j33611l914357K629415R649428R662627
$$ -24349302 -17884960 -2140270 9066489 8932878 5018521 7647936 17297364 26959991
2225B6959991M863245O8932l602972o559990q245688q745485q978445q497315
$$ 26959991 31823236 31892168 28289196 21729206 13483518 4738033 -4240412 -12737727
2217a2737727o236657l081336n83415J618993L820142L872975O75935k781373
$$ -12737727 -18974384 -22055720 -22639135 -21020142 -17200000 -13327025 -12651090 -15432463
2209a5432463m286173o532443j0745340j0923574k578926O930594P150049J060132
$$ -15432463 -19718636 -26251079 -36996419 -47919993 -50498919 -43568325 -36418276 -35358144
2201c5358144J072055R082271J3275090O807222k776689o749081o178410m535236
$$ -35358144 -34286089 -25203818 -11928728 -5121506 -7898195 -14647276 -20825686 -25360922
2193b5360922n14719N053718N407181j019047m632442J396373R198476P792857
$$ -25360922 -25875641 -20821923 -15414742 -16433789 -21066231 -19669858 -10471382 -2678525
2185b678525p3241l148815R81544M406246K299302j697019k823298o81390K116405
$$ -2678525 -2751766 -5900581 -4919037 -512791 1786511 89492 -2733806 -3415196 -1298791
2176a298791J853182l498710r322487o892091L892185J0615020M793694m326830
$$ -1298791 554391 -2944319 -12266806 -19158897 -15266712 -4651692 142002 -4184828
2168d184828k683956P294685J0913154L824233l408312l496396j414217k104163
$$ -4184828 -6868784 425901 11339055 15163288 11754976 8258580 6844363 4740200
2160D740200j842136K308746M682392M7640o732362p416329k088647K199749J497760
$$ 4740200 2898064 5206810 9889202 9936842 3204480 -4211849 -6300496 -4100747 -2602987
2151b602987j504629k356636K25690L457130L286046n55459l127993r55699J838987
$$ -2602987 -4107616 -6464252 -6238562 -2781432 504614 -50845 -3178838 -4134537 -2295550
2142b295550m19694m549629k349290M933342N849857m025899j3476375j0470258
$$ -2295550 -2715244 -7264873 -9614163 -4680821 1169036 -2856863 -16333238 -26803496
2134b6803496J681303J0226984R426077L422468k973778p825969q448085k563461
$$ -26803496 -25122193 -14895209 -5469132 -2046664 -5020442 -12846411 -21294496 -23857957
2126b3857957O349648J0904153Q070425J583440l837161o592060o629477m063426
$$ -23857957 -17508309 -6604156 1466269 3049709 -787452 -7379512 -14008989 -18072415
2118a8072415l09596K429796L611029M282689M766619M526516L792983K966337
$$ -18072415 -18382011 -15952215 -12341186 -8058497 -3291878 1234638 5027621 7993958
2110G993958J006331l042513p338341q548047n675735n94876M445183P493245
$$ 7993958 9000289 5957776 -1380565 -9928612 -15604347 -16199223 -11754040 -4260795
2102d260795O297336O43196m850313m231188K201727P069287M731453j619791
$$ -4260795 2036541 2679737 -2170576 -6401764 -4200037 2869250 7600703 5980912
2094E980912m533118k377314j010428m776076r463250p473227J381042Q461428
$$ 5980912 1447794 -929520 -1939948 -6716024 -16179274 -23652501 -22271459 -13810031
2086a3810031O930340K03419l213534p73535K551978K640985R23497k12632j687328
$$ -13810031 -6879691 -6676272 -9889806 -10663341 -8111363 -5470378 -4546881 -4759513 -6446841
2077f446841m516579o052622l369156J583523M105331L296121K901765N272620
$$ -6446841 -10963420 -17016042 -20385198 -18801675 -14696344 -11400223 -8498458 -3225838
2069c225838P571881N636675j06570m769137m953963k624789j695879k187300
$$ -3225838 4346043 9982718 9876148 5107011 153048 -2471741 -4167620 -6354920
2061f354920p44987K887219L871060p29638o154819n120614L029775J2252340
$$ -6354920 -7099907 -4212688 -341628 -1071266 -7226085 -12346699 -9316924 2935416
2053B935416J7143045J5968552Q392871l635078j3250318j3702455p184654k710070
$$ 2935416 20078461 36047013 44439884 40804806 27554488 13852033 6667379 3957309
2045C957309m063015o185338m899744k768943k393473j432500J448914K827192
$$ 3957309 -105706 -6291044 -11190788 -13959731 -16353204 -17785704 -16336790 -13509598
2037a3509598J727047L331272R265156J1457501L865684n929022o567853K98963
$$ -13509598 -11782551 -8451279 813877 12271378 16137062 10208040 3640187 3939150
2029C939150L681706N85614j798106j38065O48342j565847j788291J982870L984976
$$ 3939150 7620856 8206470 6408364 6270299 6918641 5352794 3564503 5547373 9532349
2020I532349O18665l068028k086729K86887j141853m598023n009234k401914m83761
$$ 9532349 10151014 7082986 4996257 5283144 4141291 -456732 -5465966 -7867880 -8351641
2011h351641L61096K753282O277921O913530K813115k623817m260156n83529M521169
$$ -8351641 -7990545 -5237263 1040658 7954188 10767303 8143486 3883330 3299801 7820970
2002G820970N429977J062846l525682l819818k097930k991963m857901k193515
$$ 7820970 13250947 14313793 10788111 6968293 4870363 1878400 -2979501 -5173016
1994e173016L731346M967231k29628l248229J467646O973530M760158j781965
$$ -5173016 -1441670 3525561 3295933 47704 1515350 8488880 13249038 11467073
1986A1467073l891249k371914n037349j1283659j1159290j825569N821989K350531
$$ 11467073 7575824 5203910 166561 -11117098 -22276388 -24101957 -18279968 -15929437
1978a5929437o457936q248511j269964N317910O153510O076377J0206530J4811087
$$ -15929437 -22387373 -30635884 -31905848 -26587938 -20434428 -14358051 -4151521 10659566
1970A0659566J2941047N148578j502468l989629o528627j1663852j4236282q837436
$$ 10659566 23600613 28749191 27246723 23257094 16728467 5064615 -9171667 -18009103
1962a8009103P74756N880778M627546L149307N086435O834283M858853J244732
$$ -18009103 -17234347 -11353569 -6726023 -3576716 1509719 8344002 13202855 14447587
1954A4447587j135910l206770n458135m465518J232340O170569M809651Q9932
$$ 14447587 13311677 10104907 4646772 181254 1413594 7584163 12393814 12483746
1946A2483746j101286J455957J997782j248411l820003k958435j318475j479925
$$ 12483746 11382460 12838417 14836199 13587788 9767785 6809350 5490875 4010950
1938D010950k271084k190224j805912j366427m58442r60436n159986r674970p410136
$$ 4010950 1739866 -450358 -2256270 -3622697 -4081139 -5041575 -10201561 -19876531 -27286667
1929b7286667J723301Q363917O281751J385944J961632N049207J293302q845777
$$ -27286667 -25563366 -17199449 -10917698 -9531754 -7570122 -2520915 -1227613 -10073390
1921a0073390j3555569o012380O146848J1754818R871337O920419N070486J177092
$$ -10073390 -23628959 -29641339 -23494491 -11739673 -1868336 5052083 10122569 11299661
1913A1299661m393634n913222j089238M385697M511866R43463p45662L14832J71414
$$ 11299661 6906027 992805 -96433 4289264 8801130 9744593 8998931 9313763 9485177
1904I485177k822169n450093m443413l46379L820532N028293J681395m179489
$$ 9485177 6663008 1212915 -3230498 -3576877 243655 5271948 6953343 2773854
1896B773854o608531j865615N165720N652747j144918o129204k896413L910377
$$ 2773854 -3834677 -5700292 -534572 5118175 3973257 -2155947 -5052360 -1141983
1888a141983O549643M593252J796357k113051q622419j2669978p021296N588018
$$ -1141983 5407660 10000912 11797269 9684218 1061799 -11608179 -18629475 -13041457
1880a3041457J3089895Q747892j701228r603729j2986080j3166709q791000O09514
$$ -13041457 48438 8796330 7095102 -2508627 -15494707 -28661416 -37452416 -36842902
1872c6842902R427280J1101563O841061L645046M184003L830759j408507q374523
$$ -36842902 -27415622 -16314059 -9472998 -5827952 -1643949 2186810 778303 -7596220
1864g596220j0505777n774125J542620O208981P069917O377064N826813N196865
$$ -7596220 -18101997 -23876122 -22333502 -16124521 -9054604 -2677540 3149273 8346138
1856H346138M569091N168447O525420N283023l09366o442082q012694n874342
$$ 8346138 12915229 18083676 24609096 29892119 29582753 23140671 15127977 9253635
1848I253635n308320p299449o769038j339279L539215K184503k579719l512553
$$ 9253635 3945315 -3354134 -10123172 -11462451 -7923236 -5738733 -8318452 -11831005
1840a1831005K71753K276560j432615o215567n055676K123477Q242960P435927
$$ -11831005 -11559252 -9282692 -10715307 -16930874 -21986550 -19863073 -11620113 -4184186
1832d184186J317418l792738m436622k880341k393968k218263N51841N454427
$$ -4184186 -2866768 -6659506 -11096128 -13976469 -16370437 -18588700 -18036859 -12582432
1824a2582432Q207850O006101P12402l847083n602963m596512j654630K297933
$$ -12582432 -4374582 1631519 2343921 -1503162 -7106125 -11702637 -13357267 -11059334
1816a1059334O584912J0277010J0620699M424931n932226j0862615l999737P033212
$$ -11059334 -4474422 5802588 16423287 20848218 14915992 4053377 53640 7086852
1808G086852Q126547k077897r218595l179908P701301R173516P25440o365895
$$ 7086852 15213399 13135502 3916907 736999 8438300 17611816 18337256 11971361
1800A1971361o206049l381703k276866j092950J888745L825015K078876j650038
$$ 11971361 5765312 2383609 106743 -986207 902538 4727553 6806429 5156391
1792E156391m307124m757453k766081J504635N816959P083379N129495K347453
$$ 5156391 849267 -3908186 -6674267 -5169632 647327 7730706 12860201 15207654
1784A5207654j89551k741092l707216j106452K621838K135138l542285r297954
$$ 15207654 15018103 12277011 8569795 7463343 10085181 12220319 8678034 -619920
1776f19920j0071041n113889L198517J0048844Q786129k389386j4094253j3648848
$$ -619920 -10690961 -15804850 -12606333 -2557489 6228640 3839254 -10254999 -23903847
1768b3903847j156337R527844Q383578L00327m743238m411071j565441L282653
$$ -23903847 -25060184 -15532340 -7148762 -6848435 -11591673 -16002744 -17568185 -14285532
1760a4285532R575701J2249776P671857N62625k105068j063082j778688m607113
$$ -14285532 -4709831 7539945 15211802 15774427 13669359 12606277 10827589 6220476
1752F220476n421732l896881l407431l824979k009241R14519K78121l583239m588906
$$ 6220476 798744 -3098137 -6505568 -10330547 -12339788 -11425269 -11147148 -14730387 -19319293
1743a9319293k28801M453914M120062m29425m502446m239469J141453P653907
$$ -19319293 -19548094 -15094180 -10974118 -11403543 -15905989 -20145458 -19004005 -11350098
1735a1350098P972624q6121p699182m570233O220262J1074739M156445o276353
$$ -11350098 -3377474 -3463595 -11162777 -15733010 -9512748 1561991 5718436 -557917
1727e57917j1578104j2452584j1019706m282226O875242J1900347M409164m939057
$$ -557917 -12136021 -24588605 -35608311 -39890537 -33015295 -21114948 -16705784 -21644841
1719b1644841j223314J2988973K0713007J3867565J686384m782855n036480l067983
$$ -21644841 -22868155 -9879182 10833825 24701390 26387774 21604919 16568439 13500456
1711A3500456L52719M040473L552017j728280n198323k852682m07392l665949
$$ 13500456 13853175 17893648 21445665 19717385 14519062 11666380 11258988 7593039
1703G593039p408901k898656O987043J0343000L553628l864523l818368P0839
$$ 7593039 184138 -2714518 4272525 14615525 18169153 14304630 10486262 10557101
1695A0557101J062425J98081J881488M284664K435927j948977k157706K409525
$$ 10557101 11619526 11817607 13699095 17983759 20419686 18470709 16313003 18722528
1687A8722528M747627J369601k220769l63068M291252N334963J275402m580929
$$ 18722528 23470155 24839756 22618987 22255919 26547171 31882134 33157536 28576607
1679B8576607r246784j0772597p367506p06878K950946L76869k668113O82483
$$ 28576607 19329823 8557226 1189720 482842 3433788 3810657 1142544 1825027
1671A825027O926111O245904k779482j0762331j0728635n753301j359475J688745
$$ 1825027 8751138 14997042 12217560 1455229 -9273406 -15026707 -16386182 -14697437
$$ [...]
##END NTUPLES=NMR SPECTRUM
##END=
