##TITLE=31Pdec_DE-80W
 D2O, 64 sc
 23.1.2025
##JCAMPDX= 6.0         $$ Bruker NMR JCAMP-DX V2.0
##DATA TYPE= NMR SPECTRUM
##DATA CLASS= NTUPLES
##ORIGIN= UXNMR, Bruker Analytische Messtechnik GmbH
##OWNER= root
$$ XWIN-NMR		Version 3.5
$$ Thu Jan 23 14:09:45 2025 Russian Standard Time (UT+4h)  she@DPX200
##.OBSERVE FREQUENCY= 81.013821
##.OBSERVE NUCLEUS= ^31P
##.ACQUISITION MODE= SIMULTANEOUS
##.ACQUISITION SCHEME= undefined
##.AVERAGES= 64
##.DIGITISER RES= 17
##SPECTROMETER/DATA SYSTEM= spect
##.PULSE SEQUENCE= zgpg30
##.SOLVENT NAME= CDCl3
##.SHIFT REFERENCE= (INTERNAL, CDCl3, 0, 198.062)
##AUDIT TRAIL= $$ (NUMBER, WHEN, WHO, WHERE, WHAT)
$$ ##TITLE= Audit trail, XWIN-NMR		Version 3.5
$$ ##JCAMPDX= 5.01
$$ ##ORIGIN= Bruker BioSpin GmbH
$$ ##OWNER= she
$$ F:/spectra/data/she/nmr/P31/2/pdata/1/auditp.txt
$$ ##AUDIT TRAIL=  $$ (NUMBER, WHEN, WHO, WHERE, WHAT)
(   1,<2025-01-23 14:08:43.65 +0400>,<she>,<DPX200>,
      <created by zg, POWCHK disabled, PULCHK disabled
       configuration hash MD5:
       00 E9 B6 7A A2 85 ED C7 34 08 36 98 17 FE 4E 26
       data hash MD5: 32K
       1B BF 9D 96 3E 46 42 A3 09 5E FE 15 F4 81 23 43>)
(   2,<2025-01-23 14:08:46.12 +0400>,<she>,<DPX200>,
      <Start of raw data processing
       efp BC_mod = 2 LB = 1.5 FT_mod = 6 PKNL = 1 PHC0 = 2011.825 PHC1 = 117.0871 SI = 64K 
       data hash MD5: 64K
       B5 21 BF D6 97 1A 65 C8 60 28 37 E4 ED 2E D7 0E>)
(   3,<2025-01-23 14:09:12.90 +0400>,<she>,<DPX200>,
      <pk PHC0 = 86.88112 PHC1 = -21 
       data hash MD5: 64K
       35 A8 D8 2A F5 C1 CD 16 0B 33 CC FC 75 75 06 A8>)
(   4,<2025-01-23 14:09:21.31 +0400>,<she>,<DPX200>,
      <abs ABSG = 5 
       data hash MD5: 64K
       DB 4D 64 CB 8F 8B EA 52 7C BC 63 D4 E5 54 64 E2>)
$$ ##END=
$$ 
$$ hash MD5
$$ CC F8 FA 05 6A 9D D1 18 34 41 DB 15 4A 44 A4 D0
##$RELAX= 
##$RELAX= 
##$RELAX= 
##$RELAX= 
##$RELAX= 
##$RELAX= 
##$RELAX= 
##$RELAX= 
$$ Bruker specific parameters
$$ --------------------------
##$DU= <F:/spectra>
##$EXPNO= 2
##$NAME= <P31>
##$PROCNO= 1
##$TYPE= <nmr>
##$USER= <she>
##$AMP= (0..31)
100 100 100 100 100 100 100 100 100 100 100 100 100 100 100 100 100 100 
100 100 100 100 100 100 100 100 100 100 100 100 100 100 
##$AQSEQ= 0
##$AQ_mod= 1
##$AUNM= <au_zg>
##$AUTOPOS= <>
##$BF1= 81.014009
##$BF2= 200.13
##$BF3= 200.13
##$BF4= 200.13
##$BF5= 200.13
##$BF6= 200.13
##$BF7= 200.13
##$BF8= 200.13
##$BYTORDA= 1
##$CFDGTYP= 0
##$CFRGTYP= 5
##$CHEMSTR= <none>
##$CNST= (0..31)
1 1 145 1 1 1 1 1 1 1 1 1 1 1 1 1 1 1 1 1 1 1 1 1 1 1 1 1 1 1 1 1 
##$CPDPRG= <waltz16>
##$CPDPRG1= <>
##$CPDPRG2= <waltz16>
##$CPDPRG3= <>
##$CPDPRG4= <mlev>
##$CPDPRG5= <mlev>
##$CPDPRG6= <mlev>
##$CPDPRG7= <mlev>
##$CPDPRG8= <mlev>
##$CPDPRGB= <>
##$CPDPRGT= <>
##$D= (0..31)
0 1 0 0 0 0 0 0 0 0.06 0 0.03 2e-05 3e-06 0 0 0.0002 0 0 0 0 0 0 0 0 0 
0 0 0 0 0 0 
##$DATE= 1737626923
##$DBL= (0..7)
120 120 120 11 120 120 24 19 
##$DBP= (0..7)
150 150 150 150 150 150 150 150 
##$DBP07= 0
##$DBPNAM0= <>
##$DBPNAM1= <>
##$DBPNAM2= <>
$$ [...]
##$SUBNAM3= <"">
##$SUBNAM4= <"">
##$SUBNAM5= <"">
##$SUBNAM6= <"">
##$SUBNAM7= <"">
##$SUBNAM8= <"">
##$SUBNAM9= <"">
##$SW= 400.765351723535
##$SWIBOX= (0..15)
0 1 3 0 0 0 0 0 0 0 0 0 0 0 0 0 
##$SW_h= 32467.5324675325
##$TD= 32768
##$TD0= 1
##$TE= 0
##$TE2= 300
##$TE3= 300
##$TEG= 300
##$TL= (0..7)
0 120 53 12 22 120 120 120 
##$TP= (0..7)
150 150 150 150 150 150 150 150 
##$TP07= 0
##$TPNAME0= <>
##$TPNAME1= <>
##$TPNAME2= <>
##$TPNAME3= <>
##$TPNAME4= <>
##$TPNAME5= <>
##$TPNAME6= <>
##$TPNAME7= <>
##$TPOAL= (0..7)
0.5 0.5 0.5 0.5 0.5 0.5 0.5 0.5 
##$TPOFFS= (0..7)
0 0 0 0 0 0 0 0 
##$TUNHIN= 0
##$TUNHOUT= 0
##$TUNXOUT= 0
##$USERA1= <user>
##$USERA2= <user>
##$USERA3= <user>
##$USERA4= <user>
##$USERA5= <user>
##$V9= 5
##$VALIST= <valist>
##$VCLIST= <CCCCCCCCCCCCCCC>
##$VD= 0
##$VDLIST= <DDDDDDDDDDDDDDD>
##$VPLIST= <PPPPPPPPPPPPPPP>
##$VTLIST= <TTTTTTTTTTTTTTT>
##$WBST= 1024
##$WBSW= 4
##$XGAIN= (0..3)
0 0 0 0 
##$XL= 0
##$YL= 0
##$YMAX_a= 13587
##$YMIN_a= -11795
##$ZGOPTNS= <>
##$ZL1= 120
##$ZL2= 120
##$ZL3= 120
##$ZL4= 120
##$ABSF1= 198.0616
##$ABSF2= -202.7028
##$ABSG= 5
##$ABSL= 3
##$ALPHA= 0
##$AQORDER= 0
##$ASSFAC= 0
##$ASSFACI= 0
##$ASSFACX= 0
##$ASSWID= 0
##$AUNMP= <proc_1d>
##$AZFE= 0.1
##$AZFW= 0.5
##$BCFW= 0
##$BC_mod= 2
##$BYTORDP= 0
##$COROFFS= 0
##$CY= -3
##$DATMOD= 1
##$DC= 0
##$DFILT= <>
##$DTYPP= 0
##$F1P= 0
##$F2P= 0
##$FCOR= 1
##$FTSIZE= 65536
##$FT_mod= 6
##$GAMMA= 0
##$GB= 0
##$INTBC= 1
##$INTSCL= 9.790993e-09
##$ISEN= 30
##$LB= 1.5
##$LEV0= 0
##$LPBIN= 0
##$MAXI= 10000
##$MC2= 0
##$MEAN= 0
##$ME_mod= 0
##$MI= 50
##$NCOEF= 0
##$NC_proc= -8
##$NLEV= 6
##$NOISF1= 182.463
##$NOISF2= 159.3651
##$NSP= 0
##$NTH_PI= 0
##$NZP= 0
##$OFFSET= 198.0616
##$PC= 4
##$PHC0= 2098.706
##$PHC1= 96.0871
##$PH_mod= 1
##$PKNL= yes
##$PPARMOD= 0
##$PSCAL= 0
##$PSIGN= 0
##$REVERSE= no
##$SF= 81.0140089999434
##$SI= 65536
##$SIGF1= 159.3651
##$SIGF2= -187.1042
##$SINO= 113.3802
##$SIOLD= 16384
##$SREGLST= <1H.CDCl3>
##$SSB= 0
##$STSI= 65536
##$STSR= 0
##$SW_p= 32467.5324675325
##$SYMM= 0
##$S_DEV= 0
##$TDeff= 32768
##$TDoff= 0
##$TI= <>
##$TILT= no
##$TM1= 0
##$TM2= 0
##$TOPLEV= 0
##$USERP1= <user>
##$USERP2= <user>
##$USERP3= <user>
##$USERP4= <user>
##$USERP5= <user>
##$WDW= 1
##$XDIM= 65536
##$YMAX_p= 412801206
##$YMIN_p= -72874344
$$ End of Bruker specific parameters
$$ ---------------------------------
##NTUPLES= NMR SPECTRUM
##VAR_NAME=  FREQUENCY,     SPECTRUM/REAL,   SPECTRUM/IMAG
##SYMBOL=    X,             R,               I
##VAR_TYPE=  INDEPENDENT,   DEPENDENT,       DEPENDENT
##VAR_FORM=  AFFN,          ASDF,            ASDF
##VAR_DIM=   65536,         65536,           65536
##UNITS=     HZ,            ARBITRARY UNITS, ARBITRARY UNITS
##FACTOR=    0.49542278885378, 1,            1
##FIRST=     16045.7642231865, 0,            0
##LAST=      -16421.768244346, 0,            0
##MIN=       -16421.768244346, -72874344,    0
##MAX=       16045.7642231865, 412801206,    0
$$ Real data points
##PAGE= N=1
##DATA TABLE= (X++(R..R)), XYDATA
$$ [...]
$$ plain form
42853 -757657 128832 -1424582 -4716362 -6560768 -6379382 -6682964 -8021148 -7897362 -5636704
42844 -5636704 -4049129 -4902903 -6643236 -7989196 -9873383 -12087044 -11864693 -8131220
42836 -8131220 -3928663 -2306189 -2704783 -3584110 -5504463 -8858121 -11315355 -10746113 -8712480
42827 -8712480 -8011032 -8336487 -7394512 -5152610 -4024596 -5319390 -7808951 -9438792 -8774018
42818 -8774018 -5579903 -1736423 -662595 -3875411 -8677867 -10879931 -9262456 -6096053
42810 -6096053 -4151029 -4490354 -6165257 -6798907 -4680277 -1482551 -1209061 -4896988 -8422865
42801 -8422865 -7792196 -4606930 -3392301 -5161939 -7128434 -7787957 -8414114 -9552140 -9743991
42792 -9743991 -8523250 -7548618 -7579072 -6914095 -4289587 -1312524 -379916 -1363274 -1737919
$$ packed form
42853g57657Q86489j553414l291780j844406J81386l03582j338184J23786K260658
42844e636704J587575q53774j740333j345960j884187k213661K22351L733473
42836h131220M202557J622474l98594q79327j920353l353658k457234N69242K033633
42827h712480P01448l25455R41975K241902J128014j294794k489561j629841O64774
42818h774018L194115L843480J073828l212816m802456k202064J617475L166403
42810f096053J945024l39325j674903o33650K118630L197726K73490l687927l525877
42801h422865O30669L185266J214629j769638j966495o59523o26157j138026j91851
42792i743991J220741R74632l0454O64977K624508K977063R32608r83358l74645
$$ plain form
42783 -1737919 445236 4395138 7216979 6805935 4336833 3054097 3980158 4246183 1062363
42774 1062363 -4140106 -7526383 -7543472 -5536762 -3009344 -1046033 -1324205 -4350991 -7272741
42765 -7272741 -6835348 -4156413 -3050489 -4028623 -4086513 -2475555 -2027306 -3898766 -5687610
42756 -5687610 -6177296 -7213797 -8949519 -8200937 -4337623 -1913542 -3710031 -5684619
42748 -5684619 -3419903 393509 341585 -2954609 -4457276 -3046947 -1978355 -1928612 109130
42739 109130 4585215 7702956 7262246 5554014 4989893 4878024 4029307 2989235 2181671
42730 2181671 914326 -614578 -1277454 -1745754 -3984973 -7302044 -8560424 -7291235
42722 -7291235 -6562545 -7370163 -6564618 -2618875 839393 367902 -2150890 -3206445 -3120551
$$ packed form
42783a737919K183155L949902K821841m11044k469102j282736R26061K66025l183820
42774A062363n202469l386277j7089K006710K527418J963311k78172l026786k921750
42765g272741M37393K678935J105924r78134n7890J610958M48249j871460j788844
42756e687610m89686j036501j735722P48582L863314K424081j796489j974588
42748e684619K264716L813412n1924l296194j502667J410329J068592M9743K037742
42739A09130M476085L117741m40710j708232n64121j11869q48717j040072q07564
42730B181671j267345j528904o62876m68300k239219l317071j258380J269189
42722g291235P28690q07618Q05545L945743L458268m71491k518792j055555Q5894
$$ plain form
42713 -3120551 -3813486 -4010228 -1274527 3106562 5858842 7049077 9160674 11724204
42705 11724204 11707080 9400231 9286609 13788570 19767751 22758092 21828087 18792243 15090024
42696 15090024 11162594 7257401 3418986 -334724 -3231032 -4271524 -3775939 -3114212
42688 -3114212 -2930172 -3108516 -4165747 -6639913 -9273467 -10160041 -9741625 -10091596 -11047259
42679 -11047259 -10092319 -6771687 -3929562 -3193105 -2533865 -390267 965687 -882095
42671 -882095 -3997954 -4777808 -3336877 -2449292 -2209113 81787 4560180 7203824 4893433
42662 4893433 -639675 -5321291 -7137741 -6756128 -5591062 -4852185 -5364667 -6871702 -8062339
42653 -8062339 -8172451 -7966232 -8470542 -9412004 -9543089 -7914781 -4390979 271862 4281782
$$ packed form
42713c120551o92935j96742K735701M381089K752280J190235K111597K563530
42705A1724204j7124k306849j13622M501961N979181K990341r30005l035844l702219
42696A5090024l927430l905193l838415l753710k896308j040492M95585O61727
42688c114212J84040j78344j057231k474166k633554q86574M18416l49971r55663
42679a1047259R54940L320632K842125P36457O59240K143598J355954j847782
42671h82095l115859p79854J440931Q87585K40179K290900M478393K643644k310391
42662D893433n533108m681616j816450L81613J165066P38877n12482j507035j190637
42653h062339j10112K06219n04310r41462j31085J628308L523802M662841M009920
$$ plain form
42644 4281782 5652169 4092435 1545458 91917 -273888 -1195459 -3774084 -7447172
42636 -7447172 -10580141 -11589191 -9995735 -7097760 -5219755 -5541921 -6827584 -6807825 -4594519
42627 -4594519 -1345512 1064516 1669246 1261269 1965626 5123294 9091937 10303502 7397683
42618 7397683 2976424 -64201 -2324787 -5811518 -9573269 -10893883 -10341996 -11404582
42610 -11404582 -14134393 -13527492 -6793939 1449966 4968252 4182028 4259875 6713775 8054644
42601 8054644 6531348 4951744 5537043 6504181 5866976 4814003 4726232 4130746 1683459
42592 1683459 -493388 140630 2117421 2021761 -423751 -2659058 -3509996 -3669583 -2818825
42583 -2818825 24926 3474544 4615670 3147259 1586103 1197273 894015 298784 338254
$$ packed form
42644D281782J370387j559734k546977j453541l65805r21571k578625l673088
42636g447172l132969j009050J593456K897975J878005l22166j285663J9759K213306
42627d594519L249007K410028O04730m07977P04357L157668L968643J211565k905819
42618G397683m421259l040625k260586l486731l761751j320614N51887j062586
42610a1404582k729811O06901O733553Q243905L518286p86224P7847K453900J340869
42601H054644j523296j579604N85299R67138o37205j052973q7771n95486k447287
42592A683459k176847O34018J976791r5660k445512k235307q50938j59587Q50758
42583b818825K843751L449618J141126j468411j561156l88830l03258n95231L9470
$$ plain form
42574 338254 393970 -1217477 -3103512 -1518622 3134443 5156198 1699960 -2279430 -1086196
42565 -1086196 3466313 5671209 4865199 5007935 6841095 6619749 2953721 -578498 -1057334
42556 -1057334 20063 301633 -82219 -736515 -2873441 -6395126 -8132506 -5910145 -2164480
42547 -2164480 -762586 -2041948 -3663429 -4644395 -5502268 -5626482 -3832845 -1183181 -265361
42538 -265361 -1511207 -2802860 -3059386 -3725714 -5976994 -8714257 -10511548 -11717422 -13123675
42529 -13123675 -13840436 -12212306 -8331067 -4185079 -1345272 381037 1732765 2326278
42521 2326278 1009235 -2172964 -5082800 -5279525 -2694279 211289 1288951 931447
42513 931447 774466 1019243 475864 -925010 -1386757 228745 2342370 2350709 -113714
$$ packed form
42574C38254N5716j611447j886035J584890M653065K021755l456238l979390J193234
42565a086196M552509K204896q06010J42736J833160k21346l666028l532219m78836
42556a057334J077397K81570l83852o54296k136926l521685j737380K222361L745665
42547b164480J401894j279362j621481r80966q57873j24214J793637K649664R17820
42538b65361j245846j291653k56526o66328k251280k737263j797291j205874j406253
42529a3123675p16761J628130L881239M145988K839807J726309J351728N93513
42521B326278j317043l182199k909836j96725K585246K905568J077662l57504
42513I31447j56981K44777n43379j400874m61747J615502K113625Q339k464423
$$ plain form
42504 -113714 -2796105 -3676047 -3140749 -2848216 -3207456 -2910765 -851936 2384463 5323061
42495 5323061 7190361 7992617 7506119 5388742 2474265 810477 1598163 3569308 4016566
42486 4016566 1185319 -4471757 -10593747 -14041871 -12861553 -8230408 -3801879 -2076111
42478 -2076111 -2113039 -1933420 -2002985 -4127885 -7395583 -8116507 -4681194 -78565 1966352
42469 1966352 1520450 1194199 1747993 1371555 -1012382 -3957228 -5488871 -5434009 -5118383
42460 -5118383 -5545619 -6272346 -5720225 -2804287 1222843 3188856 1374392 -2057565 -3500563
42451 -3500563 -2413107 -1415721 -1829146 -1658971 824042 3884744 4882361 4357299 4768533
42442 4768533 5987532 5313729 2305655 310784 1544017 3258277 1377327 -3669962
$$ packed form
42504a13714k682391q79942N35298K92533l59240K96691K058829L236399K938598
42495E323061J867300Q02256m86498k117377k914477j663788P87686J971145M47258
42486D016566k831247n657076o121990l448124J180318M631145M428529J725768
42478b076111l6928J79619o9565k124900l267698p20924L435313M602629K044917
42469A966352m45902l26251N53794l76438k383937k944846j531643N4862L15626
42460e118383m27236p26727N52121K915938M027130J966013j814464l431957j442998
42451c500563J087456R97386m13425J70175K483013L060702R97617n25062M11234
42442D768533J218999o73803l008074j994871J233233J714260j880950n047289
$$ plain form
42434 -3669962 -7687506 -8534465 -8003520 -7706950 -6516388 -3623100 -1180154 -1230241 -2021513
42425 -2021513 -698931 1409032 97847 -4812730 -7805669 -4741174 1436048 4729792
42417 4729792 3716957 2022628 2431239 4026886 5141601 5846875 6510145 6391221 5031215
42408 5031215 3143320 793046 -3502786 -10084336 -15901065 -17127509 -13635064 -9107625
42400 -9107625 -6776105 -6564605 -6666251 -6475209 -7021054 -9070065 -11730655 -13241222 -12835022
42391 -12835022 -11271313 -9410565 -7176831 -4789665 -3998986 -6091931 -8912221 -8460141
42383 -8460141 -4277132 -660582 -903393 -2823563 -2544927 -550046 -379011 -2478051 -3556518
42374 -3556518 -2276354 -1509176 -3545248 -6464741 -7307331 -6130885 -4574165 -2582193
$$ packed form
42434c669962m017544q46959N30945K96570J190562K893288K442946n0087p91272
42425b021513J322582K107963j311185m910577k992939L064495O177222L293744
42417D729792j012835j694329M08611J595647J114715P05274O63270j18924j360006
42408E031215j887895k350274m295832o581550n816729j226444L492445M527439
42400i107625K331520K11500j01646J91042n45845k049011k660590j510567M06200
42391a2835022J563709J860748K233734K387166P90679k092945k820290M52080
42383h460141M183009L616550k42811j920170K78636J994881J71035k099040j078467
42374c556518J280164P67178k036072k919493q42590J176446J556720J991972
$$ plain form
42366 -2582193 765279 4642543 7303040 8557131 9129263 8511798 5962628 2927620
42358 2927620 1717080 1954884 1037822 -1715644 -4110833 -4844808 -5430831 -7063088 -8029527
42349 -8029527 -6180648 -2191574 1711997 4884754 7771202 9217555 7079449 1739985
42341 1739985 -3325675 -5383074 -5160351 -4787711 -4591233 -3517252 -1845049 -1485019 -3271865
42332 -3271865 -5360612 -5219031 -2649149 30500 729007 -248720 -1110020 -1028575 -743338
42323 -743338 -676369 280588 2987015 5838003 6221761 4377348 3639458 5602397 7142734
42314 7142734 4761111 495490 -143229 3753674 6474220 3572279 -1651261 -2720535
42306 -2720535 1268061 5344287 6005986 4708581 3874905 3399773 2466622 1681310 1542602
$$ packed form
42366b582193L347472L877264K660497J254091N72132o17465k549170l035008
42358B927620j210540K37804r17062k753466k395189p33975n86023j632257r66439
42349h029527J848879L989074L903571L172757K886448J446353k138106n339464
42341A739985n065660k057399K22723L72640J96478J073981J672203L60030j786846
42332c271865k088747J41581K569882K679649O98507r77727q61300Q1445K85237
42323g43338O6969R56957K706427K850988L83758j844413p37890J962939J540337
42314G142734k381623m265621o38719L896903K720546k901941n223540j069274
42306b720535L988596M076226O61699j297405q33676m75132r33151p85312j38708
$$ plain form
42297 1542602 1114314 -18265 -494835 354390 690004 -1241578 -4353318 -6591896 -8020690
42288 -8020690 -9757720 -11169238 -10721886 -8797965 -7026244 -5238416 -1735210 3348655
42280 3348655 7360631 8277752 6627803 3893495 863649 -1814572 -3042520 -2131873
42272 -2131873 500671 3717768 6053766 6157177 4062881 1626615 335002 -743858
42264 -743858 -3130937 -5770635 -6099994 -4098735 -2590122 -3056826 -3735457 -2740105 -666304
42255 -666304 1111010 2516815 3649069 3502383 1639866 -205101 33629 2090173 3807354
42246 3807354 3569813 1499202 -844834 -1317331 1026333 4292492 5299193 3542572
42238 3542572 2014077 3094693 5428558 6264085 5198828 3825891 2986980 2236114 1105808
$$ packed form
42297A542602m28288j132579m76570Q49225L35614j931582l111740k238578j428794
42288h020690j737030j411518M47352J923921J771721J787828L503206N083865
42280C348655M011976R17121j649949k734308l029846k678221j227948R10647
42272b131873K632544L217097K335998J03411k094296k436266j291613j078860
42264g43858k387079k639698l29359K001259J508613m66704o78631R95352K073801
42255f66304J777314J405805J132254j46686j862517j844967K38730K056544J717181
42246C807354k37541k070611k344036m72497K343664L266159J006701j756621
42238C542572j528495J080616K333865Q35527j065257j372937q38911p50866j130306
$$ plain form
42229 1105808 -671924 -3247303 -5455002 -4639597 502845 7547442 12290149 12556649
42221 12556649 9218322 4736229 1942861 2649847 5559476 6732876 3930472 -667514
42213 -667514 -3660492 -4632193 -5044693 -4868723 -3334060 -1664976 -1710417 -2686752 -2649927
42204 -2649927 -2511556 -4807826 -8620430 -9718740 -6382987 -1420887 2475067 5671621
42196 5671621 8582262 9477220 7578480 5403542 5488277 6906503 7298161 6457935 5666231
42187 5666231 5022232 3639770 1470218 -619925 -1495269 332637 5246606 9673327
42179 9673327 7633472 -2082263 -12440638 -15119700 -9602869 -2342476 1635325 2505507
42171 2505507 1978324 583217 -520031 797161 3999409 4928427 1119323 -3880442
$$ packed form
42229A105808j777732k575379k207699Q15405N142442P044597M742707K66500
42221A2556649l338327m482093k793368P06986K909629J173400k802404m597986
42213f67514k992978r71701m12500J75970J534663J669084m5441r76335L6825
42204b649927J38371k296270l812604j098310L335753M962100L895954L196554
42196E671621K910641Q94958j898740k174938Q4735J418226L91658q40226p91704
42187E666231o43999j382462k169552k090143q75344J827906M913969M426721
42179I673327k039855r715735j0358375k679062N516831P260393L977801Q70182
42171B505507n27183j395107j103248J317192L202248R29018l809104m999765
$$ plain form
42163 -3880442 -4271404 946556 7292486 10729633 11476206 11254920 9406189 4118723 -3363234
42154 -3363234 -8450403 -8061290 -4168988 -1160144 -765332 -1391238 -1788569 -2860320 -5288148
42145 -5288148 -7634956 -8193828 -7141829 -5379117 -2683725 1069934 3994178 3954391 1974151
42136 1974151 1420727 3301138 4549209 2185041 -2425245 -5146118 -4184734 -1939403
42128 -1939403 -1668516 -3725300 -5863380 -6419776 -5982814 -6016412 -7089104 -8935523 -11032516
42119 -11032516 -12046493 -9870557 -4160356 1577927 2767483 -844010 -4647509 -4993230
42111 -4993230 -3531505 -4169305 -7427952 -10122565 -9841970 -7411973 -4875827 -2945775
42103 -2945775 -1080078 1024222 2670584 2652692 645578 -1668755 -1660663 1234521 4220333
$$ packed form
42163c880442l90962N217960O345930L437147P46573k21286j848731n287466p481957
42154c363234n087169L89113L892302L008844L94812o25906l97331j071751k427828
42145e288148k346808n58872J051999J762712K695392L753659K924244l9787j980240
42136A974151n53424J880411J248071k364168m610286k720873R61384K245331
42128a939403K70887k056784k138080n56396M36962l3598j072692j846419k096993
42119a1032516j013977K175936N710201N738283J189556l611493l803499l45721
42111d993230J461725o37800l258647k694613K80595K429997K536146J930052
42103b945775J865697K104300J646362j7892k007114k314333Q092K895184K985812
$$ plain form
42094 4220333 3904109 -15516 -4659293 -7045295 -6378986 -3885555 -1451648 -156950
42086 -156950 486838 1304636 1302252 -1549355 -6385597 -8573890 -5202643 151790 1350890
42077 1350890 -2248818 -5085695 -3030734 1564333 3682880 1872545 -1071290 -1937242
42069 -1937242 -26232 2705360 3392029 1038133 -1985263 -2465996 -609011 96289 -2128256
42060 -2128256 -4738026 -4646284 -2615321 -1853659 -3548570 -5906581 -6880405 -5893712 -3335985
42051 -3335985 -304814 1205374 -287263 -3644488 -5724969 -4801812 -2564034 -2076450
42043 -2076450 -4266340 -7164030 -8545844 -8543085 -8938629 -10139720 -10092340 -6983329 -2110932
42034 -2110932 1277398 1641421 262820 -1095167 -2025376 -2784907 -3392843 -3987212 -4746348
$$ packed form
42094D220333l16224l919625m643777k386002O66309K493431K433907J294698
42086a56950O43788Q17798k384k851607m836242k188293L371247N354433J199100
42077A350890l599708k836877K054961M595067K118547j810335k943835q65952
42069a937242J911010K731592O86669k353896l023396m80733J856985P05300k224545
42060b128256k609770R1742K030963P61662j694911k358011r73824R86693K557727
42051c335985L031171J510188j492637l357225k080481R23157K237778M87584
42043b076450k189890k897690j381814K759l95544j201091M7380L109011M872397
42034b110932L388330L64023j378601j357987r30209p59531o07936n94369p59136
$$ plain form
42025 -4746348 -4939051 -3425140 -692978 1036761 524734 -988597 -1761885 -1598344 -962956
42016 -962956 454178 2916951 5415720 6535523 5843692 3660919 607812 -1746119
42008 -1746119 -1260358 2326191 6399708 8251730 7872402 6852726 5819269 4384841
42000 4384841 2377146 -425673 -4467382 -8650702 -9904415 -6667518 -1568215 1645856
41992 1645856 2623372 3352309 3991645 3117798 1335221 772462 883360 -1313267 -5881463
41983 -5881463 -8647869 -7035159 -3996331 -3730266 -5935758 -6967018 -4958126 -1196050
41975 -1196050 2333264 4142607 2795973 -1975208 -7581246 -10186694 -8645680 -5459397
41967 -5459397 -3415669 -2622779 -1622889 -331895 -383239 -2434343 -4432284 -3874871 -1514616
$$ packed form
42025d746348j92703J513911K732162J729739n12027j513331p73288J63541O35388
42016i62956J417134K462773K498769J119803o91831k182773l053107k353931
42008a746119M85761L586549M073517J852022l79328j019676j033457j434428
42000D384841k007695k802819m041709m183320j253713L236897N099303L214071
41992A645856R77516P28937O39336q73847j782577n62759J10898k196627m568196
41983e881463k766406J612710L038828K66065k205492j031260K008892L762076
41975a196050L529314J809343j346634m771181n606038k605448J541014L186283
41967e459397K043728P92890R99890J290994n1344k051104j997941N57413K360255
$$ plain form
41958 -1514616 -1013231 -4064395 -7627944 -7922984 -5836738 -5497225 -7866363 -9146638 -6435513
41949 -6435513 -1829231 903035 1205912 1033103 1213115 1085677 494210 -315167 -1841671
41940 -1841671 -4006541 -4559609 -1530173 3056181 4710322 2141461 -946922 -445420
41932 -445420 3630030 7916920 9392693 7471047 3735642 431967 -1578905 -3671199
41924 -3671199 -7374664 -11582699 -13356231 -11701589 -8857414 -7317784 -7266636 -7678978 -8180160
41915 -8180160 -8647317 -8470904 -7532023 -6666800 -5976358 -4167771 -1087367 743632 -642481
41906 -642481 -3193233 -3419227 -1735478 -1869365 -4705555 -6394759 -4281082 -1606772 -3438218
41897 -3438218 -9725673 -15551920 -17469846 -16482282 -14789843 -12785982 -10343416 -8423905
$$ packed form
41958a514616N01385l051164l563549k95040K086246L39513k369138j280275K711125
41949f435513M606282K732266L02877j72809J80012j27438n91467q09377j526504
41940a841671k164870n53068L029436M586354J654141k568861l088383N01502
41932d45420M075450M286890J475773j921646l735405l303675k010872k092294
41924c671199l703465m208035j773532J654642K844175J539630N1148m12342n01182
41915h180160m67157J76413R38881Q65223O90442J808587L080404J830999j386113
41906f42481k550752k25994J683749j33887k836190j689204K113677K674310j831446
41897c438218o287455n826247j917926R87564J692439K003861K442566J919511
$$ plain form
41889 -8423905 -7528928 -6270048 -3516203 -887751 -1003745 -3690304 -5908207 -5511130 -3380128
41880 -3380128 -1496914 -443380 455500 1618482 2731969 3244490 2783780 1480208 121800
41871 121800 -514623 -564690 -580756 -83000 2271399 6542770 10555318 11979926 10783398
41862 10783398 8876148 7925301 8351328 9931199 12184899 14071102 14246829 12230856
41854 12230856 9130105 6791696 5940956 5254200 2896349 -711602 -2575655 -609121
41846 -609121 3324283 5426165 4556176 2782312 1513782 -211134 -2857061 -4678963
41838 -4678963 -4548890 -4007971 -4345097 -3925390 -1179627 1702160 1458417 -1082572 -2085773
41829 -2085773 -289064 2094699 3700410 5322008 6646756 5785415 3193147 2274154
$$ packed form
41889h423905Q94977J258880K753845K628452j15994k686559k217903L97077K131002
41880c380128J883214J053534Q98880J162982J113487N12521m60710j303572j358408
41871A21800o36423n0067j6066M97756K354399M271371M012548J424608j196528
41862A0783398j907250r50847M26027J579871K253700J886203J75727k015973
41854A2230856l100751k338409q50740o86756k357851l607951j864053J966534
41846f09121L933404K101882q69989j773864j268530j724916k645927j821902
41838d678963J30073N40919l37126M19707K745763K881787k43743k540989j003201
41829b085773J796709K383763J605711J621598J324748q61341k592268r18993
$$ plain form
41821 2274154 4427307 6923551 7584187 8082572 10083255 11408803 9469660 6121728
41813 6121728 5413644 7902850 10523537 11051349 9596975 6577251 2442567 -933780
41805 -933780 -1544735 4338 1228580 893459 -566206 -2744678 -4836600 -4624726 -1107543
41796 -1107543 2609690 2648872 268177 573677 5173033 10206630 12420902 12912542 13308038
41787 13308038 12422772 9164399 5250937 2330141 -541518 -3798979 -4904490 -2410609
41779 -2410609 236044 -1038292 -4837862 -6638385 -5728983 -5246912 -5994538 -5121564 -1516734
41770 -1516734 1997871 3356999 4304068 6617582 8395129 6832864 2721308 -557091
41762 -557091 -1465008 -1364478 -1598724 -1655790 -546773 1413019 2886531 3027190 2205894
$$ packed form
41821B274154K153153K496244O60636M98385K000683J325548j939143l347932
41813F121728p08084K489206K620687N27812j454374l019724m134684l376347
41805i33780o10955J549073J224242l35121j459665k178472k091922K11874L517183
41796a107543L717233L9182k380695L05500M599356N033597K214272M91640L95496
41787A3308038q85266l258373l913462k920796k871659l257461j105511K493881
41779b410609K646653j274336l799570j800523R09402M82071p47626Q72974L604830
41770a516734L514605J359128R47069K313514J777547j562265m111556l278399
41762e57091r07917J00530k34246n7066J109017J959792J473512J40659q21296
$$ plain form
41753 2205894 1290990 546592 -353225 -1250019 -1212447 146928 1705231 1930742 497645
41744 497645 -1776750 -3854628 -4648143 -3416213 -1159263 -383585 -1900613 -3192414 -2051909
41735 -2051909 -406322 -1519033 -4439559 -5154741 -3175382 -2548522 -5100417 -6955809
41727 -6955809 -4186317 1631267 6442319 9236361 11036336 10913881 7381711 2599528
41719 2599528 903777 3113359 5768247 6273713 5569606 5127157 4451050 2884407 1507864
41710 1507864 1700818 3294060 5151386 6266700 5701135 3092594 36428 -732370 1295346
41701 1295346 3201789 2058558 -1475491 -4127009 -3656685 -310268 4527447 9423839
41693 9423839 12673921 12616475 9248799 5043495 2987542 3340878 3165246 92494 -4047429
$$ packed form
41753B205894r14904p44398q99817q96794L7572J359375J558303K25511j433097
41744D97645k274395k077878p93515J231930K256950P75678j517028j291801J140505
41735b051909J645587j112711k920526p15182J979359O26860k551895j855392
41727f955809K769492N817584M811052K794042J799975j22455l532170m782183
41719B599528j695751K209582K654888N05466p04107m42449o76107j566643j376543
41710A507864J92954J593242J857326J115314n65565k608541l056166p68798K027716
41701A295346J906443j143231l534049k651518M70324L346417M837715M896392
41693I423839L250082n7446l367676m205304k055953L53336j75632l072752m139923
$$ plain form
41684 -4047429 -5119997 -2144740 1594040 3739482 6141461 10598882 14196406 12948906
41676 12948906 8505859 6333248 7427135 7113709 3378287 1111884 4946774 11946616
41668 11946616 15465935 13626748 9949851 7483905 6442161 6504653 7274876 6696794 2802414
41659 2802414 -2620100 -5266285 -3634200 -311830 2227738 4040159 5454894 5724557
41651 5724557 5139368 5565563 7275142 7678198 4881018 407005 -3133863 -4884779 -4644462
41642 -4644462 -1500113 3910780 7772819 6790146 2535389 -494049 -299437 1626976
41634 1626976 3638070 5031252 4250484 -326869 -6996004 -11208022 -10784117 -8196291
41626 -8196291 -6436253 -5313310 -3700605 -2724274 -3675529 -4507176 -2070617 2599199 4779979
$$ packed form
41684d047429j072568K975257L738780K145442K401979M457421L597524j247500
41676A2948906m443047k172611J093887l13426l735422k266403L834890O999842
41668A1946616L519319j839187l676897k465946j041744O2492P70223n78082l894380
41659B802414n422514k646185J632085L322370K539568J812421J414735K69663
41651E724557n85189M26195J709579M03056k797180m474013l540868j750916K40317
41642d644462L144349N410893L862039r82673m254757l029438J94612J926413
41634A626976K011094J393182p80768m577353o669135m212018M23905K587826
41626h196291J760038J122943J612705R76331r51255q31647K436559M669816K180780
$$ plain form
41617 4779979 2434009 -1059959 -1923777 -1044186 -1851843 -5014760 -7917926 -8619047 -7741943
41608 -7741943 -6510411 -5279266 -4513005 -5048606 -6278145 -5789038 -2334901 1953923 3925792
41599 3925792 3307849 2700130 4047855 6661452 8617767 8540947 5879938 1228235 -2876362
41590 -2876362 -3161660 770467 4805974 3943212 -2338679 -9355203 -12016681 -9595480
41582 -9595480 -5610100 -3838166 -4997074 -6945902 -7471527 -6577150 -6046465 -6997363 -8391224
41573 -8391224 -8348662 -6594959 -4813829 -4394629 -4600560 -3738760 -1862240 -1231317 -3525601
41564 -3525601 -7267706 -9065194 -7440807 -4454195 -3067822 -3747524 -4526106 -3909615 -2608544
41555 -2608544 -2355821 -3822979 -5870584 -6436580 -4433378 -1358495 -389184 -2680932 -5159240
$$ packed form
41617D779979k345970l493968q63818Q79591q07657l162917k903166p01121Q77104
41608g741943J231532J231145P66261n35601j229539M89107L454137M288824J971869
41599C925792o17943o07719J347725K613597J956315p6820k661009m651703m104597
41590b876362k85298L932127M035507q62762o281891p016524k661478K421201
41582i595480L985380J771934j158908j948828n25625Q94377N30685r50898j393861
41573h391224M2562J753703J781130M19200k05931Q61800J876520O30923k294284
41564c525601l742105j797488J624387K986612J386373o79702p78582O16491J301071
41555b608544K52723j467158k047605n65996K003202L074883R69311k291748k478308
$$ plain form
41546 -5159240 -3882305 533991 3266069 1643866 -1581263 -2905850 -3237330 -5472819
41538 -5472819 -8877487 -9786010 -7437693 -5221139 -5440837 -6342283 -5778946 -4724437 -4872895
41529 -4872895 -5044649 -2699296 2173771 7016617 9776791 10018412 7740501 3329245
41521 3329245 -1499302 -4660100 -5768332 -5907674 -5587227 -4501290 -3168573 -3059529 -4803753
41512 -4803753 -7619707 -10647964 -13449607 -15057130 -14172629 -10987597 -7687226 -6487525
41504 -6487525 -7716205 -9760546 -10068140 -6649979 -90269 6082172 8627539 8083733
41496 8083733 7287413 6862763 4960592 1719865 445728 2639987 5028298 4255686 2065832
41487 2065832 2357611 4614401 4146773 -1294668 -8465720 -12614720 -11849364 -7120951 -614573
$$ packed form
41546e159240J276935M416296K732078j622203l225129j324587l31480k235489
41538e472819l404668r08523K348317K216554k19698r01446N63337J054509j48458
41529d872895j71754K345353M873067M842846K760174K41621k277911m411256
41521C329245m828547l160798j108232j39342L20447J085937J332717J09044j744224
41512d803753k815954l028257k801643j607523Q84501L185032L300371J199701
41504f487525j228680k044341l07594L418161O559710O172441K545367n43806
41496H083733p96320m24650j902171l240727j274137K194259K388311p72612k189854
41487B065832K91779K256790m67628n441441p171052m149000P65356M728413O506378
$$ plain form
41478 -614573 4793196 6708835 5269113 2780644 788316 -885838 -1884429 -566334
41470 -566334 3175878 6511452 6993955 5759537 5455875 6312480 6613982 6234901 6927735
41461 6927735 8888503 9546071 6919733 2567066 -176792 5120 1622182 2769587
41453 2769587 2825600 1702960 -1057857 -5327643 -9200782 -10276316 -8474579 -6431868
41445 -6431868 -6279810 -6879799 -5442050 -1433469 2581400 4121314 3471652 2638155 2666608
41436 2666608 2853983 2113630 393810 -1191721 -1453619 -504540 165909 -480156 -1511362
41427 -1511362 -1394034 -650769 -1544825 -4645538 -7309648 -6731535 -3477422 -756606 -783823
41418 -783823 -2928897 -5041408 -5639294 -4986150 -4635079 -5655016 -7024600 -6490969 -3452962
$$ packed form
41478f14573N407769J915639j439722k488469j992328j674154r98591J318095
41470e66334L742212L335574M82503j234418l03662Q56605L01502l79081O92834
41461F927735J960768O57568k626338m352667k743858J81912J617062J147405
41453B769587N6013j122640k760817m269786l873139j075534J801737K042711
41445f431868J52058n99989J437749M008581M014869J539914o49662q33497K8453
41436B666608J87375p40353j719820j585531k61898R49079O70449o46065j031206
41427a511362J17328P43265q94056l100713k664110N78113L254113K720816k7217
41418g83823k145074k112511n97886O53144L51071j019937j369584N33631L038007
$$ plain form
41409 -3452962 -34925 1415086 876331 -243763 -1450554 -3090276 -4542099 -4156080
41401 -4156080 -1153327 3371876 7345045 8985899 7639773 4253137 797521 -1397151
41393 -1397151 -2328666 -2100709 -358040 2092361 2708927 184526 -3088648 -3750932 -1990711
41384 -1990711 -934411 -1959461 -3378866 -3921477 -4551659 -5885431 -6495314 -5365773 -3922305
41375 -3922305 -3811285 -4273512 -3571234 -1788967 -376224 190079 532038 822623 749006
41366 749006 538248 521611 136406 -1101956 -2013221 -852641 2002811 4079246 3826423
41357 3826423 2291074 1463820 2261763 4563316 7778177 10451110 10559158 7704531 4442467
41348 4442467 3808961 5430105 5572842 1739633 -3971543 -7242838 -6528860 -4177158 -2783149
$$ packed form
41409c452962L418037J450011n38755j120094j206791j639722j451823L86019
41401d156080L002753M525203L973169J640854j346126l386636l455616k194672
41393a397151r31515K27957J742669K450401O16566k524401l273174o62284J760221
41384a990711J056300j025050j419405n42611o30182j333772o09883J129541J443468
41375c922305J11020m62227P02278J782267J412743N66303L41959K90585p3617
41366G49006k10758j6637l85205j238362r11265J160580K855452K076435k52823
41357C826423j535349q27254P97943K301553L214861K672933J08048k854627l262064
41348D442467o33506J621144J42737l833209n711176l271295P13978K351702J394009
$$ plain form
41339 -2783149 -2267444 -1264038 263657 1361300 2105764 3386009 4753519 4270520 1177849
41330 1177849 -2383520 -3158738 37917 5151763 8536091 7920813 4491144 2047441
41322 2047441 3393810 7549072 11129016 12051112 10708429 7891713 3560691 -1669786
41314 -1669786 -5602640 -6499465 -5268591 -4325824 -4514830 -4108398 -1001862 4510419 9421997
41305 9421997 10846582 9304476 8259124 9514334 10307004 6980005 726352 -3324691
41297 -3324691 -2998238 -1698586 -2754917 -4459966 -3486473 -744503 -143924 -2630446 -5140443
41288 -5140443 -5414594 -4457990 -3540529 -1852440 1305104 4308104 5189252 4429787 3771556
41279 3771556 3006653 98126 -5222562 -9656950 -9306646 -3970692 2435770 5714115
$$ packed form
41339b783149N15705J003406J527695J097643P44464J280245J367510m82999l092671
41330A177849l561369p75218L196655N113846L384328o15278l429669k443703
41322B047441J346369M155262L579944R22096j342683k816716m331022n230477
41314a669786l932854q96825J230874R42767j89006M06432L106536N512281M911578
41305I421997J424585j542106j045352J255210P92670l326999o253653m051043
41297c324691L26453J299652j056331j705049R73493K741970O00579k486522k509997
41288e140443k74151R56604R17461J688089L157544L003000Q81148p59465o58231
41279C771556p64903k908527n320688m434388L50304N335954O406462L278345
$$ plain form
41271 5714115 4832901 1459149 -2651376 -6570060 -9221716 -9384550 -7148487 -4162671
41263 -4162671 -1915013 -672827 -266684 -591358 -1003590 -754903 -517224 -1732463 -3790145
41254 -3790145 -4042007 -1870229 -348901 -1799230 -3919358 -3268452 -1022891 -1677230 -6420026
41245 -6420026 -11232227 -12114041 -9462261 -6410938 -5043176 -5269847 -5830178 -5430457 -3856262
41236 -3856262 -2349587 -2123194 -2783437 -3230447 -3347875 -3284733 -2066439 894973 3746700
41227 3746700 4305463 3634296 4464522 6355813 5991794 2627482 -556323 -1566894 -2256804
41218 -2256804 -4120155 -5050600 -2836325 1017361 3681392 4787336 5134872 4018632
41210 4018632 999927 -1590774 -1363659 231801 100806 -1375540 -957111 2088859 4772189
$$ packed form
41271E714115q81214l373752m110525l918684k651656j62834K236063K985816
41263d162671K247658J242186M06143l24674m12232K48687K37679j215239k057682
41254c790145k51862K171778J521328j450329k120128O50906K245561o54339m742796
41245f420026m812201q81814K651780L051323J367762k26671n60331L99721J574195
41236c856262J506675K26393o60243m47010j17428O3142J218294K961412K851727
41227C746700N58763o71167Q30226J891291l64019l364312l183805j010571o89910
41218b256804j863351r30445K214275L853686K664031J105944L47536j116240
41210D018632l018705k590701K27115J595460j30995j476346M18429L045970K683330
$$ plain form
41201 4772189 4926924 3874693 3612141 3848774 3155884 1373819 -411432 -1424645 -1962930
41192 -1962930 -3030607 -5301854 -7996083 -9171728 -7793545 -4935565 -2307076 -609070
41184 -609070 -158375 -1494405 -3771166 -4271512 -1916413 138057 -1617446 -5486481 -6363993
41175 -6363993 -2968760 288202 -681254 -5055462 -9610397 -12620334 -13565521 -11810742
41167 -11810742 -7949201 -4523982 -3149454 -2365743 -374708 1537158 643512 -3085024
41159 -3085024 -6808962 -8373057 -7988351 -6568494 -4433152 -2053685 -500669 -362501
41151 -362501 -968724 -1174046 -553964 327435 651422 462045 1047864 3606534 7365440
41142 7365440 9958099 10155076 9189474 8629552 8132446 6595428 4558915 3684539 4154888
$$ packed form
41201D772189J54735j052231k62552K36633o92890j782065j785251j013213n38285
41192a962930j067677k271247k694229j175645J378183K857980K628489J698006
41184f09070M50695j336030k276761n00346K355099K054470j755503l869035q77512
41175f363993L395233L256962r69456m374208m554935l009937r45187J754779
41167a1810742L861541L425219J374528P83711J991035J911866q93646l728536
41159c085024l723938j564095L84706J419857K135342K379467J553016J38168
41151c62501o06223k05322O20082Q81399L23987j89377N85819K558670L758906
41142G365440K592659J96977r65602n59922m97106j537018k036513q74376M70349
$$ plain form
41133 4154888 4302105 3019343 1217455 556190 1704829 4042764 6182692 6720605 5430470
41124 5430470 3794013 3382158 3735874 3018522 771809 -1451588 -2451791 -2653686 -2346654
41115 -2346654 -552368 2932255 5896494 6015254 3873951 1902764 1124292 933951 1266030
41106 1266030 2378488 2866280 1013071 -1482994 -535866 4218107 7663744 5853877
41098 5853877 1394296 -924132 -1109201 -2226292 -3495289 -687801 6319363 11660623
41090 11660623 10979756 6643779 3296207 2035399 1776382 2889262 5824973 8618355
41082 8618355 9507364 10146841 12530952 14536112 12814218 8909724 7717171 10091488
41074 10091488 11813849 10497859 8694047 8514771 7675696 3610091 -1928230 -5432153
$$ packed form
41133D154888J47217j282762j801888o61265J148639K337935K139928N37913j290135
41124E430470j636457m11855L53716p17352k246713k223397j000203k01895L07032
41115b346654J794286L484623K964239J18760k141303j971187p78472j90341L32079
41106A266030J112458M87792j853209k496065R47128M753973L445637j809867
41098E853877m459581k318428j85069j117091j268997K807488P007164N341260
41090A1660623o80867m335977l347572j260808k59017J112880K935711K793382
41082H618355Q89009O39477K384111K005160j721894l904494j192553K374317
41074A0091488J722361j315990j803812j79276q39075m065605n538321l503923
$$ plain form
41066 -5432153 -6296956 -6050521 -5145399 -3594867 -3085752 -5126625 -7947531 -8233170 -5558983
41057 -5558983 -2545118 -940563 -140459 409459 -54758 -1747987 -3139576 -2644532 -507557
41048 -507557 1514778 1672100 -509546 -3574189 -4972482 -3593947 -1165101 54070
41040 54070 525846 2749861 7397535 11925179 13504579 11865870 8688579 5603035 3609990
41031 3609990 3205373 3857462 4019447 2773507 1202946 1232553 3106174 4740209 3951550
41022 3951550 1085842 -1026011 -15210 3354858 6064501 6391214 5670147 6031004 7396534
41013 7396534 7855584 6461632 4351097 3137810 3259069 4004980 4371473 3815788 2698634
41004 2698634 1704253 365467 -2891388 -8114216 -12368178 -12937466 -11336282 -11540951 -14219350
$$ packed form
41066e432153q64803K46435R05122J550532N09115k040873k820906k85639K674187
41057e558983L013865J604555Q00104N49918m64217j693229j391589M95044K136975
41048e07557K022335J57322k181646l064643j398293J378535K428846J219171
41040E4070M71776K224015M647674M527644J579400j638709l177291l085544j993045
41031C609990m04617O52089J61985j245940j570561K9607J873621J634035p88659
41022C951550k865708k111853J010801L370068K709643L26713p21067L60857J365530
41013G396534M59050j393952k110535j213287J21259P45911L66493n55685j117154
41004B698634r94381j338786l256855n222828m253962n69288J601184k04669k678399
$$ plain form
40995 -14219350 -15689761 -13516299 -10105405 -8792326 -8917742 -7563678 -4416746 -1684840
40987 -1684840 -87515 1622023 3094190 1739468 -3203793 -8603693 -11093581 -10927949
40979 -10927949 -10458551 -10181490 -8276735 -3535027 2738108 7523096 8059451 3899883
40971 3899883 -1914745 -4651930 -2320153 2230710 4838606 4728837 4025369 3663571 2512965
40962 2512965 403021 -1019803 -1294292 -2212666 -4428274 -5593092 -4035524 -2059706
40954 -2059706 -2675047 -4539219 -3562342 971289 5351896 6889406 7114423 8265206 9418272
40945 9418272 8331176 5482835 3936238 5582982 8986246 10819276 8770771 3582966
40937 3582966 -1186927 -2146747 565652 3558422 4140377 2898318 1865630 1579539 959657
$$ packed form
40995a4219350j470411K173462L410894J313079j25416J354064L146932K731906
40987a684840J597325J709538J472167j354722m943261n399900k489888J65632
40979a0927949M69398K77061J904755M741708O273135M784988N36355m159568
40971C899883n814628k737185K331777M550863K607896j09769p03468l61798j150606
40962B512965k109944j422824k74489r18374k215608j164818J557568J975818
40954b059706o15341j864172R76877M533631M380607J537510K25017J150783J153066
40945I418272j087096k848341j546597J646744L403264J833030k048505n187805
40937C582966m769893r59820K712399K992770N81955j242059j032688k86091o19882
$$ plain form
40928 959657 -1078130 -4869410 -9608280 -12735225 -11408918 -6245726 -2110924 -3052860
40920 -3052860 -7462200 -10449452 -10119671 -8908578 -9158777 -10242612 -10430098 -9131238 -6598602
40911 -6598602 -3485737 -1365728 -1657100 -3219684 -2975585 49744 3068444 3022650 124368
40902 124368 -3242834 -5563001 -6774402 -7256376 -7762453 -9231310 -11223679 -11634657 -9408321
40893 -9408321 -6366456 -4634410 -3399200 -422098 3933687 6701746 6374690 4621424
40885 4621424 3328600 1937633 -1145194 -5873679 -10558742 -13747412 -14991679 -14172002
40877 -14172002 -11143998 -6326621 -1247396 1931528 1947379 -160306 -1621744 -612986
40869 -612986 1835155 3256169 2722654 1458097 825603 1103445 2256060 4157662 5370662
$$ packed form
40928I59657k037787l791280m738870l126945J326307N163192M134802r41936
40920c052860m409340k987252L29781J211093k50199j083835j87486J298860K532636
40911f598602L112865K120009k91372j562584K44099L025329L018700m5794k898282
40902A24368l367202k320167j211401m81974n06077j468857j992369m10978K226336
40893i408321L041865J732046J235210K977102M355785K768059l27056j753266
40885D621424j292824j390967l082827m728485m685063l188670j244267Q19677
40877a4172002L028004M817377N079225L178924J5851k107685j461438J008758
40869f12986K448141J421014n33515j264557o32494K77842J152615J901602J213000
$$ plain form
40860 5370662 3441252 -2139067 -8387318 -11844773 -12385637 -12319371 -12325201 -10580533 -6198384
40851 -6198384 -1246441 1842372 3233695 4606053 6307440 7265113 6954413 5706222
40843 5706222 3529858 525453 -1704407 -1245772 1032129 1700242 -793480 -3738222
40835 -3738222 -3773933 -1345020 543754 957901 1761521 3781369 4975557 3612200 1365654
40826 1365654 1432469 4338324 7293653 7760695 6414282 5940717 7503131 9362613 9327651
40817 9327651 7807737 7236675 8427775 9063504 6868748 3040827 774560 1061728 2074579
40808 2074579 2575886 3434175 4974704 5284883 3046212 489796 1204093 5473863 9778312
40799 9778312 10974491 9373543 7406495 6763519 7604515 9433162 11476961 12509678
$$ packed form
40860E370662j929410n580319o248251l457455n40864O6266n830J744668M382149
40851f198384M951943L088813J391323J372358J701387R57673l10700j248191
40843E706222k176364l004405k229860M58635K277901O68113k493722k944742
40835c738222l5711K428913J888774M14147Q03620K019848J194188j363357k246546
40826A365654O6815K905855K955329M67042j346413m73565J562414J859482l4962
40817I327651j519914n71062J191100O35729k194756l827921k266267K87168J012851
40808B074579N01307Q58289J540529L10179k238671k556416P14297M269770M304449
40799I778312J196179j600948j967048o42976Q40996J828647K043799J032717
$$ plain form
40791 12509678 11539325 9222445 7945950 9591133 13254998 16144296 17079537 18013121
40783 18013121 21150639 25647410 28804697 29857414 30332534 30649865 29009806 24750023
40775 24750023 20547464 19499217 21534812 24422067 26846874 28460768 28215767 25326881
40767 25326881 21373228 18831580 17530268 15049299 10983527 8265321 9216055 12385872
40759 12385872 14737618 15360923 15354379 15070698 13309126 9147407 3482078 -1321690 -2921679
40750 -2921679 -633739 3782936 7351139 8507954 8337578 8948129 11170001 14233731
40742 14233731 16972625 18530638 18314170 16208025 12969308 9934603 8203143 8133359
40734 8133359 9266155 10444147 10425659 8981914 7369020 7338374 9518638 12655186 14206456
$$ packed form
40791A2509678r70353k316880j276495J645183L663865K889298R35241R33584
40783A8013121L137518M496771L157287J052717M75120L17331j640059m259783
40775B4750023m202559j048247K035595K887255K424807J613894k45001k888886
40767B5326881l953653k541648j301312k480969m065772k718206R50734L169817
40759A2385872K351746O23305o544k83681j761572m161719n665329m803768j599989
40750b921679K287940M416675L568203J156815j70376O10551K221872L063730
40742A4233731K738894J558013k16468k106145l238717l034705j731460o9784
40734H133359J132796J177992j8488j443745j612894l0646K180264L136548J551270
$$ plain form
40725 14206456 11902707 5567112 -2090967 -7020589 -6983651 -3331611 550630 2398781
40717 2398781 2409876 1792657 819455 -1141765 -3884684 -5487383 -3965267 237257 4262592
40708 4262592 5801048 5291325 4468348 3673440 2204027 992181 2705416 8138771 14031123
40699 14031123 16059932 13350859 8623798 4352241 518958 -3554311 -6829536 -7323177
40691 -7323177 -4766821 -1357608 373546 -118595 -1395654 -1794705 -691284 1591545
40683 1591545 4226560 6057866 6185415 4971532 3884673 3680445 3364559 1948405 680725
40674 680725 1994977 6127779 10307817 11958511 11482374 10935392 10885653 9843169 6552305
40665 6552305 1904195 -1587256 -1997200 89883 1854275 1084649 -1161203 -1711011 666513
$$ packed form
40725A4206456k303749o335595p658079m929622L6938L652040L882241J848151
40717B398781J1095o17219r73202j961220k742919j602699J522116M202524M025335
40708D262592J538456n09723q22977p94908j469413j211846J713235N433355N892352
40699A4031123K028809k709073m727061m271557l833283m073269l275225m93641
40691g323177K556356L409213J731154m92141j277059l99051J103421K282829
40683A591545K635015J831306J27549j213883j086859k04228l15886j416154j267680
40674F80725J314252M132802M180038J650694m76137n46982m9739j042484l290864
40665F552305m648110l491451m09944K087083J764392p69626k245852n49808K377524
$$ plain form
40656 666513 3761028 5223566 5720638 7154547 8998170 8742670 5635924 1626743 -1668491
40647 -1668491 -4672995 -7730429 -9458749 -8812397 -7246757 -6834009 -7061526 -5671679 -2573532
40638 -2573532 -696840 -2072401 -4723307 -5011385 -2289120 541766 1138137 621805 1390335
40629 1390335 3294242 3843986 2099952 439461 1445058 4251385 5479583 3412349
40621 3412349 -159475 -2360720 -2328082 -1459684 -1450042 -2685023 -4105744 -4158863 -2142986
40612 -2142986 1072865 3822971 5117268 4970313 3515852 834027 -2047627 -3197831
40604 -3197831 -1871884 145126 523416 -600701 -925983 690605 2708408 3329326 3107247
40595 3107247 3817921 5392550 5544793 2626322 -2303546 -6690751 -8882513 -8808818 -7172491
$$ packed form
40656F66513L094515J462538M97072J433909J843623k55500l106746m009181l295234
40647a668491l004504l057434j728320O46352J565640M12748k27517J389847L098147
40638b573532J876692j375561k650906k88078K722265K830886N96371n16332P68530
40629A390335J903907N49744j744034j660491J005597K806327J228198k067234
40621C412349l571824k201245L2638Q68398R642j234981j420721n3119K015877
40612b142986L215851K750106J294297j46955j454461k681825k881654j150204
40604c197831J325947K017010L78290j124117l25282J616588K017803O20918k22079
40595C107247P10674J574629J52243k918471m929868m387205k191762P3695J636327
$$ plain form
40586 -7172491 -4907481 -2998533 -1836098 -804966 702024 1932232 1348544 -1290934
40578 -1290934 -4368897 -6338819 -7310677 -7957188 -7586123 -4566096 1234058 7325262 10395405
40569 10395405 9029385 4649759 188994 -2039120 -1638005 110318 1586029 2077051
40561 2077051 1934553 1666439 934809 -1371916 -5636558 -9993214 -11198340 -8039842 -3442492
40552 -3442492 -1720871 -3609266 -5611483 -4815252 -2424842 -1106302 -687299 927030
40544 927030 3454066 3989290 1502787 -1199997 -1307747 384086 1399898 1409143 1992641
40535 1992641 3629737 5195826 6086072 6656063 6423391 3954696 -637988 -4736250 -6013327
40526 -6013327 -5277813 -5319622 -7379274 -9864551 -10508609 -8873165 -6355552 -4201754 -2101537
$$ packed form
40586g172491K265010J908948J162435J031132J506990J230208n83688k639478
40578a290934l077963j969922r71858o46511L71065L020027N800154O091204L070143
40569A0395405j366020m379626m460765k228114M01115J748323J475711M91022
40561B077051j42498k68114p31630k306725m264642m356656j205126L158498M597350
40552c442492J721621j888395k002217P96231K390410J318540M19003J614329
40544I27030K527036N35224k486503k702784j07750J691833J015812R245N83498
40535A992641J637096J566089Q90246N69991k32672k468695m592684m098262j277077
40526f013327P35514m1809k059652k485277o44058J635444K517613K153798K100217
$$ plain form
40517 -2101537 984426 4753061 6962953 5647217 1878096 -570075 1071459 5585598
40509 5585598 9099200 9217433 7214849 6066851 6981479 8458899 8594402 7512276 6872537
40500 6872537 7206737 6785041 3839004 -659738 -3568956 -3014301 -268828 2148513 3224134
40491 3224134 3561673 3714123 3730095 3951414 4765406 5443177 4698864 3002345 2958388 6159537
40481 6159537 10468536 11896524 9073082 4697737 2482328 3657208 6606128 8784877
40473 8784877 8501415 5885275 3047698 2624085 5061860 7575454 6810631 2653716 -1415357
40464 -1415357 -2015993 708801 3639462 4076538 2132908 99585 17304 1976332 4568198
40455 4568198 6704884 8563961 10503620 11670990 10790348 8387348 6877480 7579960
$$ packed form
40517b101537L085963L768635K209892j315736l769121k448171J641534M514139
40509E585598L513602J18233k002584j147998R14628J477420J35503j082126o39739
40500F872537L34200m21696k946037m498742k909218N54655K745473K417341J075621
40491C224134L37539J52450J5972K21319Q13992O77771p44313j696519m3957L201149
40481F159537M308999J427988k823442m375345k215409J174880K948920K178749
40473H784877k83462k616140k837577m23613K437775K513594p64823m156915m069073
40464a415357o00636K724794K930661M37076j943630k033323q2281J959028K591866
40455D568198K136686J859077J939659J167370q80642k403000j509868P02480
$$ plain form
40447 7579960 8737115 7980243 6136571 6502061 9923674 12625092 10375961 3639594
40439 3639594 -3083044 -6332439 -6296401 -4709551 -2484746 -221958 827515 -89793 -1925818
40430 -1925818 -2914577 -2398999 -650195 2205665 5607562 7602386 6493985 3610687
40422 3610687 2592412 5192512 9145334 11001537 9887186 7524896 5660930 4795681
40414 4795681 4816772 5503254 6468200 7477800 8662805 9729112 9448188 7014778 3698389
40405 3698389 1981428 2932096 5351980 7577388 9063099 9925111 10070461 9546255 9042251
40396 9042251 9189987 9646795 9554135 8812550 8340356 8943269 10285456 11313024 11718088
40387 11718088 12590009 15024335 18110628 19308338 17583489 15366532 16025645 19635043
$$ packed form
40447G579960J157155p56872j843672L65490L421613K701418k249131o736367
40439C639594o722638l249395L6038J586850K224805K262788J049473r17308j836025
40430a925818r88759N15578J748804K855860L401897J994824j108401k883298
40422C610687j018275K600100L952822J856203j114351k362290j863966q65249
40414D795681K1091O86482R64946J009600J185005J066307k80924k433410l316389
40405C698389j716961R50668K419884K225408J485711Q62012J45350n24206n04004
40396I042251J47736M56808r2660p41585m72194O02913J342187J027568M05064
40387A1718088Q71921K434326L086293J197710j724849k216957O59113L609398
$$ plain form
40379 19635043 22844735 23306829 22613128 23723033 26581402 27897591 25190557 19931452
40371 19931452 16332769 17396090 22153384 26628881 27826064 26901706 27708663 31850504
40363 31850504 36298762 37012057 33989986 30994271 30602000 31652912 32094027 32223980 33550733
40354 33550733 35741463 36712118 35466133 33185289 31352650 30188821 29375074 29112537
40346 29112537 29687531 30761152 31848643 32930641 33849830 33660272 31634043 28832597
40338 28832597 27710953 29832524 34470050 39584687 43614377 46089137 47122291 46894249
40330 46894249 45528827 43187900 40360970 38126294 37780418 39824481 43330919 46562123
40322 46562123 48430846 49514620 51580840 55711373 60690334 63793899 63753987 62445501
$$ packed form
40379A9635043L209692M62094o93701J109905K858369J316189k707034n259105
40371A9931452l598683J063321M757294M475497J197183r24358Q06957M141841
40363C1850504M448258P13295l022071k995715l92271J050912M41115J29953J326753
40354C3550733K190730R70655j245985k280844j832639j163829q13747k62537
40346B9112537N74994J073621J087491J081998R19189j89558k026229k801446
40338B8832597j121644K121571M637526N114637M029690K474760J033154k28042
40330D6894249j365422k340927k826930k234676l45876K044063L506438L231204
40322D6562123J868723J083774K066220M130533M978961L103565l9912j308486
$$ plain form
40314 62445501 62754378 65196902 67972538 70299162 74027939 81285328 91832883 103565364
40306 103565364 114408602 122897745 128400710 132276449 137710436 146751188 158343670 170835472
40298 170835472 185218923 203559555 224986851 246068925 265117550 283334194 301483454
40291 301483454 318688606 335559397 354999627 377395394 397521939 409378472 412801206
40284 412801206 412480914 411490902 408939432 403608849 396326599 387623622 375809352 359463833
40276 359463833 340676165 324059789 312658020 305527098 299134106 290717630 280448200
40269 280448200 270476846 261965727 253724401 244304410 234448870 225951792 218513210 209710006
40261 209710006 198556029 187332937 178788638 172684053 166393188 158341571 149719669 142937977
$$ packed form
40314F2445501L08877K442524K775636K326624L728777P257389J0547555J1732481
40306A03565364J0843238Q489143N502965L875739N433987R040752J1592482J2491802
40298A70835472J4383451J8340632K1427296K1082074J9048625J8216644J8149260
40291C01483454J7205152J6870791J9440230K2395767K0126545J1856533L422734
40284D12801206l20292r90012k551470n330583p282250q702977j1814270j6345519
40276C59463833j8787668j6616376j1401769p130922o392992q416476j0269430
40269B80448200r971354q511119q241326r419991r855540q497078p438582q803204
40261B09710006j1153977j1223092q544299o104585o290865q051617q621902o781692
$$ plain form
40253 142937977 139124401 137129970 134674476 130626746 126161602 123084003 121008209 117370167
40245 117370167 110904224 103951496 99970257 99330903 99059743 96578862 92112563 87147588
40237 87147588 82305458 77858636 74940897 74364563 74712054 73528629 70573281 68034910
40229 68034910 66965992 65597727 62605147 60010828 60309687 62028252 61535396 59057177
40221 59057177 58996696 63018020 66552509 64911103 60039211 57549949 58721592 59528789
40213 59528789 57207246 53789945 52393913 53308547 55021367 56466338 56911190 55927111
40205 55927111 54849236 56116463 59701355 62286477 61638521 59797153 60039534 62571782
40197 62571782 65344550 67283668 68158766 66914100 63278221 59978957 59921752 61542816
$$ packed form
40253A42937977l813576j994431k455494m047730m465144l077599k075794l638042
40245A17370167o465943o952728l981239o39354k71160k480881m466299m964975
40237H7147588m842130m446822k917739n76334L47491j183425k955348k538371
40229F8034910j068918j368265k992580k594319K98859J718565m92856k478219
40221E9057177o0481M021324L534489j641406m871892k489262J171643Q07197
40213E9528789k321543l417301j396032R14634J712820J444971M44852r84079
40205E5927111j077875J267227L584892K585122o47956j841368K42381K532248
40197F2571782K772768J939118Q75098j244666l635879l299264n7205J621064
$$ plain form
40189 61542816 60462135 55930717 51991871 51287435 51364476 49161163 46039824 45328526 46785052
40180 46785052 46839251 43679523 39200738 35883887 34207233 33583014 33718402 34176651 34199563
40171 34199563 33943281 34662162 36735782 38650714 39045635 38775985 39553864 41191673 41783405
40162 41783405 40383983 37862474 34995125 31532471 27880486 25987067 27136105 29986291
40154 29986291 32357958 34104170 36395093 38758890 39146341 37146117 34927388 34205226
40146 34205226 34224834 33856705 33755914 34695316 35299966 33803270 31399408 31428679 34981579
40137 34981579 39181301 40421933 37993581 34023442 31107131 30730159 32993483 36799665
40129 36799665 40538370 43283081 45490841 48473281 53108999 58710280 62967769 63661683
$$ packed form
40189F1542816j080681m531418l938846p04436P7041k203313l121339p11298J456526
40180D6785052N4199l159728m478785l316851j676654o24219J35388M58249K2912
40171C4199563k56282P18881K073620J914932L94921k69650P77879J637809N91732
40162D1783405j399422k521509k867349l462654l651985j893419J149038K850186
40154B9986291K371667J746212K290923K363797L87451k000224k218729p22162
40146C4205226J9608l68129j00791R39402O04650j496696k403862K9271L552900
40137C4981579M199722J240632k428352l970139k916311l76972K263324L806182
40129C6799665L738705K744711K207760K982440M635718N601281M257489O93914
$$ plain form
40121 63661683 61072113 58167725 57628317 59215322 60947847 61995197 62773169 62706378 60205743
40112 60205743 55443968 51208024 49781924 50197262 49742199 47337108 44311500 42407912
40104 42407912 41988931 41914189 40549088 37212490 33010378 29767710 27961288 26568248
40096 26568248 25201977 25021660 26609847 28245761 27844718 25919105 24930508 25876842 27156615
40087 27156615 27162686 26621001 27493391 30263220 33195739 34181824 32705143 29762272 26265215
40078 26265215 22340622 18572183 16973400 19179411 23616536 26175419 24633622 21099952
40070 21099952 18798298 17632336 14929162 10108384 6272174 6453376 9942995 13447393
40062 13447393 14847151 14616303 14126984 13906376 13721312 13424193 13105419 12694747 11912485
$$ packed form
40121F3661683k589570k904388n39408J587005J732525J047350P77972o6791k500635
40112F0205743m761775m235944j426100M15338m55063k405091l025608j903588
40104D2407912m18981p4742j365101l336598m202112l242668j806422j393040
40096B6568248j366271j80317J588187J635914m01043j925613r88597R46334J279773
40087B7156615O071n41685Q72390K769829K932519R86085j476681k942871l497057
40078B6265215l924593l768439j598783K206011M437125K558883j541797l533670
40070B1099952k301654j165962k703174m820778l836210J81202L489619L504398
40062A3447393J399758k30848m89319k20608j85064k97119l18774m10672p82262
$$ plain form
40053 11912485 10706470 9495204 8815502 8830903 9292179 9804009 9945662 9401697 8409540
40044 8409540 7970814 9162919 12224012 16511192 20905416 23716745 22975616 18265066
40036 18265066 12109384 7966535 6626772 6153009 5539859 6170008 8659843 10681015
40028 10681015 9981544 7827576 6976230 7410762 6781491 4436049 2228747 1446479 1593711
40019 1593711 2383343 4210375 6083677 5794529 3216288 1032121 920706 1369194 842926
40010 842926 655162 2212497 3292402 355395 -5868166 -10072354 -8335608 -2453503
40002 -2453503 2537861 3901411 3365849 4422012 8330166 13011141 15693383 15980016
39994 15980016 15422544 14516304 12111457 8557075 7204592 10483066 15560953 16678612
$$ packed form
40053A1912485j206015j211266o79702J5401M61276N11830J41653n43965r92157
40044H409540m38726J192105L061093M287180M394224K811329p41129m710550
40036A8265066o155682m142849j339763m73763o13150O30149K489835K021172
40028A0681015o99471k153968q51346M34532o29271k345442k207302p82268J47232
40019A593711P89632J827032J873302k89148k578241k184167j11415M48488n26268
40010H42926j87764J557335J079905k937007o223561m204188J736746N882105
40002b453503M991364J363550n35562J056163L908154M680975K682242K86633
39994A5980016n57472r06240k404847l554382j352483L278474N077887J117659
$$ plain form
39986 16678612 11995203 5834732 3354731 4844902 6530854 5641227 3008127 1176315
39978 1176315 1585785 3965495 7357783 10811260 13404281 14584120 14886888 15736646 17950715
39969 17950715 20866980 23599183 26498588 30074020 32897549 32622295 29536973 27014260
39961 27014260 27240765 28366654 27521729 24857655 22296039 19783877 15979888 12124671
39953 12124671 11652568 15125060 18507791 17997562 14388687 11126789 10017389 10696537
39945 10696537 12568250 14753846 15001131 11303810 4855449 -511856 -2387398 -1971549
39937 -1971549 -1751282 -2256977 -2041103 -163334 2409647 3986994 4091110 3768085 4141687
39928 4141687 5215624 6323665 7145241 7581084 7081559 5231166 2983698 2074111 2840456
$$ packed form
39986A6678612m683409o160471k480001J490171J685952q89627k633100j831812
39978A176315M09470K379710L392288L453477K593021J179839L02768Q49758K214069
39969A7950715K916265K732203K899405L575432K823529k75254l085322k522713
39961B7014260K26505J125889q44925k664074k561616k512162l803989l855217
39953A2124671m72103L472492L382731n10229l608875l261898j109400O79148
39945A0696537J871713K185596K47285l697321o448361n367305j875542M15849
39937a971549K20267n05695K15874J877769K572981J577347J04116l23025L73602
39928D141687J073937J108041Q21576M35843m99525j850393k247468r09587P66345
$$ plain form
39919 2840456 3819936 4082832 4689392 6793877 9350892 10087179 8187614 4745877 1016272
39910 1016272 -2378388 -4706780 -5096967 -3578599 -1229480 836689 1872955 1238680
39902 1238680 -936324 -2901432 -2696162 -773821 355526 -291418 -680656 967378 3041501
39893 3041501 2580353 -519331 -3533823 -4875198 -5745092 -7302960 -8172058 -6110657 -1222913
39884 -1222913 3645523 5433631 3410605 -198746 -1933176 -410447 1761403 643879
39876 643879 -3938233 -7591907 -6721207 -2933352 -313950 27328 104787 973525 1852320
39867 1852320 2995155 5674133 8540474 7745341 2543762 -2401657 -2763388 37005
39859 37005 1867859 1856653 1935128 2423361 2183763 2190013 4640938 8500970 9940890 7886845
$$ packed form
39919B840456R79480K62896O06560K104485K557015P36287j899565l441737l729605
39910A016272l394660k328392l90187J518368K349119K066169J036266o34275
39902A238680k175004j965108K05270J922341J129347o46944l89238J648034K074123
39893C041501m61148l099684l014492j341375q69894j557868q69098K061401M887744
39884a222913M868436J788108k023026l609351j734430J522729K171850j117524
39876F43879m582112l653674Q70700L787855K619402L41278P7459Q68738Q78795
39867A852320J142835K678978K866341p95133n201579m945419l61731K800393
39859C7005J830854j1206P8475M88233k39598O250K450925L860032J439920k054045
$$ plain form
39849 7886845 5494904 5116785 5294564 4196711 2784232 2649987 3441840 4386164 5877062
39840 5877062 7564459 7359156 4678430 2463653 3419783 6135376 7498508 7145662 6708726
39831 6708726 6323799 5146145 4246283 5621058 8659028 10439837 9376522 6224922
39823 6224922 2092050 -2007242 -4365382 -4325751 -4328801 -7121223 -11245226 -12573432 -10121895
39814 -10121895 -6706448 -3790592 36978 4511994 6097628 3127684 -1114346 -2994715
39806 -2994715 -3023603 -3036688 -2047567 1458519 5360334 6077741 3846476 2196896 2692275
39797 2692275 3553861 3458424 3457764 4408576 5064842 3889267 1212594 -1263847 -2178290 -1458662
39787 -1458662 -414977 -731926 -2419288 -3196848 -1101497 2824209 5845962 6964377
$$ packed form
39849G886845k391941l78119J77779j097853j412479j34245P91853R44324J490898
39840E877062J687397k05303k680726k214777R56130K715593J363132l52846m36936
39831F708726l84927j177654q99862J374775L037970J780809j063315l151600
39823F224922m132872m099292k358140L9631l050k792422m124003j328206K451537
39814a0121895L415447K915856L827570M475016J585634k969944m242030j880369
39806b994715k8888j3085R89121L506086L901815P17407k231265j649580M95379
39797B692275Q61586r5437o60R50812O56266j175575k676673k476441r14443P19628
39787a458662J043685l16949j687362p77560K095351L925706L021753J118415
$$ plain form
39779 6964377 7338397 7773535 7865942 7618718 7767352 8054464 7129983 4934911 3519517
39770 3519517 4471286 6709278 7749781 6314098 3089926 -162670 -1683459 -839434
39762 -839434 1116729 2101824 1533243 969369 2068154 4617437 6920690 7417277 5660248
39753 5660248 2496486 -392430 -1837974 -2296400 -2987458 -4100362 -4907995 -5431466 -6395596
39744 -6395596 -7412565 -7116178 -5696133 -5262918 -6537544 -7121694 -4762303 -703814 2301314
39735 2301314 3995648 6052644 8238480 8113504 4948076 1392175 193317 1102225
39727 1102225 2186122 2687038 3193949 4015206 4795634 5253136 5278774 4810007 4494589
39718 4494589 5793690 9196140 12777088 14004098 12996320 12518291 14235681 16284689
$$ packed form
39779F964377L74020M35138R2407k47224J48634K87112r24481k195072j415394
39770C519517R51769K237992J040503j435683l224172l252596j520789Q44025
39762h39434J956163R85095n68581n63874J098785K549283K303253M96587j757029
39753E660248l163762k888916j445544m58426o91058j112904q07633n23471r64130
39744f395596j016969K96387J420045M33215j274626n84150K359391M058489L005128
39735B301314J694334K056996K185836j24976l165428l555901j198858R08908
39727A102225J083897N00916N06911Q21257P80428M57502K5638m68767l15418
39718D494589J299101L402450L580948J227010j007778m78029J717390K049008
$$ plain form
39710 16284689 15587479 11792619 7688646 5951579 6658706 8177771 9358921 10081196
39702 10081196 10323979 9812884 8656560 7538279 6906705 6422969 5572666 4510178 3898764
39693 3898764 4090705 4827415 5646966 6306821 6979834 8317190 10904559 13979278 15064743
39684 15064743 12177238 6744387 3019202 3564708 6245042 7065769 5355765 4255488
39676 4255488 6003685 8820213 9535574 7795521 6096654 6440791 8472804 10576479
39668 10576479 11437612 10628847 8879742 7820480 8407129 9542236 9183962 6759089 3544916
39659 3544916 979539 -98538 1121689 4818718 9108364 11246633 11024644 11087348 12924133
39650 12924133 14610152 14014689 12156941 11130063 10417076 8213648 5436513 5061411
$$ packed form
39710A6284689o97210l794860m103973j737067P07127J519065J181150P22275
39702A0081196K42783n11095j156324j118281o31574m83736q50303j062488o11414
39693C898764J91941P36710Q19551O59855O73013J337356K587369L074719J085465
39684A5064743k887505n432851l725185N45506K680334Q20727j710004j100277
39676D255488J748197K816528P15361j740053j698867L44137K032013K103675
39668A0576479Q61133q08765j749105j059262N86649J135107l58274k424873l214173
39659C544916k565377j078077J220227L697029M289646K138269k21989O2704J836785
39650A2924133J686019n95463j857748j026878p12987k203428k777135l75102
$$ plain form
39642 5061411 7429081 9396771 8950243 7799133 8032818 8708841 7708059 5109992 2516922
39633 2516922 287801 -2225669 -4356839 -4394655 -2231991 238274 1842698 3615283
39625 3615283 6764049 10378154 12317695 11911088 10786083 10966683 12689388 14273454
39617 14273454 13844698 10936017 6597194 2565306 720813 2684909 8580127 15742692
39609 15742692 19800443 18221286 12560502 6417070 1534502 -3021116 -7998589 -11814300
39601 -11814300 -12130261 -8798747 -4207473 -842669 721123 1346044 1580647 950000 -1051080
39592 -1051080 -3588840 -4476898 -1927463 3456574 8682019 10851625 9803180 8002954
39584 8002954 7748512 8920898 9804691 9601029 9263071 9773040 10455963 9717677 7220021
$$ packed form
39642E061411K367670J967690m46528j151110K33685O76023j000782k598067k593070
39633B516922k229121k513470k131170l7816K162664K470265J604424J772585
39625C615283L148766L614105J939541m06607j125005J80600J722705J584066
39617A4273454m28756k908681m338823m031888j844493J964096N895218P162565
39609A5742692M057751j579157n660784o143432m882568m555618m977473l815711
39601a1814300l15961L331514M591274L364804J563792O24921K34603o30647k001080
39592a051080k537760q88058K549435N384037N225445K169606j048445j800226
39584H002954k54442J172386Q83793k03662l37958N09969O82923p38286k497656
$$ plain form
39575 7220021 4576299 3548382 3927648 3845393 2339942 863706 1260016 2501786 1158083
39566 1158083 -3847410 -8392077 -7311704 -1158298 3721335 2820120 -1014366 -1640224
39558 -1640224 2290080 6088862 5807103 3457119 3962903 8563223 13542034 15363834
39550 15363834 14803068 14629557 14727034 12214303 6614766 1902241 1347776 2619505 1347750
39541 1347750 -1749930 -1743225 2339150 5216699 3236588 -263064 -1106591 -1497390 -5562918
39532 -5562918 -10479698 -9009436 -718875 5991506 4856522 -770716 -4023769 -3243452
39524 -3243452 -975411 1797053 5708681 9310450 9720281 6548568 2255450 -841585
39516 -841585 -1634299 519304 4823146 8146679 7942632 5642001 4567595 5021931 4415337
$$ packed form
39575G220021k643722j027917L79266q2255j505451j476236L96310J241770j343703
39566A158083n005493m544667J080373O153406M879633r01215l834486o25858
39558a640224L930304L798782k81759k349984N05784M600320M978811J821800
39550A5363834n60766j73511R7477k512731n599537m712525n54465J271729j271755
39541A347750l097680O705M082375K877549j980111l499652q43527l90799m065528
39532e562918m916780J470262Q290561O710381j134984n627238l253053P80317
39524c243452K268041K772464L911628L601769M09831l171713m293118l097035
39516h41585p92714K153603M303842L323533k04047k300631j074406M54336o06594
$$ plain form
39507 4415337 2126082 932194 2790407 6000615 7891889 8126747 7879463 7579999 7206567
39498 7206567 7483790 8834504 9724304 7916405 3611047 18865 64345 3064752 5472045
39489 5472045 4930880 2855742 2410745 4476136 6738352 6771251 4716300 2410869 1131572
39480 1131572 1136649 2382858 4414674 6111138 6669835 6482329 6222270 5676321 4421844
39471 4421844 3028632 2492681 2935519 3840549 5068522 6657598 8129176 8938330 9103057
39462 9103057 8661933 7425915 6186144 6908746 10221199 13712632 14445963 12383018 9609267
39453 9609267 7014241 3866463 281683 -2050513 -1805033 733391 4210357 6788778
39445 6788778 6840593 4513405 1896568 277784 -1424374 -3660781 -3649179 1008405 7410920
$$ packed form
39507D415337k289255j193888J858213L210208J891274K34858k47284k99464l73432
39498G206567K77223J350714Q89800j807899m305358l592182M5480L000407K407293
39489E472045n41165k075138m44997K065391K262216L2899k054951k305431j279297
39480A131572N077J246209K031816J696464N58697j87506k60059n45949j254477
39471D421844j393212n35951M42838R05030J227973J589076J471578Q09154J64727
39462I103057m41124j236018j239771P22602L312453L491433P33331k062945k773751
39453I609267k595026l147778l584780k332196K45480K538424L476966K578421
39445F788778N1815k327188k616837j618784j702158k236407J1602M657584O402515
$$ plain form
39436 7410920 10013272 7859403 5219919 4916565 5272416 4603960 4440898 6326912 8944914
39427 8944914 10617204 11707919 12502900 11673956 9154034 7714337 9042265 10664396
39419 10664396 9405103 5670310 1706794 -1975692 -5402624 -6692225 -4544557 -1578450
39411 -1578450 -1334769 -2963731 -2725279 -154097 1315893 22259 -1540290 -994613 552766
39402 552766 933636 214760 -77134 685047 2063947 3549057 4623834 4756987 4113140
39393 4113140 3554919 3502154 3520854 3290360 3204001 3776937 5019596 6377664 6894059 5965417
39383 5965417 4573053 4889759 7638686 10840678 12560435 13732005 16208534 18915215
39375 18915215 18700293 15065616 11421237 10848259 12637240 13958079 13342525 11531475
$$ packed form
39436G410920K602352k153869k639484l03354L55851o68456j63062J886014K618002
39427H944914J672290J090715P94981q28944k519922j439697J327928J622131
39419A0664396j259293l734793l963516l682486l426932j289601K147668K966107
39411a578450K43681j628962K38452K571182J469990j293634j562549N45677J547379
39402E52766L80870p18876k91894P62181J378900J485110J074777J33153o43847
39393D113140n58221n2765J8700k30494q6359N72936J242659J358068N16395r28642
39383E965417j392364L16706K748927L201992J719757J171570K476529K706681
39375A8915215k14922l634677l644379n72978J788981J320839o15554j811050
$$ plain form
39367 11531475 10044169 9703732 9828593 8732378 5961065 3638906 3867016 5021239
39359 5021239 3151953 -2204596 -6076197 -3560737 4323937 11934285 14951181 13506977
39351 13506977 10554193 9149441 10919747 15134463 18714888 18475109 14348121 10018468
39343 10018468 9543988 13102089 16577210 16025762 12325020 10208164 12389252 16363535
39335 16363535 18408148 19068757 21965937 27754742 32530210 33065837 30906488 29717500
39327 29717500 30687226 32449295 33993674 35516403 37230436 39277854 42456454 47478623
39319 47478623 53683218 59575158 64232790 67260352 68274445 67930881 68633829 72159482
39311 72159482 76756718 78701053 77047634 74870536 75094262 76999229 78042728 77423137
$$ packed form
39367A1531475j487306l40437J24861j096215k771313k322159K28110J154223
39359E021239j869286n356549l871601K515460P884674P610348L016896j444204
39351A3506977k952784j404752J770306M214716L580425k39779m126988m329653
39343A0018468m74480L558101L475121n51448l700742k116856K181088L974283
39335A6363535K044613O60609K897180N788805M775468N35627k159349j188988
39327B9717500R69726J762069J544379J522729J714033K047418L178600N022169
39319D7478623O204595N891940M657632L027562J014093l43564P02948L525653
39311G2159482M597236J944335j653419k177098K23726J904967J043499o19591
$$ plain form
39303 77423137 76002083 73808115 69902727 64588198 59681721 56079767 52673248 48439860
39295 48439860 44223299 41406033 39890893 38505092 36504764 33581547 29449703 24974587
39287 24974587 22760968 24520110 28230815 30087506 29202856 28101931 28422548 28789195
39279 28789195 27669581 25559712 23018181 19355808 15370618 14809678 20107793 28206540
39271 28206540 33555024 34291580 32729528 30671949 27496176 22936422 18967193 18118458
39263 18118458 21320130 27314442 32966121 35040074 33385634 31323723 31113507 30758580
39255 30758580 27767291 23819542 21878109 20629407 16902742 12558948 12865787 17597330
39247 17597330 20109320 17149382 13551900 14231633 17196970 18555934 19345730 22159107
$$ packed form
39303G7423137j421054k193968l905388n314529m906477l601954l406519m233388
39295D8439860m216561k817266j515140j385801k000328k923217m131844m475116
39287B4974587k213619J759142L710705J856691q84650j100925L20617L66647
39279B8789195j119614k109869k541531l662373l985190n60940N298115Q098747
39271B8206540N348484P36556j562052k057579l175773m559754l969229q48735
39263A8118458L201672N994312N651679K073953j654440k061911k10216l54927
39255C0758580k991289l947749j941433j248702l726665m343794L06839M731543
39247A7597330K511990k959938l597482O79733K965337J358964P89796K813377
$$ plain form
39239 22159107 24841385 23335438 18456190 14495169 12773625 11598817 11165941 13245222
39231 13245222 16703492 18391604 18360359 19574678 22441462 24153016 23668483 22825439 22098689
39222 22098689 19923031 17011660 16508569 18442810 18798289 16056863 13942038 14998661
39214 14998661 16060504 13774314 10643069 11039953 14176176 15995111 16063641 17232203
39206 17232203 19208053 17969479 12526415 7700799 8177176 12965212 17729838 19965512
39198 19965512 19642405 16941850 12333197 8130772 7287489 10140073 13753915 14898634
39190 14898634 12872184 9399161 6792274 6585531 9115345 13556416 18276819 21541924
39182 21541924 22383564 21290244 20025772 19982928 20220885 17939378 11917827 4860388 781874
$$ packed form
39239B2159107K682278j505947m879248l961021j721544j174808m32876K079281
39231A3245222L458270J688112l1245J214319K866784J711554m84533q43044p26750
39222B2098689k175658k911371n03091J934241L55479k741426k114825J056623
39214A4998661J061843k286190l131245L96884L136223J818935O8530J168562
39206A7232203J975850j238574n443064m825616M76377M788036M764626K235674
39198A9965512l23107k700555m608653m202425q43283K852584L613842J144719
39190A4898634k026450l473023k606887k06743K529814M441071M720403L265105
39182B1541924Q41640j093320j264472m2844K37957k281507o021551p057439m078514
$$ plain form
39173 781874 257341 231907 -1035820 -1205719 2427453 8424400 12789699 13893185 13227137
39164 13227137 12041692 10278831 8834359 9622565 12361983 13940048 12337924 9149259
39156 9149259 7155066 7563997 10603600 16084534 21704087 23521698 20462532 16127799
39148 16127799 13849180 12394144 9349584 6144784 5830302 7655037 8143391 6637750
39140 6637750 5587012 5880385 6200473 6840808 9540101 12939133 12876687 8721537 5254795
39131 5254795 6254351 9817364 12155053 12543473 12021532 10458742 8005106 6851787 8247014
39122 8247014 9622054 7786133 3538179 268620 -665570 -314144 856932 3161324
39114 3161324 5523996 6152704 5354063 5205381 6379143 7496583 7736198 8034040 9375646
$$ packed form
39173G81874n24533k5434j267727j69899L633172N996947M365299J103486o66048
39164A3227137j185445j762861j444472P88206K739418J578065j602124l188665
39156I149259j994193M08931L039603N480934N619553J817611l059166m334733
39148A6127799k278619j455036l044560l204800l14482J824735M88354j505641
39140F637750j050738K93373L20088O40335K699293L399032o2446m155150l466742
39131E254795R99556L563013K337689L88420n21941j562790k453636j153319J395227
39122H247014J375040j835921m247954l269559r34190L51426J171076K304392
39114C161324K362672O28708p98641j48682J173762J117440K39615K97842J341606
$$ plain form
39105 9375646 11524761 13682522 15095133 15034725 13454138 11533400 10397251 9614669 8168491
39096 8168491 6362754 5335780 5242448 5537019 6517344 8684578 10856284 10992858 9097327
39087 9097327 7505593 7967549 9953967 12032912 13304219 13171633 11359561 8759377
39079 8759377 6885573 5914676 4547187 2410120 1251644 2738363 5924273 7994093
39071 7994093 7319338 5155636 4272380 6101778 9437967 12238196 14336585 17091872
39063 17091872 20093253 20241451 15759459 9585947 6370848 6861205 7808913 7049367 5757525
39054 5757525 5347149 5122670 4235563 3550118 3938257 4500566 4085196 3201233 2981870
39045 2981870 3437488 4015140 4676126 5143134 4377296 2299140 845829 1636464 3540793
$$ packed form
39105I375646K149115K157761J412611o0408j580587j920738j136149p82582j446178
39096H168491j805737j026974r3332K94571R80325K167234K171706J36574j895531
39087I097327j591734M61956J986418K078945J271307j32586j812072k600184
39079H759377j873804r70897j367489k137067j158476J486719L185910K069820
39071G994093o74755k163702q83256J829398L336189K800229K098389K755287
39063A7091872L001381J48198m481992o173512l215099M90357R47708p59546j291842
39054E757525m10376k24479q87107o85445L88139N62309m15370q83963k19363
39045B981870M55618N77652O60986M67008p65838k078156j453311P90635J904329
$$ plain form
39036 3540793 4297968 3736651 3533099 4355075 5189343 5257994 4775657 3878537 2562816
39027 2562816 1776153 2866391 5641893 8445685 10355136 11744864 12435283 11176621
39019 11176621 7811120 4381110 3041485 4062307 6681118 10361536 13931181 15059565
39011 15059565 12680570 9182457 8103058 9865774 11705784 11767292 11145456 11369302 12019892
39002 12019892 12128246 12227604 13165953 13892284 12560487 9653456 7962245 8909951 10620640
38993 10620640 10776045 10075826 11032849 13682955 14535626 10707469 3805511 -1721617 -3481819
38984 -3481819 -2768298 -1505775 165080 2173406 2497465 -584085 -4908838 -5881793 -2035271
38975 -2035271 3120888 5687633 5602425 4855800 3724668 1345073 -1209739 -1443392 927862
$$ packed form
39036C540793P57175n61317k03552Q21976Q34268O8651m82337q97120j315721
39027B562816p86663J090238K775502K803792J909451J389728O90419j258662
39019A1176621l365501l430010j339625J020822K618811L680418L569645J128384
39011A5059565k378995l498113j079399J762716J840010O1508o21836K23846O50590
39002A2019892J08354R9358R38349P26331j331797k907031j691211R47706J710689
38993A0620640J55405p00219R57023K650106Q52671l828157o901958n527128j760202
38984c481819P13521J262523J670855K008326L24059l081550m324753r72955L846522
38975b035271N156159K566745q5208p46625j131132k379595k554812k33653K371254
$$ plain form
38966 927862 3317801 3836079 3599390 4712246 7438615 10207780 11341036 10170398 7441178
38957 7441178 5054897 4404895 4653180 3830933 1940436 1447934 3964055 7847501 10150543
38948 10150543 9842262 8053068 6157245 4903629 4788189 5961213 7848967 9622622
38940 9622622 10927844 11774550 12056210 11469968 9563543 5975889 1432547 -1708152 -1296337
38931 -1296337 1983715 5216980 6753047 7454601 8073342 7573983 5336769 3160923 3305437
38922 3305437 5668434 8337871 9880037 9853545 8270781 5863356 3766222 1886698
38914 1886698 -1002418 -4631911 -6744218 -6514377 -5954942 -6053733 -4453911 157876 4309462
38905 4309462 4433923 2945584 4685041 8826564 10102773 7854713 7619206 12127880
$$ packed form
38966I27862K389939N18278k36689J112856K726369K769165J133256j170638k729220
38957G441178k386281o50002K48285q22247j890497m92502K516121L883446K303042
38948A0150543l08281j789194j895823j253616j15440J173024J887754J773655
38940I622622J305222Q46706K81660n86242j906425l587654m543342l140699M11815
38931a296337L280052L233265J536067P01554O18741m99359k237214k175846J44514
38922C305437K362997K669437J542166k6492j582764k407425k097134j879524
38914A886698k889116l629493k112307K29841N59435r8791J599822M611787M151586
38905D309462J24461j488339J739457M141523J276209k248060k35507M508674
$$ plain form
38897 12127880 16383771 14700163 8289990 2410149 -660431 -2074290 -2315670 -605112
38889 -605112 2561756 5297971 6450327 6139319 5045584 4512641 5979439 8800346 10107162
38880 10107162 8340812 5246342 2843126 615307 -2068749 -2982070 297032 5998897
38872 5998897 9708684 9863072 8930695 9393447 11192006 13130824 14318139 13907198 11520247
38863 11520247 8361412 6339601 6022405 6836224 8713925 11548094 13551660 12776088
38855 12776088 10330139 9400089 10499336 10335336 6491110 817496 -3368942 -5354253
38847 -5354253 -6302945 -6125672 -3645663 609947 4066658 4881249 3581856 1628203 -304820
38838 -304820 -1971613 -2618202 -1572918 560322 2369905 3447265 4816560 7045991
$$ packed form
38897A2127880M255891j683608o410173n879841l070580j413859k41380J710558
38889f05112L166868K736215J152356l11008j093735n32943J466798K820907J306816
38880A0107162j766350l094470k403216k227819k684056r13321L279102N701865
38872E998897L709787J54388r32377M62752J798559J938818J187315m10941k386951
38863A1520247l158835k021811l17196Q13819J877701K834169K003566p75572
38855A2776088k445949r30050J099247j64000l844226n673614m186438j985311
38847e354253r48692J77273K480009M255610L456711Q14591j299393j953653j933023
38838c04820j666793o46589J045284K133240J809583J077360J369295K229431
$$ plain form
38830 7045991 8731409 7881506 4529174 914904 -917362 -714636 737602 2599733
38822 2599733 3851479 3614127 2406566 1924155 2761090 3585504 3510897 3785201 5565809
38813 5565809 7259637 6131561 2019225 -2402008 -4761001 -4785495 -3371131 -1631931
38805 -1631931 -640400 -386163 737813 3606307 5996781 4977191 1561736 46182
38797 46182 1939728 3489585 887963 -4469946 -8019229 -7462916 -3975837 389254 3837232
38788 3837232 4463254 1827480 -1151175 -599697 3446448 6745629 6021148 2380888 -1141008
38779 -1141008 -3154937 -3595281 -1933242 1959629 6226301 8578756 8979439 8814704 7972004
38770 7972004 5266051 1810906 1069799 4361673 8639152 10341955 9501509 8125193
$$ packed form
38830G045991J685418q49903l352332l614270j832266K02726J452238J862131
38822B599733J251746k37352j207561m82411Q36935Q24414p4607K74304J780608
38813E565809J693828j128076m112336m421233k358993k4494J414364J739200
38805a631931R91531K54237J123976K868494K390474j019590l415455j515554
38797D6182J893546J549857k601622n357909l549283N56313L487079M365091L447978
38788C837232O26022k635774k978655N51478M046145L299181p24481l640260l521896
38779a141008k013929m40344J662039L892871M266672K352455M00683j64735q42700
38770G972004k705953l455145p41107L291874M277479J702803q40446j376316
$$ plain form
38762 8125193 6415324 3359428 18664 -900444 1151931 3719565 4677907 4304699 3710619
38753 3710619 3405115 3960618 5917392 8235500 8899391 7940750 7766556 9441806 10870076
38744 10870076 10112108 8368621 7799289 8213140 8014750 6915314 5524779 3570075 871997
38735 871997 -876262 309803 3882920 7518820 10055710 11728291 12251604 10959056
38727 10959056 8451735 5984633 3562334 725234 -1203275 -71199 3838631 7663462
38719 7663462 9351161 9424228 9269506 9389014 9461056 8714197 6485194 3764261 3345194
38710 3345194 6562344 10883539 13105651 13805346 15512743 17429162 16056167 11150255
38702 11150255 6766875 5389792 5105078 4172249 4316916 6964083 9705170 9694837 7988050
$$ packed form
38762H125193j709869l055896l340764r19108K052375K567634R58342l73208n94080
38753C710619l05504N55503J956774K318108O63891r58641j74194J675250J428270
38744A0870076p57968j743487n69332M13851j98390j099436j390535j954704k698078
38735H71997j748259J186065L573117L635900K536890J672581N23313j292548
38727A0959056k507321k467102k422299k837100j928509J132076L909830L824831
38719G663462J687699P3067j54722J19508P2042p46859k229003k720933m19067
38710C345194L217150M321195K222112O99695J707397J916419j372995m905912
38702A1150255m383380j377083k84714r32829J44667K647167K741087j0333j706787
$$ plain form
38693 7988050 7321205 7704676 7602071 7900828 10949365 16006850 18882135 16686050 10995970
38684 10995970 5930640 4367909 6040892 8278281 8685855 7637403 7497102 9026447
38676 9026447 9978785 8204249 4676987 2100374 1745819 3008228 4832217 6115021
38668 6115021 5891486 4702534 4815683 7666198 11939409 15202631 16209878 14792022
38660 14792022 11484983 8623009 9462994 14163240 18754301 20317020 20790387 22904292
38652 22904292 25085066 24432772 22633318 23905777 27996707 30453230 29966914 30210175
38644 30210175 33258779 36155930 36074122 34549016 33953083 33529702 32020948 31031376 32192922
38635 32192922 33351816 31342024 27045331 24072390 23294075 22148297 19103821 15634899
$$ packed form
38693G988050o66845L83471j02605K98757L048537N057485K875285k196085n690080
38684A0995970n065330j562731J672983K237389M07574j048452j40301J529345
38676I026447R52338j774536l527262k576613l54555J262409J823989J282804
38668F115021k23535j188952J13149K850515M273211L263222J007247j417856
38660A4792022l307039k861974Q39985M700246M591061J562719M73367K113905
38652B2904292K180774o52294j799454J272459M090930K456523m86316K43261
38644C0210175L048604K897151q1808j525106n95933m23381j508754r89572J161546
38635C2192922J158894k009792m296693k972941p78315j145778l044476l468922
$$ plain form
38627 15634899 13518562 12889006 13439300 15124660 16965335 17263226 15904130 14727557
38619 14727557 14804668 15016086 14215615 13040764 12258965 10972529 8458653 6770022 9039174
38610 9039174 15080118 20765389 22552294 21042633 18969852 17049685 13687719 8388507
38602 8388507 3417513 1247102 1549965 1985864 1633284 2375306 6306495 12391663 16727192
38593 16727192 16478234 12922044 9848545 9319478 10140539 10509475 10532130 11186142 12202241
38584 12202241 12559403 12214618 11600880 10041073 6700522 2875373 1128964 1941873 3330158
38575 3330158 4132018 5358327 7569195 9359656 9730482 9733548 10164825 9699435 7286035
38566 7286035 4621455 4020710 5189721 6304968 7031989 8060837 8679000 7571462 5723461
$$ packed form
38627A5634899k116337o29556N50294J685360J840675K97891j359096j176573
38619A4727557P7111K11418q00471j174851p81799j286436k513876j688631K269152
38610I039174O040944N685271J786905j509661k072781j920167l361966n299212
38602H388507m970994k170411L02863M35899l52580P42022L931189O085168M335529
38593A6727192k48958l556190l073499n29067Q21061L68936K2655O54012J016099
38584A2202241L57162l44785o13738j559807l340551l825149j746409Q12909J388285
38575C330158Q01860J226309K210868J790461L70826L066M31277m65390k413400
38566G286035k664580o00745J169011J115247P27021J028848O18163j107538j848001
$$ plain form
38557 5723461 5988775 9501643 14333849 17811217 18638006 16917574 13756919 10889957
38549 10889957 9287984 8109420 5996399 2941095 -141837 -2780222 -4532851 -4330391
38541 -4330391 -2045425 202214 300332 -1046966 -1758562 -1829745 -3110878 -6160868 -9477307
38532 -9477307 -11469027 -11313404 -8558746 -3906656 372694 2757285 4076583 4827698
38524 4827698 2944247 -2576473 -7781410 -7795564 -3637186 -422982 525211 2621187 6968613
38515 6968613 9902735 8985661 6655888 6045158 7277562 9609233 13168952 16754028
38507 16754028 17783062 16199044 14684721 13791163 11386051 8282895 8814145 13309628
38499 13309628 15846012 13107793 9821143 10763014 12750057 10377168 5276071 3128508
$$ packed form
38557E723461K65314L512868M832206L477368Q26789j720432l160655k866962
38549A0889957j601973j178564k113021l055304l082932k638385j752629K02460
38541d330391K284966K247639R8118j347298p11596p1183j281133l049990l316439
38532i477307j991720J55623K754658M652090M279350K384591J319298P51115
38524D827698j883451n520720n204937j4154M158378L214204R48193K095976M347426
38515F968613K934122r17074k329773o10730J232404K331671L559719L585076
38507A6754028J029034j584018j514323q93558k405112l103156N31250M495483
38499A3309628K536384k738219l286650R41871J987043k372889n101097k147563
$$ plain form
38491 3128508 4677746 6218086 6563373 7106254 6955123 4553325 2664499 5126629 9560169
38482 9560169 9901085 5677321 2066999 906145 -1105677 -4410161 -4334746 728001 5555182
38473 5555182 5917010 4590229 5731391 7960509 7382129 4092525 1500328 1380519 2969115
38464 2969115 5189499 7019580 7238834 6097631 5775208 7428685 9408619 9806352 8848155
38455 8848155 7457046 5664365 3915417 3648562 4899262 5404927 3609588 514490
38447 514490 -2628927 -5878843 -8435222 -7918042 -4034253 -370670 32921 -1126117 -63981
38438 -63981 3982647 8456241 10603169 9016436 4067723 -1082779 -1968373 2209284 6721993
38429 6721993 6671755 2498232 -2020625 -5121461 -7502414 -9138861 -9043908 -7550732 -6052220
$$ packed form
38491C128508J549238J540340L45287N42881j51131k401798j888826K462130M433540
38482I560169L40916m223764l610322j160854k011822l304484P5415N062747M827181
38473E555182L61828j326781J141162K229118n78380l289604k592197j19809J588596
38464B969115K220384J830081K19254j141203l22423J653477J979934L97733r58197
38455H848155j391109j792681j748948k66855J250700N05665j795339l095098
38447E14490l143417l249916k556379N17180L883789L663583M03591j159038J062136
38438f3981M046628M473594K146928j586733m948713n150502q85594M177657M512709
38429F721993n0238m173523m518857l100836k380953j636447R4953J493176J498512
$$ plain form
38420 -6052220 -4789495 -3000020 -767465 970288 1463430 -113528 -4420308 -9825640
38412 -9825640 -12496525 -10760887 -7401055 -5263443 -3043611 1283181 5197168 4314132
38404 4314132 -724960 -4583236 -4370056 -2369192 -1305017 -810029 379643 1980287
38396 1980287 3211991 3911689 3797616 2802624 2505574 4800711 8737661 11156453 10873447
38387 10873447 9724209 9156868 8724994 8618307 10461700 14100425 16339559 14807166
38379 14807166 11041424 7945856 5899880 3243821 -595055 -4156254 -5499115 -3729659
38371 -3729659 325665 4359552 6244925 5746493 3875466 1060270 -2460567 -4967018
38363 -4967018 -4443330 -1663573 307327 178943 -362247 10921 473081 516658 1358768
$$ packed form
38420f052220J262725J789475K232555J737753M93142j576958m306780n405332
38412i825640k670885J735638L359832K137612K219832M326792L913987q83036
38404D314132n039092l858276K13180K000864J064175M94988J189672J600644
38396A980287J231704O99698j14073r94992k97050K295137L936950K418792k83006
38387A0873447j149238n67341m31874j06687J843393L638725K239134j532393
38379A4807166l765742l095568k045976k656059l838876l561199j342861J769456
38371c729659M055324M033887J885373m98432j871027k815196l520837k506451
38363d967018N23688K779757J970900j28384n41190L73168M62160M3577Q42110
$$ plain form
38354 1358768 3380713 4742821 4298361 3505570 3574850 3157672 1196554 -188261 1448570
38345 1448570 4741192 6244360 5330431 4483909 5218343 6385065 6500681 5491984 3964708
38336 3964708 2546227 2044294 2701383 3288947 2313726 -15997 -2268890 -3754111 -4439021
38327 -4439021 -3365517 756180 7011264 12073486 13419160 11856808 10217573 10049037
38319 10049037 10087274 7926585 3084960 -1906049 -4058048 -3331951 -2338333 -2649003 -3089297
38310 -3089297 -2159961 -124353 2362884 5474619 8260646 7639063 2105989 -4805526
38302 -4805526 -7697044 -5452367 -1740882 101287 61266 -420448 -551947 -104148 560756
38293 560756 239878 -1281085 -1518887 1872474 6725412 8136840 5145838 2164455 2598719
$$ packed form
38354A358768K021945J362108m44460p92791O9280m17178j961118j384815J636831
38345A448570L292622J503168r13929q46522P34434J166722J15616j008697j527276
38336C964708j418481n01933O57089N87564r75221k329723k252893j485221o84910
38327d439021J073504M121697O255084N062222J345674j562352j639235j68536
38319A0049037L8237k160689m841625m991009k151999P26097R93618l10670m40294
38310c089297R29336K035608K487237L111735K786027o21583n533074o911515
38302d805526k891518K244677L711485J842169m0021m81714j31499M47799O64904
38293E60756l20878j520963k37802L391361M852938J411428k991002k981383M34264
$$ plain form
38284 2598719 4610206 5138250 4603898 4641715 4100580 1233115 -1890255 -1429044 2215293
38275 2215293 4414458 2870708 656156 1344554 3942507 4762449 2610192 -145733
38267 -145733 -1025897 -46406 1275199 2191186 3243696 4862647 6176067 5816565 3920971
38258 3920971 2488213 2996348 4230349 3671539 943855 -1480794 -1450162 208037 1081088
38249 1081088 425259 -66857 1499322 5058006 8598888 9808592 7926765 4586545
38241 4586545 2607134 3285519 5037323 5344298 3695885 1672937 525357 180972 642349
38232 642349 2331366 4176824 3410785 -858801 -5251662 -5589121 -2090618 1159893 1466055
38223 1466055 -329106 -2751403 -5488388 -7319994 -5518669 343124 6063858 6858775
$$ packed form
38284B598719K011487N28044n34352L7817n41135k867465l123370M61211L644337
38275B215293K199165j543750k214552O88398K597953Q19942k152257k755925
38267a45733q80164R79491J321605R15987J052510J618951J313420l59502j895594
38258C920971j432758N08135J234001n58810k727684k424649L0632J658199Q73051
38249A081088o55829m92116J566179L558684L540882J209704j881827l340220
38241D586545j979411O78385J751804L06975j648413k022948j147580l44385M61377
38232F42349J689017J845458p66039m269586m392861l37459L498503L250511L06162
38223A466055j795161k422297k736985j831606J801325N861793N720734P94917
$$ plain form
38215 6858775 2686729 -2375013 -4899614 -4326359 -1756311 967832 1762336 382242
38207 382242 -414243 1908956 5709817 6924623 4520750 1517117 542954 1254993 2612425
38198 2612425 4650356 6769386 6969923 4577158 1795738 920608 1597968 2208534 2203817
38189 2203817 1513656 -574060 -3902222 -6120358 -5063635 -1800450 553614 709578
38181 709578 407095 1992115 5898864 10240813 12192425 10468661 7122375 5881285
38173 5881285 7872065 10171353 9568342 6386204 3322205 1989387 2272855 3747937
38165 3747937 5693368 6678179 6218742 6107357 8058633 10702276 11040737 8400884 4827010
38156 4827010 2013885 116812 -722318 -198983 637376 27663 -1917918 -3312288 -3441984
$$ packed form
38215F858775m172046n061742k524601N73255K570048K724143P94504j380094
38207C82242p96485K323199L800861J214806k403873l003633r74163P12039J357432
38198B612425K037931K119030K00537k392765k781420q75130O77360O10566m717
38189B203817o90161k087716l328162k218136J056723L263185K354064J55964
38181G09578l02483J585020L906749M341949J951612j723764l346286j241090
38173E881285J990780K299288o03011l182138l063999j332818K83468J475082
38165C747937J945431R84811m59437j11385J951276K643643L38461k639853l573874
38156D827010k813125j897073q39130N23335Q36359o09713j945581j394370j29696
$$ plain form
38147 -3441984 -3481485 -3907418 -3607322 -2400815 -2086532 -3556868 -4787630 -3526357 -831529
38138 -831529 -150377 -3208240 -7975034 -10711949 -9609659 -6545197 -5212341 -7209450
38130 -7209450 -10473961 -12171520 -11983708 -11018990 -8741248 -3776387 2502842 6337904
38122 6337904 6270770 4756665 4106664 3546045 1804806 52629 114291 1638407 3174051
38113 3174051 4602714 6492442 8279446 9004818 8796208 7936710 5684031 1817697 -1851336
38104 -1851336 -3482602 -3714028 -4343844 -5666165 -7111914 -9246527 -12594661 -15352910
38096 -15352910 -15008138 -11904495 -8740993 -6789111 -5050975 -2960964 -1319603 -474536
38088 -474536 -136432 -1154355 -4660358 -8860726 -9592177 -5407774 229313 3282820 3649066
$$ packed form
38147c441984l9501m25933L00096J206507L14283j470336j230762J261273K694828
38138h31529O81152l057863m766794k736915J102290L064462J332856j997109
38130g209450l264511j697559J87812R64718K277742M964861O279229L835062
38122F337904o7134j514105o50001n60619j741239j752177O1662J524116J535644
38113C174051J428663J889728J787004P25372k08610q59498k252679l866334l669033
38104a851336j631266k31426o29816j322321j445749k134613l348134k758249
38096a5352910L44772L103643L163502J951882J738136K090011J641361Q45067
38088d74536L38104j017923l506003m200368p31451M184403N637087L053507L66246
$$ plain form
38079 3649066 3806393 4872284 5947031 6108479 5182001 3297682 1211196 413007 1560691
38070 1560691 3340849 4031801 3578840 2993006 2409192 1149762 -689854 -2149305 -2828428
38061 -2828428 -3184199 -3347450 -2783690 -1397203 43472 1081519 2314363 4108538 5095099
38052 5095099 3322686 -602926 -2815898 -342639 4229463 4434658 -2467083 -11208696
38044 -11208696 -13887658 -8754712 -1341409 2746809 3283056 3074686 3157152 2437019 469521
38035 469521 -1729116 -3167124 -3554149 -2744775 -763085 1702910 3668857 4570033 4184566
38026 4184566 2460848 29648 -1788473 -2156656 -1292378 481399 3077777 5413623
38018 5413623 5457631 2886537 288753 -35157 778271 325918 -909455 -451791 1574654
$$ packed form
38079C649066J57327J065891J074747J61448r26478j884319k086486p98189J147684
38070A560691J780158O90952m52961n85834n83814j259430j839616j459451o79123
38061b828428l55771j63251N63760J386487J440675J038047J232844J794175R86561
38052E095099j772413l925612k212972K473259M572102K05195o901741q741613
38044a1208696k678962N132946P413303M088218N36247k08370Q2466p20133j967498
38035D69521k198637j438008l87025Q09374J981690K465995J965947R01176l85467
38026D184566j723718k431200j818121l68183Q64278J773777K596378K335846
38018E413623M4008k571094k597784l23910Q13428m52353j235373M57664K026445
$$ plain form
38009 1574654 2050052 -314823 -2803463 -2707623 -897983 416908 1127928 1994812 1884020
38000 1884020 -643108 -3931244 -4746900 -3165686 -2689954 -4733556 -6179808 -4182470
37992 -4182470 -642900 797027 328941 1228654 4356961 6940712 7125346 6383312 6187384
37983 6187384 5306956 2447990 -837939 -2458367 -3196705 -4881694 -6347637 -4583080
37975 -4583080 347418 4758202 6105246 5361607 4005892 1745657 -1349430 -3241566
37967 -3241566 -2548222 -801647 -125374 -418517 -861682 -2447341 -6442490 -11409857 -14219356
37958 -14219356 -13429071 -9778149 -4422702 1007124 3737527 2265055 -930116 -1974966
37950 -1974966 -786027 -742203 -3180731 -5565319 -5781688 -4779221 -3551772 -930043 3260776
$$ packed form
38009A574654M75398k364875k488640R5840J809640J314891P11020Q66884j10792
38000A884020k527128l288136q15656J581214M75732k043602j446252J997338
37992d182470L539570J439927m68086Q99713L128307K583751J84634p42034j95928
37983F187384q80428k858966l285929j620428p38338j684989j465943J764557
37975d583080M930498M410784J347044p43639j355715k260235l095087j892136
37967c241566O93344J746575O76273k93143m43165j585659l995149m967367k809499
37958a4219356P90285L650922N355447N429826K730403j472472l195171j044850
37950a974966J188939M3824k438528k384588k16369J002467J227449K621729M190819
$$ plain form
37941 3260776 5726439 3583317 -987630 -3140039 -1529397 883097 1875497 2945783
37933 2945783 6654932 12994170 19233811 22351678 21377894 18242465 16225566 16721145
37925 16721145 17978428 17985854 17530572 18511182 20047289 19043418 14848635 10606425 8973187
37916 8973187 8982493 8726736 8870556 11078260 14383830 15948165 15100602 14124481 14714447
37907 14714447 15813021 15789253 15014408 14919151 15420579 14689393 11490424 7121018 4827302
37898 4827302 7078874 12904533 18042905 18604592 14828892 10513507 8712126 9134014
37890 9134014 10001294 10735684 11571370 11883160 10850314 9316665 9156486 10744947 12606799
37881 12606799 13760463 14870570 16544856 17809769 17117923 14134476 10019795 6544834
$$ packed form
37941C260776K465663k143122m570947k152409J610642K412494R92400J070286
37933B945783L709149O339238O239641L117867r73784l135429k016899M95579
37925A6721145J257283P426m55282R80610J536107j003871m194783m242210j633238
37916H973187R306k55757J43820K207704L305570J564335q47563r76121N89966
37907A4714447J098574k3768p74845r5257N01428p31186l198969m369406k293716
37898D827302K251572N825659N138372N61687l775700m315385j801381M21888
37890I134014Q67280P34390Q35686L11790j032846j533649j60179J588461J861852
37881A2606799J153664J110107J674286J264913o91846k983447m114681l474961
$$ plain form
37873 6544834 5019048 5173339 5073109 3338306 1439028 2088090 5109523 7178099 6646285
37864 6646285 6087529 7998296 10229883 8835835 4224588 837265 690755 702804 -2511960
37855 -2511960 -7991244 -12103572 -12701777 -9925754 -4761904 1032282 4760015 4913365
37847 4913365 3262264 3034974 4995481 6847662 6711422 5656810 5992457 8034992 9738606
37838 9738606 9379688 7616673 6346175 6022042 5113899 2510660 -449858 -1217991 1182871
37829 1182871 5520465 10013841 13337020 14244885 12020503 7906716 4660709 3779412
37821 3779412 4182969 4355374 4537853 5709246 7522444 8756615 9208246 9695937 10492841
37812 10492841 11018653 10887676 10125676 8592825 6409888 4749669 4781163 5755979 5626906
$$ packed form
37873F544834j525786J54291j00230j734803j899278O49062L021433K068576n31814
37864F646285n58756J910767K231587j394048m611247l387323j46510J2049l214764
37855b511960n479284m112328n98205K776023N163850N794186L727733J53350
37847D913365j651101k27290J960507J852181j36240j054612L35647K042535J703614
37838I738606l58918j763015j270498l24133r08143k603239k960518p68133K400862
37829A182871M337594M493376L323179R07865k224382m113787l246007q81297
37821C779412M03557J72405J82479J171393J813198J234171M51631M87691P96904
37812A0492841N25812j30977p62000j532851k182937j660219L1494R74816j29073
$$ plain form
37803 5626906 3966254 2812678 3809004 5745909 6177595 4726480 3410662 3927167 5928460
37794 5928460 8180800 10186025 11927535 12928665 12779739 12312049 12865428 14002022 13250913
37785 13250913 9212312 4060276 1443135 2177430 3682169 3831725 3445304 4031947 4916460
37776 4916460 4485548 3218611 3191314 4735695 5806947 5189670 4332228 4833467 5698002
37767 5698002 4832738 2427307 906418 1578863 3093861 3705733 3505529 3387855 3038476
37758 3038476 1501191 -854715 -2690225 -4023928 -6372373 -9861776 -11849675 -9860749
37750 -9860749 -4946692 -592672 1199116 1257276 1117630 1389947 2348043 4224436 6078004
37741 6078004 5848184 2769281 -1108108 -2954205 -2272251 -1007690 -777073 -927247 323459
$$ packed form
37803E626906j660652j153576R96326J936905M31686j451115j315818N16505K001293
37794E928460K252340K005225J741510J001130j48926m67690N53379J136594p51109
37785A3250913m038601n152036k617141P34295J504739J49556l86421N86643Q84513
37776D916460m30912j266937k7297J544381J071252o17277q57442N01239Q64535
37767E698002q65264k405431j520889O72445J514998O11872k00204j17674l49379
37758C038476j537285k355906j835510j333703k348445l489403j987899J988926
37750i860749M914057M354020J791788N8160j39646K72317R58096J876393J853568
37741F078004k29820l078903l877389j846097O81954J264561K30617j50174J250706
$$ plain form
37732 323459 3186698 5343716 4320038 827328 -1445893 -288565 2000756 1811140
$$ packed form
37732C23459K863239K157018j023678l492710k273221J157328K289321j89616
$$ [...]
##END NTUPLES=NMR SPECTRUM
##END=
