##TITLE=31Pdec_DE-80H_F
 D2O, 64 sc
 10.2.2025
##JCAMPDX= 6.0         $$ Bruker NMR JCAMP-DX V2.0
##DATA TYPE= NMR SPECTRUM
##DATA CLASS= NTUPLES
##ORIGIN= UXNMR, Bruker Analytische Messtechnik GmbH
##OWNER= root
$$ XWIN-NMR		Version 3.5
$$ Mon Feb 10 16:38:40 2025 Russian Standard Time (UT+4h)  she@DPX200
##.OBSERVE FREQUENCY= 81.013821
##.OBSERVE NUCLEUS= ^31P
##.ACQUISITION MODE= SIMULTANEOUS
##.ACQUISITION SCHEME= undefined
##.AVERAGES= 64
##.DIGITISER RES= 17
##SPECTROMETER/DATA SYSTEM= spect
##.PULSE SEQUENCE= zgpg30
##.SOLVENT NAME= CDCl3
##.SHIFT REFERENCE= (INTERNAL, CDCl3, 0, 198.062)
##AUDIT TRAIL= $$ (NUMBER, WHEN, WHO, WHERE, WHAT)
$$ ##TITLE= Audit trail, XWIN-NMR		Version 3.5
$$ ##JCAMPDX= 5.01
$$ ##ORIGIN= Bruker BioSpin GmbH
$$ ##OWNER= she
$$ F:/spectra/data/she/nmr/P31/2/pdata/1/auditp.txt
$$ ##AUDIT TRAIL=  $$ (NUMBER, WHEN, WHO, WHERE, WHAT)
(   1,<2025-02-10 16:35:52.96 +0400>,<she>,<DPX200>,
      <created by zg, POWCHK disabled, PULCHK disabled
       configuration hash MD5:
       00 E9 B6 7A A2 85 ED C7 34 08 36 98 17 FE 4E 26
       data hash MD5: 32K
       A5 0B 45 6C B7 A0 18 E0 76 0F D4 7C 80 60 40 FE>)
(   2,<2025-02-10 16:35:55.73 +0400>,<she>,<DPX200>,
      <Start of raw data processing
       efp BC_mod = 2 LB = 1.5 FT_mod = 6 PKNL = 1 PHC0 = 1622.727 PHC1 = 351.2954 SI = 64K 
       data hash MD5: 64K
       48 56 72 8B 6F 1F 1C FB C8 55 91 A5 CE DE 3D CA>)
(   3,<2025-02-10 16:36:07.82 +0400>,<she>,<DPX200>,
      <abs ABSG = 5 
       data hash MD5: 64K
       11 53 FA 73 91 5F 8D A0 74 7E 00 AC ED 71 07 E0>)
(   4,<2025-02-10 16:36:28.10 +0400>,<she>,<DPX200>,
      <pk PHC0 = -14.02381 PHC1 = 0 
       data hash MD5: 64K
       71 A9 B1 A5 E9 AD 30 0F 56 9B 46 56 E5 00 8D 5D>)
$$ ##END=
$$ 
$$ hash MD5
$$ DF 85 5A E6 6D DD 47 C0 9B 6B 6C E7 3F D9 83 0E
##$RELAX= 
##$RELAX= 
##$RELAX= 
##$RELAX= 
##$RELAX= 
##$RELAX= 
##$RELAX= 
##$RELAX= 
$$ Bruker specific parameters
$$ --------------------------
##$DU= <F:/spectra>
##$EXPNO= 2
##$NAME= <P31>
##$PROCNO= 1
##$TYPE= <nmr>
##$USER= <she>
##$AMP= (0..31)
100 100 100 100 100 100 100 100 100 100 100 100 100 100 100 100 100 100 
100 100 100 100 100 100 100 100 100 100 100 100 100 100 
##$AQSEQ= 0
##$AQ_mod= 1
##$AUNM= <au_zg>
##$AUTOPOS= <>
##$BF1= 81.014009
##$BF2= 200.13
##$BF3= 200.13
##$BF4= 200.13
##$BF5= 200.13
##$BF6= 200.13
##$BF7= 200.13
##$BF8= 200.13
##$BYTORDA= 1
##$CFDGTYP= 0
##$CFRGTYP= 5
##$CHEMSTR= <none>
##$CNST= (0..31)
1 1 145 1 1 1 1 1 1 1 1 1 1 1 1 1 1 1 1 1 1 1 1 1 1 1 1 1 1 1 1 1 
##$CPDPRG= <waltz16>
##$CPDPRG1= <>
##$CPDPRG2= <waltz16>
##$CPDPRG3= <>
##$CPDPRG4= <mlev>
##$CPDPRG5= <mlev>
##$CPDPRG6= <mlev>
##$CPDPRG7= <mlev>
##$CPDPRG8= <mlev>
##$CPDPRGB= <>
##$CPDPRGT= <>
##$D= (0..31)
0 1 0 0 0 0 0 0 0 0.06 0 0.03 2e-05 3e-06 0 0 0.0002 0 0 0 0 0 0 0 0 0 
0 0 0 0 0 0 
##$DATE= 1739190952
##$DBL= (0..7)
120 120 120 11 120 120 24 19 
##$DBP= (0..7)
150 150 150 150 150 150 150 150 
##$DBP07= 0
##$DBPNAM0= <>
##$DBPNAM1= <>
##$DBPNAM2= <>
$$ [...]
##$SUBNAM3= <"">
##$SUBNAM4= <"">
##$SUBNAM5= <"">
##$SUBNAM6= <"">
##$SUBNAM7= <"">
##$SUBNAM8= <"">
##$SUBNAM9= <"">
##$SW= 400.765351723535
##$SWIBOX= (0..15)
0 1 3 0 0 0 0 0 0 0 0 0 0 0 0 0 
##$SW_h= 32467.5324675325
##$TD= 32768
##$TD0= 1
##$TE= 0
##$TE2= 300
##$TE3= 300
##$TEG= 300
##$TL= (0..7)
0 120 53 12 22 120 120 120 
##$TP= (0..7)
150 150 150 150 150 150 150 150 
##$TP07= 0
##$TPNAME0= <>
##$TPNAME1= <>
##$TPNAME2= <>
##$TPNAME3= <>
##$TPNAME4= <>
##$TPNAME5= <>
##$TPNAME6= <>
##$TPNAME7= <>
##$TPOAL= (0..7)
0.5 0.5 0.5 0.5 0.5 0.5 0.5 0.5 
##$TPOFFS= (0..7)
0 0 0 0 0 0 0 0 
##$TUNHIN= 0
##$TUNHOUT= 0
##$TUNXOUT= 0
##$USERA1= <user>
##$USERA2= <user>
##$USERA3= <user>
##$USERA4= <user>
##$USERA5= <user>
##$V9= 5
##$VALIST= <valist>
##$VCLIST= <CCCCCCCCCCCCCCC>
##$VD= 0
##$VDLIST= <DDDDDDDDDDDDDDD>
##$VPLIST= <PPPPPPPPPPPPPPP>
##$VTLIST= <TTTTTTTTTTTTTTT>
##$WBST= 1024
##$WBSW= 4
##$XGAIN= (0..3)
0 0 0 0 
##$XL= 0
##$YL= 0
##$YMAX_a= 3334
##$YMIN_a= -5203
##$ZGOPTNS= <>
##$ZL1= 120
##$ZL2= 120
##$ZL3= 120
##$ZL4= 120
##$ABSF1= 198.0616
##$ABSF2= -202.7028
##$ABSG= 5
##$ABSL= 3
##$ALPHA= 0
##$AQORDER= 0
##$ASSFAC= 0
##$ASSFACI= 0
##$ASSFACX= 0
##$ASSWID= 0
##$AUNMP= <proc_1d>
##$AZFE= 0.1
##$AZFW= 0.5
##$BCFW= 0
##$BC_mod= 2
##$BYTORDP= 0
##$COROFFS= 0
##$CY= -3
##$DATMOD= 1
##$DC= 0
##$DFILT= <>
##$DTYPP= 0
##$F1P= 0
##$F2P= 0
##$FCOR= 1
##$FTSIZE= 65536
##$FT_mod= 6
##$GAMMA= 0
##$GB= 0
##$INTBC= 1
##$INTSCL= 9.790993e-09
##$ISEN= 30
##$LB= 1.5
##$LEV0= 0
##$LPBIN= 0
##$MAXI= 10000
##$MC2= 0
##$MEAN= 0
##$ME_mod= 0
##$MI= 50
##$NCOEF= 0
##$NC_proc= -9
##$NLEV= 6
##$NOISF1= 182.463
##$NOISF2= 159.3651
##$NSP= 0
##$NTH_PI= 0
##$NZP= 0
##$OFFSET= 198.0616
##$PC= 4
##$PHC0= 1608.703
##$PHC1= 351.2954
##$PH_mod= 1
##$PKNL= yes
##$PPARMOD= 0
##$PSCAL= 0
##$PSIGN= 0
##$REVERSE= no
##$SF= 81.0140089999434
##$SI= 65536
##$SIGF1= 159.3651
##$SIGF2= -187.1042
##$SINO= 113.3802
##$SIOLD= 16384
##$SREGLST= <1H.CDCl3>
##$SSB= 0
##$STSI= 65536
##$STSR= 0
##$SW_p= 32467.5324675325
##$SYMM= 0
##$S_DEV= 0
##$TDeff= 32768
##$TDoff= 0
##$TI= <>
##$TILT= no
##$TM1= 0
##$TM2= 0
##$TOPLEV= 0
##$USERP1= <user>
##$USERP2= <user>
##$USERP3= <user>
##$USERP4= <user>
##$USERP5= <user>
##$WDW= 1
##$XDIM= 65536
##$YMAX_p= 349500201
##$YMIN_p= -161048098
$$ End of Bruker specific parameters
$$ ---------------------------------
##NTUPLES= NMR SPECTRUM
##VAR_NAME=  FREQUENCY,     SPECTRUM/REAL,   SPECTRUM/IMAG
##SYMBOL=    X,             R,               I
##VAR_TYPE=  INDEPENDENT,   DEPENDENT,       DEPENDENT
##VAR_FORM=  AFFN,          ASDF,            ASDF
##VAR_DIM=   65536,         65536,           65536
##UNITS=     HZ,            ARBITRARY UNITS, ARBITRARY UNITS
##FACTOR=    0.49542278885378, 1,            1
##FIRST=     16045.7642231865, 0,            0
##LAST=      -16421.768244346, 0,            0
##MIN=       -16421.768244346, -161048098,   0
##MAX=       16045.7642231865, 349500201,    0
$$ Real data points
##PAGE= N=1
##DATA TABLE= (X++(R..R)), XYDATA
$$ [...]
##PAGE= N=2
##DATA TABLE= (X++(I..I)), XYDATA
7354a113641l258599j990781l79499j343959k969886j483166K449481M355668
$$ -1113641 -4372240 -6363021 -6742520 -8086479 -11056365 -12539531 -10090050 -5734382
7346e734382K641552N75650P86982J603129O40151j214656j871657j586211j670062
$$ -5734382 -3092830 -2517180 -1730198 -127069 513082 -701574 -2573231 -4159442 -5829504
7337e829504j571529k12182J245939J184175Q47759K060831K433913k118913r286038
$$ -5829504 -7401033 -7613215 -6367276 -5183101 -4335342 -2274511 159402 -1959511 -11245549
7328a1245549j0395491j752789Q679086J0729985M858752k88774j016121j916958
$$ -11245549 -21641040 -23393829 -14714743 -3984758 873994 585220 -430901 -2347859
7320b347859n747840p788255l862736K154356M080786K472768K150205L536082
$$ -2347859 -8095699 -15883954 -19746690 -17592334 -13511548 -11038780 -8888575 -5352493
7312e352493K931517K98302L9697L098276M340171M78508m117835l358672J704628
$$ -5352493 -2420976 -2122674 -2082977 1015299 5355470 5833978 1716143 -1642529 62099
7303F2099M098360J22420o088472p750268l138411K982047M950434K144323j306904
$$ 62099 4160459 4282879 -1805593 -9555861 -12694272 -9712225 -4761791 -2617468 -3924372
7294c924372k206904j823561k714320l982968k363143K625275P449937Q772081
$$ -3924372 -6131276 -7954837 -10669157 -14652125 -17015268 -14389993 -6940056 1832025
7286A832025O532800K564218j352171l398228k348663L43960J224923q44763k827891
$$ 1832025 8364825 10929043 9576872 6178644 3829981 4173941 5398864 4554101 1726210
7277A726210j685463J093998J325186k039827m922071k594300M660696J1228956
$$ 1726210 40747 1134745 2459931 420104 -4501967 -7096267 -2435571 8793385
7269H793385J1893469P427551L214092K203939J503444k573674q472511j1339404
$$ 8793385 20686854 28114405 31328497 33532436 35035880 32462206 23989695 12650291
7261A2650291r448952n292488j246893K123874M050102L904693L388922M177333
$$ 12650291 3201339 -2091149 -3338042 -1214168 2835934 6740627 10129549 14306882
7253A4306882L663714j774365q990348r911505l098135L081131K305263r96194
$$ 14306882 17970596 16196231 7205883 -2705622 -5803757 -2722626 -417363 -1413557
7245a413557K05250M461384N607496L196646J390869K09209l607029p897103o086420
$$ -1413557 -1208307 3253077 8860573 12057219 13448088 13657297 10050268 2153165 -3933255
7236c933255J686162O468682K725861m038575o119064m320402m204634n738646
$$ -3933255 -2247093 4221589 6947450 2908875 -3210189 -7530591 -11735225 -17473871
7228a7473871l608298L312550R172073Q933866M273895j19508k242432k174766
$$ -17473871 -21082169 -17769619 -8597546 336320 4610215 4490707 2248275 73509
7220G3509P37914N811930Q018057K612903o591241r177424j301833P916659P953242
$$ 73509 811423 6623353 14641410 17254313 10663072 1485648 183815 8100474 16053716
7211A6053716Q09609l370892j965679k060731o618525q627129l380495K419469
$$ 16053716 16863325 13492433 11526754 9466023 2847498 -5779631 -9160126 -6740657
7203f740657J125909l134589j318976N375251P441421K554227j164452J462610
$$ -6740657 -5614748 -8749337 -10068313 -4693062 2748359 5302586 4138134 5600744
7195E600744N276275M129691J58772r86444R81118J677481j400910o634035j0482965
$$ 5600744 10877019 15006710 15165482 14179038 15160156 16837637 15436727 8802692 -1680273
7186a680273r707275l808094K976084M827552J096905l012486l747237k914602
$$ -1680273 -11387548 -15195642 -12219558 -7392006 -6295101 -9307587 -13054824 -15969426
7178a5969426k735204j186601L603834P779289N676600j864439p567222o405341
$$ -15969426 -18704630 -19891231 -16287397 -8508108 -2831508 -4695947 -12263169 -18668510
7170a8668510j149831J638082o30769l959550k773595L042209P573124O374835
$$ -18668510 -19818341 -18180259 -18811028 -22770578 -25544173 -22501964 -14928840 -8554005
7162h554005K378392J232026K620786J371554l163170n219996j841704K461207
$$ -8554005 -6175613 -4943587 -2322801 -951247 -4114417 -9334413 -11176117 -8714910
7154h714910L613063M167253O433902N433036l463430j3585353j3019371j264280
$$ -8714910 -5101847 -934594 5499308 10932344 7468914 -6116439 -19135810 -20400090
7146b0400090Q863751P974665J226308j071582K230769M005797O32684l541500
$$ -20400090 -11536339 -3561674 -2335366 -3406948 -1176179 2829618 3462302 -79198
7138g9198l500392m04854Q83905j465831m511247m856477k549966R673J508316
$$ -79198 -3579590 -3984444 -3100539 -4566370 -9077617 -13934094 -16484060 -16474387 -14966071
7129a4966071K397530K776233J751114n99686k426129k208283l48419J977895
$$ -14966071 -12568541 -9792308 -8041194 -8640880 -11067009 -13275292 -13623711 -11645816
7121a1645816L970679M538260K605237o00898j693890N77699L005884J970745
$$ -11645816 -7675137 -3136877 -531640 -1132538 -2826428 -2248729 757155 2727900
7113B727900j851462n077928o228521n972392m150606j5309M754435O399327L237522
$$ 2727900 876438 -4201490 -10430011 -16402403 -20553009 -20568318 -15813883 -9414556 -6177034
7104f177034k279472n955142n107340q5221N705514P875528N158912J165040K52583
$$ -6177034 -8456506 -14411648 -19518988 -19604209 -13898695 -6023167 -864255 300785 553368
7095E53368K146262K713942j69023l790357m121846o43461L093264L380092P36328
$$ 553368 2699630 5413572 5244549 1454192 -2667654 -3311115 -217851 3162241 3898569
7086C898569k86275K889804N992168K626861n786415r948305n174148J410753
$$ 3898569 3612294 6502098 12494266 15121127 9334712 -613593 -5787741 -4376988
7078d376988J053606l965584m826107j03379L396418K874151L328492P175326
$$ -4376988 -3323382 -7288966 -12115073 -12218452 -8822034 -5947883 -2619391 4555935
7070D555935Q680426L232222m299271n952013j224273L761207M603938J684511
$$ 4555935 13236361 16468583 12169312 6217299 4993026 8754233 13358171 15042682
7062A5042682k601876n395872m106800L59071K569095j411113p958238r410420
$$ 15042682 12440806 7044934 2938134 3297205 5866300 4455187 -3503051 -12913471
7054a2913471l166835N673400J0282726Q039850J127181n705337p730549l384456
$$ -12913471 -16080306 -10406906 -124180 7915670 9042851 3337514 -4393035 -7777491
7046g777491L811624P666580M848958j840736n880773l280466L009123N835582
$$ -7777491 -3965867 3700713 8549671 6708935 828162 -2452304 556819 6392401
7038F392401K200234k665820k153971K481672M275417J337895o66886J589421
$$ 6392401 8592635 5926815 3772844 6254516 10529933 11867828 11200942 12790363
7030A2790363L359487N8936m486875m072152m32474n33602n452892q931527o853104
$$ 12790363 16149850 16208786 11721911 7649759 7217285 6683683 1230791 -7700736 -14553840
7021a4553840j946723J830215M121426N678727N524386K869797j076965m719291
$$ -14553840 -16500563 -14670348 -10548922 -4870195 654191 3523988 2447023 -2272268
7013b272268p049272o478905j850014M466178P612179N679967J535042j567732
$$ -2272268 -9321540 -15800445 -17650459 -13184281 -5572102 107865 1642907 75175
7005G5175l217226l833803k929861j098772n36913j372421l24274M324640Q829806
$$ 75175 -3142051 -6975854 -9905715 -11004487 -11541400 -12913821 -13238095 -8913455 -83649
6996h3649Q283454L391640l35702J46470J819072l980n497379r876140q860692
$$ -83649 8199805 11591445 11255743 11402213 13221285 13217305 7719926 -2156214 -11016906
6987a1016906l657691M44531M32535j170152o38284J297421R97981j924698l718849
$$ -11016906 -14674597 -14230066 -13797531 -14967683 -15605967 -14308546 -13310565 -15235263 -18954112
6978a8954112j907756K073734O238789R981538J1360187P093205j742110p892431
$$ -18954112 -20861868 -18788134 -12549345 -2567807 8792380 15885585 14143475 6251044
6970F251044n833605J096897N343322M593729K357953J059929l67625k606179
$$ 6251044 417439 1514336 6857658 11451387 13809340 14869269 14501644 11895465
6962A1895465m494087n723882o917709o834078l655943O48921J805266j54129
$$ 11895465 7401378 1677496 -5240213 -12074291 -15730234 -15081313 -13276047 -13430176
6954a3430176o29704J744210K374330j470982n303937m045078K97840K563184
$$ -13430176 -14059880 -12315670 -9941340 -11412322 -16716259 -20761337 -20463497 -17900313
6946a7900313K509471L153973L655189N70032m740833o653630l621286M5322J453518
$$ -17900313 -15390842 -12236869 -8581680 -8011648 -12752481 -19406111 -23027397 -22982075 -21528557
6937b1528557K149484K880866K075517J439150N474587J1774540R911569l567708
$$ -21528557 -19379073 -16498207 -14422690 -12983540 -7508953 4265587 14177156 10609448
6929A0609448j6121441j3949438p80427P989190O682076L600018M774328N786175
$$ 10609448 -5511993 -19461431 -20241858 -12252668 -5570592 -1970574 2803754 8589929
6921H589929K603906o89745n08458q27470m808884p010951j852638O013599Q114095
$$ 8589929 11193835 10504090 9995632 9168162 4359278 -2651673 -4504311 1509288 9623383
6912I623383M547557J572768L21128k986706p522022p950979m013700j363239
$$ 9623383 14170940 15743708 16064836 13078130 5556108 -2394871 -6408571 -7771810
6904g771810j876300j291112J712334K210557j878232m726491j356246M251756
$$ -7771810 -9648110 -10939222 -9226888 -7016331 -8894563 -13621054 -14977300 -10725544
6896a0725544N180338J674332j73783K570829O761220Q152067N774677J852170
$$ -10725544 -5545206 -3870874 -4044657 -1473828 5287392 13439459 19214136 21066306
6888B1066306n27061l53464j55897k760826o308521n816034p40710L180345J896136
$$ 21066306 20539245 20185781 20029884 17269058 10960537 5144503 4403793 7584138 9480274
6879I480274j316035j443693Q13862J396227k24197j192825n90274j59382n83552
$$ 9480274 8164239 6720546 7534408 8930635 8706438 7513613 6923339 6763957 6180405
6870F180405q05811n25523l20634R966O11062K26692j749686l415835l215040
$$ 6180405 5374594 4849071 4528437 4538403 5149465 5376157 3626471 210636 -3004404
6861c004404k649096l069176k250585J720762N441587M203248m33268k601532
$$ -3004404 -5653500 -8722676 -10973261 -9252499 -3810912 392336 -40932 -2642464
6853b642464r44842L34600q08805j662616q15936o03511j473454R1291M874143
$$ -2642464 -3587306 -3252706 -4061511 -5724127 -6540063 -7143574 -8617028 -8525737 -3651594
6844c651594P527971M020059j811178l631018j095533J687762L213745M729373
$$ -3651594 3876377 7896436 6085258 2454240 1358707 3046469 6260214 10989587
6836A0989587N149868J653290m554754q010505n809211j204593Q73235p16321
$$ 10989587 16139455 17792745 13237991 5227486 -581725 -1786318 -913083 -1629404
6828a629404l396328m225701k237191Q08630J447805j883828n932651n600934
$$ -1629404 -5025732 -9251433 -11488624 -10679994 -9232189 -11116017 -17048668 -22649602
6820b2649602n74214L578252K446515j453229k330724J196798N151541O212922
$$ -22649602 -23223816 -19645564 -17199049 -18652278 -20983002 -19786204 -14634663 -8421741
6812h421741N230618M077482K298856q70288l284473j858291K540251M920484
$$ -8421741 -3191123 886359 3185215 2314927 -969546 -2827837 -287586 4632898
6804D632898J863845m175111p326767m324013K520412P708052P553296L371328
$$ 4632898 6496743 2321632 -5005135 -9329148 -6808736 899316 8452612 11823940
6796A1823940j76916l71409N57977j061512m753188o422145m482588k139919k227716
$$ 11823940 11647024 11275615 11833592 10772080 6018892 -403253 -4885841 -7025760 -9253476
6787i253476l024038j740326N24680P96213n28202l56811J788107L024247K069766
$$ -9253476 -12277514 -14017840 -13493160 -12696947 -13225149 -13581960 -11793853 -8769606 -6699840
6778f699840J472065L548508O565241O600687K026861m731540r103340p973783
$$ -6699840 -5227775 -1679267 4885974 11486661 13513522 8781982 -321358 -8295141
6770h295141k496111K708277M006543J877681j018611k988710k816160J230917
$$ -8295141 -10791252 -8082975 -4076432 -2198751 -3217362 -6206072 -9022232 -7791315
6762g791315Q239132J2279594Q032852j466482p350781n519178j54289L652743
$$ -7791315 447817 12727411 20760263 19293781 11943000 6423822 6269533 9922276
6754I922276N074868L742927k692034j2795355j8128305j1857703J535971J0393827
$$ 9922276 14997144 18740071 16048037 3252682 -14875623 -26733326 -25197355 -14803528
6746a4803528Q944730K150870j869224l17054L565322N045782K342727j789699
$$ -14803528 -5858798 -3707928 -5577152 -5894206 -2328884 2716898 5059625 3269926
6738C269926k774058N46406M352923M697955K187715j053q26450j435292j996891
$$ 3269926 495868 1042274 5395197 10093152 12280867 12279814 11453364 10018072 8021181
6729H021181j538683k22573Q74160J637730K213408J357276j783314m954524m772946
$$ 8021181 6482498 6259925 7134085 8771815 10985223 12342499 10559185 5604661 831715
6720H31715j190359K576017M312013M516121M140810L269637K134031J168181
$$ 831715 -358644 2217373 6529386 11045507 15186317 18455954 20589985 21758166
6712B1758166k9197j873992l289757l102693k454747l491741n924826p105451
$$ 21758166 21728969 19854977 16565220 13462527 11007780 7516039 1591213 -5514238
6704e514238n298160j093364L599383O087835M046095j190850m310199k433627
$$ -5514238 -10812398 -11905762 -8306379 -2218544 1827551 636701 -3673498 -6107125
6696f107125J53609j802506n534947l715416L612296P863226M336549j229410
$$ -6107125 -5953516 -7756022 -13290969 -17006385 -13394089 -5530863 -1194314 -2423724
6688b423724j919696Q06060J615563K35982q643Q86462L84234q12261K53399K765116
$$ -2423724 -4343420 -3537360 -1921797 -1685815 -1694458 -807996 -423762 -1236023 -982624 1782492
6678A782492K730947j45983j421099J034207L566876K527390k59853q89975K86308
$$ 1782492 4513439 4367456 2946357 3980564 7547440 10074830 9814977 8925002 9211310
6669I211310n68841m396850p095549m801190R05966M922371M702008K233657M5332
$$ 9211310 8642469 4245619 -2849930 -7651120 -6745154 -1822783 2879225 5112882 5158214
6660E158214k107412n083079p056937n179047J66671N359072P685473P259827
$$ 5158214 3050802 -2032277 -9089214 -14268261 -14101590 -8742518 -1057045 6202782
6652F202782N099644J951301q69084k156667k635831l588329l944660k110269
$$ 6202782 11302426 13253727 12384643 10227976 7592145 4003816 59156 -2051113
6644b051113l37648k434987o344677m845456L625194J0507513P928288o29316
$$ -2051113 -2388761 -4823748 -11168425 -16013881 -12388687 -1881174 6047114 5417798
6636E417798n775218m556246j277062J030049K813963L070420l02258m775326
$$ 5417798 -357420 -4913666 -6190728 -5160679 -2346716 723704 421446 -4353880
6628d353880m716021j97864K002574j418307n035694l111311J884760L851062
$$ -4353880 -9069901 -9267765 -7265191 -8683498 -13719192 -16830503 -14945743 -11094681
6620a1094681K442954K450669N491451P532702N026644k65742l811951l431029
$$ -11094681 -8651727 -6201058 -709607 6823095 11849739 11583997 7772046 4341017
6612D341017o07137K088035L479044L637710K336064p91185m161871m403937o93481
$$ 4341017 3733880 5821915 9300959 12938669 15274733 14483548 10321677 5917740 5224259
6603E224259K542250M33029n326702p932902m412779O24829J542226j558051m712802
$$ 5224259 7766509 8199538 2872836 -5060066 -9472845 -8848016 -7305790 -8863841 -13576643
6594a3576643n576377m250601j126748K963872N983518O796082O818546P359783
$$ -13576643 -19153020 -23403621 -24530369 -21566497 -15582979 -8786897 -1968351 5391432
6586E391432O990431M124874M53441j371749k098000m346098p550648q278009
$$ 5391432 12381863 16506737 16960178 15588429 13490429 9144331 1593683 -6684326
6578f684326n578748k356747q79475l19077M23002P83699O53322J167952J719823
$$ -6684326 -12263074 -14619821 -15499296 -15818373 -15395371 -14611672 -13958350 -12790398 -11070575
6569a1070575n43406n718411q598011m723212K805462O569184M265272Q56817
$$ -11070575 -11613981 -17332392 -25930403 -30653615 -27848153 -21278969 -17013697 -16156880
6561a6156880Q56394K598461K257113J58607n25230K99894p09995m378498o480692
$$ -16156880 -15300486 -12702025 -10444912 -10286305 -10811535 -10511641 -11221636 -15600134 -22080826
6552b2080826l322871K560444N187747K622268j190373k046361j77532J587772
$$ -22080826 -25403697 -22843253 -17655506 -15033238 -16223611 -18269972 -18447504 -16859732
6544a6859732J992845J912104K146523K541167K701951K187246N74860j346894
$$ -16859732 -14866887 -12954783 -10808260 -8267093 -5565142 -3377896 -2803036 -4149930
6536d149930j253208J976063N499532M685908j319186p806986r217923m641723
$$ -4149930 -5403138 -3427075 2072457 6758365 5439179 -2367807 -11585730 -16227453
6528a6227453K007675O168502O132837L490692J406197J947825L987586M093730
$$ -16227453 -14219778 -8051276 -1918439 1572253 2978450 4926275 8913861 13007591
6520A3007591N50232l999723n378618l098668p93555r85954j765355l63727J985114
$$ 13007591 13557823 9558100 4179482 1080814 287259 -698695 -2464050 -2827777 -842663
6511h42663J751021j140416k811891j247401Q69120P63430k14383L66041J575867
$$ -842663 908358 -232058 -3043949 -4291350 -3422230 -2658800 -2873183 -2507142 -931275
6502i31275J385841J233534L749229O985287O092130R57767l052955l097330k234042
$$ -931275 454566 1688100 5437329 12422616 18514746 19472513 16419558 13322228 11088186
6493A1088186k854131k570600j90350L3122m382069p564700l143761M577274N653681
$$ 11088186 8234055 5663455 5473105 5506227 1124158 -6440542 -9584303 -5007029 646652
6484F46652n76061m464260p65654M382496M057051J69787j960908j853010j257553
$$ 646652 70591 -4393669 -5159323 -776827 3280224 3450011 1489103 -363907 -1621460
6475a621460P91068L985972K865486n541906j3779970j1980371k005184M744347
$$ -1621460 -830392 3155580 6021066 479160 -13300810 -25281181 -27286365 -22542018
6467b2542018L132646n31326P1543L248929N354497O885600Q349970P003844K852484
$$ -22542018 -19409372 -19940698 -19869155 -16620226 -11265729 -4380129 3969841 10973685 13826169
6458A3826169J653280N690038P112286j571886j4121527j6782298o736193M460204
$$ 13826169 15479449 21169487 28281773 26709887 12588360 -4193938 -10930131 -6469927
6450f469927O670781K220610j266382j586660j201045j321652j757275l147944
$$ -6469927 200854 2421464 1155082 -431578 -1632623 -2954275 -4711550 -7859494
6442g859494n049087m514072k82324M240224N639101N249691N507851M774114
$$ -7859494 -12908581 -17422653 -17704977 -13464753 -7825652 -2575961 2931890 7706004
6434G706004P35153l657488l591015l69249J84262l036080n015730l037785k26809
$$ 7706004 8441157 4783669 1192654 823405 1007667 -2028413 -7044143 -10081928 -10308737
6425a0308737Q57836J880157L292517J366269n108115j0169596p905114q19398
$$ -10308737 -9450901 -7570744 -4278227 -2911958 -8020073 -18189669 -26094783 -26914181
6417b6914181M010932M271739K868103J662915M77153P24751M056853P761696
$$ -26914181 -22903249 -18631510 -15763407 -14100492 -13623339 -12898588 -8841735 -1080039
6409a080039P048252K218624j416922j188560L29659R81484J966013L574466L102959
$$ -1080039 5968213 8186837 6769915 5581355 5911014 6892498 8858511 12432977 15535936
6400A5535936n02548m127665n102720m515806l630070j213423K564246L747812
$$ 15535936 15033388 10905723 5803003 1287197 -2342873 -3556296 -992050 2755762
6392B755762J13704m250471m216326q48498J106179Q12840J453540L784566M555533
$$ 2755762 2869466 -1381005 -5597331 -6445829 -5339650 -4526810 -3073270 711296 5266829
6383E266829J748785k382343m296345k696268J069553M072990L701223N00056
$$ 5266829 7015614 4633271 336926 -2359342 -1289789 2783201 6484424 6984480
6375F984480j750681q47687M88010j209922m336192m224088j4664M171885M531600
$$ 6984480 5233799 4386112 4874122 3664200 -671992 -4896080 -4910744 -738859 3792741
6366C792741R23183m316259p811614o655137j896721J164812Q2394O3698O096825
$$ 3792741 4715924 399665 -7411949 -14067086 -15963807 -14798995 -14716601 -14652903 -8556078
6357h556078J2945902J1018822J262624n206619l582382j464507m851515q020773
$$ -8556078 4389824 15408646 16671270 11464651 7882269 6417762 1566247 -6454526
6349f454526l943893L456228N724188K530822n22249j903496l195421k187824
$$ -6454526 -10398419 -6942191 -1218003 1312819 790570 -1112926 -4308347 -6496171
6341f496171L442680Q160786M393715m641514p960688k981907J327009r15207
$$ -6496171 -3053491 5107295 9501010 4859496 -3101192 -6083099 -4756090 -5671297
6333e671297m813989n092120m553079o630054p579330l093844L248415N414447
$$ -5671297 -10485286 -15577406 -20130485 -26760539 -34339869 -37433713 -34185298 -28770851
6325b8770851M561317O169842J0447126J2403107R889919N497920J321771k783038
$$ -28770851 -24209534 -18039692 -7592566 4810541 14700460 20198380 21520151 18737113
6317A8737113o165401p370695p041186o914126o501408m510526k432805k353774
$$ 18737113 12571712 5201017 -1840169 -8754295 -15255703 -19766229 -22199034 -24552808
6309b4552808k297224J131515O077881P261425M781562M673750Q878825J1159169
$$ -24552808 -26850032 -25718517 -19640636 -12379211 -7597649 -2923899 5954926 17114095
6301A7114095O634534l26416k864354j825159k884843o250742o417044j795273
$$ 17114095 23748629 23422213 20557859 18732700 15847857 9597115 3180071 1384798
6293A384798K304741J908279l26375r14749j517489m686016p287569l871619M515558
$$ 1384798 3689539 5597818 5271443 4356694 2839205 -1846811 -9134380 -13005999 -8490441
6284h490441J0153374Q030808J534985k418847r58660L163059M988589J496564
$$ -8490441 1662933 9693741 11228726 8809879 7851219 11014278 16002867 17499431
6276A7499431n059617p520564j167305Q400896R652498k753r091597o663796K823012
$$ 17499431 12439814 4919250 3751945 12152841 21805339 21802586 12710989 6047193 8870205
6267H870205O348105Q72783m021987j689286L053223L781190K159256K401545
$$ 8870205 15218310 16091093 12069106 10379820 13433043 17214233 19373489 21775034
6259B1775034K740750o98707n702291o567914k717912J266829K723018K515302
$$ 21775034 24515784 23817077 18114786 11546872 8828960 10095789 12818807 15334109
6251A5334109P40950l507491q171748r046301n176052L44632M861599P678967
$$ 15334109 16075059 12567568 4395820 -4650481 -9826533 -9481901 -4620302 3058665
6243C058665P734067M370265L82219m39452Q88127k0423l346210m482541k129129
$$ 3058665 10792732 15162997 15545216 15105764 15993891 15973468 12627258 8144717 6015588
6234F015588p74066k536734k790560J696969N669534K500765n057214p892078
$$ 6015588 5241522 2704788 -85772 1611197 7280731 9781496 4724282 -3167796
6226c167796k895939L851938O161723M270121J164220k451581o704784r422442
$$ -3167796 -6063735 -2211797 3949926 8220047 9384267 6932686 227902 -9194540
6218i194540p844537k405755L354048O300829O030466M198414K430538P64599
$$ -9194540 -17039077 -19444832 -16090784 -9789955 -3759489 438925 2869463 3634062
6210C634062j995789n999283q833092p622189k808122J760410L392249L760317
$$ 3634062 1638273 -4361010 -13194102 -20816291 -23624413 -21864003 -18471754 -14711437
6202a4711437N908396R029971Q907075M216376l03004L97098M154622L747232
$$ -14711437 -8803041 226930 9134005 13350381 13047377 13444475 17599097 21346329
6194B1346329k787545q261132n857512Q34239K540460k335421n628782k088904
$$ 21346329 18558784 10297652 4440140 5274379 7814839 5479418 -149364 -2238268
6186b238268K509466M70112n603722o567167o29690M102761J927641k552020k289501
$$ -2238268 271198 741310 -4862412 -11429579 -12059269 -7956508 -6028867 -8580887 -10870388
6177a0870388J784603L438232J165494l61019J840526N131127O109211M943875
$$ -10870388 -9085785 -5647553 -4482059 -4843078 -3002552 2128575 8237786 13181661
6169A3181661L118463O43803k105253l014640j569278p55014k325991k950632
$$ 13181661 16300124 16943927 14838674 11824034 10254756 9499742 7173751 4223119
6161D223119N24006M234652J554024o505352j1489100q973451l477791P3737K928601
$$ 4223119 4747125 8981777 10535801 4030449 -7458651 -16432102 -19909893 -19836156 -16907555
6152a6907555O567466O894511R53858n316781l978097K716933N015530j95759
$$ -16907555 -10340089 -3445578 -2491720 -7808501 -11786598 -9069665 -4054135 -4249894
6144d249894n652802m728433R37753O290203Q684999O792876J57376p128886q161262
$$ -4249894 -9902696 -14631129 -13693376 -7403173 1281826 8074702 8232078 1103192 -7058070
6135g058070k247998K937943J811373j839697k273296r31068k173076m313402
$$ -7058070 -9306068 -6368125 -4556752 -6396449 -8669745 -9600813 -11773889 -16087291
6127a6087291k174720L753399P789341P742159O550726N424197J958629l662608
$$ -16087291 -18262011 -14508612 -6719271 1022888 7573614 12997811 14956440 11293832
6119A1293832o660510m607472j780825l096659o756190o752004j420282M016049
$$ 11293832 4633322 25850 -1754975 -4851634 -11607824 -18359828 -19780110 -15764061
6111a5764061M028048k91723k675171K84691M680940M551329R3333k688341m80116
$$ -15764061 -11736013 -12027736 -14702907 -14418216 -9737276 -5185947 -5092614 -7780955 -8261071
6102h261071L272525M272226L169971K570169K023268R2091j555276r52616o19067
$$ -8261071 -4988546 -716320 2453651 5023820 7047088 7139179 5583903 4631287 4012220
6093D012220m104659q767582p783916O3117P711080Q543000L853676k08649q5371
$$ 4012220 -92439 -8860021 -16643937 -16580820 -8869740 -326740 3526936 3318287 3232916
6084C232916K681227M263139K339965j759122m220250k989801k34643P87312j32744
$$ 3232916 5914143 10177282 12517247 10758125 6537875 3548074 3313431 4100743 3967999
6075C967999j325000k743489n058778o625594n044119r02710L387064P070312
$$ 3967999 2642999 -100490 -5159268 -11784862 -16828981 -17731691 -14344627 -7274315
6067g274315R550543P597837l25545q243168p908314j61547N553039M053490L0124
$$ -7274315 2276228 9874065 9548520 1305352 -6602962 -6764509 -1211470 2842020 2872144
6058B872144j104588q88734k698880m973588m128137n8322M902604Q610840Q053969
$$ 2872144 1767556 878822 -1820058 -6793646 -10921783 -10980105 -6077501 2533339 10587308
6049A0587308R02246q388088r866305n51127R624395J0268121M114133J034006
$$ 10587308 11489554 3101466 -6764839 -7315966 2308429 12576550 16690683 17724689
6041A7724689K576459J522523m603970r030168o469025o86284K155881K198125
$$ 17724689 20301148 21823671 17219701 8189533 1720508 1034224 3190105 5388230
6033E388230L599290O795800P522368L027888l691205o887279m462414k55937
$$ 5388230 8987520 15783320 23305688 26333576 22642371 15755092 11292678 11036741
6025A1036741P12524j605310k789770m00381K754125K577895j524820o667096
$$ 11036741 11749265 10143955 7354185 6953804 9707929 12285824 10761004 4093908
6017D093908q870872n220540K907261Q492849N437578k674741o130238k829242
$$ 4093908 -4776964 -9997504 -7090243 1402606 6840184 4165443 -1964795 -4794037
6009d794037r82528m825760o677921p7054P509484N167859m036462p486711j568862
$$ -4794037 -5776565 -10602325 -17280246 -17357300 -9847816 -4679957 -8716419 -16203130 -17771992
6000a7771992N712696Q935965J0230246J0085631N151140k807318o710041n703349
$$ -17771992 -12059296 -3123331 7106915 17192546 22343686 19536368 12826327 7122978
5992G122978o478455j0028271q304806J052521P785496L930831l932902n553850
$$ 7122978 644523 -9383748 -17688554 -16636033 -8850537 -4919706 -8852608 -14406458
5984a4406458j821831L32674P46995L602461P225735O473721K271833k24941n14368
$$ -14406458 -16228289 -15895615 -15148620 -11546159 -4320424 2153297 4425130 4200189 3685821
5975C685821j500802j980217J013130M451061K811626j963220k909845K45788
$$ 3685821 2185019 204802 1217932 5668993 8480619 6517399 3607554 3853342
5967C853342R28351k529544m198000j096475K270718K341140J530257J962575
$$ 3853342 4781693 2252149 -1945851 -3042326 -771608 1569532 3099789 5062364
5959E062364J524461n83850j229224K94055l8824l227370l969269L82786M242308
$$ 5062364 6586825 6002975 4773751 5067806 5028982 1801612 -2167657 -1784871 2457437
5950B457437K698397j42496J578747N029473L376330k400242m588902m40171M537444
$$ 2457437 5155834 5013338 6592085 11621558 14997888 12597646 8008744 7568573 12106017
5941A2106017M974563J130134m309066r066428j0057704n004015K717096N493785
$$ 12106017 17080580 18210714 13901648 4835220 -5222484 -10226499 -7509403 -2015618
5933b015618N10567n935569n969687J97561M934622K623809l884744o745967k118801
$$ -2015618 -1505051 -7440620 -13410307 -13212746 -8278124 -5654315 -9539059 -16285026 -18403827
5924a8403827N402343Q082637L921340j902265m290485l452219j572503J446478
$$ -18403827 -13001484 -4918847 -997507 -2899772 -7190257 -10642476 -12214979 -10768501
5916a0768501N367031O353872J593230m767396n862852j423725K724252L998081
$$ -10768501 -5401470 952402 2545632 -2221764 -8084616 -9508341 -6784089 -2786008
5908b786008N423353P752037O257435j197719q544866q708711k843525K059585
$$ -2786008 2637345 10389382 16646817 15449098 6904232 -1804479 -4648004 -2588419
5900b588419K187839n93896l129189l669691j569775J779565K565725j231679
$$ -2588419 -400580 -994476 -4123665 -7793356 -9363131 -7583566 -5017841 -6249520
5892f249520n768604n102123R43965O139995N785581K209203Q64622L236267N801759
$$ -6249520 -12018124 -17120247 -16176282 -10036287 -4250706 -2041503 -1176881 2059386 7861145
5883G861145N131974J817723j246188k903433m153436m878608l069268J103806
$$ 7861145 12993119 14810842 13564654 10661221 6507785 1629177 -1440091 -336285
5875c36285L379413R46528k440442j704888Q55007j314438p356266q529505j720169
$$ -336285 3043128 3989656 1549214 -155674 699333 -615105 -7971371 -16500876 -18221045
5866a8221045N012978N079680L201624N425087P053956Q85297p961150q005588
$$ -18221045 -13208067 -8128387 -4926763 498324 7552280 8437577 476427 -7529161
5858g529161o3917L349862j659592m027004L606208J1994098R302736q77015n593390
$$ -7529161 -7593078 -4243216 -5902808 -9929812 -6323604 5670494 14973230 14096215 8502825
5849H502825j445536K779041P05624l516840l244105R02645K665080r83784n406379
$$ 8502825 7057289 9836330 10541954 7025114 3781009 4683654 7348734 6364950 958571
5840I58571l567761M494820R842146N337398l669915n153234K963225R250186
$$ 958571 -2609190 1885630 11727776 17065174 13395259 8242025 11205250 20455436
5832B0455436M640428n382072r653158o273738j744750M90937K587425N121791
$$ 20455436 25095864 19713792 10060634 3786896 2042146 2533083 5120508 10242299
5824A0242299M943599Q09216m110623o251660m914174j784751J58287j384605
$$ 10242299 15185898 15995114 11884491 5632831 718657 -1066094 -907807 -2292412
5816b292412m621072m611929m38211K143561q73710m872728l620619R05419K599345
$$ -2292412 -6913484 -11525413 -11963624 -9820063 -10693773 -15566501 -19187120 -18281701 -15682356
5807a5682356J704393K968727N550846M008259j064819k722596Q17811L119477
$$ -15682356 -13977963 -11009236 -5458390 -1450131 -2514950 -5237546 -4419735 -1300258
5799a300258K97892l191767k622952L55664K556152M136413N040013K707927k787673
$$ -1300258 -1002366 -4194133 -6817085 -6461421 -3905269 231144 5271157 7979084 5191411
5790E191411o810330o850826n664537m644913o70205O203100Q878136L157890
$$ 5191411 -1618919 -8469745 -14134282 -18779195 -19449400 -13246300 -4368164 -1210274
5782a210274m258952m670514L89790L161628K085400K029971M297654M886725
$$ -1210274 -5469226 -10139740 -9749950 -6588322 -4502922 -2472951 1824703 6711428
5774F711428K627290J410037K888418L284867k42453m957492o809666n583953
$$ 6711428 9338718 10748755 13637173 16922040 16679587 11722095 4912429 -671524
5766f71524l314508p15957J873250K299714r08582m364614k097247O067646J1411283
$$ -671524 -3986032 -4701989 -2828739 -529025 -1437607 -5802221 -7899468 -1831822 9579461
5757I579461N924339n798075j0131110k033867P235403N373175l710787o571891
$$ 9579461 15503800 9705725 -425385 -2459252 4776151 10149326 6438539 -133352
5749a33352n53483L857043P59207l263357k109541O73437J298391L358898Q327518
$$ -133352 -686835 3170208 3929415 666058 -1443483 -770046 528345 3887243 12214761
5740A2214761Q529089m93538r179104p056861L30186O19127m565210k907562O719939
$$ 12214761 20743850 20250312 11071208 4014347 4344533 4963660 398450 -2509112 4210827
5731D210827J1391292M753491l951571n767595m172217n161524o122336k586118
$$ 4210827 15602119 20355610 16404039 10636444 6464227 1302703 -4819633 -7405751
5723g405751K037006J903450j441708k172531N53091K708072K018635n99104l721733
$$ -7405751 -5368745 -3465295 -4907003 -7079534 -6526443 -3818371 -1799736 -2398840 -6120573
5714f120573n400487l199135J990676N129766L662538J694975L529026O317177
$$ -6120573 -11521060 -14720195 -12729519 -7599753 -3937215 -2242240 1286786 7603963
5706G603963M054118l335912r794750j0873356p552748l087496L56459K193619
$$ 7603963 11658081 8322169 -1472581 -12345937 -19898685 -22986181 -22629722 -20436103
5698b0436103L256408M910001O771566O499967L264181n03034k461251l121363
$$ -20436103 -17179695 -12269694 -5498128 1001839 4266020 3762986 1301735 -1819628
5690a819628l339464j902502J686260M703891M703632L171662K329060P42681
$$ -1819628 -5159092 -7061594 -5375334 -671443 4032189 7203851 9532911 10275592
5682A0275592l623734p784651o231146J029875P332464P244004K503838r89271
$$ 10275592 6651858 -1132793 -7363939 -6334064 998400 8242404 10746242 9756971
5674I756971K2375L227560L429107j844534q609526r553408k441291O262752Q548344
$$ 9756971 9779346 13006906 16436013 14591479 5981953 -3571455 -6012746 250006 8798350
5665H798350M014187j225476l304717l897878m826655m269716n85494L495973
$$ 8798350 12812537 11587061 8282344 4384466 -442189 -4711905 -5297399 -1801426
5657a801426L834323P48834j013582J559818N566087N439520j30194o082588o771997
$$ -1801426 2032897 2781731 1768149 3327967 8894054 14333574 14203380 8120792 1348795
5648A348795k773726K61966o59447k405181j226345J604366K635758K105243K683291
$$ 1348795 -1424931 -1162965 -1822412 -4227593 -5453938 -3849572 -1213814 891429 3574720
5639C574720L632291J251729m293994p352477m134278J874669M519144K343339
$$ 3574720 7207011 8458740 4164746 -3187731 -7322009 -5447340 -928196 1415143
5631A415143j393269l744948l860619j487317K437354M423935J698209k914308
$$ 1415143 21874 -3723074 -7583693 -9071010 -6633656 -2209721 -511512 -3425820
5623c425820l338812J405739N132442K870099k347380m301766k112453L67075
$$ -3425820 -6764632 -5358893 -226451 2643648 296268 -4005498 -6117951 -5750876
5615e750876J517162L020732M601966L324678p87926l427591k261513k04976j74684
$$ -5750876 -4233714 -1212982 3388984 6713662 5925736 2498145 236632 31656 -143028
5606a43028p38733K25125J524613J601628J760562K897363K851231J053689J489595
$$ -143028 -881761 -656636 867977 2469605 4230167 7127530 9978761 11032450 12522045
5597A2522045N667431O968650o96051j1613867j4113332o341189K543017O551091
$$ 12522045 18189476 25158126 24462075 12848208 -1265124 -7606313 -5063296 1487795
5589A487795Q442655R651485N427889m876671j1871614q082572L92010K171249
$$ 1487795 9930450 19581935 25009824 20133153 8261539 178967 570977 2742226
5581B742226l649858q115515o418870l169934l561974o113266o256240k791283
$$ 2742226 -907632 -9023147 -15442017 -18611951 -22173925 -28287191 -34543431 -37334714
5573c7334714J535798L673932L056407J811963K583591N537639P948951P243409
$$ -37334714 -35798916 -32124984 -29068577 -27256614 -24673023 -19135384 -11186433 -3943024
5565c943024L630038n18007k682978j777706M87288L66051l207628n631434k252651
$$ -3943024 -312986 -830993 -3513971 -5291677 -4804389 -4438338 -7645966 -13277400 -15530051
5556a5530051L890488N400180J641586j41065L636452P452316N862794J054491
$$ -15530051 -11639563 -6239383 -4597797 -4738862 -1102410 6349906 12212700 13267191
5548A3267191k927448o407806r265578p021911J348771P924181N930062j10043
$$ 13267191 10339743 3931937 -5333641 -12355552 -11006781 -3082600 2847462 2737419
5540B737419k414213k340031m913886o370661K81767J0015725R934042p40377
$$ 2737419 323206 -2016825 -6930711 -13301372 -13019605 -3003880 6930162 6189785
5532F189785q059265l763013L885714M625650N48267r58603M18038Q15046J024316
$$ 6189785 -1869480 -5632493 -1746779 2878871 3427138 2468535 2886573 3701619 4725935
5523D725935M054515P787786P402137K792168k197276n815758q545776r093691
$$ 4725935 8780450 16568236 23970373 26762541 24565265 18749507 10203731 1110040
5515A110040n299720J629921P460940R012331N867287j91159n397638o137882
$$ 1110040 -4189680 -2559759 4901181 13913512 19780799 19589640 14192002 8054120
5507H054120l315949k020067m383768n992356k741475J981378J714432l332073
$$ 8054120 4738171 2718104 -1665664 -7658020 -10399495 -8418117 -6703685 -10035758
5499a0035758o063355k040526M841571P261375K593611m811694q190093m822308
$$ -10035758 -16099113 -18139639 -13298068 -6036693 -3443082 -8254776 -16444869 -21267177
5491b1267177J511006M778038L290557O22166n6678J53157r99468k644398k256257
$$ -21267177 -19756171 -14978133 -11687576 -11065410 -11122088 -10968931 -11968399 -14612797 -16869054
5482a6869054J36354J968023J943423J551558K356970L260925J704134k279649
$$ -16869054 -16732700 -14764677 -12821254 -11269696 -8912726 -5651801 -3947667 -6227316
5474f227316m443006p72132O436125J0024115O948878K145340N91316q2089l947794
$$ -6227316 -10670322 -11442454 -5006329 5017786 11966664 14112004 14703320 14621231 10673437
5465A0673437p987586o636290k399067k429380n364877k582692N833992Q473337
$$ 10673437 2685851 -3950439 -6349506 -8778886 -14143763 -16726455 -10892463 -2419126
5457b419126Q50354n495905m68350Q101766O456808l948657r872433o536806j453097
$$ -2419126 -1568772 -7064677 -7533027 568739 7025547 3076890 -6795543 -13332349 -14785446
5448a4785446N32234L143168Q015841R574931M697738j134911j990919N73377
$$ -14785446 -14253212 -11110044 -3094203 6480728 11178466 10043555 8052636 8626013
5440H626013J695858N298l115370o084527n923995L29857R484723J2360517M438080
$$ 8626013 10321871 10327169 7211799 1127272 -4796723 -4466866 5017857 17378374 21816454
5431B1816454p407235j2959503j0178164m580255l56024K784537N612265P254957
$$ 21816454 14409219 1449716 -8728448 -13308703 -13664727 -10880190 -5267925 1987032
5423A987032O998512M744182k1749o598928j0890294q444434l19506O920865Q092506
$$ 1987032 8985544 13729726 13707977 7109049 -3781245 -12225679 -12545185 -5624320 2468186
5414B468186M286256K46435r78793L21411K244805K873315J251385j563538l063715
$$ 2468186 6754442 7000877 6022084 6343495 8588300 11461615 12713000 11149462 8085747
5405H085747k269700j296373k214710l384142j772205J420450J435195k507840
$$ 8085747 5816047 4519674 2304964 -1079178 -2851383 -1430933 4262 -2503578
5397b503578m708140j140337L831699L708314k28130j542599N97249R60414j386764
$$ -2503578 -7211718 -8352055 -4520356 -812042 -1040172 -2582771 -1985522 -1025108 -2411872
5388b411872q85242L759196N173597j177942q428634q119506k690237j53262q67918
$$ -2411872 -3297114 462082 5635679 4457737 -3970897 -12090403 -14780640 -14933902 -15801820
5379a5801820J087051N963962P722992N031513L279700M146678K253432m502988
$$ -15801820 -14714769 -8750807 -1027815 4003698 7283398 11430076 13683508 9180520
5371I180520r322326o060457J734180O539393O773466N632090L945573K64791
$$ 9180520 -141806 -6202263 -4468083 2071310 8844776 14476866 18422439 18687230
5363A8687230l990998n327208l924220l953394p245174r913765o920256J430352
$$ 18687230 14696232 9369024 5444804 1491410 -5753764 -15667529 -22587785 -21157433
5355b1157433Q844425Q971740J906769n629225p177850k934722J893458L950705
$$ -21157433 -12313008 -3341268 -1434499 -7063724 -14241574 -17176296 -15282838 -11332133
5347a1332133M422790N245887N778230M316455R03695k359876k853728K48752
$$ -11332133 -6909343 -1663456 4114774 8431229 9334924 6975048 4121320 4370072
5339D370072L871664K980225k687246o116697j723730N425871N453756k032044
$$ 4370072 8241736 11221961 8534715 2418018 694288 6120159 11573915 9541871
5331I541871p274441n065882j344848j634651j919059K395379O076194J702644
$$ 9541871 2267430 -2798452 -4143300 -5777951 -7697010 -5301631 774563 2477207
5323B477207p176006j0295010n607295m67464J020237K118377M266564L530155
$$ 2477207 -4698799 -14993809 -20601104 -21068568 -20048331 -17929954 -13663390 -10133235
5315a0133235p68454k448884J838765O222098M301865j248105l535973j518747
$$ -10133235 -10901689 -13350573 -11511808 -5289710 -987845 -2235950 -5771923 -7290670
5307g290670Q49344K081074L302527L387557Q41409p69377L344880R739655Q849398
$$ -7290670 -6441326 -4360252 -1057725 2329832 3171241 2401864 5746744 15486399 24335797
5298B4335797j116825r606333p482503N15780L126236j703425n683846l120983
$$ 24335797 23218972 13612639 6130136 6645916 9772152 8068727 2384881 -736102
5290g36102K407594N014817L750193Q34667k059501l133589o71693L120105K889893
$$ -736102 1671492 6686309 10436502 11271169 9211668 6078079 5406386 8526491 11416384
5281A1416384j797675l825642J236838O620529K832982q010287j4102434r665896
$$ 11416384 9618709 5793067 7029905 13650434 16483416 8473129 -5629305 -15295201
5273a5295201j099299L573751L901119L121791K089859J209880K817236O881066
$$ -15295201 -16394500 -12820749 -8919630 -5797839 -3707980 -2498100 319136 7200202
5265G200202Q755129N825390K208408J868350J357487m225992j1378704j1875171
$$ 7200202 15955331 21780721 23989129 25857479 27214966 22988974 11610270 -264901
5257b64901m951388J730882L460014L603767N855145Q048897O815856L327244
$$ -264901 -5216289 -3485407 -25393 3578374 9433519 17482416 24298272 27625516
5249B7625516R02619M59173J168220K398011K483184j051752p139524j0155348
$$ 27625516 28528135 28987308 30155528 32553539 35036723 33984971 26845447 16690099
5241A6690099o522419J87697L888731L238812R04123j878538n557382q437370
$$ 16690099 10167680 10355377 14244108 17482920 18387043 16508505 10951123 2513753
5233B513753p284057k040139L390421N362004L087635k209738p556363q359589
$$ 2513753 -4770304 -6810443 -3420022 1941982 5029617 2819879 -4736484 -13096073
5225a3096073k447209N558939P962770L401508j152808L31025N192206O479408
$$ -13096073 -15543282 -9984343 -2021573 1379935 227127 558152 5750358 12229766
5217A2229766K391382k418594l852772l039737l484136o039103q147770p334542
$$ 12229766 14621148 12202554 8349782 5310045 1825909 -4213194 -12360964 -19695506
5209a9695506m255512j582821r5109K370430O597225Q503073L570119n537998
$$ -19695506 -23951018 -25533839 -25628948 -23258518 -16661293 -8158220 -4588101 -10126099
5201a0126099j0143783n808728K422074P108638O862526M796810K561601L52510
$$ -10126099 -20269882 -26078610 -23656536 -16547898 -9685372 -4888562 -2326961 -1974451
5193a974451k15805J501240J911070k243193p427985p328956k688725p37361m212141
$$ -1974451 -2190256 -689016 1222054 -1021139 -8449124 -15778080 -18466805 -19204166 -23416307
5184b3416307p359545m736903J766412P122889R141041P671377L115301j136181
$$ -23416307 -30775852 -35512755 -33746343 -26623454 -17482413 -9811036 -6695735 -7831916
5176g831916K7788N896464Q569920L507098l320381l973050K81842K615226J699463
$$ -7831916 -7804128 -1907664 6662256 10169354 6848973 2875923 3157765 5772991 7472454
5167G472454J687892L294421K747631o35512l050657l216744m311350p330697
$$ 7472454 9160346 12454767 15202398 14566886 11516229 8299485 3988135 -3342562
5159c342562q384510n018444m10986J455910J026362J015087K147400L488721
$$ -3342562 -11727072 -16745516 -17156502 -15700592 -14674230 -13659143 -11511743 -8023022
5151h023022M628698N507416N875072O105275O572500N596112P11040o905608
$$ -8023022 -3394324 2113092 7988164 14093439 20665939 26262051 26973091 20067483
5143B0067483j1982826j0802530n396696q00281K48986j095313j908725l61852
$$ 20067483 8084657 -2717873 -8114569 -8914850 -8665864 -9761177 -11669902 -12031754
5135a2031754K361340K845594n78982n116498o578283m512972j981672q69776
$$ -12031754 -9670414 -6824820 -7403802 -12520300 -19098583 -23611555 -25593227 -26463003
5127b6463003j27953J656408M553599P806609R734609Q189694L823087J198597
$$ -26463003 -26590956 -24934548 -20380949 -12574340 -2839731 5349963 9173050 10371647
5119A0371647L019698N136228K015479m440871p242177m409826k94282K676520
$$ 10371647 13391345 18527573 20543052 16102181 8860004 4450178 4155896 6832416
5111F832416O035802Q341711M554733m706538j0789428q087802j339839K265547
$$ 6832416 12868218 21209929 25764662 21058124 10268696 2180894 841055 3106602
5103C106602K285855J748425N29081k349661m412784l341393j196226k21833J442749
$$ 3106602 5392457 7140882 7669963 5320302 907518 -2433875 -3630101 -3851934 -2409185
5094b409185M897939O058812K291872q69921K859159R432654Q995321K36556p750161
$$ -2409185 2488754 8547566 10839438 9969517 12828676 22261330 31256651 31493207 23743046
5085B3743046q271006m502726k657625l847035n358171n555845m566854k665244
$$ 23743046 15472040 10969314 8311689 4464654 -893517 -6449362 -11016216 -13681460
5077a3681460l00144J381862J205401r68320l386751k738562K417647P955490
$$ -13681460 -13981604 -12599742 -11394341 -12362661 -15749412 -18487974 -16070327 -8114837
5069h114837P433614R20877l525047m37077N160278N077464m16560m200884l206216
$$ -8114837 -681223 239654 -3285393 -3722470 1437808 6515272 6098712 1897828 -1308388
5060a308388j251203j699517l306112l867416l056715p95598L125954O940113
$$ -1308388 -2559591 -4259108 -7565220 -11432636 -14489351 -15284949 -12158995 -5218882
5052e218882P693507M872315R15983j758119k197213l26616K772027N007499N475467
$$ -5218882 2474625 7346940 8262923 6504804 4307591 3980975 6753002 11760501 17235968
5043A7235968M836585K538179k566398p103257m476258M702313R817646M207280
$$ 17235968 22072553 24610732 22044334 14941077 10464819 15167132 24984778 29192058
5035B9192058m149570m305980P64959m3901o844028q614761k176687K214103k157463
$$ 29192058 25042488 20736508 21501467 21457566 14613538 5998777 3822090 6036193 3878730
5026C878730p893424n971000R22741M902233N247192O282841Q018915O674883
$$ 3878730 -4014694 -9985694 -9062953 -4160720 1086472 7369313 15388228 22063111
5018B2063111J807668l235490o131435o325715l275849J823243M884226L611888
$$ 22063111 23870779 20635289 14503854 8178139 4902290 6725533 11609759 15221647
5010A5221647J182940J323130K097442o94728n520966n871459N39728P658396
$$ 15221647 16404587 17727717 19825159 19130431 13609465 7738006 8277734 15936130
5002A5936130Q030231J396545n685874p736276n677368l739629l071555j265161
$$ 15936130 23966361 25362906 19677032 11940756 6263388 2523759 -547796 -1812957
4994a812957J955343K604413j633233o672148p026506l250559r7161R55124K312853
$$ -1812957 142386 2746799 1113566 -5558582 -12585088 -15835647 -15932808 -14977684 -12664831
4985a2664831M308681M066358Q15722k252740k371794O9891L348897N556473M467380
$$ -12664831 -8356150 -4289792 -3474070 -5726810 -8098604 -8028713 -4679816 876657 5344037
4976E344037J77555k858124p36314L849099N184581K878439R66620J649k813858
$$ 5344037 5521592 2663468 1927154 5776253 10960834 13839273 14805893 14807542 11993684
4967A1993684n783216l097860N113698J0507079P314183n52949n952927o564851
$$ 11993684 6210468 3112608 8226306 18733385 26047568 25494619 19541692 12976841
4959A2976841l922862J43700L186589K891979N54649l24944M0611j657561m667164
$$ 12976841 9053979 9197679 12384268 15276247 15830896 15505952 15546563 13889002 9221838
4950I221838m214650j43274J733403o58315k043190O85552K740316j43639m134737
$$ 9221838 5007188 4863914 6597317 5939002 3895812 4581364 7321680 7178041 3043304
4941C043304l480225J057316M988095O600123N944873J934179m467870p980575
$$ 3043304 -436921 620395 5608490 12208613 18153486 20087665 15619795 7639220
4933G639220n060513L50285J396721l057130p336764n345752L092988J0910979
$$ 7639220 2578707 2928992 4325713 1268583 -6068181 -11413933 -8320945 2590034
4925B590034R723359k39449q475417o791261N202K486769J285008L627614Q660230
$$ 2590034 12313393 12073944 3598527 -3192734 -3187532 -700763 584245 4211859 12872089
4916A2872089Q709360L961842K297568M014045J018156o862562r653750m553697
$$ 12872089 21581449 25543291 27840859 31854904 32873060 26010498 16356748 11803051
4908A1803051m08591r62477M35624M540789J928589q112378j2056110m199158
$$ 11803051 11394460 10431983 10867607 15408396 17336985 9224607 -2831503 -7030661
4900g030661L221276J578561n83642L518095N451823J10001j602736O268605J0393965
$$ -7030661 -3809385 -2230824 -2814466 703629 6155452 6265453 4662717 10931322 21325287
4891B1325287J716069o106125o34989O618698K204893m509327j405423K333729
$$ 21325287 23041356 16935231 16300242 22918940 25123833 20614506 19209083 21542812
4883B1542812k578740k595605J1737020K0245390Q202573J1914J6477605K8677676
$$ 21542812 18964072 16368467 28105487 48350877 56553450 56565364 73042969 101720645
4875A01720645J0144766N497782O8233246J42672525J05601307n2909777j84055909
$$ 101720645 111865411 117363193 185596439 328268964 433870271 380960494 196904585
4868A96904585j65036141n1904629J6768624M493111j7244736n122667R131901
$$ 196904585 31868444 -20036185 -3267561 1225550 -16019186 -21141853 -12009952
4861a2009952O8371q435273K059894J0460498J16677j0544567m252840N726449
$$ -12009952 -11941581 -20376854 -18316960 -7856462 -7739785 -18284352 -22537192 -16810743
4853a6810743L772015j545325J012228L678769j584250n255516J028272P285756
$$ -16810743 -13038728 -14584053 -13571825 -9893056 -11477306 -16732822 -15704550 -8418794
4845h418794L209448l747390l631364j555412m932838p481053j359991O750585
$$ -8418794 -5209346 -8956736 -12588100 -14143512 -19076350 -26557403 -27917394 -21166809
4837b1166809O607952J419242K1821J046394j390749l858958M78652P429632O719379
$$ -21166809 -14558857 -13139615 -13117794 -12071400 -13462149 -17321107 -16842455 -9412823 -2693444
4828b693444j326807n849672j413226N795885Q126805N202465J135174j751595
$$ -2693444 -4020251 -9869923 -11283149 -5487264 2639541 7842006 8977180 7225585
4820G225585m324005p597359r434761n773755K783965Q105754L617471n229627
$$ 7225585 2901580 -4695779 -14130540 -19904295 -17120330 -9014576 -5397105 -10626732
4812a0626732o886574K9845M990617J635112l720461l467027K14687J423371M09085
$$ -10626732 -17513306 -17483461 -12492844 -10857732 -14578193 -18045220 -17830533 -16407162 -15998077
4803a5998077N21298O07150k521610p282733q962976o087288o98783N431102J0707980
$$ -15998077 -15476779 -14869629 -17391239 -24673972 -33636948 -39724236 -40423019 -34991917 -24283937
4794b4283937J1902997O818734j651515o967119m838351K722220Q624724O871229
$$ -24283937 -12380940 -5562206 -7213721 -14180840 -19019191 -16296971 -7672247 -801018
4786h01018o87001n303437j719389M876757O379812L106497J259776J712690j03552
$$ -801018 -1488019 -6791456 -8510845 -3634088 2745724 5852221 7111997 8824687 8721135
4777H721135l867929l515730J776057M921721K167937j456042j590212j348374
$$ 8721135 4853206 1337476 3113533 8035254 10203191 8747149 7156937 5808563
4769E808563m056816o566535n245648k488236j813237j822650k74782P76730p42189
$$ 5808563 1751747 -4814788 -10060436 -12548672 -14361909 -16184559 -16459341 -15682611 -16424800
4760a6424800j790842J354753O766145R335180O848579O92844n964965q511248
$$ -16424800 -18215642 -16860889 -10094744 -759564 6089015 6781859 816894 -7694354
4752g694354m225144K250377K446973m007949p562833k661111L863525L897929
$$ -7694354 -11919498 -9669121 -7222148 -11230097 -18792930 -21454041 -17590516 -13692587
4744a3692587L50715P72774M466388M778743O95288k461565k060132l40118J205424
$$ -13692587 -13341872 -12569098 -8102710 -3323967 -2628679 -5090244 -7150376 -7490494 -6285070
4735f285070K798232K608536j487525o575842o880784j620139L847784M794562
$$ -6285070 -3486838 -878302 -2365827 -8941669 -15822453 -17442592 -13594808 -8800246
4727h800246J382501l139209m945918j480435N553232J0172429Q421766L179359
$$ -8800246 -7417745 -10556954 -15502872 -16983307 -11430075 -1257646 7164120 10343479
4719A0343479l95782j710494l190312m701494m460011l430587l685175l972100
$$ 10343479 9947697 8237203 5046891 345397 -4114614 -7545201 -11230376 -15202476
4711a5202476j945289Q05607J239107P27450K495220M580411K396422j923531
$$ -15202476 -17147765 -16342158 -15103051 -14375601 -11880381 -7299970 -4903548 -6827079
4703f827079p46433O504901R827888K290998q813176j0865981k581147N258424
$$ -6827079 -7573512 -1068611 8759277 11050275 2237099 -8628882 -11210029 -5951605
4695e951605M991905R48883P56332L711242L410422r40187l075191j96524K198362
$$ -5951605 -959700 -10817 745515 4456757 7867179 6926992 3851801 3655277 5853639
4686E853639k75342k874629O22288O823775P330145J869052k105581k023559k684620
$$ 5853639 5578297 2703668 3325956 10149731 17479876 19348928 17243347 15219788 12535168
4677A2535168n312794m492357Q75312L586900l6783l652583k202816p06407m279440
$$ 12535168 7222374 2730017 3605329 7192229 7155446 3502863 1300047 593640 -3685800
4668c685800p766310m505636J460459K039981j419526j761430R54562P99032k351929
$$ -3685800 -11452110 -15957746 -14497287 -12457306 -13876832 -15638262 -14683700 -13884668 -16236597
4659a6236597l043499o27583N24185J81100J980010M654530L164434j562151l510134
$$ -16236597 -19280096 -19907679 -19383494 -19202394 -17222384 -12567854 -9403420 -10965571 -14475705
4650a4475705k303679l316194o461610n109834J950564P433234P288838O115852
$$ -14475705 -16779384 -20095578 -26557188 -31667022 -29716458 -22283224 -14994386 -8878534
4642h878534P365316P261962L040629r46238n63720J527951J541807N27050K471
$$ -8878534 -1513218 5748744 8789373 7843135 7279415 8807366 10349173 10876223 10878694
4633A0878694k149280o352869p646324k858715L196672M057953L62767k489221
$$ 10878694 8729414 2376545 -5269779 -8128494 -4931822 -873869 -511102 -3000323
4625c000323k104860l13733N44245p55742l658474m761415j131556L930335L711478
$$ -3000323 -5105183 -5418916 -4874671 -5630413 -9288887 -14050302 -15181858 -11251523 -7540045
4616g540045j521653l593660R79320M778443R33515n968742p018974j735957L324661
$$ -7540045 -9061698 -12655358 -11676038 -6897595 -5964080 -11932822 -18951796 -20687753 -17363092
4607a7363092M656506L566339J016866k455458l751571l08370N042544P036172
$$ -17363092 -12706586 -9140247 -8123381 -10578839 -14330410 -14638780 -9596236 -2560064
4599b560064M266123r25923n844524p314277k727817M256750M518934l897527
$$ -2560064 1706059 780136 -5064388 -12378665 -15106482 -10849732 -6330798 -10228325
4591a0228325r676352k880686R334327J1785012K723155n161271m163487p3573
$$ -10228325 -19904677 -22785363 -13451036 -1666024 1057131 -4104140 -8267627 -8341200
4583h341200M20560m06761J613476M559056M799886K885972N79309k367291m684243
$$ -8341200 -7920640 -8327401 -6713925 -2154869 2645017 5530989 6110298 3743007 -941236
4574i41236k626941L375541O729613L874595J03822R42207K685519j828441j1212050
$$ -941236 -3568177 -192636 6536977 10411572 10515394 11457601 14143120 12314679 1102629
4565A102629j6306444j2028769k698125M428279O236778M058046J048260L77976
$$ 1102629 -15203815 -27232584 -29930709 -25502430 -19265652 -15207606 -14159346 -13781370
4557a3781370L060818O298152N779292N22539n638648p799821m625896N79947
$$ -13781370 -10720552 -4422400 1356892 1879431 -3759217 -11559038 -16184934 -15604987
4549a5604987K976717Q17064k780935l476833r30669J344105J404955J449140
$$ -15604987 -12628270 -11811206 -14592141 -18068974 -18999643 -17655538 -16250583 -14801443
4541a4801443L677169O186045N404748J175070k969400m015533k279316m09415
$$ -14801443 -11124274 -4938229 466519 1641589 -1327811 -5343344 -7622660 -8032075
4533h032075o56752k619846l262371k86586M311847N987896L457125K62266m75274
$$ -8032075 -8688827 -11308673 -14571044 -14857630 -10545783 -4557887 -1100762 -838496 -1313770
4524a313770J25788k9147j38329J090026J844249p2000k624946j911424J492756
$$ -1313770 -1187982 -1217129 -1355458 -265432 1578817 1506817 -1118129 -3029553 -1536797
4515a536797K683990o81951n123467n893742k250589K668624N265936M207983
$$ -1536797 1147193 465242 -4658225 -10551967 -12802556 -10133932 -4867996 -660013
4507f60013J255916n09842l50477o71195k555387k675607J976897Q123016R680197
$$ -660013 595903 86061 -264416 -935611 -3490998 -6166605 -4189708 3933308 13613505
4498A3613505O331044L099712J423783k640946r488406j2498592p986325k427866
$$ 13613505 19944549 23044261 24468044 21827098 12338692 -159900 -8146225 -10574091
4490a0574091l327058p429216n937001R99514L979242r76383o100775l655000
$$ -10574091 -13901149 -21330365 -27267366 -26267852 -22288610 -23264993 -29365768 -33020768
4482c3020768K952178N293233K520190J125860L905334O009059L334160o33124
$$ -33020768 -30068590 -24775357 -22255167 -21129307 -17223973 -11214914 -7880754 -8513878
4474h513878j19823L752333M028354j754355o925230m255279L737468P690243
$$ -8513878 -8633701 -4881368 -853014 -2607369 -9532599 -13787878 -10050410 -2360167
4466b360167L973779r95027q46232J579268k86244n678799p377777k831079K155941
$$ -2360167 1613612 618585 -227647 1351621 1065377 -4613422 -11991199 -14822278 -12666337
4457a2666337K453306P05725K066026N880049O948635L154853k037557m163091
$$ -12666337 -10213031 -9507306 -7441280 -1561231 5387404 8542257 6504700 2341609
4449B341609k107183J804670L993529K204653k399390n943449n751797k883327
$$ 2341609 234426 2039096 6032625 8237278 5837888 -105561 -5857358 -8740685
4441h740685J50132K665199M963179N631925K664775k658486n663038l351721
$$ -8740685 -8590553 -5925354 -962175 4669750 7334525 4676039 -986999 -4338720
4433d338720J691185L778931L32602n093048o381461j440477N365563P937495
$$ -4338720 -2647535 1131396 1463998 -3629050 -10010511 -11450988 -6085425 1852070
4425A852070M886553K4063k873499l554978l498764l316893l056679k835356j817079
$$ 1852070 6738623 6762686 3889187 334209 -3164555 -6481448 -9538127 -12373483 -14190562
4416a4190562J296200N244606O094414K379726j775977j512177K326281M615883
$$ -14190562 -12894362 -7649756 -1555342 824384 -951593 -2463770 -137489 4478394
4408D478394K732941j305169m851987p232563p956318n708444p75834L622188
$$ 4478394 7211335 5906166 1054179 -6178384 -14134702 -19843146 -20618980 -16996792
4400a6996792M421471K442743J533737L727057O145503M069746k400077o599304
$$ -16996792 -12575321 -10132578 -8598841 -4871784 1273719 5343465 2943388 -3655916
4392c655916k805334N470405Q784241L986423j678950j222842K210542R13600
$$ -3655916 -6461250 -990845 7793396 11779819 10100869 8878027 11088569 12002169
4384A2002169n363769r111560n662807J514605O229584N655084R06161m067762
$$ 12002169 6638400 -2473160 -8135967 -6621362 -391778 5263306 6169467 2101705
4376B101705m135209J808495P072563L809282n758584j0556198n218181K504209
$$ 2101705 -2033504 -225009 6847554 10656836 4898252 -5657946 -10876127 -8371918
4368h371918K809705k792967m898325O2026N983653O616623L122651K18706j066496
$$ -8371918 -5562213 -8355180 -13253505 -13191479 -7207826 -591203 2531448 2750154 1683658
4359A683658l205243o255879o088169j28523P345035Q894611K983321l916369
$$ 1683658 -1521585 -7777464 -13865633 -13994156 -6649121 2245490 5228811 1312442
4351A312442n687262l660695k522674k546242q59424J576675O43830l038069l222661
$$ 1312442 -4374820 -8035515 -10558189 -13104431 -13963855 -12387180 -11743350 -14781419 -18004080
4342a8004080K768834R276486R956366N999117K924006K371815J403858j639889
$$ -18004080 -15235246 -5958760 3997606 9996723 12920729 15292544 16696402 15056513
4334A5056513m577535m699655k281511l57097j601521n135627o883214m461183
$$ 15056513 10478978 5779323 3497812 3140715 1539194 -3596433 -10479647 -14940830
4326a4940830o20538Q48151J237095M441904R033652Q967395L293590j577968
$$ -14940830 -15561368 -14713217 -13476122 -9034218 -566 8966829 12260419 10682451
4318A0682451k007250k478374o365585q434188l499167L181248K976522k283540
$$ 10682451 8675201 6196827 -168758 -8602946 -12102113 -8920865 -5944343 -8227883
4310h227883l219909J914606N095401K227438j120763p36635j054506n835315
$$ -8227883 -11447792 -9533186 -4437785 -2210347 -3331110 -4067745 -5122251 -10957566
4302a0957566r337658m516854M946363R151084N977427K338908K094818J185182
$$ -10957566 -20295224 -24812078 -19865715 -10714631 -4737204 -2398296 -303478 881704
4294H81704l161285o103439k895851K527691L006880p59570j524175K639905M812130
$$ 881704 -2279581 -8383020 -11278871 -8751180 -5744300 -6503870 -8028045 -5388140 -576010
4285e76010j99087p495030q489297k114281M875960O719527L449473j766356n642778
$$ -576010 -775097 -8270127 -16759424 -18873705 -13997745 -7278218 -3828745 -5595101 -11237879
4276a1237879n538965j394244K731873K485723j227664l744978l289632j989808
$$ -11237879 -16776844 -18171088 -15439215 -12953492 -14181156 -17926134 -21215766 -23205574
4268b3205574m73528L141301P578969P483578J370510m223667k781622L417510
$$ -23205574 -23679102 -20537801 -12958832 -5475254 -4104744 -8328411 -11110033 -7692523
4260g692523P026260N566518K798641J632302Q09810j023720k243778r54874J742357
$$ -7692523 -666263 4900255 7698896 9331198 10141008 9117288 6873510 5918636 7660993
4251G660993K993557J544553j444248m325888o349078o823299m349924J144327
$$ 7660993 10654550 12199103 10754855 6428967 79889 -6743410 -11093334 -9949007
4243i949007N947252N250923k86075l902699j438535K522727J404442l303470
$$ -9949007 -4001755 1249168 963093 -2939606 -4378141 -1855414 -450972 -3754442
4235c754442m484092k59549M126552M936253L768893K323081J36404j390018K52961
$$ -3754442 -8238534 -8498083 -4371531 564722 4333615 6656696 6793100 5403082 5656043
4226E656043K315030j313384r382920j2370996n971968K270699M538895L352187
$$ 5656043 7971073 6657689 -2725231 -15096227 -21068195 -18797496 -14258601 -10906414
4218a0906414M671224P358689O668090K807290j048608m688059q127107p548886
$$ -10906414 -6235190 1123499 7791589 10598879 9550271 4862212 -3264895 -10813781
4210a0813781j090248N240826M502648j582498o282700p364464o480492l212654
$$ -10813781 -11904029 -6663203 -2160555 -3743053 -10025753 -17390217 -23870709 -27083363
4202b7083363K834177P299877N830540R83341k004057k947423l838308k668636
$$ -27083363 -24249186 -16949309 -11118769 -10135428 -12139485 -15086908 -18925216 -21593852
4194b1593852K262879O126775M040367K2766Q92748M932825N620333K853661P47513
$$ -21593852 -19330973 -13204198 -9163831 -9141065 -8248317 -3315492 2304841 5158502 5906015
4185E906015j950141q326326j3275916q866545J890306Q165237P031393M641764
$$ 5906015 3955874 -4370452 -17646368 -26512913 -24622607 -16457370 -9425977 -4784213
4177d784213L098397j196540o212458m465184L682915Q721014O128943J180061
$$ -4784213 -1685816 -2882356 -9094814 -13559998 -9877083 -1156069 4972874 6152935
4169F152935j614940k997417k162060K902831P352401L801489m362616o556060
$$ 6152935 4537995 1540578 -621482 2281349 9633750 13435239 9072623 2516563
4161B516563k509892k147260o785789o311646J686060O277742J902541k818467
$$ 2516563 6671 -2140589 -8926378 -15238024 -13551964 -7274222 -5371681 -8190148
4153h190148j020681K566329L820189O144763Q832413M160202o901025j1889728
$$ -8190148 -9210829 -6644500 -2824311 3320452 12152865 16313067 9412042 -2477686
4145b477686o655866j348638m94556L302313Q862341L414637r804498q625311
$$ -2477686 -9133552 -10482190 -10976746 -7674433 1187908 4602545 -5201953 -13827264
4137a3827264P943377Q091843j9699198l4033984J592573N3339834N6420897P446209
$$ -13827264 -5883887 2207956 -17491242 -51525226 -49932653 3407181 59828078 67274287
4129F7274287l2446778k5772288n81782N763284j790556k246485J088552m631445
$$ 67274287 34827509 9055221 8473439 14236723 12446167 10199682 11288234 6656789
4121F656789j1962003o751943M513570N757272j675277m411620m66143J894912
$$ 6656789 -5305214 -12057157 -7543587 -1786315 -3461592 -7873212 -8339355 -6444443
4113f444443J523619L234738M980269J880455j810045P18542M797719J145393
$$ -6444443 -4920824 -1686086 3294183 5174638 3364593 4083135 8880854 10026247
4105A0026247o748931o560913K908826R232826M632866m694039r500902q345355
$$ 10026247 3277316 -3283597 -374771 8858055 13490921 8796882 -704020 -9049375
4097i049375m798483j046396K407502M820475N291777L333345j78465j890013
$$ -9049375 -13847858 -14894254 -12486752 -7666277 -2374500 958845 780380 -1109633
4089a109633J141137N963637N716403m23527m864560k821387M22970j189120m290334
$$ -1109633 31504 5995141 11711544 11288017 6423457 3602070 4025040 2835920 -1454414
4080a454414k550504J703217J026620m777624q313184n580531O0636M588197P299850
$$ -1454414 -4004918 -2301701 -1275081 -6052705 -14365889 -19946420 -19885784 -15297587 -7997737
4071g997737P726197M512826j227881n601075o104312l505786K66231L543114
$$ -7997737 -271540 4241286 3013405 -2587670 -8691982 -12197768 -11931537 -8388423
4063h388423M865295L975333K161709k0080l537922p602952q369694l711460L098706
$$ -8388423 -3523128 452205 2613914 2593834 -944088 -8547040 -16916734 -20628194 -17529488
4054a7529488P263002P627343N462602J253117l871463o337756l683307J920693
$$ -17529488 -10266486 -2639143 2823459 4076576 205113 -6132643 -9815950 -7895257
4046g895257O554470Q540316P181414J471349o175772r029747m095786K151955
$$ -7895257 -1340787 7199529 14380943 15852292 9676520 646773 -3449013 -1297058
4038a297058J837969l136481m482050m06013K333885l04007l545401j810574K632702
$$ -1297058 540911 -2595570 -7077620 -7483633 -5149748 -5453755 -8999156 -10809730 -8177028
4029h177028L348743q62453m734441m130330j015191N85048Q04123K722701N762646
$$ -8177028 -4828285 -5690738 -10425179 -14555509 -15570700 -14985652 -14181529 -11458828 -5696182
4020e696182N089435l41351l887564q7376O060523N105261l437721j0840462j1618773
$$ -5696182 -606747 -948098 -4835662 -4923038 1137485 6242746 2805025 -8035437 -19654210
4011a9654210q422829m189223J843177Q193222R934857O974151N465737P085609
$$ -19654210 -28077039 -32266262 -30423085 -22229863 -12295006 -5320855 144882 7230491
4003G230491N387579k213779p772876m921508O02390O06418k833923l435758k767735
$$ 7230491 12618070 10404291 2631415 -2290093 -1687703 -1081285 -3915208 -7350966 -10118701
3994a0118701n744356r269959o673376j23445K498745R06341J615668N255342
$$ -10118701 -15863057 -25133016 -31806392 -31929837 -29431092 -28524751 -26909083 -21653741
3986b1653741N862046K696150J640694L654937K608168k875283n485933q95542
$$ -21653741 -15791695 -13095545 -11454851 -7799914 -5191746 -8067029 -13552962 -14448504
3978a4448504N417539P285714O060635N063968K778903k897093q693364r580478
$$ -14448504 -9030965 -1745251 4315384 9379352 12158255 9261162 567798 -9012680
3970i012680n197506Q72781N187012N354615O23190n757939q128776m748898M44011
$$ -9012680 -14210186 -13337405 -8150393 -2795778 -2172588 -7930527 -16059303 -20808201 -20364190
3961b0364190L748642N520927O719898O258209L995631J992166M20689l262095
$$ -20364190 -16615548 -11094621 -4374723 1883486 5879117 7871283 8291972 5029877
3953E029877q400263r303086l151109M564366P014788M852765L120434K551793
$$ 5029877 -3370386 -12673472 -15824581 -11260215 -4245427 607338 3727772 6279565
3945F279565J52204l161960k457542K760429O113862L181558j998151l272068
$$ 6279565 6431769 3269809 812267 3572696 9686558 12868116 10869965 7597897
3937G597897j575901k199789m704623k827373M148426P428416J159681p094358
$$ 7597897 6021996 3822207 -882416 -3709789 438637 7867053 9026734 1932376
3929A932376o115963K306224O082481J352597k415035J633507P139628N552659
$$ 1932376 -4183587 -1877363 4205118 5557715 3142680 4776187 11915815 17468474
3921A7468474q81187m536143m162015l255736j907212J417247L779188J523222
$$ 17468474 16587287 12051144 7889129 4633393 2726181 4143428 7922616 9445838
3913I445838k726217m068976l250373l410895k610715K143500O737184N046677
$$ 9445838 6719621 2650645 -599728 -4010623 -6621338 -4477838 2259346 7306023
3905G306023j72146j071650K239630K395909k154790m911194k740481p0737l99463
$$ 7306023 7133877 6062227 8301857 10697766 8542976 3631782 891301 820564 421101
3896D21101k081704l596682n003353l795311K366355Q788424Q459364L343939
$$ 421101 -1660603 -5257285 -10260638 -14055949 -11689594 -2901170 5558194 8902133
3888H902133J357770K691342M55962m927285m992357J095310L623669j061018
$$ 8902133 10259903 12951245 13407207 8479922 3487565 4582875 8206544 7145526
3880G145526m383183j171633J811690l48294j404030L298641O938217L692435
$$ 7145526 2762343 1590710 3402400 3054106 1650076 4948717 11886934 15579369
3872A5579369q0587K264445M804785k10731p573233p504811j820706N47027j634400
$$ 15579369 15498782 17763227 22568012 22357281 14784048 7279237 5458531 6005558 4371158
3863D371158l395998m615173p657665q495587k198574O155070P542392K949783
$$ 4371158 975160 -3640013 -11297678 -19793265 -21991839 -15836769 -8294377 -5344594
3855e344594K17593J50097k549288o970716o706111j703053J853582K597979M158304
$$ -5344594 -5127001 -4976904 -7526192 -14496908 -21203019 -22906072 -21052490 -18454511 -14296207
3846a4296207N593299K984432m87291J886947P055019N199899l246214o833729
$$ -14296207 -8702908 -5718476 -6205767 -4318820 2736199 7936098 4689884 -2143845
3838b143845j627658K836428K10993k973166l12241L465794K131003j174627r68987
$$ -2143845 -3771503 -935075 -724082 -3697248 -4009489 -543695 1587308 412681 -556306
3829e56306O14080p92028l026876k246036j005880l188159n237283j104170O660291
$$ -556306 57774 -734254 -3761130 -6007166 -7013046 -10201205 -15438488 -16542658 -9882367
3820i882367R064525L327797l560444m571904n98491K620816J779928j462707
$$ -9882367 -817842 2509955 -1050489 -5622393 -6220884 -3600068 -1820140 -3282847
3812c282847l334616k047335O73115J922800Q62569j219244k921415k862398P58033
$$ -3282847 -6617463 -8664798 -7991683 -6068883 -5206314 -6425558 -9346973 -12209371 -11451338
3803a1451338P442304J2168070R983574K757440k695008l221942j747682j145005
$$ -11451338 -4009034 8159036 18142610 20900050 18205042 14983100 13235418 12090413
3795A2090413r78955j253340l797479p710626q256857l059744M284400Q835827
$$ 12090413 11111458 9858118 6060639 -1649987 -9906844 -12966588 -8682188 153639
3787A53639Q960474N016829j961438q129651q162413j920327L947540M001870
$$ 153639 9114113 14130942 12169504 4039853 -4122560 -6042887 -2095347 1906523
3779A906523K07928k412281k516649j773316r95751l73589o83190j143893J103219
$$ 1906523 2114451 -297830 -2814479 -4587795 -5583546 -5957135 -6640325 -7784218 -6680999
3770f680999O245490R404352O597580P54155k085782r99997o67767m038839p998712
$$ -6680999 -435509 8968843 15566423 16320578 14234796 13234799 12567032 8528193 529481
3761E29481p435699j923511L235935L128127n36614j704361R99676J643464l414738
$$ 529481 -6906218 -8829729 -5593794 -2465667 -3002281 -4706642 -3706966 -2063502 -5478240
3752e478240p738481k967184P913406J3331032Q448751m30175o988633j1281934
$$ -5478240 -13216721 -16183905 -8270499 5060533 13509284 13079109 6090476 -5191458
3744e191458j3153122r127588l31316N206818L761706J696583M231615O574305
$$ -5191458 -18344580 -27472168 -27803484 -22596666 -18834960 -17138377 -12906762 -6332457
3736f332457L667306P62561M377423Q970585M381054o855168j1785863o047087
$$ -6332457 -2665151 -1902590 2474833 11445418 15826472 8971304 -2814559 -8861646
3728h861646Q85425J138630j236998P08759N747814P758301M884463O55012j000895
$$ -8861646 -7976221 -6837591 -8074589 -7365830 -1618016 6140285 11024748 11679760 10678865
3719A0678865J269761N708793P892468M427406k255829n740140l644452m65235
$$ 10678865 11948626 17657419 25549887 29977293 27721464 21981324 18336872 17871637
3711A7871637n79405k087908q56933K075320J635533l240169p051516n087616
$$ 17871637 17292232 15204324 14347391 16422711 18058244 14818075 7766559 2678943
3703B678943l92949J95758l871931n391375P617O252758M710161l028282o934287
$$ 2678943 2285994 2481752 -1390179 -6781554 -6773937 -521179 4188982 1160700 -5773587
3694e773587k666659L480846N262328M310528L562369M87485o750281j2216225
$$ -5773587 -8440246 -4959400 302928 4613456 8175825 8663310 1913029 -10303196
3686a0303196r131245n19908M448269K589104j550677l980431m196167j347244
$$ -10303196 -19434441 -19954349 -15506080 -12916976 -14467653 -18448084 -22644251 -23991495
3678b3991495M913633R988203P998197N92575m286951l099099J2419J129007J027385
$$ -23991495 -19077862 -9089659 -1091462 -498887 -4785838 -7884937 -7872518 -6743511 -5716126
3669e716126N74022j323906k889485O22826Q758818J3485355R138933R0795n582436
$$ -5716126 -5142104 -6466010 -9355495 -8732669 26149 13511504 22650437 22741232 17158796
3660A7158796n950484m465210k935500l49711K941814M241182J702031l627974
$$ 17158796 11208312 6743102 3807602 3457891 6399705 10640887 12342918 8714944
3652H714944q517955r443440n348405N70717L666169L030746J699308J552355
$$ 8714944 196989 -9246451 -14594856 -14024139 -10357970 -7327224 -5627916 -4075561
3644d075561J365485N97300J007118K658817K235516j893493o044577n702716
$$ -4075561 -2710076 -2112776 -1105658 1553159 3788675 1895182 -4149395 -9852111
3636i852111j423462K368731K685349O1330k737844k441075K029961P036316P091280
$$ -9852111 -11275573 -8906842 -6221493 -6160163 -8898007 -11339082 -9309121 -2272805 4818475
3627D818475J956005k271097j277649J834584K095094K28056K24289J840330P62254
$$ 4818475 6774480 4503383 3225734 5060318 7155412 7383468 7607757 9448087 10210341
3618A0210341m337647r472446j0619742p990699m312472j441531M25544J840295
$$ 10210341 5872694 -3599752 -14219494 -22210193 -26522665 -27964196 -27538652 -25698357
3610b5698357L069070L298255J395013j636400k215911J965637Q399034J1888868
$$ -25698357 -22629287 -19331032 -17936019 -19572419 -21788330 -19822693 -11423659 465209
3602D65209R832998L972846k291546o477232p479433n658685k875065j094446
$$ 465209 10298207 14271053 11979507 5502275 -1977158 -7635843 -10510908 -11605354
3594a1605354n30368J84794K080041M757695O968208P492246N519309R94356m684864
$$ -11605354 -12135722 -11950928 -9870887 -5113192 1855016 9347262 14866571 15860927 11176063
3585A1176063q301601o470308L33644N696191K786248o196594r987749j799516
$$ 11176063 2874462 -3595846 -3262202 2433989 5220237 -976357 -10964106 -12763622
3577a2763622J0294095J2619558L817342m095107k870657K257423L024566J19366
$$ -12763622 -2469527 10150031 13967373 9872266 7001609 9259032 12283598 12402964
3569A2402964j056683l59150j346779l480347l033777K4904K151032K063272J305180
$$ 12402964 11346281 10987131 9640352 6160005 3126228 3151132 5302164 7365436 8670616
3560H670616K53052j519351k308161p36648L07602k473407o341847n749850j059954
$$ 8670616 8923668 7404317 5096156 4359508 4667110 2193703 -4148144 -9897994 -10957948
3551a0957948K188040K247628K639663M321441L608024l75938l104756k340208
$$ -10957948 -8769908 -6522280 -3882617 438824 4046848 3670910 566154 -1774054
3543a774054k098310n271173p893140n233645Q12223M942300N502488M124321
$$ -1774054 -3872364 -9143537 -17036677 -22270322 -21458099 -16515799 -11013311 -6888990
3535f888990J652073j176255j856218N86787K765834J608145n69238j53431J150720
$$ -6888990 -5236917 -6413172 -8269390 -7682603 -4916769 -3308624 -3877862 -4031293 -2880573
3526b880573o39578l892007l052530J773984L541969j422541p303230o370767
$$ -2880573 -3520151 -7412158 -10464688 -8690704 -5148735 -6571276 -13874506 -20245273
3518b0245273J004848P594679Q422911N152174K103867Q03635o87339l973298
$$ -20245273 -19240425 -11645746 -3222835 1929339 4033206 4836841 4149502 176204
3510A76204o843247m907005K279507Q394207O714743j108584o487274m889183
$$ 176204 -6667043 -11574048 -9294541 -900334 5814409 4705825 -1781449 -6670632
3502f670632j032987p41052k126675L33398N872164P827778L545598k115968m382300
$$ -6670632 -7703619 -8444671 -10571346 -10237948 -4365784 3461994 7007592 4891624 509324
3493E09324m084737l153312m8950N905125R845968O888870J31653k857571o35247
$$ 509324 -3575413 -6728725 -6777675 -872550 8973418 15862288 15993941 13136370 12501123
3484A2501123J182722l16426j356922Q53847L034114K146709J052065K603570
$$ 12501123 13683845 13367419 12010497 12864344 15898458 18045167 19097232 21700802
3476B1700802K819916l213365j1437430j2484971m852114K739443L375521L050
$$ 21700802 24520718 21307353 9869923 -2615048 -7467162 -4727719 -1352198 -1349148
3468a349148q93239J890425N191083O891687O561516L789812l57993k444921o34004
$$ -1349148 -2242387 -351962 4839121 11730808 18292324 22082136 21724143 19279222 18645218
3459A8645218K152256J952361j106465m145351n905853o527836m963869o09942
$$ 18645218 20797474 22749835 21643370 17498019 11592166 5064330 100461 -509481
3451e09481L710333M492439K618161J679984J834761p6802m160890o303671m759360
$$ -509481 3200852 7693291 10311452 11991436 13826197 13749395 9588505 3284834 -1474526
3442a474526l071182l980278m792231k244110J612869K624477J114323P23776
$$ -1474526 -4545708 -8525986 -13318217 -15562327 -13949458 -11324981 -10210658 -9486882
3434i486882K235071L203182K975191L233319L467464J045398k900581k817008
$$ -9486882 -7251811 -4048629 -1073438 2159881 5627345 6672743 3772162 955154
3426I55154L119182Q557414O891844M50047l290011k645842k810400o117292p854481
$$ 955154 4074336 12631750 19523594 19973641 16683630 14037788 11227388 5110096 -2744385
3417b744385m383610K12614L56387j942440l81687M699803N533706j330471q401262
$$ -2744385 -7127995 -6915381 -6558994 -8501434 -8883121 -4183318 1350388 19917 -8381345
3408h381345o569520K445339Q154706M753506k486848n170708j818494K615086
$$ -8381345 -14950865 -12505526 -4350820 402686 -2084162 -7254870 -9073364 -6458278
3400f458278M273632L678882K472663P11552j655127l248894k819674r25965J076096
$$ -6458278 -2184646 1494236 3966899 4678451 3023324 -225570 -3045244 -3971209 -2895113
3391b895113K379921K168192l13844l502720l561223N86255M231450K819293m56143
$$ -2895113 -515192 1653000 1339156 -2163564 -5724787 -5138532 -907082 1912211 1456068
3382A456068J563617Q340434J0275338J969998r134292j2499029q068122l432918
$$ 1456068 3019685 11360119 21635457 23605455 14471163 1972134 -6095988 -9528906
3374i528906j133366K428065O637433N389357j423532m520570J381006Q397673
$$ -9528906 -10662272 -8234207 -1596774 3792583 2369051 -2151519 -770513 7627160
3366G627160O702762j019478m781217k837438k209194n254501o275406l066323
$$ 7627160 14329922 13310444 8529227 5691789 3482595 -1771906 -8047312 -11113635
3358a1113635j737099n455065o944494O46430J1294567J3066472M874916k117079
$$ -11113635 -12850734 -18305799 -25250293 -24603863 -13309296 -242824 4632092 2515013
3350B515013N5910O568696P810687J529216o294742r333457o401556p51744L485889
$$ 2515013 2570923 9139619 16950306 18479522 12184780 2851323 -3550233 -4301977 -816088
3341h16088M522715L671080K647176P05135l639112q484834r476941n854622k254211
$$ -816088 3706627 7377707 10024883 10730018 7090906 -1393928 -10870869 -16725491 -18979702
3332a8979702k435042m111833k785422J702317N768626P426386P322291N709079
$$ -18979702 -21414744 -25526577 -28311999 -26609682 -20841056 -13414670 -6092379 -383300
3324c83300K507863j27030L26948K110820R14426k869039l593212Q00248M501043
$$ -383300 2124563 1997533 2324481 4435301 5349727 2480688 -1112524 -312276 4188767
3315D188767K351661j637906K5520O548327R283965L889073l944182o622917l678492
$$ 4188767 6540428 4902522 4928042 11476369 20760334 24649407 20705225 14082308 10403816
3306A0403816K1520J333983P08038n90780j506713n13907K819468N656137M030890
$$ 10403816 10425336 11759319 12467357 11876577 10369864 9855957 12675425 18331562 22362452
3297B2362452k026830p433082p477010l358806o52998k161227m225634j961901
$$ 22362452 20335622 12902540 5425530 2066724 1413726 -747501 -4973135 -6935036
3289f935036L115781M313301o85757n788164n035598j126327j85434j297040R89649
$$ -6935036 -3819255 494046 -191711 -5979875 -11015473 -12141800 -12327234 -13624274 -12634625
3280a2634625M874618J922078q004309j2607148m470240O091100N110212m134006
$$ -12634625 -7760007 -5837929 -13842238 -26449386 -30919626 -24828526 -19718314 -23852320
3272b3852320o220932K910233J0494603O639268k386581n457223j571956L076546
$$ -23852320 -30073252 -27163019 -16668416 -10029148 -12415729 -17872952 -19444908 -16368362
3264a6368362N568694O266118L833725j737400m682221K838P409116P545625j156633
$$ -16368362 -10799668 -4533550 -699825 -2437225 -7119446 -7116608 292508 7838133 6681500
3255F681500r757159j0531703m975013P16123K964891K237634J180616K460099
$$ 6681500 -3075659 -13607362 -18582375 -17866252 -14901361 -12663727 -11483111 -9023012
3247i023012N455001N417782l98072o892895o651777p34629K570337L68248r58588
$$ -9023012 -3568011 1849771 1451699 -5441196 -12092973 -12827602 -10257265 -9889017 -10847605
3238a0847605K964344O949252M892149l04426j778078Q57722K841255K729225
$$ -10847605 -7883261 -934009 3958140 3653714 1875636 2733358 5574613 8303838
3230H303838K482560J202618l762256r850525j0477834m324245K356541M209248
$$ 8303838 10786398 11989016 8226760 -1623765 -12101599 -16425844 -14069303 -9860055
3222i860055K484583O32638q88418k882038m363199l949392j746462J741461N905278
$$ -9860055 -7375472 -6742834 -7631252 -10513290 -14876489 -18825881 -20572343 -18830882 -12925604
3213a2925604Q366875O633116K639861J502718L902652M268049o66330o134557
$$ -12925604 -4558729 2074387 4714248 6216966 10119618 14387667 13721337 7586780
3205G586780o176122k078100R78077K242959M325088O034321L221992l365892
$$ 7586780 1410658 -667442 310635 2553594 6878682 12913003 16134995 12769103
3197A2769103p479916n971376k769749k412649m078943m259687j604594L076954
$$ 12769103 5289187 -682189 -3451938 -5864587 -9943530 -14203217 -15807811 -12730857
3189a2730857Q196985J0617256P145707l32477m554535j328390M308017M445018
$$ -12730857 -4533872 6083384 13229091 12896614 8342079 7013689 11321706 15766724
3181A5766724j000146m537474j560361L967290N257701O41118n863825r440717
$$ 15766724 14766578 10229104 8668743 12636033 17893734 18534852 12671027 3230310
3173C230310q139832l398548J090473J788097j641456n548806n584311j149575
$$ 3230310 -4909522 -8308070 -7217597 -5429500 -7070956 -12619762 -18204073 -19353648
3165a9353648L941412N687832M357433L589646M787222M357479j192948q586286
$$ -19353648 -15412236 -9724404 -5366971 -1777325 3009897 7367376 6174428 -2411858
3157b411858j0103697l526395M158760N533665J787483q43560p37202j369467
$$ -2411858 -12515555 -16041950 -11883190 -6349525 -4562042 -5405602 -6142804 -7512271
3149g512271l294900k297491K885802O838505M853242j99329k322573n55773J527539
$$ -7512271 -10807171 -13104662 -10218860 -3380355 1472887 1273558 -1049015 -1604788 -77249
3140g7249K094179K168407J811832m4977k203270k048415j66769J04955j430294
$$ -77249 2016930 4185337 5997169 5952192 3748922 1700507 1533738 1638693 208399
3131B08399q09532L339273O239530L396144k559384n452254m058339k550843k987240
$$ 208399 -601133 2738140 8977670 12373814 9814430 4362176 303837 -2247006 -5234246
3122e234246k060800L039001Q992611R604358L545941l649680n498638j041222
$$ -5234246 -7295046 -4256045 4736566 14340924 17886865 14237185 8738547 7697325
3114G697325M922416P045866M251148j49620k318307j594405n50885j683808m446475
$$ 7697325 12619741 19665607 23916755 23767135 21448828 19854423 19303538 17619730 13173255
3105A3173255o008982m861198k655609j676520j490516q4903J826701N23394n057227
$$ 13173255 7164273 2303075 -352534 -2029054 -3519570 -3604473 -1777772 -1254378 -6311605
3096f311605r827357p896806m71299N010594L878532p58606k928913p99490K918721
$$ -6311605 -16138962 -24035768 -24507067 -19496473 -15617941 -16376547 -19305460 -20104950 -17186229
3087a7186229N147983M730249K044048j329837l125929k205629M17075K988928
$$ -17186229 -12038246 -7307997 -5263949 -6593786 -9719715 -11925344 -11508269 -8519341
3079h519341M420786L855976R00241k489271k690461Q89059L906843K625540m54174
$$ -8519341 -4098555 -242579 657662 -1831609 -4522070 -3633011 273832 2899372 2445198
3070B445198m4997L874812N675521K272683k135934j613270L487013O612380K939307
$$ 2445198 2400201 6275013 11950534 14223217 12087283 10474013 13961026 20573406 23512713
3061B3512713m448301p644386l483748J740628j73179p820913j0954989m347645
$$ 23512713 19064412 11420026 7936278 9676906 9503727 1682814 -9272175 -13619820
3053a3619820M518805N857259Q95317j685652O19681K190231O2114j814615m87737
$$ -13619820 -9101015 -3243756 -2348439 -4034091 -3414410 -1224179 -1162065 -2976680 -3464417
3044c464417J419297J549602J482072J656367p92241n560259o972468k686943
$$ -3464417 -2045120 -495518 986554 2642921 1850680 -3709579 -10682047 -13368990
3036a3368990J382842n4177l452679k855199O17966K199192J948494K833922M080505
$$ -13368990 -11986148 -12040325 -15493004 -18348203 -17730237 -15531045 -13582551 -10748629 -6668124
3027f668124L559639L363323N496462N479886j106255q553665p448255K74851
$$ -6668124 -3108485 254838 5751300 11231186 10124931 1571266 -5876989 -5602138
3019e602138L431227j029314l947557M61406N982437N797577K573469J185665
$$ -5602138 -2170911 -3200225 -7147782 -6686376 -703939 5093638 7667107 8852772
3011H852772n8821l869010o677867m527995p93097m97545j431036J439325O255224
$$ 8852772 8793951 4924941 -1752926 -6280921 -7074018 -7571563 -9002599 -7563274 -1308050
3002a308050O772466K335191j920411l379798l777565l760415k011440O63086
$$ -1308050 5464416 7799607 5879196 2499398 -1278167 -5038582 -7050022 -6386936
2994f386936K073841K985800N382119P205959M522234j565900n839776o389351
$$ -6386936 -4313095 -1327295 4054824 11260783 15783017 14217117 8377341 1987990
2986A987990n360861l038095J871443N969711L188073m965829q940998m351797
$$ 1987990 -3372871 -6410966 -4539523 1430188 4618261 -347568 -9288566 -13640363
2978a3640363J538695J160360k264339j258927L675988O119958M794899M302302
$$ -13640363 -12101668 -10941308 -13205647 -14464574 -10788586 -4668628 126271 4428573
2970D428573N683970M211699j973908p648125p799100m211568j471698l22802
$$ 4428573 10112543 14324242 12350334 4702209 -3096891 -7308459 -8780157 -9102959
2962i102959J067067J989764k7014m244433o697704n494599k711905k34958K837989
$$ -9102959 -8035892 -6046128 -6073142 -10317575 -17015279 -22509878 -25221783 -25456741 -22618752
2953b2618752O763025Q229603M241243k558184n987156l575052J259123M277007
$$ -22618752 -15855727 -7626124 -3384881 -5943065 -11930221 -15505273 -14246150 -9969143
2945i969143M479541K596265q54939m205766m362700m41126M292666O265524N467151
$$ -9969143 -5489602 -2893337 -3748276 -7954042 -12316742 -12757868 -8465202 -2199678 3267473
2936C267473L505163L46860m022113o920971n818965k687270j710008l206335
$$ 3267473 6772636 7119496 3097383 -3823588 -9642553 -12329823 -14039831 -17246166
2928a7246166l483533o66191K736117L440919Q53477l140796n427878l277088
$$ -17246166 -20729699 -21395890 -18659773 -15218854 -14365377 -17506173 -22934051 -26211139
2920b6211139K532085P047058O740576M484718M929048O468414L552872l397118
$$ -26211139 -23679054 -16631996 -9891420 -5406702 -477654 5990760 9543632 6146514
2912F146514p179166m341298Q9484J054194K88177J030308K065853K017647L963349
$$ 6146514 -1032652 -5373950 -5284466 -4230272 -3942095 -2911787 -845934 1171713 5135062
2903E135062R372150J1940712N205677o236980j1224859p156509k801154m823449
$$ 5135062 14507212 26447924 31653601 25416621 14191762 7035253 4234099 -589350
2895e89350q807973p028545L47705O416292O916809M041784J736512P35679p27560
$$ -589350 -9397323 -16425868 -16078163 -9661871 -2745062 1296722 3033234 3768913 3041353
2886C041353k941279l308329K94831N712195Q135408N752993J344444k468461
$$ 3041353 100074 -3208255 -2913424 2798771 10934179 16687172 18031616 15563155
2878A5563155o218213r933195j0351757n573866M72623K793087K330138L218373
$$ 15563155 9344942 -588253 -10940010 -16513876 -16041253 -13248166 -10918028 -7699655
2870g699655M956074L325618j583444m552631k946818M61171L049286M877252
$$ -7699655 -2743581 582037 -1001407 -5554038 -8500856 -8039685 -4990399 -113147
2862a13147M751987L23023n840495o882587j579760K519821k30943n611103o760575
$$ -113147 4638840 4961863 -878632 -7761219 -9340979 -6821158 -7052101 -12663204 -19423779
2853a9423779l650248J14684M461391J0036674J2722760Q704891J985661q92551
$$ -19423779 -23074027 -22959343 -18497952 -8461278 4261482 12966373 14952034 14059483
2845A4059483j133614m375028q999187p528891R615M149573J12726n162818m324410
$$ 14059483 12925869 8550841 -448346 -7977237 -7967622 -3818049 -3705323 -8868141 -13192551
2836a3192551J66099K583309L441610N267380M582498k979106j2285605j2559865
$$ -13192551 -13026452 -10443143 -7001533 -1734153 2848345 -130761 -12416366 -24976231
2828b4976231k070346Q492597R424239K978314k002971j714110O55454J880923
$$ -24976231 -27046577 -18553980 -9129741 -6151427 -8154398 -9868508 -9213054 -7332131
2820g332131K472906L225900K245339j911307o226634n916763j003399L359909
$$ -7332131 -4859225 -1633325 612014 -1299293 -7525927 -13442690 -14446089 -11086180
2812a1086180M171685M229428N928413N825011N40279n288426m271066J882990
$$ -11086180 -6914495 -2685067 3243346 9068357 9608636 4320210 49144 1932134
2804A932134M194444O24854r55409L065088M921518j254940q103571o160220M83647
$$ 1932134 6126578 6751432 5796023 8861111 13782629 12527689 4424118 -1736102 -1252455
2795a252455O83717n723037q310013l180056K075459J707129o80264p68976k6671
$$ -1252455 -568738 -6291775 -14601788 -17781844 -15706385 -13999256 -14679520 -15448496 -15475167
2786a5475167L36775L211199Q541585J0043349M408937k625406m784946l771292
$$ -15475167 -15138392 -11927193 -3385608 6657741 11066678 8441272 3656326 -114966
2778a14966l613236k528461K548695P892214P005430K03984o102195p653984m775087
$$ -114966 -3728202 -6256663 -3707968 4184246 11189676 11393660 5291465 -2362519 -7137606
2769g137606N03131M348156J529145p717594j4102920r455890J829370Q619309
$$ -7137606 -6634475 -2286319 -757174 -8474768 -22577688 -32033578 -30204208 -21584899
2761b1584899P977320N964013N090612J154420n949473q253743j364260P119966
$$ -21584899 -13607579 -7643566 -2552954 -1398534 -7348007 -15601750 -16966010 -9846044
2753i846044O779346k167007r710525q106204P39675Q634430R251011L516799
$$ -9846044 -3066698 -5233705 -14944230 -23050434 -22310759 -13676329 -4425318 -908519
2745i08519k060681k766975l06270J471933K829597N990179Q762708O229463j411449
$$ -908519 -2969200 -5736175 -6042445 -4570512 -1740915 4249264 13011972 19241435 17829986
2736A7829986q392828j1091518j0679021q108817l139426R31466p64419n691048
$$ 17829986 9437158 -1654360 -12333381 -20442198 -23581624 -22650158 -23414577 -29105625
2728b9105625m620246N030238J3880190J3323549O783831K589227J920575Q56097
$$ -29105625 -33725871 -28695633 -14815443 -1491894 5291937 7881164 9801739 10657836
2720A0657836n57199P85318L819658M180974R73657k855957n322834n826492l189783
$$ 10657836 10100637 10885955 14705613 18886587 19860244 17004287 11681453 5854961 2665178
2711B665178J574671L129439j755740p721730o769030Q23055P294819P721710
$$ 2665178 4239849 7369288 5613548 -2108182 -8877212 -8054157 -759338 6962372
2703F962372L776395j362887n590743o204930k000594L078710M036344K092399
$$ 6962372 10738767 9375880 3785137 -2419793 -4420387 -1341677 2694667 4787066
2695D787066K104401L705136K046297k682649m284650p43139J952681q49204n443667
$$ 4787066 6891467 10596603 12642900 9960251 5675601 4932462 6885143 6035939 592272
2686E92272n676953j165897L633590M842898J333974m785005q107946m456767
$$ 592272 -5084681 -6250578 -2616988 2225910 3559884 -1225121 -9333067 -13789834
2678a3789834K865060N709396J592436l252590l152417J62506K693992M397771
$$ -13789834 -10924774 -5215378 -3622942 -6875532 -10027949 -9865443 -7171451 -2773680
2670b773680O158885N562118Q52243m325754n138878k178974L50917Q59005P18402
$$ -2773680 3385205 8947323 9799566 5473812 334934 -1844040 -1493123 -634118 84284
2661H4284L65527p65337j545069j08124K881397M537268K962247j313422n916876
$$ 84284 449811 -315526 -1860595 -1968719 912678 5449946 8412193 7098771 1181895
2652A181895p518115m072723K391179P085067P535208N174099J665363k710931
$$ 1181895 -6336220 -10408943 -8017764 -932697 6602511 11776610 13441973 10731042
2644A0731042o258828o060842k835408j119359k505751l519229k506516k763229
$$ 10731042 4472214 -1588628 -4424036 -5543395 -8049146 -11568375 -14074891 -16838120
2636a6838120n222178m371068L014191J0439664R596117J779316m940748o430250
$$ -16838120 -22060298 -26431366 -23417175 -12977511 -3381394 -1602078 -6542826 -12973076
2628a2973076m010885J055777P242568R580777M399517m185621q938469q636804
$$ -12973076 -16983961 -15928184 -8685616 895161 5294678 1109057 -7829412 -16466216
2620a6466216o394581k345644M055589P838717M413357o06393J682102Q093460
$$ -16466216 -22860797 -25206441 -21150852 -13312135 -8898778 -9505171 -7823069 270391
2612B70391P262947p62876k839046N846397J2657975O724881n042110j0068558
$$ 270391 7533338 6770462 3931416 9777813 22435788 29160669 24118559 14050001
2604A4050001p707119m442667p05778N404820Q125588J198073q736659r109088
$$ 14050001 6342882 1900215 1194437 6599257 14724845 15922918 7186259 -1922829
2596a922829l59994M678758N88137l998712k244559L13731l133313q330324o584862
$$ -1922829 -2282823 2395935 2984072 -1014640 -3259199 -2945468 -6078781 -14409105 -20993967
2587b0993967J778369Q064987O671893O8286o128694q144543m785179K416888
$$ -20993967 -19215598 -11150611 -4478718 -4410432 -10539126 -18683669 -23468848 -21051960
2579b1051960Q917415R792747M299772k809403n421442j928163L161451M239075
$$ -21051960 -12134545 -2341798 1957974 -851429 -6272871 -8201034 -5039583 -800508
2571h00508J134378j204364m8330J308645n71324l053480j595353K231093K771822
$$ -800508 333870 -870494 -918824 389821 -181503 -3234983 -4830336 -2599243 172579
2562A72579l38089j250056K546328N888724L856932j057704l211539j370469J567436
$$ 172579 -165510 -1415566 1130762 7019486 10876418 9818714 6607175 5236706 6804142
2553F804142L347486L393440J541214j085309k057743j172602j550916m531107
$$ 6804142 10151628 13545068 15086282 14000973 11943230 10770628 9219712 4688605
2545D688605o397536l645597J184703K898624O55642k449384m613000n592586
$$ 4688605 -1708931 -5354528 -4169825 -1271201 -615559 -3064943 -7677943 -13270529
2537a3270529l809446J363903N594712L787532j818045l663321L48106M143849
$$ -13270529 -17079975 -15716072 -10121360 -6333828 -8151873 -11815194 -11467088 -7323239
2529g323239L227083R82508K010201M498519L818139M0663k959653l681778l814929
$$ -7323239 -4096156 -3113648 -1103447 3395072 7213211 7253874 4294221 612443 -3202486
2520c202486m108279l357528j192190R84491J714100M96931j956261l227326r41171
$$ -3202486 -7310765 -10668293 -11860483 -10875992 -9161892 -8664961 -10621222 -13848548 -14789719
2511a4789719L286035M270251K6182m886135o014181n615598p787719r937326
$$ -14789719 -11503684 -7233433 -7207251 -12093386 -18107567 -23723165 -31510884 -41448210
2503d1448210n817662L816217J0689698J0193201O614280N106796M645978K488033
$$ -41448210 -47265872 -43449655 -32759957 -22566756 -15952476 -10845680 -6199702 -3711669
2495c711669K48182O60540J930603M06979l237607n048274l714944j495815j24119
$$ -3711669 -3463487 -2802947 -872344 -465365 -3702972 -8751246 -12466190 -13962005 -14086124
2486a4086124O26820Q89363M43772J68023J028490K106865K050427J579115J890934
$$ -14086124 -13459304 -12569941 -12126169 -11958146 -10929656 -8822791 -6772364 -5193249 -3302315
2477c302315J681794j018782m770880n897913l426007L37914L602568N810570
$$ -3302315 -1620521 -2639303 -7410183 -13308096 -16734103 -16396189 -12793621 -6983051
2469f983051N172978K98886n134878m567654K418482P829560N145297k309792
$$ -6983051 -1810073 -1511187 -6646065 -11213719 -8795237 -965677 4179620 1869828
2461A869828o559275n276199k332045l45884J792046M244462M340946J013234
$$ 1869828 -4689447 -9965646 -12297691 -12643575 -10851529 -6607067 -2266121 -1252887
2453a252887k568489k942705n43863J883046K946093K703899J051510j348554
$$ -1252887 -3821376 -6764081 -7307944 -5424898 -2478805 225094 1276604 -71950
2445g1950j826016J322139M799972K857837m797309j0829371q709820j107687
$$ -71950 -1897966 -575827 4224145 7081982 2284673 -8544698 -17254518 -18362205
2437a8362205L733806K798526R99509K701427N439156M736544J385505j33787
$$ -18362205 -14628399 -11829873 -10830364 -8128937 -2689781 2046763 3432268 3298481
2429C298481J519499L367818K904472M64622k714890n376400n456189j950893
$$ 3298481 4817980 8185798 11090270 11554892 8840002 3463602 -1992587 -3943480
2421c943480K318174L260167J082715k75124M19911L8826l066704o013024o189818
$$ -3943480 -1625306 1634861 2717576 2442452 2862363 2901189 -165515 -6178539 -12368357
2412a2368357m961245m018116k123399J200228K618531r3926l166150j665940
$$ -12368357 -17329602 -21347718 -23471117 -22270889 -19652358 -19746284 -22912434 -24578374
2404b4578374L044621N688396N123103M468294M164987J145323m322706o816881
$$ -24578374 -21533753 -15845357 -10722254 -6253960 -2088973 -943650 -5266356 -12083237
2396a2083237l097628L146633O425068N748347L320994L17361k843318m471889
$$ -12083237 -15180865 -12034232 -5609164 139183 3460177 3777538 934220 -3537669
2388c537669l385781j495760j544470k729900j228358M575708J1123833J2718354
$$ -3537669 -6923450 -8419210 -9963680 -12693580 -13921938 -9346230 1777603 14495957
2380A4495957P132617j912797p957199p875951m405228j948985j090226N46602
$$ 14495957 21628574 19715777 11758578 3882627 -522601 -2471586 -3561812 -3015210
$$ [...]
##END NTUPLES=NMR SPECTRUM
##END=
