##TITLE=31Pdec_De-80HDEK
 D2O, 64 sc
 12.2.2025
##JCAMPDX= 6.0         $$ Bruker NMR JCAMP-DX V2.0
##DATA TYPE= NMR SPECTRUM
##DATA CLASS= NTUPLES
##ORIGIN= UXNMR, Bruker Analytische Messtechnik GmbH
##OWNER= root
$$ XWIN-NMR		Version 3.5
$$ Thu Feb 13 15:00:49 2025 Russian Standard Time (UT+4h)  she@DPX200
##.OBSERVE FREQUENCY= 81.013821
##.OBSERVE NUCLEUS= ^31P
##.ACQUISITION MODE= SIMULTANEOUS
##.ACQUISITION SCHEME= undefined
##.AVERAGES= 64
##.DIGITISER RES= 17
##SPECTROMETER/DATA SYSTEM= spect
##.PULSE SEQUENCE= zgpg30
##.SOLVENT NAME= CDCl3
##.SHIFT REFERENCE= (INTERNAL, CDCl3, 0, 198.062)
##AUDIT TRAIL= $$ (NUMBER, WHEN, WHO, WHERE, WHAT)
$$ ##TITLE= Audit trail, XWIN-NMR		Version 3.5
$$ ##JCAMPDX= 5.01
$$ ##ORIGIN= Bruker BioSpin GmbH
$$ ##OWNER= she
$$ F:/spectra/data/she/nmr/P31/2/pdata/1/auditp.txt
$$ ##AUDIT TRAIL=  $$ (NUMBER, WHEN, WHO, WHERE, WHAT)
(   1,<2025-02-13 14:59:45.18 +0400>,<she>,<DPX200>,
      <created by zg, POWCHK disabled, PULCHK disabled
       configuration hash MD5:
       00 E9 B6 7A A2 85 ED C7 34 08 36 98 17 FE 4E 26
       data hash MD5: 32K
       7A 5B DE 21 68 C8 B5 54 A8 0A B6 E7 D8 51 7D DF>)
(   2,<2025-02-13 14:59:48.57 +0400>,<she>,<DPX200>,
      <Start of raw data processing
       efp BC_mod = 2 LB = 1.5 FT_mod = 6 PKNL = 1 PHC0 = 1711.971 PHC1 = 150.6954 SI = 64K 
       data hash MD5: 64K
       07 A0 E1 27 4D 6A 6E B9 A3 E2 2E 2B 5C C2 A7 27>)
(   3,<2025-02-13 15:00:13.57 +0400>,<she>,<DPX200>,
      <pk PHC0 = -15.92506 PHC1 = 0 
       data hash MD5: 64K
       13 74 D8 7D C2 87 13 A2 DC 0D C1 E9 1F D4 16 B2>)
$$ ##END=
$$ 
$$ hash MD5
$$ 03 E5 A5 B9 4C FB A1 E3 87 1F F6 70 AB FF DD 54
##$RELAX= 
##$RELAX= 
##$RELAX= 
##$RELAX= 
##$RELAX= 
##$RELAX= 
##$RELAX= 
##$RELAX= 
$$ Bruker specific parameters
$$ --------------------------
##$DU= <F:/spectra>
##$EXPNO= 2
##$NAME= <P31>
##$PROCNO= 1
##$TYPE= <nmr>
##$USER= <she>
##$AMP= (0..31)
100 100 100 100 100 100 100 100 100 100 100 100 100 100 100 100 100 100 
100 100 100 100 100 100 100 100 100 100 100 100 100 100 
##$AQSEQ= 0
##$AQ_mod= 1
##$AUNM= <au_zg>
##$AUTOPOS= <>
##$BF1= 81.014009
##$BF2= 200.13
##$BF3= 200.13
##$BF4= 200.13
##$BF5= 200.13
##$BF6= 200.13
##$BF7= 200.13
##$BF8= 200.13
##$BYTORDA= 1
##$CFDGTYP= 0
##$CFRGTYP= 5
##$CHEMSTR= <none>
##$CNST= (0..31)
1 1 145 1 1 1 1 1 1 1 1 1 1 1 1 1 1 1 1 1 1 1 1 1 1 1 1 1 1 1 1 1 
##$CPDPRG= <waltz16>
##$CPDPRG1= <>
##$CPDPRG2= <waltz16>
##$CPDPRG3= <>
##$CPDPRG4= <mlev>
##$CPDPRG5= <mlev>
##$CPDPRG6= <mlev>
##$CPDPRG7= <mlev>
##$CPDPRG8= <mlev>
##$CPDPRGB= <>
##$CPDPRGT= <>
##$D= (0..31)
0 1 0 0 0 0 0 0 0 0.06 0 0.03 2e-05 3e-06 0 0 0.0002 0 0 0 0 0 0 0 0 0 
0 0 0 0 0 0 
##$DATE= 1739444384
##$DBL= (0..7)
120 120 120 11 120 120 24 19 
##$DBP= (0..7)
150 150 150 150 150 150 150 150 
##$DBP07= 0
##$DBPNAM0= <>
##$DBPNAM1= <>
##$DBPNAM2= <>
##$DBPNAM3= <>
##$DBPNAM4= <>
##$DBPNAM5= <>
##$DBPNAM6= <>
##$DBPNAM7= <>
##$DBPOAL= (0..7)
0.5 0.5 0.5 0.5 0.5 0.5 0.5 0.5 
##$DBPOFFS= (0..7)
$$ [...]
##$SUBNAM3= <"">
##$SUBNAM4= <"">
##$SUBNAM5= <"">
##$SUBNAM6= <"">
##$SUBNAM7= <"">
##$SUBNAM8= <"">
##$SUBNAM9= <"">
##$SW= 400.765351723535
##$SWIBOX= (0..15)
0 1 3 0 0 0 0 0 0 0 0 0 0 0 0 0 
##$SW_h= 32467.5324675325
##$TD= 32768
##$TD0= 1
##$TE= 0
##$TE2= 300
##$TE3= 300
##$TEG= 300
##$TL= (0..7)
0 120 53 12 22 120 120 120 
##$TP= (0..7)
150 150 150 150 150 150 150 150 
##$TP07= 0
##$TPNAME0= <>
##$TPNAME1= <>
##$TPNAME2= <>
##$TPNAME3= <>
##$TPNAME4= <>
##$TPNAME5= <>
##$TPNAME6= <>
##$TPNAME7= <>
##$TPOAL= (0..7)
0.5 0.5 0.5 0.5 0.5 0.5 0.5 0.5 
##$TPOFFS= (0..7)
0 0 0 0 0 0 0 0 
##$TUNHIN= 0
##$TUNHOUT= 0
##$TUNXOUT= 0
##$USERA1= <user>
##$USERA2= <user>
##$USERA3= <user>
##$USERA4= <user>
##$USERA5= <user>
##$V9= 5
##$VALIST= <valist>
##$VCLIST= <CCCCCCCCCCCCCCC>
##$VD= 0
##$VDLIST= <DDDDDDDDDDDDDDD>
##$VPLIST= <PPPPPPPPPPPPPPP>
##$VTLIST= <TTTTTTTTTTTTTTT>
##$WBST= 1024
##$WBSW= 4
##$XGAIN= (0..3)
0 0 0 0 
##$XL= 0
##$YL= 0
##$YMAX_a= 4728
##$YMIN_a= -10573
##$ZGOPTNS= <>
##$ZL1= 120
##$ZL2= 120
##$ZL3= 120
##$ZL4= 120
##$ABSF1= 0
##$ABSF2= 0
##$ABSG= 0
##$ABSL= 0
##$ALPHA= 0
##$AQORDER= 0
##$ASSFAC= 0
##$ASSFACI= 0
##$ASSFACX= 0
##$ASSWID= 0
##$AUNMP= <proc_1d>
##$AZFE= 0.1
##$AZFW= 0.5
##$BCFW= 0
##$BC_mod= 2
##$BYTORDP= 0
##$COROFFS= 0
##$CY= -3
##$DATMOD= 1
##$DC= 0
##$DFILT= <>
##$DTYPP= 0
##$F1P= 0
##$F2P= 0
##$FCOR= 1
##$FTSIZE= 65536
##$FT_mod= 6
##$GAMMA= 0
##$GB= 0
##$INTBC= 1
##$INTSCL= 9.790993e-09
##$ISEN= 30
##$LB= 1.5
##$LEV0= 0
##$LPBIN= 0
##$MAXI= 10000
##$MC2= 0
##$MEAN= 0
##$ME_mod= 0
##$MI= 50
##$NCOEF= 0
##$NC_proc= -9
##$NLEV= 6
##$NOISF1= 182.463
##$NOISF2= 159.3651
##$NSP= 0
##$NTH_PI= 0
##$NZP= 0
##$OFFSET= 198.0616
##$PC= 4
##$PHC0= 1696.046
##$PHC1= 150.6954
##$PH_mod= 1
##$PKNL= yes
##$PPARMOD= 0
##$PSCAL= 0
##$PSIGN= 0
##$REVERSE= no
##$SF= 81.0140089999434
##$SI= 65536
##$SIGF1= 159.3651
##$SIGF2= -187.1042
##$SINO= 113.3802
##$SIOLD= 16384
##$SREGLST= <1H.CDCl3>
##$SSB= 0
##$STSI= 65536
##$STSR= 0
##$SW_p= 32467.5324675325
##$SYMM= 0
##$S_DEV= 0
##$TDeff= 32768
##$TDoff= 0
##$TI= <>
##$TILT= no
##$TM1= 0
##$TM2= 0
##$TOPLEV= 0
##$USERP1= <user>
##$USERP2= <user>
##$USERP3= <user>
##$USERP4= <user>
##$USERP5= <user>
##$WDW= 1
##$XDIM= 65536
##$YMAX_p= 196315601
##$YMIN_p= -296753084
$$ End of Bruker specific parameters
$$ ---------------------------------
##NTUPLES= NMR SPECTRUM
##VAR_NAME=  FREQUENCY,     SPECTRUM/REAL,   SPECTRUM/IMAG
##SYMBOL=    X,             R,               I
##VAR_TYPE=  INDEPENDENT,   DEPENDENT,       DEPENDENT
##VAR_FORM=  AFFN,          ASDF,            ASDF
##VAR_DIM=   65536,         65536,           65536
##UNITS=     HZ,            ARBITRARY UNITS, ARBITRARY UNITS
##FACTOR=    0.49542278885378, 1,            1
##FIRST=     16045.7642231865, 0,            0
##LAST=      -16421.768244346, 0,            0
##MIN=       -16421.768244346, -296753084,   0
##MAX=       16045.7642231865, 196315601,    0
$$ Real data points
##PAGE= N=1
##DATA TABLE= (X++(R..R)), XYDATA
$$ [...]
##PAGE= N=2
##DATA TABLE= (X++(I..I)), XYDATA
7379A3487150P06038j112687L650237Q172374M343851m803210q403971l025848
7371A3013934K777645J049846n032588p071480l095780J557473K364359k2813
7363E540596k566399l319740k224120r38494j677256m343906n528653k513304
7355a7571276K352295L788706Q1615m959229o965924n619949l209182o29235K981684
7346b9750495P174337Q995590O073355K23441l437676j647441L350666O199024
7338b819199M197971l90033l721956m459567l715514k486344r86688R208o17283
7329a4989405j981828q07221M627028J0606193J0631373L303148m510222n158705
7321A720361K13841L420108O51652k875089j915108O20758n11409l284416j922164
$$ plain form
7379 13487150 14193188 13080501 16730738 24903112 29246963 24443753 16039782 13013934
7371 13013934 15791579 16841425 11808837 4737357 1641577 3199050 5563409 5540596
7363 5540596 2974197 -345543 -2569663 -3508157 -5185413 -9529319 -15057972 -17571276
7355 -17571276 -15218981 -11430275 -11348660 -16307889 -23273813 -28893762 -32102944 -32732179 -29750495
7346 -29750495 -22576158 -13580568 -7507213 -7283772 -10721448 -12368889 -9018223 -2819199
7338 -2819199 1378772 988739 -2733217 -7192784 -10908298 -13394642 -14381330 -14372122 -14989405
7329 -14989405 -16971233 -17778454 -13151426 -2545233 8086140 11389288 6879066 1720361
7321 1720361 1934202 5354310 6005962 3130873 1215765 1836523 1325114 -1959302 -3881466
7312c881466K368854K859472o69769p95101M381119O611292J102856m229230q51482
7303F896545O229373O136717p59713m195959n57843K672613k56848n556118p287678
7294C321089m975025j219935J955096K318059j007892l729811p16564M569234
7286E14251K963511n613715r374882j558472Q641518R229199K144342j998252
7278D947500l92252Q60077q20843j331030R86291K172187K54692j383804n46512
7269D746306K9891j747603l021377m87088M287177O997128N833267K470262m79946
7260A8628017j510109r87691p50162k015067l747580m212083l391062k259594
7252b45331p51656J389427K800577K021157q2099j802861l250010m844683m859025
$$ plain form
7312 -3881466 -1512612 1346860 677091 -118010 4263109 10874401 11977257 7748027 6896545
7303 6896545 13125918 19262635 18502922 14306963 13749120 16421733 16164885 10608767 3321089
7294 3321089 -1653936 -2873871 -918775 1399284 391392 -3338419 -4054983 514251
7286 514251 3477762 -2135953 -11510835 -13069307 -4427789 4801410 6945752 4947500
7278 4947500 4555248 5415325 4594482 3263452 4249743 6421930 6676622 5292818 4746306
7269 4746306 4776197 3028594 7217 -479871 3807306 10804434 16637701 19107963 18628017
7260 18628017 17117908 16130217 15380055 13364988 9617408 5405325 2014263 -245331
7252 -245331 -996987 392440 3193017 5214174 5132075 3329214 79204 -4765479 -9624504
7243i624504k035554P37239l37412l680718l704431J451979P546170R809449P232987
7234G395205J447783m610341o989081m119264k01296o76577m069518l520379K746970
7225a2596498Q254247P530481L004509j83503j112170j271089m35569J417108
7217D607516J746982o55791k450887p30439J529440k18207m275259m330847J586733
7208c190759Q245520R789181N911460P80983j809128j412008l04898k95538j73328
7199A7541485K328215N802065N253616j153683q096775r059391m737614j812585
7191F065333l663090o025810l374975K835313N169998k52990p524654p069972
7183a3840847J982062R340196O083332l671481q279244l556550L811395P129759
$$ plain form
7243 -9624504 -11660058 -10922819 -11260231 -14940949 -18645380 -17193401 -9647231 162218 7395205
7234 7395205 8842988 4232647 -2756434 -6875698 -7076994 -7753571 -11823089 -15343468 -12596498
7225 -12596498 -4342251 3188230 6192739 6009236 4897066 3625977 3190408 4607516
7217 4607516 6354498 5698707 3247820 2517381 4046821 3828614 -446645 -4777492 -3190759
7208 -3190759 5054761 14843942 20755402 21536385 19727257 18315249 18010351 17714813 17541485
7199 17541485 19869700 25671765 30925381 29771698 21674923 12615532 7877918 6065333
7191 6065333 2402243 -3623567 -6998542 -4163229 1006769 753779 -6770875 -13840847
7183 -13840847 -11858785 -2518589 3564743 -106738 -8385982 -11942532 -8131137 -1001378
7175a001378O897794N874721L874491M89684k582107m817917p237518p481083
7167e983313j418390P446616Q721567M80200n138138M69840P858466L592933q028787
7158H000994j0981696j830492O486348N252999M21162l78532J307537J732845
7150A0011165K060178K736832m4819o228073q604923m058305r6786k823414n943836
7141a2991981q73184Q114274R359616J313829n871740n606314k116314r75958
7133i647772p47108K202500O244338O551829K242662k130116k066254J546676
7125D196755L352900K1113n129395o014847j882246J920414J837815K75096r6703
7116a519098j106926m290759n955119k483259K734584L677179Q21702j85110K413629
$$ plain form
7175 -1001378 5896416 11771137 15645628 16135312 13553205 8735288 1497770 -5983313
7167 -5983313 -7401703 44913 8766480 9246680 4108542 4578382 12436848 16029781 8000994
7158 8000994 -2980702 -4811194 1675154 6928153 7349315 6970783 8278320 10011165
7150 10011165 12071343 14808175 14763356 8535283 -69640 -4127945 -4224731 -7048145 -12991981
7141 -12991981 -13865165 -5750891 3608725 4922554 -949186 -6555500 -8671814 -9647772
7133 -9647772 -10394880 -8192380 -1948042 4603787 6846449 4716333 2650079 4196755
7125 4196755 7549655 7570768 2441373 -3573474 -5455720 -3535306 -1697491 -1422395 -1519098
7116 -1519098 -2626024 -6916783 -12871902 -15355161 -12620577 -8943398 -8121696 -8306806 -5893177
7107e893177M871887M681878K940463L05349l296983m832268n73941O542787Q443177
7098A3189172K871503l133641l319222j472J558788J030236Q17809N80298r21478
7089A2671993j823786j59795J590291J0285l021145k764614P69786K798161J184301
7080A1255477j039668j287089j063572k440730m573721n745203n954977n291882
7072a6141365k233533L634431Q669811P970285J197337o312786q638097m424370
7064a6278287K860835Q290480Q688542M081870k427736o436641n333289n41121
7056g095347L587388L722281N66167k174612j734275R84971K686078J581048m23349
7047A700350k09973J924948J809634l069830r135465j0557914o792323k615816
$$ plain form
7107 -5893177 -1021290 3660588 6601051 6906400 3609417 -1222851 -1796792 4745995 13189172
7098 13189172 16060675 12927034 9607812 9606340 11165128 12195364 13013173 13593471 12671993
7089 12671993 10848207 10688412 12278703 12288988 9267843 6503229 7273015 10071176 11255477
7080 11255477 10215809 8928720 7865148 5424418 850697 -4894506 -10849483 -16141365
7072 -16141365 -18374898 -14740467 -6070656 1899629 3096966 -3215820 -11853917 -16278287
7064 -16278287 -13417452 -5126972 3561570 7643440 5215704 -1220937 -6554226 -7095347
7056 -7095347 -3507959 214322 780489 -1394123 -3128398 -2143427 542651 2123699 1700350
7047 1700350 1490377 3415325 5224959 2155129 -6980336 -17538250 -24330573 -26946389
7039b6946389m79921K377518P231093R585720O016637R36067L65807K018242q05435
7030B99339o822504p174442N07905P218983N439801o98911l144060j280660N16400
7021e138149J274630K497978K948212J256296L03938K144124K282473l011807
7013D557695p440991k871553N583099M978369m543465p858088J847927J1277985
7005E530978P007708l980093n705905K445914O738587J345300m502545k941281
6997E938663J324557R26825k498488k998032m08016R21278j49247j146078j298361
6988F13101j903109k245312k2862L824319M899286J438243k516014k309196R01778
6979B680234J765468j772874n653850n447215k264409l35303l15338J118487M830213
$$ plain form
7039 -26946389 -27426310 -25048792 -17817699 -8231979 -2215342 -1279275 -913468 1104774 299339
7030 299339 -6523165 -13697607 -13189702 -5970719 -530918 -1229829 -4373889 -5654549 -5138149
7021 -5138149 -3863519 -1365541 1582671 2838967 3142905 5287029 7569502 4557695
7013 4557695 -2883296 -5754849 -171750 4806619 263154 -7594934 -5747007 5530978
7005 5530978 12538686 8558593 2852688 5298602 12037189 13382489 8879944 5938663
6997 5938663 7263220 8190045 5691557 2693525 2285509 3206787 3057540 1911462 613101
6988 613101 -1290008 -3535320 -3558182 266137 5165423 6603666 4087652 1778456 2680234
6979 2680234 4445702 2672828 -2981022 -8428237 -10692646 -11027949 -11343287 -10224800 -5394587
6970e394587O589313L127538k211661l130600J735518P378775Q139848K869163
6962A9103307m630238q496292n451866J549772N763156M326193J124727N8802
6954A3347561p20065l888979o155801k643621M168231O978738M258214R01603
6946A6245881j478247o182247j1673049r792649J384455J1183958R738386J398055
6938A0824543l037605k243791l093862o430281m834437M297241J2563170J1311162
6930A9356140K664289m306832m697548j422357j6948k773745p114667q223291
6922f534959m054832J812548L682685L86147l282963k319823K846977P190167
6914b74053O575070J955109j526654J9711M437339N568978Q78201n095654o531140
$$ plain form
6970 -5394587 1194726 4322264 2110603 -1019997 715521 8094296 16234144 19103307
6962 19103307 14473069 5976777 524911 2074683 7837839 12164032 13288759 13347561
6954 13347561 12627496 8738517 2582716 -60905 4107326 11086064 15344278 16245881
6946 16245881 14767634 8585387 -3087662 -12880311 -11495856 -311898 9426488 10824543
6938 10824543 7786938 5543147 2449285 -3980996 -8815433 -4518192 8044978 19356140
6930 19356140 22020429 17713597 13016049 11593692 11576744 8802999 1688332 -6534959
6922 -6534959 -10589791 -8777243 -5094558 -4708411 -7991374 -10311197 -7464220 -274053
6914 -274053 6301017 8256126 6729472 6749183 11186522 16755500 17633701 12538047 6006907
6905F006907l118398J457478N155061P857580Q123612M628492J04272j192249
6897B9022755j09020j807878p527281j1935292j0391076m681641N02036L190165
6889c737232M141725M431377N073305O312556N915208J430498m609684o044400
6881A2913353j814365J391693j237809m937331k512368M185269O492860J540904
6873A6022206l959164l710907j96169j40929m933654r046744p185038n93062M423799
6864i319662L616924m31948j535997K314639O295677M975754o34211m514319l279496
6855b512639J21046O61969k641361n836315m661454N10469M678361L606098j240231
6846g314057m561699l909155k161592k453084l320811j250385L753413Q090266
$$ plain form
6905 6006907 2888509 4345987 9501048 17358628 25482240 30110732 30215004 29022755
6897 29022755 28913735 27105857 19578576 7643284 -2747792 -7429433 -6927397 -3737232
6889 -3737232 404493 4835870 9909175 16221731 22136939 23567437 18957753 12913353
6881 12913353 11098988 12490681 11252872 6315541 3803173 7988442 14481302 16022206
6873 16022206 12063042 8352135 8155966 8015037 3081383 -5965361 -13150399 -13743461 -9319662
6864 -9319662 -5702738 -6134686 -7670683 -5356044 939633 5915387 5281176 766857 -2512639
6855 -2512639 -2391593 -1729624 -4370985 -10207300 -14868754 -14358285 -9679924 -6073826 -7314057
6846 -7314057 -11875756 -15784911 -17946503 -20399587 -23720398 -24970783 -21217370 -13127104
6838a3127104R372330Q526158O976322M183073r13499p150366j0938029r100319
6830a2171434k246525M875140P485954N477204K778663K009314J898634O79039
6822A0785989p08480o59492J15370J7964p33092j119548j421465j956572j476941
6813B843733M88905J464164o03037l297945k666036R48573L791825M467513M561371
6804A1999066M138033J580065j773117k072061N50332R90376k966209o443522
6796F002963m318652J720534O552016Q377588P871767M045971l355661r318717
6788A7577809p811628n96098M005687K151059j246586j176789K45939j022812
6780A2126581l424598k984615q92265j404390l433029j305700N098012P934398
$$ plain form
6838 -13127104 -3754774 4771384 11747706 15930779 15017280 7866914 -3071115 -12171434
6830 -12171434 -14417959 -9542819 -2056865 3420339 6199002 8208316 10106950 10785989
6822 10785989 10077509 9418017 9533387 9551351 8818259 7698711 6277246 4320674 2843733
6813 2843733 3332638 4796802 4193765 895820 -1770216 -821643 2970182 7437695 11999066
6804 11999066 16137099 17717164 15944047 13871986 14422318 15412694 12446485 6002963
6796 6002963 1684311 3404845 9956861 18334449 26206216 30252187 26896526 17577809
6788 17577809 9766181 9170083 13175770 15326829 14080243 12903454 13149393 12126581
6780 12126581 8701983 5717368 4825103 3420713 -12316 -1318016 3779996 11714394
6772A1714394K506334m919095n463708J59761L641667Q65200m477628p967527
6764c940602q736497o414308l09707O448932P733315K391813l245324l910057
6756i982435j956203j824921k529719o28589K725872L371904R48428j021428p36504
6747a1633595P44331K851977N408922O078513K609830k780987n604832n146111
6739g471952m031179k743972K74607L656146M038433K082636J564620K060377
6731e70284o49594n572718n626922R70921N952682K794490l198860l115066K398235
6722f617116N694191M306484K487087K344180J578329O3093J035793M210099M487392
6713A9589532J87149l246515j314109K469430J875594k950373o260524m737249
$$ plain form
6772 11714394 14220728 9301633 3837925 3997686 7639353 8504553 4026925 -3940602
6764 -3940602 -12677099 -19091407 -19401114 -12952182 -5218867 -2827054 -6072378 -9982435
6756 -9982435 -11938638 -13763559 -16293278 -16921867 -14195995 -10824091 -9875663 -10897091 -11633595
6747 -11633595 -10889264 -8037287 -2628365 3450148 6059978 3278991 -2325841 -7471952
6739 -7471952 -11503131 -14247103 -13972496 -10316350 -6277917 -4195281 -2630661 -570284
6731 -570284 -1219878 -6792596 -12419518 -11448597 -5495915 -2701425 -5900285 -9015351 -6617116
6722 -6617116 -922925 3383559 5870646 8214826 9793155 9856248 10892041 15102140 19589532
6713 19589532 19776681 16530166 15216057 17685487 19561081 16610708 10350184 5612935
6705E612935n50353K761935L657018K007233j237925l159224q72178M113939O194778
6696A8528158K447044k902698l520974P29350L829210J837683k505234m644088
6688A3798451m251400l705662l055274l40816L906913O253958M884346J654077
6680A9144593r60843k374345k653362j407965P89298J879414N51501k249115m545385
6671H173791m625821j369491M233877P889706N629811n67059m238135k772195
6663A2354484n21038j712911m469925n066360m218233m624416n135028k679829
6655a6073256J503797L029807J545830J576953N122057P799913M593521l247831
6647E850791r164702q020672j017169N358313N535439R31460j479053J702458
$$ plain form
6705 5612935 5062582 7824517 11481535 13488768 12250843 9091619 8219441 12333380 18528158
6696 18528158 20975202 18072504 14551530 15280880 19110090 20947773 18442539 13798451
6688 13798451 9547051 5841389 2786115 2445299 6352212 12606170 17490516 19144593
6680 19144593 18183750 15809405 13156043 11748078 12537376 14416790 14968291 12719176 8173791
6671 8173791 3547970 2178479 6412356 14302062 19931873 19364814 15126679 12354484
6663 12354484 11833446 10120535 5650610 584250 -3633983 -8258399 -13393427 -16073256
6655 -16073256 -14569459 -11539652 -9993822 -8416869 -3294812 4505101 9098622 5850791
6647 5850791 -3313911 -11334583 -12351752 -6993439 -1458000 -526540 -2005593 -303135
6639c03135M946629J211498p122891j0259372m209976L787668N431134J832530
6631d685915k49268J008659J195572k072277m968000l211159J447605L471994
6623h062789J152891j050340J175406N469967N379240p89141p014963p073999
6615a0813728k049899K537852M575317N926130O473097L183691l808023r102058
6607c077621q498389l991811J57903K947385N160372N485064K331773j994433
6599a479757l089970k27294K923309L501883K585683K550191L584342L847576
6591A4195963J864716j911221n371984o559382n493708l605226j236456K575605
6583e541693O945131Q093941L749634k996708o857831o301446l789122j334552
$$ plain form
6639 -303135 4643494 5854992 -1267899 -11527271 -15737247 -11949579 -6518445 -4685915
6631 -4685915 -4935183 -3926524 -2730952 -4803229 -9771229 -12982388 -11534783 -8062789
6623 -8062789 -6909898 -7960238 -6784832 -1314865 4064375 3275234 -3739729 -10813728
6615 -10813728 -12863627 -10325775 -5750458 175672 6648769 9832460 6024437 -3077621
6607 -3077621 -11576010 -15567821 -15409918 -12462533 -7302161 -1817097 514676 -1479757
6599 -1479757 -4569727 -4797021 -1873712 1628171 4213854 6764045 10348387 14195963
6591 14195963 16060679 14149458 8777474 2218092 -3275616 -6880842 -8117298 -5541693
6583 -5541693 1403438 9497379 13247013 10250305 3392474 -2908972 -6698094 -8032646
6575h032646R15894K429288K294530J481211J640942J640117q85124m301071l962246
6566f779105L23218K792205K19219k889241j370015K562597L327807Q87829o0843
6557i86329J960250L834605L760504L066678K109377m53909l799003n140684m248726
6548A02763l030733q06321L933327O978601J815248q097989r683614J582711J2308967
6539E102960Q309263n513215j2614429p686362l82501K044328L102559O151264
6531a486133P008716K628550k116967k558802j803811l729185m841790m74093
6523g373515N966081P826603N615926M536825M380806P44181m693292m482597
6515A2521018K449844P428240M318889j811762l194744q97683j434583n114674
$$ plain form
6575 -8032646 -7116752 -4687464 -2392934 -911723 729219 2369336 1484212 -2816859 -6779105
6566 -6779105 -6455887 -3663682 -3444463 -6333704 -7703719 -5141122 -1813315 -925486 -986329
6557 -986329 973921 4808526 8569030 11635708 13745085 13291176 9492173 4351489 102763
6548 102763 -2927970 -3734291 199036 7177637 8992885 894896 -8788718 -7206007 5102960
6539 5102960 13412223 7899008 -4715421 -12401783 -12784284 -10739956 -7637397 -1486133
6531 -1486133 5522583 8151133 6034166 3475364 1671553 -2057632 -6899422 -7373515
6523 -7373515 -1407434 6419169 12035095 16571920 20952726 21696907 17003615 12521018
6515 12521018 14970862 22399102 26717991 24906229 21711485 20813802 19379219 14264545
6507A4264545n206875J053760P013515N186760k574379p646860n859693j719434
6499D511339q22543k405683k498008j306221k295135m686266k856339M685984
6491g672872J0775904Q149712n83397o126909m086824J087438L237237J260470
6483F040759j938904l673766l006087l07602K926583M663306L748458P15041k590391
6474F577397l945653k311932O57510J624007q49940m506684n924926l761849R65833
6465a1476237N972912Q321079O268008J682101j745851l553770o383470r673864
6457a0589092q487270j700031L894075K649522j372332j220079J574689M30655
6449a4819863l961856m015028K077368P077635O058946K865622J998448J338271
$$ plain form
6507 14264545 9057670 10111430 17124945 22311705 19737326 12090466 6230773 4511339
6499 4511339 3688796 1283113 -1214895 -2521116 -4816251 -9502517 -12358856 -7672872
6491 -7672872 3103032 11252744 10669347 4542438 455614 1543052 4780289 6040759
6483 6040759 4101855 428089 -2577998 -2885600 40983 4704289 8452747 9167788 6577397
6474 6577397 2631744 319812 977322 2601329 1751389 -2755295 -8680221 -12442070 -11476237
6465 -11476237 -5503325 2817754 9085762 10767863 9022012 5468242 -915228 -10589092
6457 -10589092 -19076362 -20776393 -16882318 -14232796 -15605128 -16825207 -15250518 -14819863
6449 -14819863 -18781719 -22796747 -20719379 -13641744 -7582798 -4717176 -2718728 -1380457
6441a380457k397980o504685n824921k18737N474077O768100K725691l312372
6433d671284m940718J258931R422015R281342l27248q548167o690452M88787K902855
6424a823939o25387l215733j756248n331m52378l01452K609652N127234L080611
6415B637029k359880n360688j996451N079939Q853367M943998l887608j0843107
6407b933401j1943119q288722k637066L119501P145020P972418O613557N402781
6399D450969M192196J059852k884575l812468j366313J84588j325528k900479
6391b401758k164108j120941j426268j040797J118958K257491J021232N33668
6383c222523K168867J982098j786960l603766P44889N940345M917452J16309j325858
$$ plain form
6441 -1380457 -3778437 -10283122 -16108043 -16326780 -10852703 -4084603 -1358912 -4671284
6433 -4671284 -9612002 -8353071 1068944 10350286 10023038 1474871 -5215581 -4726794 -1823939
6424 -1823939 -2449326 -5665059 -7421307 -7426638 -7879016 -8180468 -5570816 -443582 2637029
6415 2637029 277149 -5083539 -7079990 -2000051 6853316 11797314 7909706 -2933401
6407 -2933401 -14876520 -23165242 -25802308 -22682807 -15537787 -7565369 -951812 4450969
6399 4450969 8643165 9703017 6818442 3005974 1639661 1824249 498721 -2401758
6391 -2401758 -4565866 -5686807 -7113075 -8153872 -7034914 -4777423 -3756191 -3222523
6383 -3222523 -1053656 928442 -858518 -4462284 -3717395 2222950 7140402 7256711 5930853
6374E930853K96642p45378m038309l514471R81026K398653j846811n524376l449680
6365i511851J440322L880973L428835K792869L237927M010696L512877M81468
6357A3274116l283870k869347K781675O188231J45884j0332093j2957060n061025
6349a2113489L178891M109205K252357M690872R704028J0810606O711544J283882
6341C0627896k968341o363832q897103r481908p446089l061561K017599M614675
6333i58664L107819O68773J764171N388116O192544K638188r86086j434504k32153
6324A6148204M68090N24773p13841m106399o894552n031809l32602J150821r71886
6315B40799m83078M658145Q514633O981514L460784J375399q25973l324680k269731
$$ plain form
6374 5930853 6227495 5482117 1443808 -2070663 -1089637 1309016 -537795 -6062171 -9511851
6365 -9511851 -8071529 -4190556 -761721 2031148 5269075 9279771 12792648 13274116
6357 13274116 9990246 7120899 9902574 16090805 16236689 5904596 -7052464 -12113489
6349 -12113489 -8934598 -4825393 -2573036 2117836 11821864 22632470 29344014 30627896
6341 30627896 27659555 21295723 12398620 2916712 -4529377 -7590938 -5573339 -958664
6333 -958664 2149155 2817928 4582099 9970215 16162759 18800947 17814861 16380357 16148204
6324 16148204 16616294 17141067 16427226 12320827 5426275 394466 61864 1212685 240799
6315 240799 -242279 4415866 12930499 19912013 23372797 24748196 23922223 20597543 18327812
6306A8327812J773724J706405m014656o524464r32429L939621p65645r263335
6298D247033j0641026n384765q55928K811072R114617J2863647O157622n808283
6290A2503989r344601k306742L888832K828361M10309J631051K883886J159259
6282A3654344l22508R0044r81230l606463k397862L115123N442137J159438l108896
6273A3044127j787557J425978J901555J797556L068514J269466o008635j1771160
6265B939844q897797j056817L330611K786636J091713o45391k282366k14009O521743
6256C574167J0161524L857381n978035p236473k628L929406p64415o190614m878395
6247c528082j84324J342576M0522p3861R56257M21866j131756p12712J670905
$$ plain form
6306 18327812 20101536 21807941 17793285 11268821 10336392 14276013 13510368 4247033
6298 4247033 -6393993 -11778758 -12634686 -9823614 -708997 12154650 18312272 12503989
6290 12503989 3159388 852646 4741478 7569839 7980148 9611199 12495085 13654344
6282 13654344 13331836 13421880 12440650 8834187 6436325 9551448 14993585 16153023 13044127
6273 13044127 11256570 12682548 14584103 16381659 19450173 20719639 14711004 2939844
6265 2939844 -5957953 -7014770 -3684159 -897523 194190 -451201 -2733567 -2947576 3574167
6256 3574167 13735691 17593072 11615037 4378564 4375936 8305342 7540927 1350313 -3528082
6247 -3528082 -3712406 -2369830 -2329308 -2403169 -1446912 -1025046 -2156802 -2869514 -1198609
6238a198609K511134j53558l725307l895765J82420M207017L063166k921168p739976
6229i670646o838444k319100R13438J617724J663390J428071J15205p96275P95789
6220a3090848L151058K612383k68144j393198O2567P08478o62046j307213m49684
6211a0636647j101345l653922l449524J680924O599828O007017K080819Q2232
6203b390618J33763q59252j938285O14143N770186Q012091N547456K583618K139300
6194A9612402J823474r53705m054957m150831k031483q68505j119970o45802R52820
6185H563443J351613p87122l434978l558829q00892K084241K276358n0026k026805
6176C617003j563453J70369O63634j71635o5515J602482K253339l2480l135387
$$ plain form
6238 -1198609 1312525 1158967 -2566340 -6462105 -6279685 -2072668 990498 -1930670 -9670646
6229 -9670646 -16509090 -18828190 -17914752 -16297028 -14633638 -13205567 -13090362 -13886637 -13090848
6220 -13090848 -9939790 -7327407 -7595551 -8988749 -8926182 -8217704 -8879750 -10186963 -10636647
6211 -10636647 -11737992 -15391914 -18841438 -17160514 -10560686 -4553669 -2472850 -2390618
6203 -2390618 -2256855 -3116107 -5054392 -4440249 1329937 9342028 14889484 17473102 19612402
6194 19612402 21435876 20482171 16427214 12276383 10244900 9376395 8256425 7610623 8563443
6185 8563443 9915056 9127934 5692956 2134127 1333235 3417476 5693834 5643808 3617003
6176 3617003 2053550 2223919 2887553 2715918 2650403 4252885 6506224 6473744 3338357
6167C338357l699375k081267j663010l473773m500470k295094J270060K727132
6159a0377440J863621J409262K265239J589869k994439q528414q420276k03377
6151b3395955R696526J1567748L493310n734769o926018j383471K356422J168681
6143i157526O74356M595271P441620K904637n079692o873334j058670L682311
6135b871027J276292m240387o432671n216804l587907q73430M786000J0279406
6127f880528J0137073M386898j393949l507838k896675q10201K912768O303167
6119H250715N299170j71219m191263j977222L860627P036395N228679J135008
6111B4470890k187267l909717m370661m144354l858253l319370j677638K78831
$$ plain form
6167 3338357 -361018 -2442285 -4105295 -7579068 -12079538 -14374632 -13104572 -10377440
6159 -10377440 -8513819 -7104557 -4839318 -3249449 -6243888 -14772302 -23192578 -23395955
6151 -23395955 -13699429 -2131681 1361629 -4373140 -11299158 -12682629 -10326207 -9157526
6143 -9157526 -8483170 -3887899 3553721 6458358 1378666 -5494668 -6553338 -2871027
6135 -2871027 -1594735 -5835122 -12267793 -17484597 -21072504 -21945934 -17159934 -6880528
6127 -6880528 3256545 7643443 6249494 2741656 -155019 -965220 1947548 8250715
6119 8250715 13549885 13378666 9187403 7210181 11070808 18107203 23335882 24470890
6111 24470890 22283623 18373906 14003245 9858891 6000638 2681268 1003630 1282461
6103A282461j89969l744527o581711n026205j018139M77855j375537k721098j527682
6094b0424552l79634j528885l002009j896982J257747L947831N395507O251564
6086a0379413O073033L869742N63196j483173j376738l97872K10084N63841R27371
6077a429929M79030j765498m962556o090193k631372L807097P752670N574099
6069G33348L06042j757026Q24736L258006K064628l2210P32244K898852K791183
6060A1819803J127621J535207L652499L118747j264523n383894o089447n102894
6052C413119m739811l924798j266891J354942J714117J303496K886214N456009
6044F196397N151326Q33692l930502m659801l74707N305498O727398J462307n863267
$$ plain form
6103 1282461 1092492 -2652035 -9233746 -14259951 -15278090 -14800235 -16175772 -18896870 -20424552
6094 -20424552 -20804186 -22333071 -25335080 -27232062 -25974315 -22026484 -16630977 -10379413
6086 -10379413 -4306380 -436638 126558 -1356615 -2733353 -3131225 -2921141 -2357300 -1429929
6077 -1429929 -950899 -2716397 -7678953 -13769146 -16400518 -12593421 -4840751 733348
6069 733348 1039390 -717636 107100 3365106 5429734 5397524 6129768 9028620 11819803
6060 11819803 12947424 14482631 18135130 21253877 19989354 14605460 8516013 3413119
6052 3413119 -1326692 -5251490 -6518381 -5163439 -3449322 -2145826 740388 6196397
6044 6196397 11347723 12181415 8250913 3591112 3216405 8521903 15249301 16711608 10848341
6035A0848341p384335j618538L631721J330406m716190n117692J224148N274326
6027C472187J198260n061714m648197J556182N051686K439503l89102K178712
6019E797517O897830O168970j234611p928536o790189O75595O617764O130167
6011A6334507J708212j762987l447691n392609o692970l325344M857604J0751595
6003A3030317P262594l442846j1595382j0775845m057659J394660K485891J039192
5995d659078n96738j445805p03369J852010M149636L417659J85154j616772N19175
5986A101872M569140O488517M228177j144899o328325p415756l223581K242150
5978E17295L448129L35529j770582l51760R57051k96691l94616L325483N643622
$$ plain form
6035 10848341 3464006 1845468 5477189 6807595 2091405 -3026287 -1802139 3472187
6027 3472187 4670447 -391267 -5039464 -3483282 1568404 4007907 3618805 5797517
6019 5797517 12695347 18864317 17629706 9701170 2910981 3586576 10204340 16334507
6011 16334507 18042719 16279732 12832041 7439432 746462 -2578882 2278722 13030317
6003 13030317 20292911 16850065 5254683 -5521162 -9578821 -8184161 -5698270 -4659078
5995 -4659078 -5255816 -6701621 -7404990 -5552980 -1403344 2014315 2199469 582697 1101872
5986 1101872 5671012 12159529 16387706 15242807 8914482 1498726 -1724855 517295
5978 517295 3965424 4300953 2530371 2178611 3135662 2838971 2444355 5769838 11413460
5969A1413460J142563n251708m468251J988093L722927j899939n620804j689587
5961f63246L085613J213019l607772l815903j37867J673510J008913J214923K107589
5952B078779J346673J75503O72513M59314k695027m567747q55407L646126J647229
5943A907956l607777k745261L634735N336842m6150k799279K135075O186057J554177
5934A1556375n718566n692922J71711L107928J218498L0820J617635J975480j190009
5925G076950m962779o018195m132693p98899J990952K114559l28001k032936p22451
5916g813493J312611R18701q89922j316504r94384k299614l980145k417012K191350
5907a5288412N511170N212194L409770K405937J667293J06086j662733k676256
$$ plain form
5969 11413460 12556023 7304315 2836064 4824157 8547084 6647145 1026341 -663246
5961 -663246 2422367 3635386 27614 -3788289 -3926156 -2252646 -1243733 -28810 2078779
5952 2078779 3425452 3600955 4273468 4732782 2037755 -2529992 -3385399 260727 1907956
5943 1907956 -1699821 -4445082 -810347 4526495 4480345 1681066 3816141 10002198 11556375
5934 11556375 5837809 144887 316598 3424526 4643024 4673844 6291479 8266959 7076950
5925 7076950 2114171 -3904024 -8036717 -8835616 -6844664 -4730105 -5058106 -7091042 -7813493
5916 -7813493 -6500882 -5582181 -6472103 -7788607 -8782991 -11082605 -15062750 -17479762 -15288412
5907 -15288412 -9777242 -4565048 -1155278 1250659 2917952 3024038 1361305 -1314951
5899a314951l026407k801964j431312Q84807K534422K423447J706162K513624
5891A487828N069591O886194N511688J855238n46671j17574P44524l08319j857215
5882A8725284j818795j889925m508577p082592m965713L18694K247088o90776
5874C34688k945566j414593L37226Q3808J360700N464453O630978J313131m419810
5865F745015l953931q37208k360425p207288q337800m738223j237452J011716
5857b0915596M663914Q098409O382271L51867l528181k797369r50320K63042K518863
5848e913100M533126K458949j945687j849283L720357P346608M436047n31621
5840A2255396k297963k199736l183588l928607k600318j074629q66031L75645
$$ plain form
5899 -1314951 -4341358 -7143322 -8574634 -7689827 -5155405 -2731958 -1025796 1487828
5891 1487828 6557419 13443613 18955301 20810539 20263868 20146294 20890818 20582499 18725284
5882 18725284 16906489 15016564 10507987 3425395 -1540318 -1221624 1025464 334688
5874 334688 -2610878 -4025471 -3688245 -3604437 -2243737 3220716 9851694 11164825 6745015
5865 6745015 2791084 1953876 -406549 -7613837 -15951637 -20689860 -21927312 -20915596
5857 -20915596 -16251682 -8153273 -1771002 -1419135 -4947316 -7744685 -8695005 -8431963 -5913100
5848 -5913100 -1379974 1078975 -866712 -2715995 1004362 8350970 12787017 12255396
5840 12255396 9957433 7757697 4574109 645502 -1954816 -3029445 -3895476 -3519831
5832c519831L817383N293861J092772n341255p080022k155340M883510Q095599
5824E086677M824173k481311p612703o206678p14903L031197L620782L882341
5816C429575L794995M65014m186025l733702K156870N364225J446417l495623
5808E241746l083646l78021r38112k714808m70517M625769P507102P529033O874994
5799B4193540L995466l447803j1132515j1404971l778565M056262N659529J531758
5791I672701l805421n987864l137670K050000M013466J276595j160353L32434
5783C253888K357563J461654J207275N126598P739043K043013p359485r175029
5775F654520k118212L974132L795988K353472L289251K504093k311497n567027
$$ plain form
5832 -3519831 297552 5591413 6684185 1342930 -5737092 -7892432 -3008922 5086677
5824 5086677 9910850 7429539 -183164 -6389842 -7104745 -4073548 -452766 3429575
5816 3429575 7224570 7689584 3503559 -230143 1926727 7290952 8737369 5241746
5808 5241746 2158100 1780079 841967 -1872841 -2343358 2282411 9789513 17318546 24193540
5799 24193540 28189006 24741203 13608688 2203717 -1574848 2481414 8140943 9672701
5791 9672701 5867280 -120584 -3258254 -1208254 2805212 4081807 2921454 3253888
5783 3253888 5611451 7073105 8280380 13406978 21146021 23189034 15829549 6654520
5775 6654520 4536308 8510440 12306428 14659900 17949151 20453244 18141747 12574720
5767A2574720l204009m69253l579210r470709j0527971n333390J251151N335699
5759a3422972N932427K690686k890723o195472m312099l39341J335729J750329
5751a5451436M456546P878863O595776J46665n134993m621546j212497k83995
5743g626617k236387l199137j194629J761833L252792L186410K350321P24069
5735b981345j340990k182792j039784L47380P33864K238614O506283R351589M845254
5726A6478073m739930r577637n609500p28012k899478q211770p760670j660891
5718b4709815K693671L671395O703893J2572748J4357349Q694341J482531j653782
5710B3812331l144151o581983q438037l468056N307516Q885094L570826n073092
$$ plain form
5767 12574720 9370711 8901458 5322248 -4148461 -14676432 -20009822 -18758671 -13422972
5759 -13422972 -7490545 -4799859 -7690582 -13886054 -18198153 -18537494 -17201765 -15451436
5751 -15451436 -10994890 -3116027 3479749 3626414 -1508579 -6130125 -7342622 -7626617
5743 -7626617 -9863004 -13062141 -14256770 -12494937 -9242145 -6055735 -3705414 -2981345
5735 -2981345 -4322335 -6505127 -7544911 -7197531 -6463667 -4225053 2281230 11632819 16478073
5726 16478073 11738143 2160506 -3448994 -4177006 -7076484 -15288254 -23048924 -24709815
5718 -24709815 -22016144 -18344749 -11640856 931892 15289241 23983582 25466113 23812331
5710 23812331 20668180 14086197 5648160 2180104 7487620 16372714 19943540 14870448
5702A4870448r551381p991352l866634q34702O65127K070611L149925J854434
5694C66476j360207k021194K291900O831324N414957m11151l679136k315257k67403
5685D850309J237296N049912R251781O413348m010830j1217245p290796J342902
5677E626677M095515J609442K086221O552086P699546K129340n082737q546172
5669A6169918q143483n496439j017268L837413N969820L892604j168393p100565
5661F943607j0913165q777796o92756O373773N594904j65162j932668K403904
5653a165359N637970L099721m22877N87361K994754K98127o405371r411667n531890
5644a0319231k12589R66791J63561K930313Q415391R127572J735553o405662n844387
$$ plain form
5702 14870448 5319067 -2672285 -6538919 -7373621 -6708494 -4637883 -1487958 366476
5694 366476 -993731 -3014925 -723025 6108299 11523256 11112105 7432969 5117712 4850309
5685 4850309 6087605 11137517 20389298 26802646 22791816 11574571 4283775 5626677
5677 5626677 9722192 11331634 13417855 19969941 27669487 29798827 24716090 16169918
5669 16169918 8026435 2529996 1512728 5350141 11319961 15212565 14044172 6943607
5661 6943607 -3969558 -12747354 -13440110 -7066337 -1471433 -1636595 -3569263 -1165359
5653 -1165359 4472611 7572332 7149455 7736816 10731570 11029697 4624326 -4787341 -10319231
5644 -10319231 -10531820 -9565029 -9401468 -6471155 1944236 11071808 12807361 6401699 557312
5635E57312J965927N925501L977q986005j0862096m432912L451522P322056O936091
5626A881373M432765K395938L007924N022443L496594l361365r493813q189884
5618h08025j901462J070178j483330l540944q23623L426619M241297J433807j689433
5609g4916k475267m85230K102129J451359l342279p237673m825585J902697O058052
5600f926713N209121K740904P49348j741407l592633k088616M58878j421000o182417
5591a2794535n608291J619826N932895J582995l621422o75554O199103O764299
5583f00684R08805k645508q08720Q93452p30815j761797J236305N943680Q485342
5574A0920060P549731L117660l898869r530527r004271k860104K811669L576573
$$ plain form
5635 557312 2523239 8448740 8452717 -533288 -11395384 -15828296 -12376774 -5054718 1881373
5626 1881373 6314138 8710076 11718000 16740443 20237037 16875672 7381859 -808025
5618 -808025 -2709487 -1639309 -3122639 -6663583 -7487206 -4060587 180710 1614517 -74916
5609 -74916 -2550183 -3035413 -933284 518075 -2824204 -10061877 -14887462 -12984765 -6926713
5600 -6926713 -1717592 1023312 1772660 31253 -3561380 -5649996 -5191118 -6612118 -12794535
5591 -12794535 -18402826 -16783000 -10850105 -9267110 -12888532 -13564086 -7364983 -600684
5583 -600684 308121 -2337387 -3146107 -2252655 -2983470 -4745267 -3508962 2434718 10920060
5574 10920060 18469791 21587451 17688582 8158055 -846216 -3706320 -894651 2681922
5566B681922J064591n60209N22307L173980M901500L630702J46317j527782J266814
5557A5300142N434255N226258p77221q472489j3003680j1892872n215301L395500
5549a0005408P518678M376407p02111j078842J550151M87745m168190n011373
5541g032943M43095N233670L758771j67528m38187K304117L806775L336157K320863
5532A3564790O7405l643918n115315j499740L618924M736233K210938M10121N13329
5523A4862767P94924J832081M915807O629608K152092o022453r729831o601022
5515H833973k983516l267479l223670J983697Q861924J0097644M518362k533906
5507B2287029o537440o990495n045090k361471j283493k248869j995213J833480
$$ plain form
5566 2681922 3746513 3186304 3708611 6882591 11784091 15414793 15561110 14033328 15300142
5557 15300142 20734397 25960655 25183434 16710945 3707265 -8185607 -13400908 -10005408
5549 -10005408 -2486730 1889677 1187566 108724 1658875 2146620 -2021570 -7032943
5541 -7032943 -6589848 -1356178 2402593 2235065 1796878 4100995 7907770 11243927 13564790
5532 13564790 13632195 9988277 4872962 3373222 6992146 11728379 13939317 14349438 14862767
5523 14862767 15657691 17489772 22405579 29035187 31187279 25164826 15434995 8833973
5515 8833973 5850457 2582978 -640692 1343005 10204929 20302573 24820935 22287029
5507 22287029 15749589 8759094 3714004 1352533 69040 -2179829 -4175042 -2341562
5499b341562N496079L278558l609849p556751m809142Q8598K112955K702232N235893
5490E97011Q134857P691984M852628L294744K247429k385653r559874j2272947
5482B600179p406001p50453J276326J95001J127794L644384K969953j244530l624262
5473a211609j257793J975927J332495k245692m126438k292611R44615K659480
5465d221626K711682L037959M193095L704838n17072n414462n039476L99706K164314
5456A018958n236782j3398636r279231N493912J4172341O940082n587634p394624
5448a3271614J570337Q146449N891708J595524J919164L542758M85766n721334
5440D158758q639847o128982k015628R9699Q38000K620925N611057P195538N175865
$$ plain form
5499 -2341562 3154517 6433075 2823226 -4733525 -9542667 -9454069 -7341114 -4638882 597011
5490 597011 8731868 16423852 21276480 24571224 26818653 24433000 14873126 2600179
5482 2600179 -4805822 -5556275 -4279949 -4084948 -2957154 687230 3657183 2412653 -1211609
5473 -1211609 -2469402 -493475 839020 -1406672 -5533110 -7825721 -6881106 -4221626
5465 -4221626 -1509944 1528015 5721110 9425948 8908876 3494414 -1545062 -1145356 1018958
5456 1018958 -4217824 -17616460 -26895691 -21401779 -7229438 -289356 -5876990 -13271614
5448 -13271614 -11701277 -3554828 2336880 3932404 5851568 9394326 9880092 4158758
5440 4158758 -4481089 -10610071 -12625699 -12526000 -11688000 -9067075 -3456018 3739520 8915385
5431H915385P92318k347008k487460j327994o36195M07766K454955L034389j41259
5422H664897m452731n021401j425600K215446L361169K850208Q96822l325033
5414C763777p242704n800807Q41326N777684M625311J262348L24695p36417n851616
5405c036403j0467449n935642O465334J3994420Q046531m431597r738338m313257
5397i416401K468205J641694m442982o772145j733344N608061R354283R124975
5389E832346P019778K920011k871954n512520n81479P327729P849380j374456
5381B0608835j0397808j0042915l642832m08327j621317p56411M544612Q480508
5373F764345O214661N53753l357375n208573p376357q538178m397872M990161
$$ plain form
5431 8915385 9707703 7360695 4873235 3545241 2909046 3316812 5771767 8806156 8664897
5422 8664897 4212166 -809235 -2234835 -19389 3341780 6191988 7088810 3763777
5414 3763777 -3478927 -9279734 -8438408 -2660724 1964587 3226935 3551630 2815213 -3036403
5405 -3036403 -13503852 -19439494 -12974160 1020260 9066791 4635194 -5103144 -9416401
5397 -9416401 -6948196 -5306502 -9749484 -16521629 -18254973 -12646912 -3292629 5832346
5389 5832346 12852124 15772135 12900181 7387661 6806182 14133911 21983291 20608835
5381 20608835 10211027 168112 -3474720 -3883047 -5504364 -6260775 -1716163 6764345
5373 6764345 12979006 13532759 10175384 4966811 -2409546 -10947724 -15345596 -10355435
5365a0355435J2382656J0475273R83403o174964m029770L210439N778480Q40865
5357A3110947m862736n088162j654767M45397O53761J256239J781410K93031j827186
5348D107934j739759n32954j428026l437511k578895O52833J281328j541127k365072
5339g581249J380693M155981Q84905m039302k630650M168048O697672q8931r305621
5330f358454j0965344m223971L323372O578524P817046R719129R049410K015935
5322A6955647p084981r248212k986700L262921K988612n24611j871084k504620
5314a013028n653018p505247k130100P337761J1438708P831460L340374J972591
5306A5619501m0630m756674o985843l080969J940525J995329q87986j355344l70060
$$ plain form
5365 -10355435 2027221 12502494 13485897 7310933 3281163 6491602 12270082 13110947
5357 13110947 8248211 3160049 1505282 1950679 2604440 3860679 5642089 5935120 4107934
5348 4107934 2368175 1835221 407195 -3030316 -5609211 -4956378 -3675050 -5216177 -7581249
5339 -7581249 -6200556 -2044575 -1159670 -5198972 -7829622 -3661574 3036098 2947167 -6358454
5330 -6358454 -17323798 -21547769 -18224397 -11645873 -3828827 5890302 14939712 16955647
5322 16955647 9870666 622454 -2364246 898675 3887287 3362676 1491592 -1013028
5314 -1013028 -6666046 -14171293 -16301393 -8963632 2475076 10306536 13646910 15619501
5306 15619501 15578871 10822197 3836354 755385 2695910 4691239 3803253 2447909 2077849
5297B077849k908650q247746r665092m125146L143520N317185J909999j684237
5289a4182318j017455K514912L850827R56295k328623j684343J455792K571003
5281g863910J516439K195677M860518M700575l00557n778445p627780o712983
5273a5010466m136270K097755J1220619J5972710J0717955j11844p059020o481741
5265G209698j765711L192132O416049O102275J860298l296641o092046o677466
5257F948588o275923m080057j15428K305838J478264J147206M384644P227883
5249A3021015M504286j112119k749751J20495J860326Q676k505722l649353l990704
5240E507149k698617J363942M841553L059577k013331l953484k113159j957717
$$ plain form
5297 2077849 -830801 -9078547 -18743639 -22868785 -19725265 -14408080 -12498081 -14182318
5289 -14182318 -15199773 -12684861 -8834034 -7877739 -10206362 -11890705 -10434913 -7863910
5281 -7863910 -6347471 -4151794 708724 5409299 5108742 -669703 -8297483 -15010466
5273 -15010466 -19146736 -17048981 -5828362 10144348 20862303 20750459 13691439 7209698
5265 7209698 5443987 8636119 15052168 21154443 23014741 19718100 13626054 6948588
5257 6948588 672665 -3407392 -3522820 -1216982 261282 1408488 5793132 13021015
5249 13021015 17525301 16413182 13663431 13783926 15644252 15652928 13147206 9497853 5507149
5240 5507149 2808532 4172474 9014027 12073604 10060273 6106789 3993630 2035913
5232B035913m309024k809037M901676J1338928R291549J852010k847627k563803
5224A6890585j385191k095394l106002k128087O33799L131028L708253K603543
5216A8252534J424894Q80694j0515j696595l101083m227591o554222q423777m555486
5207h011147N297640J1919263P620766k158603o319530l899070k629167m014233
5199b194081j887206L707139M136097k603291o380612p66807O282597N418220
5191E712056M64551N61657M642958M263603j951442o744875n862473k766955j327555
5182c008475n39987J766030M319500L708477r96357n749479m651444K616543Q017846
5173E482654M165380m828976p791210k003238L505464K106235j757090k234275
$$ plain form
5232 2035913 -2273111 -5082148 -180472 11158456 20450005 22302015 19454388 16890585
5224 16890585 15505394 13410000 10303998 8175911 8809710 11940738 15648991 18252534
5216 18252534 19677428 20558122 20547607 18851012 15749929 11522338 4968116 -3455661 -8011147
5207 -8011147 -2713507 9205756 16826522 14667919 8348389 4449319 1820152 -2194081
5199 -2194081 -4081287 -374148 3761949 1158658 -5221954 -5988761 293836 5712056
5191 5712056 6176607 6738264 11381222 15644825 13693383 6948508 1086035 -1680920 -3008475
5182 -3008475 -3548462 -1782432 2537068 6245545 5249188 -500291 -5151735 -2535192 5482654
5173 5482654 9648034 4819058 -2972152 -4975390 -1469926 636309 -1120781 -3355056
5165c355056j684533m074445o098721k876492K762182M575068K551144J058913
5157g141940R57144N38396J005499M003442O508221M789510Q19606j316578k139733
5148H023567l664028l456470R40128N244723M043886O1561n00331J053129j088676
5139A0657489n355934m280844K304199N714709J653450l996309n041783k759323
5131a104346r68866k36484j50625j720632m524093n799047m282778j258872K452338
5122a7593405O046252O029086J59531o089704m312472M508337R958237O621698
5114E327560R93583M49153K538491P59390m358238o479859l251456Q84460J338693
5105a798223j078512k101531L21624L461502L269584j31288k578637k212537k248585
$$ plain form
5165 -3355056 -5039589 -9114034 -15212755 -18089247 -15327065 -10751997 -8200853 -7141940
5157 -7141940 -6184796 -5646400 -4640901 -637459 5870762 10660272 11479878 10163300 8023567
5148 8023567 4359539 903069 1843197 7087920 11131806 11193367 10693036 11746165 10657489
5139 10657489 5301555 1020711 3324910 9039619 10693069 6696760 1654977 -1104346
5131 -1104346 -2073212 -2309696 -2460321 -4180953 -8705046 -14504093 -18786871 -20045743 -17593405
5122 -17593405 -11547153 -5518067 -5358536 -11448240 -15760712 -11252375 -1294138 5327560
5114 5327560 6321143 6770296 9308787 10068177 5709939 -769920 -4021376 -3136916 -1798223
5105 -1798223 -2876735 -4978266 -4656642 -1195140 2074444 1943156 -635481 -2848018 -5096603
5096e096603m893847o352843k367850M377909P783047O774842M453289J289746
5088E967690l867754p705350n212940J634309N299816L064563q61719l353454
5080e034839m880997m165902Q41192N693854K782576n473212o565230M305757
5072a2496801J5239863J2894443n2395r541509p412001K215120J0217265J0521078
5064B1585063L315808n407286r183683q064571p388087q656222p051488l97966
5056b1248432N707957O064339L674503L987882N666473L235885l476469q218320
5048d606182o040302J517877Q509957R738104M898575j062164l051421j473821
5040H430623m96874j385182j604623l64355k263j127682j384232K3107J375230
$$ plain form
5096 -5096603 -9990450 -16343293 -18711143 -14333234 -6550187 224655 4677944 5967690
5088 5967690 2099936 -5605414 -10818354 -9184045 -3884229 -819666 -1681385 -5034839
5080 -5034839 -9915836 -14081738 -13240546 -7546692 -4764116 -10237328 -16802558 -12496801
5072 -12496801 2743062 15637505 15585110 6043601 -1368400 846720 11063985 21585063
5064 21585063 24900871 19493585 10309902 2245331 -5142756 -13798978 -20850466 -21248432
5056 -21248432 -15540475 -9476136 -5801633 -1813751 3852722 7088607 3612138 -4606182
5048 -4606182 -10646484 -9128607 -618650 9119454 14018029 12955865 9904444 8430623
5040 8430623 7933749 6548567 4943944 4579589 4577326 3449644 2065412 2088519 3463749
5031C463749K274971L032535P82240o515092j2356313p327945N732792J2265303
5023A352240N583988l777735l766342L304407P420060N362944P50665l853890
5015A2376337o987513n724043l48633K995562N74787l033332k998503j926719
5007e072057k929195k014811M202844R500416O464961r15893l108740K46878J672142
4998H046545p70178j871088j0036L82264k380765m339613k950490l82099J155995
4989c119465J934543K210358J754744J501034J903773J200973j086453j654964
4981D644543J475146M635541L750737K79731k501392m633839o061748l649180
4973b060461K418144N212800J067954l200115j098741K186994q79660n785830
$$ plain form
5031 3463749 5738720 8771255 9553495 3038403 -9317910 -16645855 -10913063 1352240
5023 1352240 6936228 3158493 -607849 2696558 10116618 15479562 16230227 12376337
5015 12376337 5388824 -335219 -683852 2311710 2886497 -146835 -3145338 -5072057
5007 -5072057 -8001252 -10016063 -5813219 3687197 10152158 9236265 6127525 6374403 8046545
4998 8046545 7276367 5405279 5395243 5777507 3396742 -942871 -3893361 -4275460 -3119465
4989 -3119465 -1184922 1025436 2780180 4281214 6184987 7385960 6299507 4644543
4981 4644543 6119689 10755230 14505967 14785698 12284306 7650467 1588719 -2060461
4973 -2060461 357683 5570483 6638437 3438322 2339581 4526575 3646915 -2138915
4965b138915k833120O058137J0078241O360204J679737p60122l735347o342706
4957H366109m654725j793756m628821j0021967p576489K366432P162307J654841
4949i126069l892904j054428M037527K726822j861942j647784K661020L881714
4941d276044J48119l617526m024269k686766j690894p3848L775574P927369P446449
4932B928164R47086n047731l242304L029112L099846m200406o898312J394055
4924g990490R905045P091252j587128m363520k488246m227722p056067k599463
4916a3316339N580841O456476P45028j362914P88537q04643m741680j754067N960112
4907b448649O009070k396954o657307k576795P32352l24205O03641L094642r65446
$$ plain form
4965 -2138915 -4972035 1086102 11164343 17524547 19204284 18444162 14708815 8366109
4957 8366109 3711384 1917628 -2711193 -12733160 -20309649 -17943217 -10780910 -9126069
4949 -9126069 -13018973 -14073401 -10035874 -7309052 -9170994 -10818778 -8157758 -4276044
4941 -4276044 -4127925 -7745451 -11769720 -14456486 -16147380 -16221228 -12445654 -4518285 2928164
4932 2928164 3875250 -1172481 -4414785 -1385673 1714173 -2486233 -9384545 -7990490
4924 -7990490 1914555 9005807 7418679 3055159 566913 -3660809 -10716876 -13316339
4916 -13316339 -7735498 -1279022 -533994 -1896908 -1108371 -1913014 -6654694 -8408761 -2448649
4907 -2448649 3560421 1163467 -5493840 -8070635 -7338283 -7662488 -7058847 -3964205 -4929651
4898d929651q452528o108211N390920R948700L223099j090430K640382L261840
4890C884121l391320o464316k964699l276512o806413j66530J2645159J0110643
4882C570133o881856j0654847M961310J2326311K710090M185728K2625800K0510137
4874E3352806n881427J0483822J01714181J74054715J13072010m4784411j43251196
4867B58760500j09453566l0822896q765655k9399169k7623494j969928M009074
4860E4734866j2592126j7415128m791248m83908r263264r733466K511105Q347951
4852A1314782J401384l889274j413371q50434m521990k973155M188243N905357
4844I161542K70722k582349L28512J324642j030128P75423P149020Q913928L250057
$$ plain form
4898 -4929651 -13382179 -19490390 -14099470 -4150770 -927671 -2018101 622281 3884121
4890 3884121 492801 -5971515 -8936214 -12212726 -19019139 -19185669 -6540510 3570133
4882 3570133 -3311723 -13966570 -9005260 3321051 6031141 10216869 32842669 53352806
4874 53352806 47471379 57955201 159669382 333724097 446796107 402011696 258760500
4867 258760500 149306934 118484038 109718383 80319214 52695720 50725792 54734866
4860 54734866 42142740 24727612 19936364 19452456 10189192 455726 2966831 11314782
4852 11314782 12716166 8826892 7413521 6563087 2041097 -932058 3256185 9161542
4844 9161542 9432264 6849915 7178427 8503069 7472941 8248364 15397384 24311312 27561369
4835B7561369k268445l579777m846380p464954o712369j456887L385992N350236
4827I968785N967044M186820j936519p811407o719746r48593J447108j09295Q28851
4818D873048M940219N818380J587178k687824m763020p266267r180075n399517
4810a2077878L353284R198537P816307K861737j470191m573749n221656j323896
4802a437505M351504N491316J253491k196855o04259L486236N568367L741613
4794A9653908j598368p527724q749358l313832L045060L784061O26694n59292
4786E361149q3421k427218n989413m449264J656529M062962r04530p031169p212833
4777a7017208j308060O307591J1211670J0376370M658949k67927n17853K80531
$$ plain form
4835 27561369 25292924 21713147 16866767 9401813 2689444 1232557 4618549 9968785
4827 9968785 15935829 20122649 18186130 10374723 3654977 2706384 4153492 4044197 4873048
4818 4873048 9813267 15631647 17218825 14531001 9767981 2501714 -6678361 -12077878
4810 -12077878 -8724594 473943 8290250 11151987 9681796 5108047 -113609 -1437505
4802 -1437505 2913999 8405315 9658806 7461951 6857692 10343928 15912295 19653908
4794 19653908 18055540 10527816 1778458 -1535374 1509686 5293747 5920441 5361149
4786 5361149 5277728 2850510 -3138903 -7588167 -5931638 -1868676 -2773206 -9804375 -17017208
4777 -17017208 -18325268 -12017677 -806007 9570363 14229312 13961385 13443532 13724063
4769A3724063k382413n103392k560571J412777o17461n590119l754282M337081
4761e34317Q119626N093966M106624P635012O155722l702895j0248891n180154
4753A1444693K090009l4927o389311m834999L227254O443468K496336p99971j002720
4744A2639832l665385r060761r298041k002415L949081J545161l763192k736737
4736a2392457M114640Q243599N230858q94343m707957n622826n899092n962221
4728a7889799m263051n86649K894624M160201L347252J693381R3256l69669J606739
4719i313715N191995O743299L997707l43679k090800j525636k427641n643250
4711e411720p455480m922314L26883M451859N197668L044239O95855J085252L657836
$$ plain form
4769 13724063 11341650 6238258 3677687 5090464 4473003 -1117116 -4871398 -534317
4761 -534317 7585309 12679275 16785899 24420911 30576633 26873738 16624847 11444693
4753 11444693 13534702 13499775 7110464 2275465 5502719 11946187 14442523 13642552 12639832
4744 12639832 8974447 -86314 -9384355 -11386770 -7437689 -5892528 -9655720 -12392457
4736 -12392457 -8277817 -34218 5196640 4302297 -405660 -6028486 -11927578 -17889799
4728 -17889799 -22152850 -22739499 -19844875 -15684674 -12337422 -10644041 -10550785 -10920454 -9313715
4719 -9313715 -4121720 2621579 6619286 6275607 4184807 2659171 231530 -5411720
4711 -5411720 -12867200 -17789514 -17462631 -13010772 -7813104 -4768865 -4073010 -2987758 670078
4702F70078L752130j360043p262169p179555r49625N162199O849139N257609K687355
4693G627118L6159j396812o56708P1834j744294l704541j425389L685581N809863
4684H302811L492884J23759l700244r544175j2680844n148193R719348J6819029
4676G384375Q835747l626221p907276n316257l018396J40620P995290J4485747
4668A8973629J0371309p48455o014634j989001K104702K21655l051788l321404
4660A6546013l841217p392807r480239n825309m24876M14097j887609n06713O160255
4651f238405J1786994J0287311K742509n043606r210564r907654q059457l547438
4643a7190310J939571L478967j373104o734053m006059N713330J1028826N197898
$$ plain form
4702 670078 4422208 3062165 -4200004 -11379559 -12329184 -7166985 -317846 4939763 7627118
4693 7627118 7663277 6266465 5609757 5681591 3937297 232756 -1192633 2492948 8302811
4684 8302811 11795695 11919454 8219210 -1324965 -14005809 -19154002 -9434654 7384375
4676 7384375 16220122 12593901 4686625 -629632 -3648028 -3507408 4487882 18973629
4668 18973629 29344938 28596483 22581849 20592848 22697550 22919205 19867417 16546013
4660 16546013 12704796 5311989 -4168250 -9993559 -10418435 -10004338 -11891947 -12398660 -6238405
4651 -6238405 5548589 15835900 18578409 13534803 4324239 -5583415 -13642872 -17190310
4643 -17190310 -15250739 -11771772 -13144876 -19878929 -23884988 -18171658 -7142832 -1944934
4635a944934m155192n410491J614394P154665N568283Q13623j396126m96092P95392
4626B543522O68480o06111j067423J124430M267092L582461k001326o569388m968743
4617c027006o18307L0653k111636j077180L196562M391924N14441k874440j832090
4608c407079O59088J030430M09660N48203N6810j937363l110725k163122j453594
4599i367692k301947j813839K071011N915129N011789q2550m424787m405630m65540
4590i864056M093141N551451L078067L35520J123318L377230J754059l235413
4582F213317m382480J527333P886487P199439J093118l489610m205038l800395
4574H042171l473785j927316J3753l95859k713897l192341p02096J217420k91232
$$ plain form
4635 -1944934 -6100126 -11510617 -9896223 -2741558 2826725 3640348 2244222 1748130 2543522
4626 2543522 3212002 2605891 1538468 2662898 6929990 10512451 8511125 1941737 -3027006
4617 -3027006 -3645313 -3614660 -5726296 -6803476 -3606914 785010 1299451 -1574989 -3407079
4608 -3407079 -2747991 -1717561 -1307901 -759698 -702888 -2640251 -5750976 -7914098 -9367692
4599 -9367692 -11669639 -13483478 -11412467 -5497338 -485549 -568099 -4992886 -9398516 -9864056
4590 -9864056 -5770915 -219464 2858603 3194123 4317441 7694671 9448730 6213317
4582 6213317 1830837 3358170 11244657 18444096 19537214 16047604 11842566 8042171
4574 8042171 4568386 2641070 2654823 2258964 -454933 -3647274 -4349370 -3131950 -3423182
4565c423182l194835l731359j643285J44751K66430P93560L330664N033156J583063
4556h41037n432331p938602j389143P491988Q149025K49859n809671l093750L703622
4547d910040O813708N759570M507916L367789R7841l620208l441725J92351J334926
4538A0102128l451799j0014324j1407215o089941J97090Q76187l474489n066524
4530b8328887J431010J0990045J4039794R242065M506523M475576M283383p51108
4522A9888401o309887n911646j190453J487477P08958o62662k492385o120467
4514f02664q498045n519184R1893K040622P84907K351888O794019O755247l47193
4505C851490o885881n493259J334334N938879M855299J64312m146859m328929
$$ plain form
4565 -3423182 -6618017 -10349376 -11992661 -11847910 -11581480 -10787920 -7457256 -2424100 -841037
4556 -841037 -6273368 -14211970 -15601113 -8109125 39900 289759 -5519912 -8613662 -4910040
4547 -4910040 1903668 7663238 12171154 15538943 15636784 12016576 8574851 8767202 10102128
4538 10102128 6650329 -3363995 -14771210 -20861151 -20664061 -19787874 -23262363 -28328887
4530 -28328887 -26897877 -15907832 -1868038 7374027 11880550 16356126 20639509 19888401
4522 19888401 13578514 7666868 6476415 7963892 8672850 8010188 5517803 -602664
4514 -602664 -9100709 -14619893 -14528000 -12487378 -11702471 -9350583 -2556564 4198683 3851490
4505 3851490 -3034391 -8527650 -7193316 -1254437 3600862 3765174 -381685 -4710614
4497d710614N58150N819016M954706j615453o099812l702264J433889L288426
4489g3956J960199J057721J446824J669559J444190J111764o3958k338358m311455
4480A902530m889944m088907j618469J814219K433461j905790n534814j092558
4472a2980272P751526R243119J490115l527916J269510O983696M350238q85266
4464A3694750P06349N192935L060739l319035m956708l715128q156901j4681508
4456a2174507j0430365M072456J2353056O088178l782879n779884l101823k469501
4448a5225269j293974L879464P110818K607572l645045k952622J787241J908143
4440e823672j784375q78880O049062J0964519P951070o86029r355664j3644999
$$ plain form
4497 -4710614 -4152464 1666552 6621258 5005805 -1094007 -4796271 -3362382 -73956
4489 -73956 1886243 2943964 4390788 6060347 7504537 8616301 8552343 6213985 1902530
4480 1902530 -2987414 -7076321 -8694790 -6880571 -4447110 -6352900 -11887714 -12980272
4472 -12980272 -5228746 4014373 5504488 1976572 3246082 10229778 14580016 13694750
4464 13694750 14401099 19594034 22654773 19335738 14379030 10663902 2507001 -12174507
4456 -12174507 -22604872 -18532416 -6179360 -91182 -3874061 -9653945 -12755768 -15225269
4448 -15225269 -16519243 -12639779 -5528961 -2921389 -6566434 -9519056 -7731815 -5823672
4440 -5823672 -7608047 -8486927 -2437865 8526654 16477724 15791695 6436031 -7208968
4432g208968j0912379k630579M723285O290253M803195N367032P224674O310234
4424A3966747K876426J12289k099144n215735o480868k854053J657282P39766
4416B702710l495590l051056L038143O956703M144981r95038l073831k131882
4408D095140k44571J589270J352389k814723p645265p203854j738670K464812
4400a0145472L232368M782119P831933O228212k178793r307487p588771p63588
4392g909479K415987K68632k553596l787725m515916l884927J64193N332224N819290
4383h651317j71423p171875p853808m69083R144593J2825219Q325103J652754
4375G630163p53691l39016k707865p396157q169823l640312J95784j14049r21037
$$ plain form
4432 -7208968 -18121347 -20751926 -16028641 -9738388 -4935193 431839 7656513 13966747
4424 13966747 16843173 16955462 14856318 9640583 3159715 305662 1962944 2702710
4416 2702710 -792880 -3843936 -805793 6150910 10295891 9300853 6227022 4095140
4408 4095140 3850569 5439839 6792228 3977505 -3667760 -10871614 -12610284 -10145472
4400 -10145472 -6913104 -2130985 5700948 11929160 9750367 442880 -7145891 -7909479
4392 -7909479 -5493492 -5224860 -7778456 -11566181 -16082097 -19967024 -19802831 -14470607 -8651317
4383 -8651317 -8822740 -15994615 -23848423 -24317506 -15172913 -2347694 5977409 7630163
4375 7630163 6876472 6537456 3829591 -3566566 -11736389 -15376701 -15180917 -15294966 -16216003
4366a6216003K20091O6048k153507p80658N861681R411616L789276l770090l329088
4357f900634K327792L372033q54607k819200q78124m00215k063867q71542K819598
4348f268766K687178j600917k751569J324864L673593Q00449j439115O55505J325254
4339a593524l706446p829635l519986M869860P277206K567633j564894o26946
4331d126732K678789M945717N247096K441221l912084r509835q203837l53617
4323a0793282O470679O769971L185173J499486L033145M626591M034378K299477
4315B1125618J012127m57309l662804p747511r260416o258121j216578J927583
4307d537411K559830K671771K241840p98143n486081p036198l294878J595157
$$ plain form
4366 -16216003 -15995912 -15929864 -18083371 -18864029 -13002348 -3590732 198544 -3571546 -6900634
4357 -6900634 -4572842 -1200809 -2055416 -4874616 -5752740 -6152955 -8216822 -9088364 -6268766
4348 -6268766 -3581588 -5182505 -7934074 -6609210 -2935617 -2135168 -3574283 -2918778 -1593524
4339 -1593524 -5299970 -13129605 -16649591 -11779731 -4502525 -1934892 -3499786 -4126732
4331 -4126732 -1447943 3497774 8744870 11186091 7274007 -2235828 -10439665 -10793282
4323 -10793282 -4322603 2447368 5632541 7132027 10165172 14791763 18826141 21125618
4315 21125618 22137745 21680436 18017632 10270121 1009705 -5248416 -6464994 -4537411
4307 -4537411 -1977581 694190 2936030 2137887 -3348194 -10384392 -13679270 -12084113
4299a2084113K958976K070469L191141O218933O605417K106322m110599p477632
4291e21086o344726j919251L462574P123324P186900M177347M35443k547777m985856
4282F066892o634399n575306o25812N959947R882964Q885795M315833j170267
4274B1105647n665061p314643m113177L083786Q726531P298314J40636n666851
4266A7595182o019535l941967l668774m597195l997873k149064q20100N54598
4258g044728K756722L188301n61780n228481n413956j679319N14913n52187j284550
4249a5305065P8544J189517J511947L892117Q056914Q820368L777581k830760
4241I191163o954768r545910j0957535p088227L239881J2462245J2726786O597240
$$ plain form
4299 -12084113 -9125137 -7054668 -3863527 2355406 8960823 11067145 6956546 -521086
4291 -521086 -6865812 -8785063 -5322489 1800835 8987735 13165082 13600525 11052748 6066892
4282 6066892 -567507 -6142813 -6768625 -808678 9074286 17960081 22275914 21105647
4274 21105647 15440586 8125943 4012766 7096552 15823083 23121397 23262033 17595182
4266 17595182 11575647 7633680 3964906 -632289 -4630162 -6779226 -7599326 -7044728
4258 -7044728 -4288006 -1099705 -1661485 -6889966 -12303922 -13983241 -13468328 -14020515 -15305065
4249 -15305065 -15226521 -14037004 -12525057 -8632940 -576026 8244342 12021923 9191163
4241 9191163 2236395 -7309515 -18267050 -25355277 -22115396 -9653151 3073635 9670875
4233I670875K581938K811063K339390r91436l592994l128497j665649o74456J209779
4224H560013L729550L706324N76692j519545j52782J076402j600948n350823m706291
4215D318592n05308O66390l618191p434069m716079K225713O216892M758866J496854
4206C409660m68385j330265p50039K448746N162142J368986p767815j1868109
4198i795079m966296M998066P461602M133480L383289M872344J775084m300454
4190G562036m152447K835543O750767L724508J097089K197245J4799p482357r603323
4181B943860n0095J0196761Q375884j510235p348744p337864p200585o577351
4173h508369j780860L445762L202981R51978L056312N546518R16817o158487m841916
$$ plain form
4233 9670875 12252813 15063876 17403266 16411830 12818836 9690339 8024690 7350234 8560013
4224 8560013 12289563 15995887 16572579 15053034 14900252 15976654 14375706 9024883 4318592
4215 4318592 3813284 4479674 861483 -6572586 -11288665 -9062952 -2846060 1912806 3409660
4206 3409660 2941275 1611010 860971 3309717 8471859 9840845 2073030 -9795079
4198 -9795079 -14761375 -9763309 -2301707 1831773 5215062 10087406 11862490 7562036
4190 7562036 3409589 6245132 12995899 16720407 17817496 20014741 20029540 12547183 2943860
4181 2943860 2893765 13090526 21466410 19956175 12607431 5269567 -1931018 -8508369
4173 -8508369 -10289229 -6843467 -3640486 -2688508 367804 5914322 6831139 672652 -4169264
4164d169264K891810M785948j315985n064370j773762K185203L368017N714886
4156F622483Q919074O778950j28983l774029k709314k855097l364964K081375
4148A1569495Q675902M261326p224442p541017N247027J2370739R509979J7592200
4140E4461209M0954413M4417415K114730n2576860o3402849k7127996N356997
4133D197059K277547j3333502r834855O667490J1745566K923051l631756k289258
4125a278658j327774l809303l743384N56296L319828J636550j026258j791338
4117g464041j529568j306451j264593k181876l680449k585378K731044Q395763
4109h885549R443210N989624J239742l847183r262983j1759682p626673P81711
$$ plain form
4164 -4169264 -1277454 3508494 2192509 -2871861 -4645623 -2460420 907597 6622483
4156 6622483 15541557 22320507 22191524 18417495 15708181 12853084 9488120 11569495
4148 11569495 20245397 24506723 17282281 9741264 14988291 27359030 36869009 54461209
4140 54461209 95415622 139833037 141947767 89370907 25968058 -1159938 4197059
4133 4197059 6474606 -6858896 -16693751 -10026261 1719305 4642356 1010600 -1278658
4125 -1278658 -2606432 -6415735 -10159119 -9602823 -6282995 -4646445 -5672703 -7464041
4117 -7464041 -8993609 -10300060 -11564653 -13746529 -17426978 -20012356 -17281312 -8885549
4109 -8885549 557661 6547285 7787027 3939844 -5323139 -17082821 -24709494 -23927783
4101b3927783O106163M436033l62237j610264K736487Q147965Q262369J743054
4093E531787n607746o809281j552621M162938O123726O078217O789198P024941
4085B1741159M349466k8364k605836k244171q02249l21420j630854m385585o690208
4076G381938o278454l697887k211751k680582j393335L929092Q693752O604584
4068A0347357r96597o105286m726063j502702j703100l195224m96382N879211
4060b498786R298616O095525Q2294l558884m792583o080976o498027l238731K315554
4051h875998N189835L817307J688447R88635l58091l204893m023798q75263K130684
4042c523135J023549j387364n55383J618644K77689l115086k523853K345982N017461
$$ plain form
4101 -23927783 -17821620 -13385587 -13747824 -15358088 -12621601 -4473636 3788733 5531787
4093 5531787 -75959 -6885240 -8437861 -4274923 1848803 7927020 14716218 21741159
4085 21741159 26090625 26062261 23456425 21212254 20410005 20088585 18457731 14072146 7381938
4076 7381938 1103484 -2594403 -4806154 -7486736 -8880071 -4950979 3742773 10347357
4068 10347357 9350760 3245474 -1480589 -2983291 -4686391 -7881615 -8377997 -2498786
4060 -2498786 6799830 12895355 12977649 9418765 4626182 -1454794 -7952821 -11191552 -8875998
4051 -8875998 -3686163 131144 1819591 2808226 2450135 -754758 -4778556 -5653819 -3523135
4042 -3523135 -2499586 -3886950 -4442333 -2823689 -2546000 -5661086 -8184939 -5838957 -821496
4033h21496K296008j573090k444942j643356j519310j343544l58754m9283p63771
4024h221538n03314P78572M31794j183897K92801N425998P771260K910296l947398
4015C754574m633262R23747N424272L965115j337012n196752m206541Q43464N244666
4006D782271M385933r28812n314915n844539m732811l950186k093948J177751
3998a2519256L005134K688338L530952N773626M285149j801779m502464R07826
3990A367526O373639L024729l634163k339773M489501M030310n224692j0001175
3982a914098l479896M036786K080433m220819m138113J836886N146915L294025
3974B642119R03762o3299k038528m978119n494028k957314m79258M63110J440003
$$ plain form
4033 -821496 1474512 -98578 -2543520 -4186876 -5706186 -7049730 -7408484 -7457767 -8221538
4024 -8221538 -8724852 -7946280 -7514486 -8698383 -8405582 -2979584 4791676 7701972 3754574
4015 3754574 -878688 45059 5469331 9434446 8097434 2900682 -1305859 -462395 4782271
4006 4782271 9168204 8239392 2924477 -2920062 -7652873 -11603059 -13697007 -12519256
3998 -12519256 -9514122 -6825784 -3294832 2478794 6763943 4962164 459700 1367526
3990 1367526 7741165 10765894 7131731 4791958 9281459 13311769 8087077 -1914098
3982 -1914098 -5393994 -1357208 723225 -3497594 -7635707 -5798821 -651906 2642119
3974 2642119 3545881 3482582 1444054 -3534065 -9028093 -11985407 -12464665 -12001555 -10561552
3965a0561552K966579L409861K240774O10409j200703l202548l024615J685894
3957g075901P793164Q304488J305269o476552p536919k313422K710615L603329
3949C14071K175040J012329q01048m733585p773914m509165M717853J1429482
3941A831063Q404724m84375m679720r95727K437972j590963q833613j0003319
3933a3913958l863783K238426L291810J781952J638037K761418L503211M098441
3925A535554M901231M283453J028504l147529n592279n637652l992141j147021
3917g767880J877328L101510J932167M14176L32817P84726O02332J097834L532199
3908E907209N596852M032473j94114l189595m153949n688316p700674o171030
$$ plain form
3965 -10561552 -7594973 -4185112 -1944338 -1333929 -2534632 -5737180 -8761795 -7075901
3957 -7075901 717263 9021751 10327020 3850468 -3686451 -5999873 -3289258 314071
3949 314071 2489111 3501440 2700392 -2033193 -9807107 -14316272 -9598419 1831063
3941 1831063 10235787 9751412 5071692 4075965 6513937 4922974 -3910639 -13913958
3933 -13913958 -17777741 -15539315 -12247505 -10465553 -8827516 -6066098 -2562887 1535554
3925 1535554 6436785 10720238 11748742 8601213 3008934 -2628718 -6620859 -7767880
3917 -7767880 -5890552 -2789042 -856875 -442699 -109882 674844 1277176 2375010 5907209
3908 5907209 11504061 15536534 15342420 12152825 7998876 2310560 -5390114 -11561144
3900a1561144l12966L779809Q44116n342158o486968j075028M000838L153554
3892a2999947j370792m087536l351749j371233P7072J071961K028637L051472
3884a6952115M234080N224971N146971L821496K085861K24957k429683n413099
3876d056561o355284l665994J384839O302367R281481Q554270K833152n154070
3868I124200q450904l127477N730613R234015N049219j351381n028651o357293
3860D822341o981099n977564k337537K188442N069430N401211K925798k291768
3852B819254p453341p806272k731783J825138N06959l976137m295724J822853
3844a9289053R142235J1696920Q683198L565656K93427P22870L230570L527632
$$ plain form
3900 -11561144 -11874110 -8094301 -7250185 -12592343 -19079311 -20154339 -16153501 -12999947
3892 -12999947 -14370739 -18458275 -21810024 -23181257 -23104185 -22032224 -20003587 -16952115
3884 -16952115 -12718035 -7493064 -2346093 1475403 3561264 3786221 1356538 -4056561
3876 -4056561 -10411845 -14077839 -12693000 -6390633 2890848 11445118 14278270 9124200
3868 9124200 673296 -2454181 3276432 12510447 17559666 16208285 11179634 4822341
3860 4822341 -2158758 -8136322 -10473859 -8285417 -3215987 2185224 5111022 2819254
3852 2819254 -4634087 -12440359 -15172142 -13347004 -12840045 -16816182 -21111906 -19289053
3844 -19289053 -10146818 1550102 10233300 13798956 14092383 14815253 18045823 21573455
3836B1573455q01316o325739o901855j383026M426721M725761L04550l471501
3828A2147050l357364p36786J462328K004210J481710R11681P29065M31814q96083
3819A4177625l144623m555630l538496r81287N96453M64481N59535J948433K380994
3810G907485k53909l423353k576686J778163L996516J719844m55793J044538K187046
3801A1923851j517816n492133k264488M688081L823506o087122j1545349l695315
3793a0166785Q081937J0655816O682760P626431J2739776R822336l396968j3389814
3785B8655489j0735571l464908l192738p758197p165266k48409M972156M509657
3777E572213K439344K309906K611166J766015J175354J493067O91419k219781
$$ plain form
3836 21573455 20772139 14446400 7544545 6161519 10588240 15314001 15618551 12147050
3828 12147050 8789686 8052900 9515228 11519438 13001148 13912829 14641894 15073708 14177625
3819 14177625 11033002 6477372 2938876 1957589 2554042 3018523 3578058 5526491 7907485
3810 7907485 7653576 4230223 1653537 3431700 7428216 9148060 8692267 9736805 11923851
3801 11923851 10406035 4913902 2649414 7337495 11161001 5073879 -6471470 -10166785
3793 -10166785 -2084848 8570968 15253728 22880159 35619935 45442271 42045303 28655489
3785 28655489 17919918 14455010 11262272 3504075 -3661191 -3909600 1062556 5572213
3777 5572213 8011557 10321463 12932629 14698644 15873998 17367065 18058484 15838703
3769A5838703m955164n022625k762771n16767k93118k001026k795875J27178M471644
3760B090179L859296k870544p520214l252543M302067M443698k566242o526019
3752h040322l767827j356228k651329r40164O510242R629907O67266j0778487
3744a0726942j0094987O62654O613512K633283j749240j06464K113962K0322j968334
3735a2602234K50996K381957L83448j424207J289524L966588J400780j594834
3727e947982K091133Q205685O500563k441683p222505k714859L698992N121713
3719G291057M228054N173245N214773N27423n808030p989024n741967l081827
3711a86296j908266j429159j254889r01997J301521N056206O449532L172880j341489
$$ plain form
3769 15838703 10883539 5860914 3098143 2581376 2288258 287232 -2508643 -2381465 2090179
3760 2090179 5949475 3078931 -4441283 -7693826 -3391759 1051939 -1514303 -8040322
3752 -8040322 -11808149 -13164377 -15815706 -16755870 -10245628 -615721 51545 -10726942
3744 -10726942 -20821929 -20159275 -13545763 -10912480 -12661720 -12768184 -10654222 -10633900 -12602234
3735 -12602234 -12351238 -9969281 -9585833 -11010040 -9720516 -5753928 -4353148 -5947982
3727 -5947982 -3856849 4348836 10849399 8407716 1185211 -1529648 2169344 7291057
3719 7291057 11519111 16692356 21907129 22434552 16626522 8637498 2895531 -186296
3711 -186296 -2094562 -3523721 -4778610 -5680607 -4379086 677120 7126652 10299532 8958043
3702H958043k739644j689396r04357L24038L330136M850219J074757m809529n877252
3693B517015j635400J685684J093719M02401K824377O370367Q338125Q471372
3685C0067660N820228j318812r737876j1943286o211279k85955p29686m165934
3677A495060m320647k232202k447648l345344K00943O416405P705927K628142
3669F100636j305322Q02002L867717J258072m530767n222780J294963P647049
3661I911570O329882r69045n727403l245560J974821L098680O33387P18079M200992
3652A6925403M003954l397782j0176575p338333J535208M973070J01837m573588
3644B053194l159556R8143m3990j632675j063242J63291k81141k11232K299754
$$ plain form
3702 8958043 6218399 4529003 3624646 3948684 7278820 12129039 13203796 8394267 2517015
3693 2517015 881615 2567299 3661018 4063419 6887796 13258163 21596288 30067660
3685 30067660 35887888 34569076 24831200 12887914 6676635 6390680 5660994 1495060
3677 1495060 -2825587 -5057789 -7505437 -10850781 -10649838 -4233433 3472494 6100636
3669 6100636 4795314 5597316 9465033 10723105 6192338 969558 2264521 9911570
3661 9911570 16241452 15272407 9545004 6299444 8274265 11372945 12006332 12724411 16925403
3652 16925403 20929357 17531575 7355000 16667 1551875 6524945 6626782 2053194
3644 2053194 -1106362 -1008219 -1052209 -2684884 -3748126 -3584835 -3865976 -4077208 -1777454
3635a777454L721864R12531k124719k58251L451053K100901l656349o696869m958091
3626i285384l457240m153577k301398M266132R606382P934931K097817j089004
3618C618659l07471J93803k228838n575691o399021l184267K667409P341665P222889
3609C349137K498190l044569o473221p794818p123663l484639J672773L736561
3601a6664249J061869j385531J444238P059441Q853358N289147P39325j678820
3593D718778k729064k733012l65708K946846K720047j997083o033114n094162
3585h566472j692388o12936j632899j083567J443205K868706K448802K897286
3577c930263M863671M752607L53037m663190n065225j032107K552797K968008
$$ plain form
3635 -1777454 1944410 2856941 732222 473971 3925024 6025925 2369576 -4327293 -9285384
3626 -9285384 -12742624 -16896201 -19197599 -14931467 -5325085 2609846 4707663 3618659
3618 3618659 3311188 3504991 1276153 -4299538 -10698559 -13882826 -11215417 -3873752 3349137
3609 3349137 5847327 2802758 -3670463 -11465281 -18588944 -22073583 -20400810 -16664249
3601 -16664249 -15602380 -16987911 -15543673 -8484232 369126 5658273 6397598 4718778
3593 4718778 1989714 -743298 -1109006 1837840 4557887 2560804 -3472310 -8566472
3585 -8566472 -10258860 -10871796 -12504695 -13588262 -12145057 -9276351 -6827549 -3930263
3577 -3930263 933408 5686015 6039052 1375862 -3689363 -4721470 -2168673 799335
3569G99335K199222K117937Q59770l433068p793399p397178k876517k48929k014144
3560a7786971k630382L200799J0767276J0010463j73796q931763p561489p64124
3552a3869987J495684j108057l79854N841485R441840M962896j379688j367014
3544C637305K537808K023058k963621m215115O90286L705632r04277o974639n712360
3535h175923Q76787L487696o8391k019732L166763J0600212J1812327N186309
3527B4866048l676895q936769q821677n227819k037439k461384n508057o187425
3519a7991417j485870N066735P398220M573689J437033J638568L171442K064697
3511E873097j770480m390640k851164J049580K547352m82714m123840k321177
$$ plain form
3569 799335 2998557 5116494 5976264 2543196 -5250203 -12647381 -15523898 -15772827 -17786971
3560 -17786971 -20417353 -17216554 -6449278 3561185 3387389 -5544374 -13105863 -13869987
3552 -13869987 -12374303 -13482360 -13862214 -8020729 1421111 6384007 5004319 3637305
3544 3637305 6175113 8198171 5234550 1019435 1709721 5415353 4511076 -2463563 -8175923
3535 -8175923 -7299136 -3811440 -3879831 -5899563 -2732800 7867412 19679739 24866048
3527 24866048 21189153 12252384 3430707 -1797112 -3834551 -6295935 -11803992 -17991417
3519 -17991417 -19477287 -14410552 -7012332 -2438643 -1001610 636958 3808400 5873097
3511 5873097 4102617 -288023 -3139187 -2089607 457745 -24969 -4148809 -6469986
3503f469986M799737Q963865L502206o321112q138491J144231R654044N547791
3495A2682285o829707j2583166o137778K647123L664588q0720O85675O963689
3487A011989J0962148P823088P49363n614396j0388761j3134050j0942859k725979
3479b2259457O822160J1399017R731002N282766R18353k991285n858822n673553
3471b629819j674171L377124N095842K005079k189881k057789K945065O900213
3463A1771663M716566o13910k032809J082151K035335k475366p065273o345917
3455A072440k914836j596792r57851K668346O543932M835551j355802n069059
3447C225929l782542j110991J296098N331812R328181Q016392J660985k963466
$$ plain form
3503 -6469986 -1670249 7293616 10795822 4474710 -3663781 -2519550 7134494 12682285
3495 12682285 5852578 -6730588 -12868366 -10221243 -6556655 -6637375 -5951700 1011989
3487 1011989 11974137 19797225 20546588 14932192 4543431 -8590619 -19533478 -22259457
3479 -22259457 -15437297 -4038280 5692722 10975488 11893841 8902556 3043734 -2629819
3471 -2629819 -4303990 -926866 4168976 6174055 3984174 1926385 4871450 11771663
3463 11771663 16488229 15874319 13841510 14923661 16958996 14483630 7418357 1072440
3455 1072440 -1842396 -3439188 -4397039 -1728693 4815239 9650790 8294988 3225929
3447 3225929 -556613 -1667604 -371506 4960306 14288487 22304879 23965864 21002398
3439B1002398l400263m868332r213781r697174k714949L808595J763440m272526
3431g592592m706310k98197K83579m774221q405734o488527k215554J613862N749893
3422b6833801Q631348N918402j280912m999085r40814N325846O485151L015205
3414d678660O91666K231670N338632O773101N239286J637368j529084k068922
3406A3635057k74358J984472L814668M762743L023635j989948o203220m990970
3398A3762079o29953Q0578l588729m584830P76554O581893O255884J830156j005669
3389A9477963k129708m680148o993071m490054J324683L011523k372314q742579
3381e593705r294983m950132j288282j49073J417889M599558N723845J980213
$$ plain form
3439 21002398 17602135 12733803 3520022 -6177152 -8892101 -5083506 -3320066 -7592592
3431 -7592592 -12298902 -12597099 -12313520 -17087741 -25493475 -31982002 -34197556 -32583694 -26833801
3422 -26833801 -18202453 -12284051 -13564963 -18564048 -19504862 -14179016 -7693865 -4678660
3414 -4678660 -3986994 -1755324 3583308 10356409 15595695 17233063 15703979 13635057
3406 13635057 13360699 15345171 19159839 23922582 26946217 24956269 18753049 13762079
3398 13762079 13132126 13212704 9623975 5039145 5815699 12397592 18653476 20483632 19477963
3389 19477963 17348255 12668107 5675036 1184982 2509665 5521188 3148874 -5593705
3381 -5593705 -14888688 -19838820 -21127102 -21276175 -19858286 -15258728 -9534883 -7554670
3373g554670k537431q61192O688634J1137854O431024j694954l294207K152459
3365A0467517O274700M919446K801256L549517L293731j355184n701140l781423
3357B0468420J736223L406542J6720l108172l319684l264777m291641l787062
3349G856569p26696J464533J60405k283123k366115n69115L81124N46706K636425
3340G100713O674307P611418O64533j1141628j7461881j1190170K469399J0888748
3332d384561Q273704J195768j545152l6007m11911m290910o687307l974823R81364
3323a0879835L038498J112703j370326r98684J781234L258196R89141k743178
3315e812251l569119q03104K308575M273034O796813Q825172M807017o392170
$$ plain form
3373 -7554670 -10092101 -10953293 -4264659 6873195 13304219 11609265 8315058 10467517
3365 10467517 16742217 21661663 24462919 28012436 31306167 29950983 24249843 20468420
3357 20468420 22204643 25611185 25627905 22519733 19200049 15935272 11643631 7856569
3349 7856569 7129873 8594406 8754811 6471688 4105573 3536458 3917582 4464288 7100713
3340 7100713 13775020 21386438 22050971 10909343 -6552538 -17742708 -15273309 -4384561
3332 -4384561 3889143 5084911 3539759 3503752 3091841 -1199069 -7886376 -11861199 -10879835
3323 -10879835 -7841337 -6728634 -8098960 -9097644 -7316410 -4058214 -3069073 -5812251
3315 -5812251 -9381370 -10184474 -7875899 -3602865 3193948 12019120 16826137 10433967
3307A0433967j5489164j2579437o97078P555354O291344K033232K237472N425488
3299E211178O079285L702275K123585K805560L502481K619676J329126J013522
3291B8386688Q00485j320249n483162q924011q667418m998645r72240J532894
3283C54342L100033L669452J528868k622211m213211q97200K944089K143319j412024
3274D595457k111901K52470J000905o38336k58635L266423M906977J720867j901362
3265A0832865j128834J662242Q22511l658988n974462k685136K682755M350945
3257F903898J630135n17579J415306M025352J784582l609216m281117J506804
3249H858165M829751p54613p808950n385800L606848O518936Q79225k355926K589353
$$ plain form
3307 10433967 -5055197 -17634634 -18331712 -10776358 -4485014 -2451782 -214310 5211178
3299 5211178 11290463 14992738 17116323 19921883 23424364 26044040 27373166 28386688
3291 28386688 29187173 27866924 22383762 13459751 4792333 -206312 -1178552 354342
3283 354342 3454375 7123827 8652695 6030484 1817273 920073 3864162 6007481 4595457
3274 4595457 2483556 2736026 3736931 3098595 2839960 6106383 11013360 12734227 10832865
3265 10832865 9704031 11366273 12188784 8529796 2555334 -129802 2552953 6903898
3257 6903898 8534033 8016454 9431760 13457112 15241694 11632478 7351361 8858165
3249 8858165 13687916 12933303 5124353 -261447 3345401 9864337 10743562 8387636 10976989
3240A0976989P138643L472652k293466p00512N504712O560044J426374j923778
3232C0161658Q3708K176181m58737n661895q614734p635777m230791q62787K83434
3223E240260j316301l894584n498920o057197o088059m852576j508114L232877
3215b0742614P923804J1304246J1678556P859260J692047l084906n200347n908978
3207E521068m829675p77740K803516J09985p045301r012784k146948M696464L333867
3198g347548j383576k28922N553028P646082M765188K979790L830968K414027
3190A8229037k350565m746510j499649L344828N042952L854099K222647J122588
3182B5219427P53961R46276J52850k551214m955602m822193l961628m773023m928222
$$ plain form
3240 10976989 18115632 21588284 19294818 18594306 24099018 30659062 32085436 30161658
3232 30161658 30245366 32421547 31962810 26300915 17686181 10050404 5819613 4956826 5240260
3223 5240260 3923959 29375 -5469545 -11526742 -17614801 -22467377 -23975491 -20742614
3215 -20742614 -12818810 -1514564 10163992 18023252 19715299 16630393 11430046 5521068
3207 5521068 691393 -86347 2717169 2827154 -4218147 -13230931 -15377879 -10681415 -7347548
3198 -7347548 -8731124 -8960046 -3407018 4239064 9004252 11984042 15815010 18229037
3190 18229037 15878472 11131962 9632313 12977141 18020093 21874192 24096839 25219427
3182 25219427 25973388 26919664 27072514 24521300 19565698 14743505 10781877 6008854 1080632
3173A080632j259262L124795K565687j543084k376475J556487M967574N171693
3165A3288047M800839M293861J62283p035448j0891841q345364l792861j275214
3157h795698N51773K781972K801926K04451n30565K562288M906235K898408l36197
3148G044593q71356K6071J44712R47247L270740L727716L44247k979749k368043
3139I286178K67954J726269K763341M245316L354556j136035m804446m146202
3131A1556931k298586k986558m206012l592424l954573o708779o248721Q89268
3123a7549454P454106N820769J206859L018618P629503L592415p921618j2849396
3115i598198n849652K252149K862567J954750O879309J2299679Q956673j203165
$$ plain form
3173 1080632 -178630 2946165 5511852 3968768 1592293 3148780 8116354 13288047
3165 13288047 18088886 22382747 22545030 15509582 4617741 -3727623 -7520484 -8795698
3157 -8795698 -8243925 -5461953 -2660027 -2455576 -2986141 -423853 4482382 7380790 7044593
3148 7044593 6173237 6199308 6344020 7291267 10562007 14289723 14633970 11654221 9286178
3139 9286178 9554132 11280401 14043742 18289058 21643614 20507579 15703133 11556931
3131 11556931 9258345 6271787 2065775 -1526649 -5481222 -12190001 -18438722 -17549454
3123 -17549454 -10095348 -4274579 -3067720 -49102 7580401 11172816 3251198 -9598198
3115 -9598198 -15447850 -13195701 -10333134 -8378384 -1499075 10800604 19757277 18554112
3107A8554112q324758q273513m565301l16301L707751N226682K086409k843811
3099E251270m236725j524744R52341L35597k335353n148974o567004m454320J729354
3090a5998558P922098Q740124M073723j130085l746660n120050o080855l838671
3082a5178934L247266J0667305J1456846M568815l363173n476036j946693J647070
3074E622466J803932K31415o22107j824506n261693q885598q406197l164975L257620
3065a7249643Q118937J1140919J0852485M741214m599976q822650l814577L554620
3057C921329M043572j430593m050804k28655M611307N556284M159360K604011
3049A9185811j144166p814416j1753617p373123K130429Q132165P170368L131134
$$ plain form
3107 18554112 10229354 1955841 -2609460 -2925761 781990 6008672 8095081 5251270
3099 5251270 1014545 -510199 442142 777739 -1557614 -6706588 -13273592 -17727912 -15998558
3090 -15998558 -8076460 663664 4737387 3607302 -139358 -5259408 -11340263 -15178934
3082 -15178934 -11931668 -1264363 10192483 14761298 11398125 5922089 3975396 5622466
3074 5622466 7426398 7657813 7035706 5211200 -50493 -8936091 -17342288 -20507263 -17249643
3065 -17249643 -9130706 2010213 12862698 17603912 13003936 4181286 366709 3921329
3057 3921329 7964901 6534308 2483504 2254849 6866156 12422440 16581800 19185811
3049 19185811 18041645 10227229 -1526388 -8899511 -6769082 1363083 8533451 11664585
3041A1664585M7088j700701k039130J08085L113341K558208k443612o553596m777294
3032b3026J074119N217308M704053P22789m377173q156148q197170m566949p64274
3023a4366471P47019K066466N469947P852025M693433j656114l849147k74405
3015F82753K321985p48507m845522l250004K608930N411421K275574k240894l073125
3006h57389m74182J766647J144312j478097l120672j611137J916844L808747J978313
2997C073386j661755l845411l725748k513239p76242J651780L906176M645269
2989G54216M083827L280145J663116k137750o658792p650870l353569K341419
2981g678258M272233K442920J409008L295028M512080J219300m322949o221814
$$ plain form
3041 11664585 11711673 10010972 7971842 8079927 11193268 13751476 11307864 4754268 -23026
3032 -23026 1051093 6268401 10972454 11695243 7318070 -838078 -9035248 -13602197 -14366471
3023 -14366471 -13619452 -11552986 -6083039 1768986 6462419 4806305 957158 682753
3015 682753 3004738 2256231 -2589291 -5839295 -3230365 2181056 4456630 2215736 -857389
3006 -857389 -1331571 435076 1579388 101291 -3019381 -4630518 -2713674 1095073 3073386
2997 3073386 1411631 -2433780 -6159528 -8672767 -9449009 -7797229 -3891053 754216
2989 754216 4838043 8118188 9781304 7643554 984762 -6666108 -10019677 -7678258
2981 -7678258 -3406025 -963105 445903 3740931 8253011 9472311 5149362 -1072452
2973a072452l029856N69658R11876K5215P83492J372495j137725m454867l729378
2964i761542N58868L042641J964750J577968M636230P731870O656733K248107
2956A8655625j777506l369959k250270R57322L330091J110892m627649p302872
2948D725674k854527M754142Q934833P913064L817519j567304o154400o519241
2940A3049760k341316J122085k98974l508171l483504j461244j784538l404104
2932b110006j707977K511363L393155m20797l404176j687201J922590L350996
2924A847947K705534K139950K205402K326802J998974M01862k493174m228073
2916F905224k470684O74057O40268l019407n696191l882784R95238N095020N394566
$$ plain form
2973 -1072452 -4102308 -3532650 -2620774 -2595559 -1812067 -439572 -1577297 -6032164 -9761542
2964 -9761542 -9202674 -6160033 -4195283 -2617315 2018915 9750785 16407518 18655625
2956 18655625 16878119 13508160 11257890 12215212 15545303 16656195 12028546 4725674
2948 4725674 1871147 6625289 15560122 23473186 27290705 25723401 19569001 13049760
2940 13049760 10708444 11830529 11531555 8023384 4539880 3078636 1294098 -2110006
2932 -2110006 -3817983 -1306620 2086535 1665738 -1738438 -3425639 -1503049 1847947
2924 1847947 4553481 6693431 8898833 11225635 13224609 13626471 11133297 6905224
2916 6905224 4434540 5108597 5748865 2729458 -2966733 -6849517 -5854279 -759259 4635307
2907D635307Q62915o010706r453697o152019j36290K154844M65044o44188k96890
2898a4575680j777035m696157m022407J548903O751065P171090L743595j317405
2890g174031o423208p211308O00539J2005529J4780825N502951m367851m309974
2882C403472R83864Q77446m327495n764648j392549J722233l9563j653595J302140
2873d888695N816136O929882M491209J142656k212399n307654n769129j656757
2865a454751L951252M687902j250983p265376n438924K835689P282484J850298
2857E197591o610027p353904m79094M049785J220388l050335k456752R09674K400101
2848f172573K933688N451607P590877M250389m316437j1879373j2960089p213427
$$ plain form
2907 4635307 5498222 -512484 -9966181 -16118200 -16254490 -14099646 -13634602 -14278790 -14575680
2898 -14575680 -16352715 -21048872 -25071279 -23522376 -16771311 -9600221 -5856626 -7174031
2890 -7174031 -13597239 -20808547 -20208008 -8202479 6578346 12081297 7713446 3403472
2882 3403472 4387336 5264782 937287 -4827361 -6219910 -4497677 -4537240 -6190835 -4888695
2873 -4888695 927441 7857323 12348532 13491188 11278789 5971135 202006 -1454751
2865 -1454751 2496501 7184403 5933420 -1331956 -6770880 -3935191 3347293 5197591
2857 5197591 -1412436 -8766340 -9245434 -5195649 -3975261 -7025596 -9482348 -8572674 -6172573
2848 -6172573 -3238885 2212722 9803599 14053988 9737551 -2141822 -15101911 -22315338
2840b2315338J365725O981492N680581q01187o125079n914435j590998K880040
2832a9839199N072159M295666J494019k41715R02767J442855k579484p003497
2824a6456429l663344N723558R392593K771912m276189l166993P31233p16795
2816i660454m147207k195339K457429K436136n88603K68691L714824L050423o75367
2807e339467p12510K222143J440279k171685j165097L695213L041982m626164
2799c615306q986992m206631K552784L809004K274329K895979L769334J645321
2791A37822q80980j00486K449756L412493K534812N64735k585394m793606k665077
2782a925925K021072L212261K35772o82656K848844N210822K837985J42575R72278
$$ plain form
2840 -22315338 -20949613 -13968121 -8287540 -9088727 -15213806 -21128241 -22719239 -19839199
2832 -19839199 -14767040 -10471374 -8977355 -9219070 -8316303 -6873448 -9452932 -16456429
2824 -16456429 -20119773 -14396215 -5003622 -2231710 -6507899 -9674892 -8943659 -9660454
2816 -9660454 -13807661 -16003000 -13545571 -11109435 -11698038 -11429347 -7714523 -4664100 -5339467
2807 -5339467 -6051977 -3829834 -2389555 -4561240 -5726337 -2031124 1010858 -3615306
2799 -3615306 -12602298 -16808929 -14256145 -10447141 -8172812 -5276833 -1507499 137822
2791 137822 -743158 -843644 1606112 5018605 7553417 8118152 5532758 739152 -1925925
2782 -1925925 95147 3307408 3543180 2860524 5709368 10920190 13758175 13900750 14873028
2773A4873028K311921J412494R43939J597302j689677r349145j1821625l230698
2765d952461P195869P282734n38271m319769p20521K893010J807670j254168l838548
2756C555545o528470p733266m365386J263462K856015j53427j194291L202229
2748i097589P932809O885823J288771k637390j520526K275319M284027K779353
2740A2190597o6134j691084k768813n196935p256639n092348K29449K455801o72351
2731g868457l433998r87905L103135L072491k7707j147142P57839L304476N842522
2722B615254Q072029O603572p14941r226531j2159134r003663l965384J196509
2714a6582289O697912R656340O480623p01877n983030p083121n721816k566042
$$ plain form
2773 14873028 17184949 18597443 19541382 21138684 19449007 10099862 -1721763 -4952461
2765 -4952461 2243408 9526142 8987871 4668102 3947581 6840591 8648261 7394093 3555545
2756 3555545 -2972925 -10706191 -15071577 -13808115 -10952100 -11105527 -12299818 -9097589
2748 -9097589 -1164780 5721043 7009814 4372424 2851898 5127217 9411244 12190597
2740 12190597 12124463 10433379 7664566 2467631 -4789008 -9881356 -9651907 -7196106 -7868457
2731 -7868457 -11302455 -12290360 -9187225 -6114734 -6142441 -7289583 -6531744 -3227268 2615254
2722 2615254 10687283 17290855 16575914 7349383 -4809751 -13813414 -17778798 -16582289
2714 -16582289 -9884377 -228037 6252586 5550709 -432321 -7515442 -13237258 -15803300
2706a5803300K372031O049133N176922J573315m44196k30341M75340J991999M245072
2697E405975L594484j248152m236934o86198L533910R35929l869704j185535O101060
2688H344835N740683l316063q193556k624140L726514J645488m288578n625940
2680d590757l027550j758577k253406k248917j905205j128304K035433N851104
2672i026179M738683j037627l344742J422227O309655N522947L115004L411602
2664A1111570K252949l636930p285060j830470O660855P597178J677298k447965
2656A4099425k661637l340019m468185k470824J45202k537643q217421q301752
2648a7752854j759928L245948K619751J336368L218164N021433L858659K462179
$$ plain form
2706 -15803300 -13431269 -7382136 -2205214 -631899 -1076095 -1306436 -831096 1160903 5405975
2697 5405975 9000459 7752307 3515373 2829175 6363085 7299014 3429310 2243775 8344835
2688 8344835 14085518 10769455 2575899 -48241 3678273 5323761 1035183 -4590757
2680 -4590757 -7618307 -9376884 -11630290 -13879207 -15784412 -16912716 -14877283 -9026179
2672 -9026179 -4287496 -5325123 -8669865 -7247638 -937983 4584964 7699968 11111570
2664 11111570 13364519 9727589 2442529 612059 7272914 14870092 16547390 14099425
2656 14099425 11437788 8097769 3629584 1158760 1303962 -1233681 -9451102 -17752854
2648 -17752854 -19512782 -16266834 -13647083 -12310715 -9092551 -4071118 -212459 2249720
2640B249720L282796L896143K012966j89982m7689J378210J473983p39074m464242
2631H852831o924982m086158L821439Q909788M134267n555421q001603r7616Q560055
2622I612600R409457M110437k025816p073223r308457n364959L142087P998027
2614A0500153M866057n89634k134324k010146m389091o184688k447602L604525
2606A215250M521677p251l610037l334395j814491n00976J804792L920221K972241
2597E167031O01767J573838N007511L892372m046285j1087882r082350m5916O944857
2588a075057O792872K446837p94366j632565k821656o223515r015896o293456
2580a8616802J930221Q776441Q295116L267061J225037L913975N834916L374905
$$ plain form
2640 2249720 5532516 9428659 11441625 11251643 11203954 12582164 14056147 13317073 8852831
2631 8852831 1927849 -2158309 1663130 10572918 14707185 9151764 1150161 1052545 9612600
2622 9612600 19022057 23132494 21106678 14033455 4724998 -639961 2502126 10500153
2614 10500153 15366210 14776576 12642252 10632106 6243015 58327 -2389275 1215250
2606 1215250 5736927 5729676 2119639 -1214756 -3029247 -3530223 -1725431 2194790 5167031
2597 5167031 5768798 7342636 12350147 16242519 12196234 1108352 -7973998 -8019914 -1075057
2588 -1075057 5717815 8164652 7370286 5737721 2916065 -3307450 -12323346 -18616802
2580 -18616802 -16686581 -7910140 384976 3652037 4877074 8791049 14625965 18000870
2572A8000870k63149j002556L62281J179725J380254J520542m7233m305810q484361
2563H340563r244510o742343k717861K578879Q231187J0594756P754306L533935
2555B2328912K403262K627735l49858n707543q477229p825624p471983p923820
2547a0396148n286008R42139N685043O255873O186318P971879P951509K563677
2539B1874282n221918j0037024j0503174p710453k089135L738784M043017k287629
2531h193250p440302m558390J934762L173091l63615o41442L995554O196013J858049
2522d039530l442765k991649K369155O651412N201050k292851j0589418j0939764
2514b0074360l49493J1567519J2292190K914122l748281k134039j92581l607282
$$ plain form
2572 18000870 17737721 16735165 17097446 18277171 19657425 21177967 21130734 16824924 8340563
2563 8340563 -903947 -7646290 -10364151 -7785272 445915 11040671 18794977 22328912
2555 22328912 24732174 27359909 27010051 21302508 12825279 4999655 -2472328 -10396148
2547 -10396148 -15682156 -14740017 -9054974 -2799101 3387217 11359096 19310605 21874282
2539 21874282 16652364 6615340 -3887834 -11598287 -13687422 -9948638 -5905621 -8193250
2531 -8193250 -15633552 -20191942 -18257180 -15084089 -15447704 -16089146 -12093592 -5897579 -4039530
2522 -4039530 -7482295 -10473944 -8104789 -1453377 3747673 1454822 -9134596 -20074360
2514 -20074360 -20423853 -8856334 3435856 6349978 2601697 467658 275077 -3332205
2506c332205n857111r80867M478563K041429m310552m944916K58428M301684N727730
2497b617817P680069Q139016L122213k537867n3607Q026247R661906J610790o209117
2488B6821833p104111o063124p304443n427127L474762J1688106J0112207J819161
2480B8017264l512274l480461k572262k170757k36581J453499j108605n901173
2472A0488650o414460k021378O14401k058437n540289n288568l458423l597082
2464a7275586l381473J831632J0198372J3520572P035585m273812j0965912r166523
2456a2477145l478496l99910r31238q15587L084722Q598571J0708408P058620
2448A1347945N34230l274263j419443L163357M638807J196407k726255k761409
$$ plain form
2506 -3332205 -9189316 -10170183 -5691620 -3650191 -7960743 -12905659 -12647231 -8345547 -2617817
2497 -2617817 5062252 13201268 16323481 13785614 13732007 21758254 31420160 33030950 26821833
2488 26821833 19717722 13654598 6350155 923028 4397790 16085896 26198103 28017264
2480 28017264 24504990 21024529 18452267 16281510 16044929 17498428 16389823 10488650
2472 10488650 4074190 2052812 2667213 608776 -4931513 -10220081 -13678504 -17275586
2464 -17275586 -20657059 -18825427 -8627055 4893517 11929102 7655290 -3310622 -12477145
2456 -12477145 -15955641 -16355551 -17286789 -18102376 -15017654 -6419083 4289325 11347945
2448 11347945 11882175 8607912 7188469 10351826 14990633 16187040 13460785 10699376
2440A0699376p58317j251537l809024m006708j414019n09871k482396k467671
2432f000167K043523N911067L953059j013828l118573k416936k744324l683230
2424g069409j776233J855492K526587M12710N53674L419533L021605k762777o998142
2415f816960l466643L885441O948639M911128L364894M258356L497190j476468
2407A5105577p503510j0355814r138239m813914J366938O168137N396654l66213
2399d140384m544523k724995R01495j99197m478643m242443K157513O745265L168912
2390g357000l944564n337633P78739Q066840J1383324J1240762R412826N568979
2382B9812273j06211m840468o106496m490109k475951k087186m169313p799418
$$ plain form
2440 10699376 9941059 8689522 4880498 873790 -540229 -1050100 -3532496 -6000167
2432 -6000167 -3956644 1954423 5907482 4893654 1775081 -641855 -3386179 -7069409
2424 -7069409 -8845642 -6990150 -4463563 -4050853 -3497179 -77646 2943959 181182 -6816960
2415 -6816960 -10283603 -6398162 550477 5461605 8826499 13084855 16582045 15105577
2407 15105577 7602067 -2753747 -11891986 -16705900 -15338962 -9170825 -3774171 -4140384
2399 -4140384 -8684907 -11409902 -10508407 -10707604 -15186247 -19428690 -17271177 -10525912 -7357000
2390 -7357000 -11301564 -16639197 -15860458 -7793618 3589706 14830468 24243294 29812273
2382 29812273 29706062 24865594 18759098 14268989 11793038 9705852 5536539 -2262879
2374b262879r963717q246635m252930j668943o46176K344919Q074038J1956004
2366d666319J0122764M759512P57393j85670M03222Q38503l21835m045355p974515
$$ plain form
2374 -2262879 -12226596 -20473231 -24726161 -26395104 -27041280 -24696361 -16622323 -4666319
2366 -4666319 5456445 10215957 10973350 10787680 11190902 12029405 11707570 7662215 -312300
$$ [...]
##END NTUPLES=NMR SPECTRUM
##END=
