##TITLE=31Pdec_DE-80H3_b
 D2O, 64 sc
 17.2.2025
##JCAMPDX= 6.0         $$ Bruker NMR JCAMP-DX V2.0
##DATA TYPE= NMR FID
##DATA CLASS= NTUPLES
##ORIGIN= UXNMR, Bruker Analytische Messtechnik GmbH
##OWNER= root
$$ XWIN-NMR		Version 3.5
$$ Mon Feb 17 16:30:10 2025 Russian Standard Time (UT+4h)  she@DPX200
##.OBSERVE FREQUENCY= 81.013821
##.OBSERVE NUCLEUS= ^31P
##.DELAY= (6, 6)
##.ACQUISITION MODE= SIMULTANEOUS
##.ACQUISITION SCHEME= undefined
##.AVERAGES= 64
##.DIGITISER RES= 17
##SPECTROMETER/DATA SYSTEM= spect
##.PULSE SEQUENCE= zgpg30
##.SOLVENT NAME= CDCl3
##.SHIFT REFERENCE= (INTERNAL, CDCl3, 0, 243.863)
##AUDIT TRAIL= $$ (NUMBER, WHEN, WHO, WHERE, WHAT)
$$ ##TITLE= Audit trail, XWIN-NMR		Version 3.5
$$ ##JCAMPDX= 5.01
$$ ##ORIGIN= Bruker BioSpin GmbH
$$ ##OWNER= she
$$ F:/spectra/data/she/nmr/P31/2/audita.txt
$$ ##AUDIT TRAIL=  $$ (NUMBER, WHEN, WHO, WHERE, WHAT)
(   1,<2025-02-17 16:27:38.51 +0400>,<she>,<DPX200>,
      <created by zg, POWCHK disabled, PULCHK disabled
       configuration hash MD5:
       00 E9 B6 7A A2 85 ED C7 34 08 36 98 17 FE 4E 26
       data hash MD5: 32K
       00 D3 9D D4 F3 32 C7 A7 52 C0 F4 28 07 FB E7 89>)
$$ ##END=
$$ 
$$ hash MD5
$$ AB B5 D7 A3 44 7C BC D3 A3 CD 86 C5 21 45 3A 70
##$RELAX= 
##$RELAX= 
##$RELAX= 
##$RELAX= 
##$RELAX= 
##$RELAX= 
##$RELAX= 
##$RELAX= 
$$ Bruker specific parameters
$$ --------------------------
##$DU= <F:/spectra>
##$EXPNO= 2
##$NAME= <P31>
##$PROCNO= 1
##$TYPE= <nmr>
##$USER= <she>
##$AMP= (0..31)
100 100 100 100 100 100 100 100 100 100 100 100 100 100 100 100 100 100 
100 100 100 100 100 100 100 100 100 100 100 100 100 100 
##$AQSEQ= 0
##$AQ_mod= 1
##$AUNM= <au_zg>
##$AUTOPOS= <>
##$BF1= 81.014009
##$BF2= 200.13
##$BF3= 200.13
##$BF4= 200.13
##$BF5= 200.13
##$BF6= 200.13
##$BF7= 200.13
##$BF8= 200.13
##$BYTORDA= 1
##$CFDGTYP= 0
##$CFRGTYP= 5
##$CHEMSTR= <none>
##$CNST= (0..31)
1 1 145 1 1 1 1 1 1 1 1 1 1 1 1 1 1 1 1 1 1 1 1 1 1 1 1 1 1 1 1 1 
##$CPDPRG= <waltz16>
##$CPDPRG1= <>
##$CPDPRG2= <waltz16>
##$CPDPRG3= <>
##$CPDPRG4= <mlev>
##$CPDPRG5= <mlev>
##$CPDPRG6= <mlev>
##$CPDPRG7= <mlev>
##$CPDPRG8= <mlev>
##$CPDPRGB= <>
##$CPDPRGT= <>
##$D= (0..31)
0 1 0 0 0 0 0 0 0 0.06 0 0.03 2e-05 3e-06 0 0 0.0002 0 0 0 0 0 0 0 0 0 
0 0 0 0 0 0 
##$DATE= 1739795258
##$DBL= (0..7)
120 120 120 11 120 120 24 19 
##$DBP= (0..7)
150 150 150 150 150 150 150 150 
##$DBP07= 0
##$DBPNAM0= <>
##$DBPNAM1= <>
##$DBPNAM2= <>
##$DBPNAM3= <>
##$DBPNAM4= <>
##$DBPNAM5= <>
##$DBPNAM6= <>
##$DBPNAM7= <>
##$DBPOAL= (0..7)
0.5 0.5 0.5 0.5 0.5 0.5 0.5 0.5 
##$DBPOFFS= (0..7)
0 0 0 0 0 0 0 0 
##$DE= 6
##$DECBNUC= <off>
##$DECIM= 4
##$DECNUC= <off>
##$DECSTAT= 4
##$DIGMOD= 1
##$DIGTYP= 9
##$DL= (0..7)
0 0 52 120 120 21 21 25 
##$DP= (0..7)
150 150 150 150 150 150 150 150 
##$DP07= 0
##$DPNAME0= <>
##$DPNAME1= <>
##$DPNAME2= <>
##$DPNAME3= <>
##$DPNAME4= <>
##$DPNAME5= <>
##$DPNAME6= <>
##$DPNAME7= <>
##$DPOAL= (0..7)
0.5 0.5 0.5 0.5 0.5 0.5 0.5 0.5 
##$DPOFFS= (0..7)
0 0 0 0 0 0 0 0 
##$DQDMODE= 0
##$DR= 17
$$ [...]
##$SUBNAM1= <"">
##$SUBNAM2= <"">
##$SUBNAM3= <"">
##$SUBNAM4= <"">
##$SUBNAM5= <"">
##$SUBNAM6= <"">
##$SUBNAM7= <"">
##$SUBNAM8= <"">
##$SUBNAM9= <"">
##$SW= 400.765351723535
##$SWIBOX= (0..15)
0 1 3 0 0 0 0 0 0 0 0 0 0 0 0 0 
##$SW_h= 32467.5324675325
##$TD= 32768
##$TD0= 1
##$TE= 0
##$TE2= 300
##$TE3= 300
##$TEG= 300
##$TL= (0..7)
0 120 53 12 22 120 120 120 
##$TP= (0..7)
150 150 150 150 150 150 150 150 
##$TP07= 0
##$TPNAME0= <>
##$TPNAME1= <>
##$TPNAME2= <>
##$TPNAME3= <>
##$TPNAME4= <>
##$TPNAME5= <>
##$TPNAME6= <>
##$TPNAME7= <>
##$TPOAL= (0..7)
0.5 0.5 0.5 0.5 0.5 0.5 0.5 0.5 
##$TPOFFS= (0..7)
0 0 0 0 0 0 0 0 
##$TUNHIN= 0
##$TUNHOUT= 0
##$TUNXOUT= 0
##$USERA1= <user>
##$USERA2= <user>
##$USERA3= <user>
##$USERA4= <user>
##$USERA5= <user>
##$V9= 5
##$VALIST= <valist>
##$VCLIST= <CCCCCCCCCCCCCCC>
##$VD= 0
##$VDLIST= <DDDDDDDDDDDDDDD>
##$VPLIST= <PPPPPPPPPPPPPPP>
##$VTLIST= <TTTTTTTTTTTTTTT>
##$WBST= 1024
##$WBSW= 4
##$XGAIN= (0..3)
0 0 0 0 
##$XL= 0
##$YL= 0
##$YMAX_a= 11052
##$YMIN_a= -11737
##$ZGOPTNS= <>
##$ZL1= 120
##$ZL2= 120
##$ZL3= 120
##$ZL4= 120
##$ABSF1= 60
##$ABSF2= -190
##$ABSG= 5
##$ABSL= 3
##$ALPHA= 0
##$AQORDER= 0
##$ASSFAC= 0
##$ASSFACI= 0
##$ASSFACX= 0
##$ASSWID= 0
##$AUNMP= <proc_1d>
##$AZFE= 0.1
##$AZFW= 0.5
##$BCFW= 1
##$BC_mod= 2
##$BYTORDP= 1
##$COROFFS= 0
##$CY= 9.86611175537109
##$DATMOD= 1
##$DC= 1
##$DFILT= <>
##$DTYPP= 0
##$F1P= 182.462994727601
##$F2P= 168.069089081705
##$FCOR= 0.5
##$FTSIZE= 0
##$FT_mod= 0
##$GAMMA= 1
##$GB= 0
##$INTBC= 1
##$INTSCL= 1
##$ISEN= 30
##$LB= 1.5
##$LEV0= 0
##$LPBIN= 0
##$MAXI= 11.51145
##$MC2= 0
##$MEAN= 0
##$ME_mod= 0
##$MI= 1.244541
##$NCOEF= 0
##$NC_proc= 0
##$NLEV= 6
##$NOISF1= 0
##$NOISF2= 0
##$NSP= 1
##$NTH_PI= 0
##$NZP= 1
##$OFFSET= 243.8632
##$PC= 1.4
##$PHC0= 1714.488
##$PHC1= 150.6954
##$PH_mod= 0
##$PKNL= yes
##$PPARMOD= 0
##$PSCAL= 0
##$PSIGN= 0
##$REVERSE= no
##$SF= 81.0140731611343
##$SI= 65536
##$SIGF1= 0
##$SIGF2= 0
##$SINO= 80
##$SIOLD= 65536
##$SREGLST= <31P.CDCl3>
##$SSB= 0
##$STSI= 0
##$STSR= 0
##$SW_p= 25641.0256410257
##$SYMM= 0
##$S_DEV= 0
##$TDeff= 0
##$TDoff= 0
##$TI= <>
##$TILT= no
##$TM1= 0
##$TM2= 0
##$TOPLEV= 0
##$USERP1= <user>
##$USERP2= <user>
##$USERP3= <user>
##$USERP4= <user>
##$USERP5= <user>
##$WDW= 1
##$XDIM= 64
##$YMAX_p= 0
##$YMIN_p= 0
$$ End of Bruker specific parameters
$$ ---------------------------------
##NTUPLES= NMR FID
##VAR_NAME=  TIME,          FID/REAL,        FID/IMAG
##SYMBOL=    X,             R,               I
##VAR_TYPE=  INDEPENDENT,   DEPENDENT,       DEPENDENT
##VAR_FORM=  AFFN,          ASDF,            ASDF
##VAR_DIM=   16384,         16384,           16384
##UNITS=     SECONDS,       ARBITRARY UNITS, ARBITRARY UNITS
##FACTOR=    3.08e-05,      1,               1
##FIRST=     0,             0,               0
##LAST=      0.5045964,     0,               0
##MIN=       0,             -11737,          0
##MAX=       0.5045964,     11052,           0
$$ Real data points
##PAGE= N=1
##DATA TABLE= (X++(R..R)), XYDATA
$$ [...]
11274A505r76J66o74J69r98J321J19j023O90r85N83O92M46L36j844N17j92Q78
11292G30m40L99m38q59R15j792K508J58j285O89q62M16J31N61k225J011Q16j620
11310a187J221p5l60J53r68J560j082J221j124J008n50L60K35k071K550k250J472
11327A13j653J214O67k71N65m17J270k193J792r56Q11q60L60M03j430P12r6q99
11345h68J937k49J02j626J051j028J106j361N73j242K365j287K36Q59L22l30j832
11362a272J760r70J232o08p04K121j606M67J54J011j244L83K73j993K039n36q20
11379c13q03j393K112n33J750k604K822j733J79J273r8n77K41l92J342j135q27
11396f89m86Q81o37J026M4k8J171j748O52J40q02O41o65P22K04P97j679J095o83
$$ y = [1505, 529, 695, 21, 190, -808, 513, 632, -391, 299, -686, -103, 589, 1035, 1371, -473, 44, -148, 730, 290, 689, 251, -608, 307, -1485, 1023, 1181, -104, 585, -277, 139, 270, 831, -1394, -383, 433, -1187, 34, -41, -401, -248, -1216, 344, -738, 483, -641, 367, -183, 177, 412, -1659, 891, -1359, 113, -1540, -326, 341, 70, 635, 218, 1488, -705, 1087, 131, 942, 82, 442, 845, -585, 127, 31, -868, 1069, 820, 922, -704, 347, -681, 425, -936, -363, -1605, 760, -527, -291, 568, 890, 560, -1272, 488, -482, 750, 142, -562, 1559, -47, 420, 574, 1585, 341, 724, 997, -996, 1043, 507, -313, -1116, -2509, -397, -930, 820, -1784, 1038, -695, -516, 757, 659, 82, 323, -69, 1273, 138, -689, -1175, -294, -931, 95, 139, 111, 1282, -466, 186, 326, -476, 165, -500, 222, 426, 1223, -456, 639, -44]
11415d4j720M091k953Q53j251J620o85o45P98o57O81N33M79o20j659J223j058
11432a014N15O21J057k29o76r17J50L86K1J345k197J656j200L34m48J256r05J685
11450A440k066K026n60q2n05q02J581k148K965o73p55j58N31n75k64O99j517p0
11468i33N89P40N15k215J829l65j002Qn56L275k528J89m78o64L566l357Q26m1
11486f02J090k068p7J830M19n35n58K055r46j221O21o48j0m39J825k037R91jm01
11505g12K548k038j06L7p4m37J499M18j876r5M16O0p77R75K07O50l14R94j664
11524b89J428j540n22J267k374K977r38m22j30l20M78n86O70M29O9N17j175Q22
11542C61j221M55Q54j40M24r43J27P5K052k108J362l45l06q67n15J958j173J53
$$ y = [-44, -1764, 2327, -626, 227, -1024, 596, -89, -734, 64, -593, 88, 621, 1100, 480, -1179, 44, -1014, -499, 122, 1179, 950, 274, -643, -493, -107, -86, 1259, -938, 718, -482, -148, -596, 660, -245, 1440, -626, 1400, 840, 758, 253, -549, 1032, -1116, 1849, 1176, 421, 263, 794, 219, -45, 654, -863, -933, -344, 396, 911, -1304, 525, 160, -842, -834, -1390, 1885, -643, -454, -932, -1596, 1970, -1387, -561, -602, 488, -1580, -1657, 173, 592, 57, -501, 1554, 608, -613, 8, -640, -650, -1089, 736, -1301, -310, -311, -712, 1836, -202, -308, -271, -345, -782, 717, 1135, -741, -836, -420, -360, -1137, -162, 45, 695, 381, 1375, -289, 1139, -401, -923, 344, -2030, 947, 9, -413, -543, -863, -385, -971, -301, 128, 197, 714, -461, 361, -860, -405, 449, 309, 733, -210, -83, -8, 2044, -64, 1298, 953, 647, -220, -735, 1223, 50, 203]
11560B03k1J41n91m85J476j443N64J151j354J03N45J740k481J750q20j097K32
11577c87O66J069k976K212r35k22J099j98j188j3K327j362j428K091k059M36P43
11594a25l33Q57q50P0M87q96l47J107r73K455j149m38J155j73j816K19J730j384
11612d04J12n90O21j07K84r47J202K88q35K41M35M44j068J420p21m12L47j043
11630g33J563p60R22o81j4j062M47J314j868J022N73j407J173r39J074k123Q16
11647f83j028J815j011J140M40j896J770j150Q51j845R91K51K49p63N06l87k9
11664g79k09J468j986K140l65o61R72j682J845q96J119j448M28J535r13r43K11
11681a64J151o26P35p41P22K72j753O34j386J982j587M10N02n11o7q63L57Q12
$$ y = [203, 182, 323, -268, -753, 723, -720, -156, 995, -359, -256, 289, 2029, -452, 1298, 478, -619, -387, 279, 1348, -1628, 584, -351, -573, 526, 328, -860, -873, 1454, 92, -1336, 755, -1304, -868, -125, -458, 399, -451, -381, 106, -790, -1137, -30, -1003, 1452, 303, -135, 1020, 847, -969, -750, 980, -404, -292, -882, -261, -368, -84, -1031, 171, 459, -376, -135, 300, 744, -324, 1096, 375, -37, 310, -733, 830, 70, 992, 311, 297, -765, -318, 996, -872, 150, 723, -684, 489, -450, 624, -1499, -683, -1711, 104, -907, 233, 673, -1223, 547, -603, 248, -1597, -606, -355, -106, -869, -363, -750, -779, -988, 480, -1506, 634, 269, -392, 580, -1102, 743, -153, 966, -482, -54, 1481, 568, -375, -164, 987, 361, 1096, 355, 1077, 1349, -404, 230, -1156, 826, -761, -351, 151, -360, -427, -1290, -933, -121]
11699a21J294j936Q19J455k092J576n43j001J58J062q43J262j554J615l34q26
11715ij14J9O74j041K90o73J568J26l2O16j435J336j210j293N53o97J415rJ532
11734A616p41r1q80l10K357j377R24j444n49J137p27K23j217J110j171K349n68
11751F41p15N42p83K334l264P59J218j213L16rJ477m93r5j487K197o06k387L417
11769A849j451j125N25o95J146k30N1n66O68j002J016j005O36m43K89J128j263
11786d72j42J770j831Q84P68r46r39O76J834o79j83p10Q58j19L03j618J659q63
11804B50P15k85j049M49N30K05j771J096L10O21r73K1j098J272J648j560l9K7
11822C69L27l80n01L91j475J100Q46j536J434r38J179j283O83n75K523l558J626
$$ y = [-121, 1173, -763, 56, 1511, -581, 995, 452, -549, -391, 671, -172, 1090, -464, 1151, 817, -9, -123, -104, 570, -471, -181, -854, 714, 840, 808, 1424, -11, 1325, 115, -1178, -625, -1322, 93, 84, 1616, 875, 784, -96, -406, 1951, 574, 1498, 54, -495, 642, -85, 138, -1079, 31, -1140, 1209, 641, -74, 468, -315, 2019, -1245, -486, 732, -481, -165, -174, 1303, 810, 715, -772, 1425, 819, -1568, 1849, 398, -727, -202, -897, 249, 19, 70, -496, 172, -830, 186, -819, -183, -626, -337, 791, -472, -614, 1156, -675, 209, 977, 31, -908, -232, 1602, 923, 740, 30, 888, 769, 1072, -546, 1113, 250, 965, 680, -369, 80, 610, 815, -956, 140, 450, 1071, 98, 119, -979, 293, 1941, 381, 342, 369, 696, 316, -185, 206, -1269, -169, 677, -859, 575, -363, 816, -467, 216, -359, 2164, -1394, 232]
11839B32L02m65J684k533O66n42M1J121q22L69q3P05o93k12P86l110K016L87k80
11858d31J536k178J193J38p24M34J004O62j661M73j190J150P11j535M02m54J067
11875E97j065l67M87k6N91P71j611Q56o9k4J162q4r92n48J125k109K068q90o75
11894h03n08J008j0o66J838k303Q60j209K002j252J101l3m75J72K210j887r29
11911h84Q58o38j83N19m45P63k20j52J218j313O24n43J546p56j794J338j373L016
11929A581j948K67j822J961J31m91P42j459K223n9j104O62q98J237j367J584n65
11946F75k84j182o83K479j545J442o42o36J991k794R6O34L76L62K22j117o55L40
11964i21J99Q35K04j61l60n8j247J819j054J12Q41J62K45K32j54mJ82j344J557
$$ y = [232, 534, 69, 1753, -780, -114, -656, -615, 506, -316, 53, -30, 675, -18, -230, 556, -2554, -538, -151, -431, 1105, -1073, 120, 258, -466, -32, 972, 1634, -27, 446, -744, 406, 1117, -418, -16, -470, 597, -468, -835, -348, -374, 217, 988, -623, 233, 164, 140, 1302, 1218, 226, -322, 803, -1306, 762, -128, -803, -1311, -303, -313, -979, 859, -1444, -584, -1793, 209, -1043, 58, 25, -450, -278, 1932, 45, -884, -26, -664, -847, -328, -773, -10, -230, -382, 836, -477, 147, -396, 1150, 394, -1400, -62, -1435, 1581, -367, -100, -1922, 39, 170, -321, 421, -1038, 1185, 1126, 22, 684, -214, 1023, -344, 1240, 675, 391, -791, -1474, 1005, -540, 902, 260, -376, 1615, -1179, -1083, -449, -73, 289, 511, -606, -1261, -921, -722, 113, 317, 156, -204, -262, -1509, 310, -744, -632, 209, 371, 616, 848, 694, 690, 872, -472, 1085]
11983A085k332R14J006r36K604k485J458j449J14m67R41n6j053J762j123J038
11999A021j269l32P81q8n76n16P66O24j114J731p54N00M34o25m48q98P87r50J372
12018D46r41n12L11J765n39j861K376j754J607j42j532J101j553K631k532K797
12034A668k021L09J116k001K051j350m49J355l32k5j080J838j48j871J297q74
12050e17Q61j223J141l05M83j063J800l86n78o04p75J523M31j262N40Q15j587
12067g06N43r38R82L32j762J693J22n3J692l343J656M71L74j673J779j890J027
12084C06L08r86O37j504J494j395K391j443n08L22M01L70j014J513k132J315j167
12101a092j92J021O9J354j720P83M66j674J905p46J046Kj371M5L46J21j809K374
$$ y = [1085, -1247, -333, 673, -263, 2341, -144, 1314, -135, -21, -488, 453, 397, -656, 1106, -17, 1021, -248, -580, 201, 113, -463, -979, -213, 411, -703, 1028, 274, 774, 1208, 583, 135, -763, 24, -926, 446, -495, -1007, -696, 1069, 530, -1331, 1045, -709, 898, 756, -776, 325, -1228, 1403, -1129, 1668, -353, -44, 1072, -929, 1122, -228, -677, 678, 346, 321, -759, 1079, 931, -940, 357, -517, 344, -879, 262, -43, 440, -623, 1177, 791, 213, -391, -1166, 357, 788, -474, 66, 881, -706, -163, -1101, -119, 213, -1549, 144, 266, 213, 1905, -1438, 218, 689, 1063, -610, 1169, -721, 306, 614, -372, 265, -1239, 255, -1140, 1251, -192, -700, -378, 23, 393, -621, 892, -1240, 75, -1092, -1284, -263, -194, 1160, -560, 223, 689, -985, 920, 174, 1220, 1222, -149, -104, 242, 363, -1446, 928]
12119I28m92r8j55o11j00m21J185j687K110j255K09O26j39Q57o58M47k14j167
12137f35K050k164J57K219o85m08l84p31J78N6P84j033J630j157n45J570m67K71
12155G06j216R21l74M95k09j249K439k174Q19K21l67M61j730J273j2r54N19N71
12173A40k90K68Q00j476k1N9J66k4o76J971k348M65l04J262r84J059rk66n6r63
12193a227Q93J842k565J496j210L98j218J763r76R03m65P00R02j976J859n84p19
12210a84N6J503j161j298J365l23j315J380J155n23j548Q15J424p52n0J36j207
12227e27K56n23J219M78k022J368p6q57l92J166K36j127M87j242K127k320J450
12244b99r33J362J158l60o68j609Q25r02Q95K16J575j565m08K187k355L68O61
$$ y = [928, 436, 338, 183, -428, -528, -949, 236, -1451, 659, -596, -387, 239, 100, 957, 299, 746, 532, -635, 1415, -749, -592, 1627, 942, 534, 150, -581, -403, -347, 437, -596, 1034, -123, -668, 902, 435, 706, -510, 411, 37, 532, 323, -926, 1513, -661, 158, 379, 12, 473, -1257, 16, 4, -950, -431, 140, -150, 118, 918, -558, -579, -520, -354, -378, -1054, 917, -1431, -966, -1270, -8, -992, 67, 58, -208, -264, -1227, -334, 1508, -1057, 439, -771, -373, -1591, 172, -804, 99, -366, 334, 1236, -740, 1119, 535, -184, -128, 1375, 214, -1084, 281, -42, -1357, 23, 1178, 655, -893, -78, 1346, 594, 544, 680, -527, -271, -794, 425, 903, -1119, 249, 173, -684, -1076, 90, 326, -801, -314, -1556, 571, -1749, -299, -1232, 130, 1288, 928, 260, -1349, -524, -1426, -531, -315, 1260, -305, -713, 1474, -881, -513, 148]
12261A48lN22k40j284%J9J649j7r38q92L483l090J337p96J113j835P49J61l23
12280b37J607p58j274P76j213j55J552J618q21k478J537j47J557j988k16L90M96
12297B46j097O47j33K41Q56n26o76R62k35j88k21J17J066j482j128J792n92L46
12315eM35J047j689o89Q07p54J78l47J476o61P30j327P9Q3J626k252J144n93o45
12334a357J813L15n35p4K75L85q70j108K390j949Q82m97J526j447P06m57p7J069
12352I90j512J320j980J026Q9K96J181k116Q6L57L15M28o00l47p2k81K41R29p53
12371d03k84K05J329j083o53R40M24J1j240O23R65r20J37p43J480o71J77K29k09
12390C14J93k71j26P87j611J862J2k059P51k98j2n32J203p68R43n24K2J217j416
$$ y = [148, 145, 667, 427, -857, -857, -838, 811, 794, -144, -1036, 2447, -643, 694, -102, 1011, -824, -75, 86, -237, 1370, 612, -662, 114, -1099, -1254, 298, 1916, 1095, -1383, 154, 7, 1564, -424, -640, -250, 246, -851, -204, -337, -96, 760, 234, -442, 520, 285, 97, -124, -7, 1059, -423, -1551, 241, -351, -5, 430, 1477, -212, -901, -94, -848, -670, -1017, 459, -202, 528, -799, -720, -637, 989, -1263, -119, -712, -1357, 456, 771, 236, 162, 437, 822, -48, -1156, 1234, -715, 167, -330, 1196, -251, 455, -2, -79, 990, -522, 798, -1182, -156, -67, 229, 1410, -706, -620, -263, 52, 480, -120, -467, -539, -820, -579, 350, -403, -687, -482, 847, -236, -889, 51, 475, 486, -754, -131, 834, -86, 51, -692, 788, 117, 294, 523, 314, 507, 236, 110, 897, -714, 1148, 1160, -899, -148, -446, -458, -990, 213, -555, 388, -136, -114, 1103, -313]
12409c13O04L35j49l87O08p39N51j362L57J376j048P81j545J076R7o84J355r16
12427cJ16j238K270j188o14O98J2J59n54Q40m53L81k9j367Q09l74O88q51Q71j207
12447a034J309k029K496j950r7J627j64O22l91j8J49j694N70n85J279j298J788
12464E80l57p49J317q21J535n48j793J046q01K75m02KR11Q90j191r52J364l08
12482bO25j564L41J69N34q71J53J365j48j70J98r39M56L19j275M12N9J38j676
12501a876J651l23O05n90n77K146p87L57K12l14k42p49N82N1m38o26J602r62p73
12520a051L097k607j276K094o81R10j691L097j632j280J606r84R47k567J817r92
12536a193R18r25R0J086J11L7k58O83j27J35j482Q61n07l78P76M65p19K79p09
$$ y = [-313, 291, 626, 477, 90, 698, -41, 510, -852, -495, 881, -167, 614, -931, 145, 242, -442, 913, -3, 113, -1125, 1145, -43, -657, 41, 53, 212, -342, 498, 45, 426, 397, -970, -161, -535, 153, -698, 173, -1034, 275, -1754, 742, -1208, -1305, 322, 158, 780, 389, 371, 520, -1174, -604, -1189, 90, -1208, 580, 223, -526, 791, -30, 1505, 957, -836, 210, -591, -316, -718, -716, 195, 1085, -106, -1058, 306, -2, 623, -941, -600, -431, 103, -768, -615, 750, 602, 432, 630, -309, 147, 466, -809, -397, -338, -200, -1876, -225, -548, 57, -533, -1110, 1036, 249, 606, 818, 504, 262, -487, 95, 146, -292, -918, 684, -278, -1051, 2046, -561, -1837, 257, -424, 486, -1205, 1892, 260, -1020, 586, -398, 549, -2018, -201, -1193, -275, -1200, -1110, -24, 87, 124, -134, 549, 422, 557, -925, -64, -571, -949, -173, 292, -427, -148, -857]
12555h57J726q98M39O17Q1j99j292l63J15j43Q18K60p05L38L28L95k92n70O58
12574D56p17j036J817p82k73J0M04N70j262R60j244K204p54L85j328J783k204
12591a011J137j23o63Q92r59J889p13r01j61R51j21J127o85k17L72k909L673j217
12609C61q38R72k209K458k780K410j04j9q58R22L19j583J801k358J998J44j421
12626g85J328j359L21K56K652p18j253r55J70J047j039L19R84j423n75j63K070
12643H77j945O71L48j649J520O39l22M99k99j571Q60M5m68J822o42Q41k037J718
12661I07j113j317J482m31R91M86j723O24Q4o11k15J649m5j078M46j045nJ008
12679I4Q5P16m35P2o88M46j64j10K82p85P30k28L13n07k60m65o3R82j208J281
$$ y = [-857, 869, -29, 410, 1027, 1108, 909, -383, -746, -631, -774, 44, 304, -401, -63, 265, 660, 368, -202, 456, -261, -1297, 520, -262, -535, -525, -121, 449, -813, 147, -1097, 1107, 353, 738, -590, 1193, -1011, 126, 3, -660, 232, -727, 1162, 449, -452, -613, 338, 217, 1344, 659, 442, 814, -2095, 1578, 361, -477, 495, -1714, 744, -2036, 374, 270, 251, -607, 315, 634, -949, 852, -1506, 492, 636, -785, 543, -816, -495, -239, 2413, 1695, 442, -513, -343, 704, -335, -16, 968, -455, -1030, -1193, 877, -1068, -397, -49, -1698, -178, 461, 139, 638, 339, -1232, -372, -327, -795, 1027, 385, 1226, -811, 907, -206, -1523, -41, -472, 519, 1005, -718, -94, -10, -621, -836, 813, 768, -310, 136, -909, -914, 94, 179, 895, 460, 532, -156, 290, 126, 16, 298, -487, 243, 15, 328, -179, -439, -904, -967, 15, -1193, 88]
12699H8O75j868J715j320Q91q87j111K120j983K890m76p63L1j482K390j264m69
12716h23o83J417O53k844K344j739K631k486K499k398J697l83j183J800j651L05
12732h44J885j283m80J451l81k809K940p06M38J67j487J940j183Q48k16L51J74
12749H05j417Q39q15m13Q64O12o6M77j30l244J811J118j659M89L14J040m29O4
12767B60r23Q62j2J247j342m9o03J754j092k56J007j535k75L6K254k209J512k66
12785C70M95j50j170M59n47L72J101k599K101p50j8K10k71p62J245M88r38j03
12803d67J20O62q83j66K155k640J373k070K916K5j308J889j970M08l67J358j162
12820a27P86M04O47j090j326P55m58J019l35k17n48l47J395j788J340k256J182
$$ y = [88, 763, -1105, 610, -710, 181, -706, -1817, 303, -1680, 1210, 734, -29, 2, -1480, 910, -354, -823, -1506, -89, 564, -2280, 64, -1675, 956, -1530, 969, -1429, 268, -115, -1298, 502, -1149, -844, 1041, -242, -722, 729, 348, -2461, 479, -227, 211, 378, -1109, 831, -352, 496, 280, 631, 805, -612, 227, -588, -1001, -137, 475, 409, 886, 756, -2488, -677, 441, -1218, -729, -415, 625, 196, 260, -663, 199, 187, 1434, 92, 43, -560, 1194, 102, -154, 853, -682, -957, -921, 1333, -876, 636, 370, 865, 715, -455, 4, -543, -171, 930, -1669, 432, -318, -336, -126, -397, -1159, 86, 574, -364, -467, -347, 315, -568, -734, 1421, -1219, 154, -1916, 1000, 1025, -283, 1606, -364, 44, -323, 1035, -127, 659, 1063, 1710, 620, -706, 49, -409, 610, 275, 58, -490, -837, 558, -1230, 110, -2146, -964]
12837i64J72K47J285L03k37j161J205N00o81k090J841o53O25p79J102j398j30
12854h13J256j071q4J220j454P52o76O96j92Q20j48j563J532j239J981j883K613
12871A747j635j075J219n34J067j093R68j593K2J585j774K235j931J073j80o00
12887d99J576j274P96j444K164m78q69q69L25J351j689J238j631J824k4m85N55
12904E67j61J63j263K551k479Q36L67j644J038R57k056K114k935J970j181Q71
12920b85l67P05J08k63r3k147K861Q78k965K765j908K34p80J600O98j585P87k075
12938a832k5J919k046K860j061M4k6R4N09l8L10p84J987j167q82L36l57J679k079
12957e59J551k244J375R1o33k54q84K279K20j948J870k406J951k257K138n04M51
$$ y = [-964, -792, -545, 740, 1043, 806, -355, 850, 1350, 669, -1421, 420, -233, 392, -387, 715, -683, -813, 443, -628, -712, 508, -946, -194, -870, -174, -366, 454, 306, -1257, 275, -964, 1017, -866, 1747, 112, -963, 256, -278, 789, -304, 664, -929, -907, 678, -1096, 1139, -792, 281, 101, -499, 1077, -197, 599, -845, 1319, 841, -28, -897, -572, 779, -910, 328, -1303, 521, 497, 12, 567, 406, 569, -694, 1857, -622, 214, 581, -1063, -25, 932, -1124, 990, -1945, 25, -1156, -285, -652, 53, 161, -102, -195, -2342, 519, 1397, -1568, 1197, -711, -477, -1257, 343, 1041, -544, 243, -1832, -1857, 62, -1984, 876, -185, -141, -167, -73, 436, 398, 708, -76, 1911, 744, -138, 198, -159, 1520, -559, 992, -1252, 123, 214, -419, -673, -1557, 722, 942, -1006, 864, -1542, 409, -1848, 290, -214, 237]
12974B37R27j588p39J993o70o97J915r49j003O29J43K4j762J303P66m56L40l24
12992H9r2j446Q94O32j144J870p35O60j280R86O07j207K49j055R47r4rj197P92
13011e33Q55r76O41j407J210J284p10N37L28j826J239n43m3o32N26J199k55j111
13029b17o49J386q85P93j419L83j56J683M79k305J73K06J29O32j207J251o00P14
13047C91o50l07J166j588J671k105J465J62M54j321J552M38k240J612m06r76J223
13064E41q05R87q55J150k498K177J53j519J552n52m34j96q17J012q81K146k770
13081a609R65K269j666l31o06K07j47O12L36J829j378l60r91M13J570j47J32m97
13099F01l97m20q01p34K086j87Q18j257Q73j13L56J98j947K534j870R70j152n12
$$ y = [237, 1164, -424, -1163, 830, 160, -537, 1378, 429, -574, 55, 198, 222, -1540, -237, 529, 73, 413, 89, -3, -1449, -555, 77, -1067, 803, 68, 728, -552, 434, 1041, -166, 83, -972, -25, -119, -128, -1325, -533, 322, -654, -13, -1420, -210, 1074, 364, 901, 1229, -597, 642, 99, 56, -576, -50, 1149, 894, -217, -866, 520, -365, 428, -991, -608, -764, 919, 1398, -907, -734, -528, -399, 233, -974, 277, -323, 391, -259, -566, 600, -988, 683, -1422, 43, 205, 659, -662, 890, 1328, -912, 700, 294, -682, 541, -264, 723, -132, 1018, -1480, 697, 850, -669, 883, 331, -103, -299, -1116, -104, -985, 1161, -1609, -644, 1625, -41, -372, -978, -771, -918, -306, 30, 1859, 481, 121, -870, -457, 1113, 966, 1098, 601, 204, -216, -1017, -1751, 335, 148, 966, -291, 582, 469, 825, 1023, -924, 1610, -260, 710, -442, -954]
13117i54O13P39j056Q42J334r93q26l70k33J723Q40k056L26j59l5J16J756j66
13135A441k793K088j72%j059P53J50j358P57m30o7J35J435j477J255J3j337J877
13153A211j44j702j5J338j203P75N12J48j68j298R19j327j04K120j042L03o22
13170b99k89q45J574j880K312J530k341o7L8N72P23l06j1p77m68R60r95l2R45
13189C44k20k113J874q85P93J99R94J67j081l87J187j371m36P71L3K72j151R67
13207d3j096N59J033q93J630k035J498N02j164R26j411J828j524K87N30p61N11
13224C77J70j04j177M79R30P85j528n65L99n94J463P73m77q59M30J150j692J006
13242I66k143J204J766k954J338O79p67k38J11J62M39k26p62J504k529K432j625
$$ y = [-954, -341, 398, -658, 184, 1518, 525, -301, -671, -904, 819, 1659, -397, -71, -230, -265, -149, 1607, 1441, -1352, 736, 564, 564, -495, 258, 408, -950, -193, -623, -690, -555, 880, -597, 658, 671, -666, 1211, 1067, -635, -650, 688, -515, 260, 772, 920, 752, -546, 373, -954, -1058, 1062, 20, 323, -299, -588, -1433, 141, -1739, 573, 2103, -238, -305, -267, 305, 1028, 722, 711, -66, -534, 426, -569, -601, 344, 124, -1989, -115, -1000, -207, -8, 986, 1153, 72, -315, 872, -499, -935, -164, -131, 141, -1010, -43, -1139, -580, 453, -440, 1190, -845, 653, 1155, -9, 917, -494, 1334, -190, 97, 627, -134, 377, 547, 443, -734, -255, 675, 1460, -68, -633, -234, -828, 635, 1408, 931, 72, 502, 1652, -40, 966, -1177, 27, 1793, -1161, 177, 856, 89, -149, -38, 124, 563, 337, -425, 1079, -1450, 982, -643]
13259f43Q43k30J9o49J857j803J048j424K284k876J711J69j038J210n24j050N6
13276a040J032j08J722j039p59L71l80J83j035J752n67N86j359O10j083J189r42
13293h67r6K03k5P01k91N90J58M96j661J295o1K98m78l7l80J9r3Q23j443J257
13313D08j485J463q76q76P40Q19q5N33J96o65K10j434R85O90j018J774j114m74
13331b09N39O85o37j250R34O59J84k443K770p18j226J926j329O0m93j690L116
13348H78k472J843O24q09P31j997P75n27J300k651L247j425m4k99J044m59o49
13365h90n70K49J275j44m49j29o60K325k124m07K279j762R57K59N89j172N10l67
13383b31J94p27J606r52J474j342R15j769M83J958j817J246j881K090k47r19J410
$$ y = [-643, 200, -30, -11, -660, 1197, -606, 442, -982, 1302, -1574, 137, 306, -732, 478, -46, -1096, -1040, -8, -116, 1606, 567, -192, 179, -201, -18, -1053, 699, 132, 718, -641, -31, -1114, 75, -867, -963, -760, -785, -84, -375, 215, 373, 869, -792, 503, 442, 740, 262, 225, -155, -136, -229, 594, -849, 408, -1077, 386, -490, -1366, -626, 193, 108, 641, 837, 172, 382, -1052, -67, 623, -395, 1379, 265, -209, 330, 1015, 378, -872, 62, 721, 905, -1538, 1232, 514, -712, 1214, -115, -55, -548, -2238, 878, -1594, 249, 873, 64, 795, -1202, -427, -954, 346, -2305, 942, -483, -527, -826, 218, -241, -890, -1460, -1211, 64, -80, -529, -658, -1318, 1007, -1117, -1524, 755, -1007, -50, 209, 798, -374, 136, -231, -37, -764, 842, -110, 1364, 22, 937, -832, -349, 1609, -208, 1038, -843, 1247, 1000, 81, 1491]
13400A491k323K74L34K93J203k184J746l86n48q89J323r81Q00Q11j302N79j97
13417D4J78o83N96J40P84j049k510L650j881k58J977j219P51o53k74Q54r06J241
13435G82k283K557o35l6j865J979j207N95M41o69N26m93n33L73K006q53p36q8
13453a39j519K147j797k73K092p33J026k604J827j207J325j50O55o08k70j56K031
13470A647l291K260K34l56M0K88k71O47j75l58m24k333K723L17r58n29J444k225
13488a320J963j640Q94J51L24m38l5j82r38Q98J959j830O36q45l65J042j56q29
13506g11o76J242k4j23l98N31n80J690j052l63M78J05m05l96O35J535k841K221
13524H68k859L670n70j015K04p47J980k350J719k69q05J36p78K144j224K05q24
$$ y = [1491, -832, -558, -224, 69, 1272, -912, 834, 448, -100, -989, 334, -647, 153, 964, -338, 241, 44, 222, -461, 135, 275, 1059, 10, -2500, 1150, -731, -989, 988, -231, 520, -133, -407, 447, -459, 782, -1501, 1056, 421, 385, -1480, 499, -708, -113, 328, -341, 185, -308, -841, -468, 1538, 685, -51, -139, -1658, 489, -1308, -1581, 511, -222, 804, -1800, 27, -1180, 145, -5, 650, 42, -228, -384, 1647, -1644, 616, 850, 494, 534, 822, 551, 1198, 1023, 665, 241, -2092, 631, 948, -10, -539, 905, -1320, 643, -997, -103, 48, 372, -66, -101, -283, -1221, -323, 1636, -194, 442, -403, -768, 274, 118, -711, -1387, -145, -169, -292, -690, -159, -739, 951, -101, -464, 14, 119, -286, -682, -47, 1488, -1353, 868, -1991, 1679, 1109, 94, 298, -449, 1531, -819, 900, 631, -174, -38, -816, 1328, 104, 309, -515]
13541e15L59j77J503l77k132K571q77L87o32n10l38nP02J089j111k23O60q80K01
13560c05m76Q32N19l1m70j61L63M61k110J558N10j05o00L92m80rk38J225r09q38
13580h72J161Q6n28m2M35k531K640R73L5n79j187J181j628J143J071k162m38M10
13598h32K09P44P48k011J713r30r10P37N02q56J460r2Q50k431L482j931j242J98
13616e92m2J039j140J12o58Q79K55J263j809p4J420P5q07q97J935k071J724P16
13634A328j514J224j817J6L13K70j098J440k06J29m63J699j128J489o28j108m17
13651d71J639j248P58p01R6j4q19N31j302J027N48J174k593J658l24K85N11j304
13669e49L6R16q07r02K463r94p68K080l649J601j053K291q24N24l8p32K242k789
$$ y = [-515, -156, -333, 1170, 793, -1339, 1232, 355, 742, 110, -400, -738, -743, -41, 1048, -63, -286, 374, -506, -305, -781, 51, 570, 539, 69, -92, 271, 732, -1378, 180, 690, 585, -15, 377, -103, -112, -350, 875, -34, -872, 289, 375, -153, -195, 240, -2291, 349, 1322, 1357, 778, -409, 772, -856, 287, 1358, -804, -1242, -832, -623, 121, 869, -1142, 571, -359, -1269, -532, -30, -886, 574, 482, 1332, -1099, 2383, 452, -790, -592, -634, 405, -735, -623, -1281, -402, -147, 1116, -693, -767, 653, 728, -79, -976, 959, -1112, 612, 1328, -186, 1038, -779, -763, -450, -180, -1278, 162, -44, 85, -378, 1321, 193, 1682, 1054, -54, -471, 1168, -80, 678, -23, 73, 59, -760, -229, -1531, -504, 44, 1218, -1375, 283, -41, 244, 755, -549, -513, 403, -404, -1306, 1157, 163, -605, 1475, -2174, -573, -1626, 665, -159, 365, 327, -405, 1837, -952]
13687i52J388l0q53J147j126P91j079J011m9k15q79K9J435r62M66q95K53O27j276
13706a169J872o31k79J009j380J037j26J022j284j325Q28M6J450k871K036j142
13722i07pJ006j88J48m21N87m63m30R80j12m74m92m15L055l179J297L89J27K4
13741E25o24K99p07Q56l23j30M68O61j034k68j6k38J099j876P26J608j044M24
13759D06k39O47j095j68J104j650J752q75L89M5R4q24q85K281r84N15K91j604
13777h00J979k035J547p39O87l16j59J492k352J447k083N30L97k31j10m75J264
13794D3L54r23N33k01L60k26J156j978O29J27L99j426K222j756N32P18R26j082
13812D07p00j12j23O54O58o29M55j686J647O05j331o85J057N70r79k6Q67j46n91
$$ y = [-952, 436, 406, -447, 700, -426, 365, -714, 297, 248, 33, -846, -817, 618, -344, 122, -773, -520, 107, -1169, 703, 72, -207, 802, -578, 459, 333, 1355, 71, -1254, -426, -380, 1070, -1801, 235, -907, -914, 92, -96, 52, -369, 218, -245, -675, 305, 193, -281, -773, -1188, 1867, -1312, -15, 374, 501, 525, -99, 200, -507, 349, 26, -104, 364, 1025, -9, -277, -293, -531, 568, -1308, -582, 1026, -18, 406, 167, 814, -281, -449, 655, -995, 757, -118, 271, 316, 410, -414, -1299, 982, -2, 513, 804, -800, 1179, -856, 691, -48, 639, 323, 164, 1656, -696, 751, -1332, -802, -405, -636, -746, -1221, 43, 397, -526, 7, -194, 166, -60, 1096, -882, -253, -126, 273, -1153, 1069, -687, -155, 563, 1489, 407, -293, -405, -528, 126, 784, 155, 610, -1076, 571, 1176, -155, -840, 217, 787, -192, -218, 649, 503, -88]
13831h8P40j428J84Q71r13K78N06p71M13q3J86q54J683j960J656j531J613K86
13849G88o96M73j083J776k460J999j219p71J790j953K078j805J396l54o63J344
13865F40p06J119k156R11o04l38N36j5J649j982K48K91K58J037k090K134j860
13882i28J509k07k088K163j925K946m297L835j769J640o45p04L49n5L82m40n32
13899g66J38M8J68L26r83N84M62R1j54o02J346j257R47j78m08j428K204M8j117
13918e31J348k155K810j433O82n42KM69m11kj287J001n56L05O81p75Q10j453J317
13937B80J59l10p61J417J60n07P23r96p66J765q74o53J148r01M0K06J378j686
13955a78M37q13l99R19j009J466k75N73j467Q1Q88J53n83L67j064j142J384K7
$$ y = [-88, 652, -776, -592, 279, -634, -356, 150, -621, -208, -291, -105, -959, 724, -1236, 420, -1111, 502, 788, 92, 565, -518, 1258, -1202, 797, -422, -1193, 597, -1356, 722, -1083, 313, -41, -704, 640, -66, 1053, -1103, -192, -796, -1134, -598, -613, 1036, -946, -698, -407, -149, 888, -1202, 932, -928, 581, 374, -1714, 449, -1476, 1470, -2827, 1008, -761, 879, 234, -470, -121, -176, 206, -234, -766, -628, -580, -412, -86, -1069, -485, -23, 68, -86, -688, 658, -599, 348, 170, -238, -1666, 538, 586, -531, 817, -1338, 1472, 39, 721, 179, 181, 650, 239, 237, -1050, -49, -605, -300, 381, -394, 416, -1037, 280, 439, 129, -632, 785, 945, 438, 1161, 165, -601, 1164, 290, -363, 785, -116, -76, 130, 1508, -178, 259, -554, -953, -34, -1043, 423, 148, 721, -746, -665, 223, 376, -207, 160, -904, -2046, -662, -635]
13973f35rN74j094K069k51K95O1k134J424o96P35K09m10j177P92J95l62k29K115
13992A472k149J941k002O53j073Q56J73P53k59j115K758r69j609Q16Q29j31k495
14009a551J543L66j097J651r77q80K143k187K100j284K41j419K501j147K29j271
14025a039j33P16p09K063q24L63l97j888L396k274J334j689R86P59j621J310k428
14042b075L596j385j43m60Q44j197R27j142R02J050q31P83j601R2K076k270L04
14059e30O46j57J100j505P80n07r6L94q48N75r63J791j318Q5M34L34M48j281o3
14078f81J425q84L44P78j369M79J08K97j429J050O67k165R05j58J024o06K83L10
14096C78o68q2q12J925j447J350o61M37m26j90J459o82n94j08o36J305j160J627
$$ y = [-635, -644, -70, -1164, 905, 654, 949, 1010, -1124, 300, -396, 339, 548, 138, -1039, -247, -52, -414, -643, 1472, -677, 1264, -738, -85, -1158, -302, -129, 624, 365, -750, 2008, 1039, -570, 246, 1075, 944, -1551, -8, 358, -739, 912, -65, -945, 1198, -989, 1111, -173, 68, -1351, 1150, 3, 232, -1039, -1172, -456, -1165, 898, 74, 437, 40, -1848, 1548, -726, 608, -1081, -95, 664, -957, 353, -2075, 1521, 136, -7, -467, 377, -820, 107, -1035, -133, 917, 86, 869, -732, -640, 1436, -834, -530, 116, -41, 1059, -446, 334, -173, -269, 125, -723, -148, -1111, 680, -638, -553, -119, 215, 663, -618, -681, 744, -140, 204, 982, -387, 92, 200, 497, -932, 118, 785, -1380, -475, -633, 391, -215, 68, 378, -290, -372, -1184, 741, -706, 644, -17, 420, -6, -196, 1263, 581, -13, -121, -757, 548, -612, 1015]
14114A015j988J376l138K266P03r28J404k679J893n77J847p96J14r98q41J051
14130b76J66N31m42m65O65K71j16j521J323o61K49J343j352J21N52p2j582K059
14148G93m4k820K815q52K70O4n07p75O59k50L46m61J393p86L17j735L128k362
14166h07K38l25R70J07R62k39j712N54P03j93K5j346J186o53P32Q61j871K25L15
14185b68R16m48r51K19k81P8J486j828L30P76J043k832J514j82p5k85j170M052
14203B094j205m04j775J398M71j059J117m82J74q46J771j67l86R4q82j61j75j73
14221e96J691k227L278k526J024N06j0j889l3K725j658J9j49M32o94k97K0M19
14239C5p11J032k87o14K13M41K01L68p15O64q09L6R1M28k29N9l93L46M8j966J890
$$ y = [1015, -973, 403, -2735, -469, 234, -694, 710, -1969, -76, -653, 1194, 398, 512, -486, -1327, -276, -110, 421, -21, -486, 179, 450, 334, -1187, 136, -525, -276, 1067, -285, -164, 388, 316, -1266, 793, 749, -2071, 744, -108, 162, 226, -281, -1056, -397, -647, -301, -762, 631, -155, 162, -1573, 1555, -807, -569, -894, 76, 183, 1145, 906, -806, -252, 451, 258, 283, -1063, 123, -530, 202, 1063, -808, -583, -268, 648, 200, -751, -532, -813, -735, 751, -1077, -747, 29, 1072, -1760, -246, -428, -503, -788, -1958, 2094, 889, 485, -1290, 108, 579, -480, 637, 155, 329, -517, 1254, 1087, 701, 795, -87, -248, -423, -596, 1095, -1132, 2146, -380, 644, 1150, 1140, -749, -782, 1943, 285, 304, 155, 587, -107, -404, -384, 35, -676, 356, 69, -545, -332, 109, 310, 678, -37, 627, -182, -146, -55, 373, 144, 203, -190, 156, 204, -1762, 128]
14260A28m58M63l41R00j448R81n67N46J06M84j393n81K234k016J907q22p70r39
14278a586P65L96J196Nl01j548J175m69o72K97m31J620j312K305k593J740L72
14295I59k439K180q54R73j935P78Q88j9N5l80j241J572j814K195j800K208k123
14312g97J973j898J883l39n37M66k010J945j876P19N19j614N26P84j88J18N99
14329B73rK11j003j15j033L044n26j609N06j22O31j538Q60O95l76j104J155m01
14347d61k50J388p2j561N90k28k13j153K183J69J462k276O46O99j585l17K89J508
14365H18j78q16o5o23K488k494M4J014j394J332N54j323N78J681j137j209L73
14382c57P96R35k343J593j080R24j193P25P22j167K398j494o77P03j836K629k751
$$ y = [128, -330, 133, -208, 692, -756, 225, -342, 204, 310, 794, -599, -1180, 1054, -962, 945, 123, -647, -1586, -821, -425, 771, 776, 475, -1073, 102, -367, -1039, -742, -1173, 447, -865, 1440, -1153, 587, 959, -1480, 700, -154, 819, -1116, -338, 550, 531, 586, 206, -1035, 537, -1277, 918, -882, 1326, -797, 1176, -722, 1161, 822, 285, 751, -1259, 686, -1190, -471, 48, -1566, -1040, -256, -444, -326, 273, 264, 475, -528, -643, -1676, 1368, 842, -767, -261, -383, 248, -1290, -430, 265, -111, -1215, -60, -461, -711, 677, 605, -956, -366, -594, -807, -1960, 223, 392, 1854, -422, 224, 923, -662, -979, -690, 818, 640, -176, -241, -864, 1624, -870, -826, 188, -1206, 126, 680, -643, -65, 1616, 479, -730, -357, 439, 1374, -969, 624, -456, 468, -725, 0, 722, -445, 1953, 459, -218, 485, -1351, 1278, -1473]
14399a473J460K09j198J17P50J136j622J252K69j31q61K16J525j190N99j001Q51
14416I08m96o61J500q22r92R56L7m22M33j29j2P09o46l27Q60j574R99l81R87j171
14436b44M67J041k128L78K106o71n59j27p35Q13P90k118J0K088k097J073J53q14
14454e74R51j119J80o15O93l63J356p10P42r16J551j780l35J359k29n09O96l66
14472A2k29j304J276R36r15K350k540M41m53P39j127J135r27O57O63k319J574
14489c1k62j175J178K59p6J115q62O36k012J803o3k51q28J106k604K754q6l04
14507B97L41j720P58J049j527P42K52m76q61J368N7j357P68J698K66j129p84j459
14525a717J209J741j459j28O84j151J955j628n78J357n19l4j79M92j35J525k093
$$ y = [-1473, -13, 196, -1002, -885, -135, 1001, -621, 631, 900, 769, -92, 124, 1649, 459, 1058, 57, 908, 412, -249, 1251, 429, -563, 393, 430, 8, 441, 312, 300, 1009, 363, 36, 896, -678, 321, -60, 927, -244, 223, 1264, -864, -486, 1620, 949, 390, 263, -472, 341, 1131, -987, -977, 1111, -986, 87, 240, -574, 377, -742, -562, -1177, -484, -847, 509, -201, 541, -375, 1176, -604, -939, 420, 191, -318, 378, 12, -217, -1521, -245, 691, -224, 2126, -414, 27, -426, 313, -814, 321, -606, 51, 714, -1605, -31, -293, -1468, -290, -31, -107, 1008, 146, 782, -1230, 573, 510, 259, -569, 537, -2067, 687, 601, 297, 638, -1082, -324, 725, -802, -60, 192, -284, -1145, 223, 280, -1077, -309, 1389, 1655, 526, -258, -1717, -508, 1233, -226, -354, 330, -821, 1134, -494, -1072, 285, -234, -268, -447, 45, -90, 1435, -658]
14542f58N79J148k253K063j422L294k780L32j175J283j180J45J299r93J49R85
14558H16p47M63j334J131L28k495K250j127J406k200J725Q52j658J269j625K60
14574f86k01P74J636o05j188j65J572r25N19j925P20L85n8o37R17j073O79l0m50
14593g41M76k91r22K685j540K48N98Q21p45R1N40k498R34J369j326R84J13k378
14611a582K242q31j21L21l46J327o30l8j423K145j033R26k012K045j272Q01j681
14628a162J397j913J211P95Q15j738M67O41l45k44R05J75o45p7q04L62O29j220
14646g51L89K65M71Q8n34M45j3N29n24J925l071J086o94N11R89n12k63j157J561
14665G40j022J99J528j893J763j542k70Q04j135N61q80M13R29r19K05J178j55
$$ y = [-658, -79, 1069, -1184, 879, -543, 2751, -29, 303, -872, 411, -769, -624, 675, -318, -169, 816, 69, 532, -802, 329, 657, -1838, 412, -715, 691, -1509, 216, 1068, -590, 679, -946, -686, -887, -113, 1523, 918, -270, -435, 1137, 212, 731, -1194, -474, -89, -147, -784, 133, -940, -261, -291, -741, -265, -556, -1478, 1207, -333, -85, 513, 1334, 589, 680, 1220, -1278, -344, 1025, -301, 683, 796, -1582, 660, -171, -292, 29, -317, 1010, 380, 342, -1081, 1064, 31, 957, -1055, 990, -282, 519, -1162, 235, -1678, -467, 328, 1143, -595, -128, 513, 168, -76, 829, 1004, 359, 282, -522, -160, 469, -751, -362, -97, 374, 462, -72, 373, 360, 889, 365, 2290, -781, 305, -389, 122, 1111, 599, 336, -821, 740, -282, -83, 1445, -448, 1315, -227, -497, 307, -828, -267, -1147, -734, 195, -724, -519, 659, 504]
14682E04o39J134q96j094K171k866L183k211P25J605j595j52l03O26k9n89O54
14699B28k22J05r50J053Q2r3J83p11m03J698l45j202O23J787k605J869j548O70
14717B19m23p27Q54K13j22m09L69j60O03p17N24m73n8o70J601P11n77q95O15k50
14737B28j514J526l13N30j267L10p74R22N06j463K106lk76j705J22K462k625K258
14755A030j006J6m92m85J439R1j264O42J466k322J181j03m86K11M65J4o02M09
14773B04l27p34J129l7j36j913K282j327k45K145k492J197N02Q37j742O54J707
14790A704j873r04L62P38O96j259R73l86q62K34M3J95J087n22J44n96J308j895
14808h13K077r46J69M50r81J103k146O39n18N06N3l50J818j024n91j047J688k29
$$ y = [504, -135, 999, 103, -991, 1180, -1686, 1497, -714, 11, 1616, 21, -131, -434, 192, 163, -426, 228, 6, 111, -839, 214, 296, 203, 386, -325, -728, 970, 625, -577, 46, 1833, -772, 1097, -451, 219, -204, -931, -77, 136, 14, -395, -26, -186, 417, -300, 224, -249, -307, -977, 624, 1335, 758, -137, 478, 228, -1286, 240, -73, 457, -810, -500, -1274, -352, 154, -1309, 797, 794, 518, -1187, -1065, 1397, -1228, 1030, 24, 40, -452, -937, 502, 593, -671, -29, 1437, -885, 296, 193, -293, -82, 383, 397, -205, 204, -123, -857, 272, 235, 99, -1814, 468, -859, -1104, 1041, -1451, -254, 248, 1085, -657, -3, 1704, -169, -1073, -711, 27, 723, -536, 437, 51, -811, -577, -534, -339, 748, 226, 370, -226, 1082, -813, 1264, 318, 487, 937, -44, 1059, -1087, -448, -966, -460, -407, -757, 1061, 37, -554, -1601, 87, -142]
14826a42j13J158k51n61J38J100j126O08N90k349K788j749j374J505l57r17N14
14843e38L85k78L01o46J28m27J178M06k84K26k46K90l53j313J111P99j283P37
14861A93o30L91q50Q22j277J049J230j408L17l84J187p65M69j64k61K09l83O60
14879D05k46P7r00j12M81K53l20j095J797n21J358j862m11M72J197j483J101K99
14897D90n08qN80j43j905K405j979J338M40j323L50j241J176p22M78P13J48O7
14915C56j309J961q73j35N87m23J66l96Q70k628K026R1J92m67O70K04j304J69
14933b43q68K828p12j958J164m94J671j993r2J357J99o41j184K429j120j275R32
14950@m41O00N45o75L69o35q53J636k62p82M0J13J837j697L60K82O51n05j069
$$ y = [-142, -255, 903, 652, 91, 229, 1329, 203, 811, 1401, -948, 1840, 91, -1283, 222, -135, -1052, -538, -153, -431, -130, -776, -648, -1075, 103, 509, 225, 451, 205, 495, 142, -1171, -60, 739, -544, 193, -437, -46, -896, -74, -1351, -302, 928, -480, -163, -547, 640, -125, 344, 180, -81, 128, -255, 405, 159, 236, -664, -776, -295, -42, -362, -1457, 340, -181, 1177, -685, -1096, -624, 573, -910, 191, 490, -18, -26, 554, 411, -1494, 911, -1068, 270, 710, -613, -263, -1504, -328, -1050, -572, 141, 289, 356, -953, 1008, 135, 0, 587, 164, 330, -66, 804, -1824, 202, 293, 485, 18, 688, 892, -412, -243, -1111, 1717, 1005, -953, 211, -283, 1388, -605, -697, 660, 859, 218, -966, 1463, 343, -932, 0, -441, 159, 704, 29, 398, -237, -1090, 546, 284, -498, -458, -345, 1492, -205, 155, 437, 1088, 583, -486]
14969d86R30m99j151K007k88r10r33j71K275j124n45O85m60M06K46O03k39l71
14987b5J884j424k6J006j268o02J017P64l62j440q67J802K91j836K44M50K98m29
15005e23J388m97l48o04L98J900k619J235J35M95l26j483J114m9N1m29j26Q20
15023E32j131J150j456R32j476J513J509j053M6j264O65j102J261M33j173jK94
15040c21k64K48Q3J322j320j6K15r58L13k10J86l50N14Q79K55j699K658j506m16
15059c87J254j155J585j329p89M56J99l29K10j89J234j738J908m67j22N62j650
15076g47K157j082Q30j657K880j974j8m20l82J688j083j085P24M53n21n63O74
15093a26j635J672O67l82J364l167K545l57n31n12Q85q7p16R23p59L67o31m15
$$ y = [-486, 444, -55, -1206, 801, 513, -397, -1330, -1501, 774, -350, -895, -210, -670, -264, -18, 585, 346, -25, 1859, 435, 409, 1415, 147, -455, 562, 1326, 964, -476, -1343, 459, 750, -1086, -842, -392, -94, -523, 865, 368, 20, -584, -186, 1714, -905, 330, 465, 960, 634, -849, 265, 216, 267, -162, -288, 532, -599, 551, -905, 27, -1449, 64, 1573, 520, 566, -698, -33, -1135, 126, 559, -614, -615, -321, -585, -337, -254, 1068, -252, -268, -53, -1011, -698, -908, -722, -1072, -558, 321, 576, -1123, 1535, 29, -387, 867, -288, 1297, -32, -821, -365, -166, -495, -285, -474, 760, -978, 930, 463, 341, 903, -747, 1410, 328, 1158, -499, 2381, 407, 389, -31, -413, 1275, 192, -893, -169, 284, -237, -800, -126, -1761, -89, 578, 196, 1560, -1607, 938, 581, 50, -462, 423, 336, -380, 543, -216, 151, -480, -895]
15111h95Q23r12J246r8O2j97r18J328r39J666j813j180L239j751Q69j888L42l74
15129a390J303J56J121j652N16J718j048m8r92R28j52L73r53J039k061J288l0
15146A16j169K412k79j315R24j593J584j680R19q8o5O21n40j042J159m12J274
15163H26O89j554Q33j782J496p32j57J021k40L66p31o8J436j546P09l177K701
15180I0k93K00N73p30P63q47J66n80l82J273M80K53r92J144j251p68R06j31M25
15199B99l77P3j56l10N51K75J09o51L33n29J615k443J928n35l01M9K48M25p20
15218a17l89N96l22J873l326K339p85j557Q20J226L40j38j638N54o7J280j328
15235f39J921o93q04M27l69l71J095M02j907k29L142k151P54j413m1J840m14j55
$$ y = [-895, -72, -984, 262, 164, 226, 29, -889, 439, -500, 1166, -647, -1827, 1412, -339, 530, -1358, -1016, -1390, -87, 69, 1190, -462, 54, 1772, 724, 676, -316, 612, 460, 833, -120, 919, -1142, 146, 116, -1053, 1359, 1080, -235, 689, -904, 680, -1000, -81, -169, -234, 387, -153, -1195, -36, -448, 826, 1515, -39, 794, -988, 508, -224, -381, 640, 400, 766, 35, -33, 1403, -143, 566, -2611, 90, -203, -3, 570, -160, 603, -244, -78, -658, -1040, 233, 713, 966, -26, 1118, -133, -901, 5, -126, 299, -78, -5, -161, -471, 80, 355, 464, -187, 146, -383, 1232, -1211, 717, 182, -119, -70, 178, 603, -117, -506, 90, -232, 1641, -1685, 654, -131, -1688, -868, 358, 698, 560, -1078, -524, -591, 689, -639, 1282, 589, -215, 212, -157, -528, 567, 969, -938, -1167, 1975, -176, 578, -835, -876, 964, 550, 395]
15253C95R2J82r43l76K109j603P70O9o11k07n25Q68j005J348J26o01L89p33J325
15272A069j966N31N93Q42o39m26J382k442J853O9n03j832M26K511j117R51j205
15289I7p49N47r01J776j214K67L14K847m011P94J06p76K271j961N20O39l28j350
15307a112J940Q8j743K132j817L39L2r2M34L45p06P38k001N61L87J45j93J150
15325F27j462L10J91K24J7O02q37N84m94P1J032j541J828j382J586r50j40K206
15343B472l175M41l55P41j8Q33q34q97K654k495J993j025j3R87j854N95J0Q40
15361I00j314O16M87q61j281R50J355j115K78N40r93J24N11j174J377n99K8o83
15379h54J80r51J198M73K72p69N49n58K41O99r59K81p69P65M46l09J095m92l97
$$ y = [395, 487, 669, -274, -650, 1459, -144, 626, 695, 84, -123, -648, 220, -785, 563, 689, 88, 477, -256, 1069, -897, -366, 227, 1069, 430, 4, 1386, -1056, 797, 866, 363, -1469, -1043, 1468, 351, 1302, 97, -652, -105, -1006, 770, -444, -177, 137, 2984, -1027, -233, -127, -903, 1368, -593, -73, 566, 238, -1112, 828, 916, -827, 1305, -512, -173, -141, -233, 201, 546, -160, 578, -1423, -862, -475, -330, -523, 627, -835, -525, -334, -110, -93, 509, -328, 256, -238, -167, 865, -676, 1152, -230, 1356, 406, 266, 2472, -703, -262, -617, 124, 106, 939, 105, -792, 1862, -633, 1360, 335, 322, 1309, -545, 50, 60, 900, -414, 202, 689, -172, -1453, -503, 852, -263, 15, 555, -438, -314, 197, -977, 400, -199, -171, -854, -674, -1625, -427, 46, 318, -451, 98, -460, -219, 480, -479, -198, -967, -202, 244, -65, 1030, 538, 141]
15398A41l84J303j129m88J995o68j321J444j333n59Q85R55j896J42N62l86R6J307
15416F66m81o3j16L91j055J613m29k257J780kJ145j367O43p11O0J049j136J005
15434G35j171l39J852j881J21j638K873k04l15k81o29K80J197m01o44m23Q33J90
15452A55n27K71O12k196J260M77j72J358k290k52J038J00r03o98J933j91p92M52
15470c65J255r8j719J652j658J517p40O61j278M72j68k30M06J42k65q50O43O03
15488b0j021J102K32L61j021Q05pj837J681p85n92J568l61K96l50p1n66j02J522
15507H34J95j309k19m01J731Q57m62j390R90k1r22Q73j732K75j69N96M33k68J160
15526A051j360n0j026K717j696O67R69j335O16k499J737M81q60J682k315J189
$$ y = [141, -243, 1060, -69, -557, 1438, 770, -551, 893, -440, -999, -114, 841, -1055, -913, -351, -737, -641, 666, 185, 122, 6, 397, -658, 955, 526, -1731, 49, 47, 1192, -175, 468, -243, -183, 866, -270, 735, -436, -775, 1077, -804, -683, -2321, 552, 348, 33, -248, -877, -597, 600, 199, -445, -868, -35, 155, -372, -101, 511, -1685, -425, 52, -120, 1238, -1052, -1304, -266, -166, -1069, -1767, 166, -25, -817, -365, 890, 792, -927, 725, -933, 584, -156, 505, -773, -301, -469, -699, -293, -151, -416, -1266, -623, -20, -1041, 61, 293, 654, -367, 438, 431, -1406, 275, -510, -1102, 466, 105, 401, 51, -20, -586, -688, 834, 1029, -280, -499, -900, 831, 1688, 1226, -164, 826, 805, -117, 756, -976, -701, -870, -274, 159, -109, 1051, -309, -359, -1385, 1332, -364, 303, 1272, -63, 553, -1946, -209, 272, -588, 1094, -1221, -32]
15542c2P82n90p38K77J016j596P20J39k20k08j49J033j55Q03k341K171k003J406
15560C15J57r97p72K058j274M17k45O83j607O11p67J020J292j840P92J563l23
15577A083k072M77kR93P18k391l04K392L84k344J108K039m351K290n68J068k82
15594B38Pj082P60M36j347K18L16M52J005k2k180J244j51l06M57p66J276K36P7
15613H68j578J315j843J795n17j48L97k13J414k249J795k085l6N87j175J875J54
15630C56p86n75L20k38J965j199p99K588k325L55q37J645o9j569Q91M25o39L50
15648a41M39N92p33j011k24M84n02O82Q65j671J184K40q20R41o58O44J53j099
15666f35P58q44O9J387r60L24m23k40J102l06o5j287J830m98K44j648J328p76
$$ y = [-32, 750, 160, -578, -301, 715, -881, -161, -22, -242, -450, -599, 434, 279, 1082, -1259, 912, -1091, 315, 472, -525, -1297, 761, -513, -96, -341, 342, -1265, -654, -1421, -401, 891, -949, -157, 1406, 1083, -989, -512, -514, 479, 1197, -1194, -1498, 894, 1278, -1066, 42, 2081, -2270, 20, -548, 520, 238, 245, -837, -77, 359, -988, -770, -454, -2, 1003, 981, -1199, 45, -106, -412, 45, -721, 555, 791, 868, -710, 605, -1238, 557, 40, -108, 289, 76, 1490, -759, 1036, -1049, -1085, -498, -1673, 202, 356, -430, -1005, -685, -923, 1042, -157, -956, 1632, -693, -338, -1175, 470, 401, -1168, -277, 148, -491, -141, 298, 890, 157, -854, -1078, -594, -1096, -414, 451, -1220, -36, 204, -616, 325, -333, 311, 464, -635, 123, -721, -652, 735, -225, 99, -324, -564, 538, 232, 167, -1120, 710, 212, 456, -1192, 136, -640]
15684f40J091R18m35Q71k444J187q3q40R06n9r9R2J15j789J508l20o41R58m41
15703a45O12q70N89J361j759L08k064J966q38O32o26P32M57j722J781m36j64L31
15721A45n62j89M78R48j160M37M8n78J382j386l56M49Q88J486j932P78K7k44m11
15740B48j58j05o87L51J566j117K54m28J12Q84j156L44j54L88j388J129n69l24
15758h10J307J440j027k013J283P15r31n0J192l96P0l22l64k44p65M36M83R82
15776I86m94l18o1L88n70Q47q56J313j202j038J043P75j657l00J674k255J494
15793b31L67L3J058j840J990j733R8O75L51j106j286J793j41M27l15j95o23J871
15811A193q48j54M20n68r05J262p45O35K56r03k51k95J044M31m80K5j91p40J489
$$ y = [-640, 451, 1369, 934, 1805, -639, 548, 465, -375, 531, 472, 373, 465, 580, -1209, 299, -21, -662, 296, -145, 467, -403, 186, 1547, -212, 96, -1968, -2, -840, -208, -834, -102, 355, -1367, 414, -22, -186, 145, -417, -606, -128, 820, -340, 97, 145, -433, 949, -437, -793, -344, 544, 2030, 98, 876, 903, 659, 248, 90, -15, -702, -351, 1215, 98, 352, -76, 36, 920, -236, 108, -46, 342, -1046, 83, -486, -810, 497, 1937, 910, -1103, 180, 895, -36, -86, 1106, 710, 780, 458, 94, -150, -915, -479, 4, 986, 492, 174, 113, 501, -69, 778, -78, 1235, 33, -1005, 38, 813, -844, -1144, 530, -1725, -231, 136, 169, 1227, -613, 1377, -356, -258, 417, 768, -338, -1624, 169, 28, 455, 140, -55, -678, 1193, 345, 191, 611, 43, -862, 400, -345, 290, 546, -357, -608, -903, 141, 572, 92, 117, -74, -814, 675]
15830F75l7q37P43k00o86j067L238k267j158J697p84J511k59n22k06OJ32R6q9
15849a4Q78k35l67J51J13J06l2L41j245J103j040j123Q20j12P06K51N73q07M2
15868A09J391k940J400o26P31p11K81N56q86J782j182J159j352k60M14K19K607
15885B692l545J197n84l52M00J02q1Q47k50j761J051J049J08n46j411K239o92
15902D63k35q08K216j247O02k023J256m75M06o55J641j194O89O27j149k49p2L65
15920A58N43j87o15N82K12K66j839R20R25r11M94l92K97n76k94J246j148O68M07
15939G56j914J343Q82j692o22J359J000j228N73Q80j029q46l45R52J681j202J01
15956F49j93P05k1j981O14P99J231k984J882j074P65l61K96K72j93l5q54P69o86
$$ y = [675, 638, -199, 544, 344, -342, -1409, 1829, -438, -1596, 101, -683, 828, 569, 47, -159, -153, -21, 75, -14, 864, 629, 262, 413, 526, 632, 600, 941, -304, 799, -241, -1364, -544, -656, 50, 301, 874, 67, 109, 1500, -1440, -40, -666, 65, -646, -365, 191, -695, 1087, -95, 1064, -288, -548, -134, 85, 2692, -853, 344, -240, -592, -192, -90, -171, 676, 426, -1335, -284, 765, 873, 327, -1084, 1155, 463, 228, -580, 1636, 389, 991, -1032, 224, -251, 155, -500, 1141, -53, 636, 1263, 114, -135, -207, 158, 701, 514, -101, 481, 693, 959, -880, 40, 965, 54, 548, 156, 453, -123, -417, 829, -319, 349, 756, -1158, 185, 1067, -625, -1247, 112, 1112, -116, 457, 1337, 308, -538, -883, 69, 1750, 548, 649, 456, 1161, 1140, -841, -227, 572, 1803, -1181, 701, -373, 392, 31, 327, 599, 406, 371, -483, 286, -400]
15975d00K55q3J321l15o17j2O45j781k73l83Q60K81k63r22N05K005L40j639J081
15994F05N65j848J086n69k114K512q00O3N28J913j084l1K19j42k37j37k66p02
16012d39n72K03kJ265j943J436m73J77Q95Q10k230l5J684j049l46J248N30j205
16030d6R57j261K39L39n75J270o59j183l7J158l07q67Q35j094P69M90J084j101
16048A1n92K013k317Q52j060J133j13J034l95o59J584k193J867r24o90L77M66
16065C94J65j748K243j447Q87J52p8P87k625J170k025L090j980P03J113p96R58
16082I63o33R95j642l57K579k718J349Q3p75N2q88N92M27O07m10j79J212k390
16100a133J237l63J215k147Q05j167P88j16J636q02m09R40P61p78k36m94j278
$$ y = [-400, -145, -228, 1093, 778, 161, 149, 794, -987, -1260, -1643, -783, -502, -765, -1687, -1182, 823, 1163, -476, 605, 1170, -678, 408, -161, -2275, 237, -563, -500, 28, 1941, 857, 826, 1045, 903, 666, 529, 263, -439, -1011, -808, -810, 455, -1488, -52, -525, -348, 547, 1357, -873, -908, 776, -273, -619, 629, 1159, -46, 911, -350, -111, 228, -347, 923, 264, -919, -956, 202, -105, -972, -137, -1231, -462, 28, 1112, 11, -581, 1432, -885, -33, -1093, 40, -73, 961, 566, -93, 1491, -702, 1165, 241, -449, -72, 394, 559, -1189, 1054, -393, 494, 646, 568, 1355, -1270, -100, -2125, 965, -1015, -312, 801, 5, 963, 330, 1325, -317, -674, 1905, -813, 536, 619, -156, -104, -992, -400, 27, 634, 224, 45, 1257, -1133, 104, -259, 956, -1191, -386, -1553, -765, -881, 755, -47, -456, 484, 1245, 467, 231, -263, -1541]
16117a541J857m31R25k049K305k99K81k92q50M09m01k89q2n25Q64K84j395K261
16135A032r99N95r12Q1J264N33j963L28L33R70j941j44P44n84Q45p70M75J72k77
16154b18Q28j544J701j350O16O93q47j81j00J009k4k74j173L01J225k436J329
16171d45P46o72o21R31J496k202J657j709J327q69o32R01L49N49n00L0N98j086
16189a52r27L75J220N12j751J956j989K28Q93p80N92%j059J392j355Q47J93l8
16207A57k12p51J905j663J66N09j32N65j014l2J11Q46P0J80p33o30R96p12J102
16226G28j076J9l93J203j722R22M33K78o07MJ252j560J707j732L31R64J58n46
16244C63k15Nr29l33J767J33n97j436Q82P57j83k79o18k25q9J244l32m35J047
$$ y = [-1541, 316, -115, 810, -1239, 1066, 767, 1048, 756, -94, 315, -86, -375, -457, -982, -118, 166, -1229, 1032, 33, 628, -284, -203, 1061, 1594, -369, -41, 292, 1262, -679, -823, -79, -663, 182, -588, -113, 59, -218, 610, -934, 767, -583, 33, 726, -121, -302, -402, 607, 583, 309, -864, -563, 662, -1774, -445, 301, -371, -992, -61, 1435, -767, 890, -819, 508, -361, -993, -92, 257, 806, 306, 336, 934, -152, -1079, -704, 516, 1028, -723, 1233, -756, -528, 365, -415, 177, 177, -882, 510, -845, 2, 195, 157, -55, -806, 1099, -564, -398, 111, -21, 544, -470, -502, -391, 455, 525, 705, -28, -658, 338, -374, 728, -348, -329, -722, 481, -1241, -319, 114, 392, -215, -211, 1041, -519, 1188, -544, -213, 751, 909, 363, 148, 153, -776, -1109, 658, 791, 194, -1242, -360, 397, 214, -65, -683, -908, -997, 247, -85, -520, 527]
16263E27j297R39L75m60r36J238L59n89L61q49J21L25J67q06J752o60j866J536
16281B37o81J032J42j258Q64o77p28J619j104P35k72l28Q72n81J074j716J764
16298I94j608o7J116j436K338k069N50J755n64k91l4K1j615M46R47r54P87m59
16316a43J079j639R01M47l14J76K71n6m39j10j106J586O95k520K560k411K331
16333A308p0k205O64q19J107j235J534L41j292R05l37q3K517k422J263j506O87
16350C57j826J567M06j568K222j644R87j595J410j388P99J463r91q04o5O73O64
16367F67j060N29k177L664j439Q45j660k71J754k33k299J191N2K82J204n56
$$ y = [527, -770, 169, 544, 84, -852, 386, 745, 156, 517, -332, -211, 114, 281, -525, 1227, 567, -1299, 237, -444, 588, 730, -528, 336, -341, -1069, 550, -554, 181, -91, -419, 453, -128, 946, -770, 994, -614, -681, 435, -1001, 1337, -732, -182, 1573, 1009, 718, 684, 705, -910, -464, 483, -471, 316, -143, 936, -703, 198, 645, 331, 507, 778, 722, 283, 173, -933, 653, 1348, -1172, 1388, -1023, 1308, 1238, -967, -303, -1122, -15, -1250, 284, 625, -667, 238, -99, -182, 2335, -87, 1176, -330, 357, -1469, 98, 504, -1064, 1158, -486, 501, -1094, 316, -1072, -273, 1190, 199, -605, -670, 3, 667, -393, 136, -2041, 1623, 184, 1029, -631, -902, 852, 619, -1680, -489, -437, -155, 1049, 493]
16383D93
$$ Imaginary data points
##PAGE= N=2
##DATA TABLE= (X++(I..I)), XYDATA
0@%%%%%%%%%%%%%%%%%%%%%%%%%%%%%jMpRj1J3j6J4j0J0j1RnNmPj4J9k6K8k6L0
51A7m1M2m0M6n2N9o7P5r0J10j35J76k37L54o25m264J5724n445m722o069m124k83
73i591R25K705L297N241J966M73M53l54k770l562k542k214Q37K53J940L328L337
90C722J808L46j324j77m035j568l225n39j184J927J236J311L816J463J677o9j069
107D116j885m783r25l680M43k004M425N121Q36M328p27Q42k010p08l250l681o69
124d211j202J472j307L611L559M67L867l235J034l901j206j369j627r85J565J885
140a583J952O29K823P45j884J192k339k272j549L71j659p0J710J386J823J397
156B672K783j313o74j037k988j713k479J420n69M21L074R49L770j117J120j919
$$ y = [0, 0, 0, 0, 0, 0, 0, 0, 0, 0, 0, 0, 0, 0, 0, 0, 0, 0, 0, 0, 0, 0, 0, 0, 0, 0, 0, 0, 0, 0, -1, 3, -4, 5, -6, 7, -9, 5, -5, 5, -6, 3, -2, 3, -1, 6, -8, 11, -15, 13, -13, 17, -24, 18, -22, 24, -28, 31, -36, 39, -51, 59, -76, 100, -137, 217, -408, -4672, 11052, 5607, 885, -5184, -9308, -9591, -8666, -5961, -2664, 2577, 4543, 5016, 5469, 5115, 2345, -1217, -3759, -5973, -5136, -4883, -2943, 385, 3722, 5530, 5876, 4552, 4375, 340, -1228, -4453, -4992, -6176, -4249, -3013, -1702, 2114, 3577, 5254, 5185, 4116, 2231, -2552, -3477, -7157, -6714, -8718, -4293, 828, 1664, 5992, 5265, 6107, 4097, 3389, 139, -3542, -4211, -5413, -3941, -5248, -1637, 1922, 2389, 6256, 3021, 4055, 154, -1052, -2421, -4048, -5033, -3468, -1583, 369, 998, 3821, 4566, 2682, 3874, 1535, -737, -2286, -1915, -3574, -3644, -1934, -548, 1275, 2672, 5455, 4142, 3468, 2431, -557, -2270, -4749, -3329, -3898, -3477, -403, 546, 4316, 3199, 4319, 2400]
172B400n89j435k012k71k427K233R64J82L931K26P76k310R96l579j947N05j256
189c613L56j367M513J44K863R58o38J440k537j181l134J847k605R91P37l38K899
206A335j75K191M36m36j206j494j750l98j244J120j022M67J661K907M4j88J102
223C350j968m2j658j326p56K68j208J841K119J286l24Q95j78k09j784j367j734
240b795P42o83R90N42K028P53k61J366j58j819J793k493j744j234n77K569l99
257a380K545r95j68K384L29j015j352m57j943o74j70J158J010J429M50n18O69
274A302O40K9j414k253K023j866j32j13P43R96R8J723P87P4q71j599L11k511Q14
293a219j283L144k297J614K206j405K136j031n67K23j691p37k176J670p70J341
$$ y = [2400, 1811, 376, -1636, -1907, -4334, -2101, -1137, -955, 2976, 3202, 3978, 1668, 2664, -915, -2862, -2357, -3613, -3257, -4624, -111, 33, 2896, 3854, 3216, 4656, 2119, 938, -2196, -349, -2954, -1963, -1226, -1564, 1335, 1160, 3351, 3787, 3351, 2145, 651, -1099, -1497, -2741, -1621, -2643, -2176, -515, 2392, 2436, 2248, 3350, 1382, 1340, -318, -1644, -2400, -2132, -3340, -1499, 620, 1906, 1582, 2477, 2299, 2090, 306, -1061, -2795, -2053, -2736, -1746, -1204, 824, 1577, 1316, 2682, 2524, 705, 2498, 5, -1739, -2973, -3550, -981, -1380, 1165, 170, 2, 2386, 2715, 1700, 348, -109, -2052, -2726, -2896, -1738, -728, 701, 1151, 633, 1302, 1942, 1971, 557, -1696, 327, -1539, -1671, -1784, -1041, -45, 53, 1776, 2563, 2637, 1766, 167, 478, -2033, -1219, -2502, 642, -1655, -41, 2165, 760, 2896, 1865, 1298, 1521, -170, -907, -3083, -1413, -2183, -842]
309h42R94Q76N10n13Q59j112n3m0j988K12j040K192o15J405J379k600K210o61
327A173j385J456l36r81k176J0Q30R02m97J815N75M18J261l416m76J150k209J532
345c54k723K197M39K168k66K09j063O09j098m28p92j64p35J551n54m91J509m71
363d57J447j006R06J94o70P34k139J002l93r19O28M67p21M83J339M60J48j481
381B2q24K63m8K00m53O92J02R60O58j59j092J223r65j048K52k773J907q92K873
400H98j249M91Q0M3j06q46O26o66K04m9o24J627p57o9L55m15Q50P07N36j132q46
421c42j541K285k978K211j19M70J343N79r27j277J106j606J327l95k462R9P01
438a526J897k164J861J172J21r48j63M56j296J039n33p60J642j700M23n3K203
$$ y = [-842, 152, 1028, 1538, 1025, 1884, 772, 719, 679, -1309, -1097, -2137, 55, -560, 845, 2224, -376, 1834, 1173, -212, 1244, 908, -73, -2249, -2239, -1409, -507, -1004, 811, 1386, 1804, 3065, -351, -827, 323, -1886, -354, -3077, -880, -441, 1727, 1461, 1670, 607, 1216, 118, -310, -1102, -1266, -2001, -450, -1004, -1495, 14, -457, 990, -16, 890, 1084, 414, 1148, -991, 11, -382, -1301, -673, -206, -927, -444, 895, 1355, 1503, 22, -802, -539, -587, -387, -840, -148, -46, 914, 1572, 1413, 321, 1544, 579, -469, -217, -2990, -1083, -1975, 898, -351, 140, 220, 263, 157, -689, -63, -729, -525, -574, -1198, 429, -328, -397, -42, -457, 393, 1100, 1636, 504, -342, -1883, 402, -2576, -365, -484, -14, 1329, 1908, 981, -296, 810, -796, 531, 136, -2326, -2227, -1526, 371, -1793, 68, 1240, 1361, 413, 250, 706, -590, 449, -84, -844, 798, -902, -479, -532, 1671]
455A671o80l66N64j681L57o98k94o21J088K98o94Q77Q40l52O08J007j888j150
473a114J070K65n65K83k50Q77n90m64M02J306o65m18k86j287J283j918J030J221
491A80N85K49j01l6k02k59j7k49k29j325L223k032l29J247o65q1l72O1O28K05
511D81q1q36m84o8M33N59Q98k84l23N23L57n72o51l05p5j034K064j540J060N09
531F31j505J242Q2J728k093J29r93N00Rr17K546k191P15o9M60J940k505J347k181
550a125Q25j285J145l21k96J769j829K964k126J124o41P36M54j212r49L53J08
567c06r3n76r1J560r1l21N71Q20r22R52k726n47J119K08M62O8J377k36j468m48
587f88R09j32k17q15m80M90O83p10Q96J723j381P4k33N9q89O76m97J036P26k547
$$ y = [1671, 991, 625, 1189, -492, -135, -833, -1127, -1748, -660, -362, -1056, -179, 661, 309, 917, 1924, 36, -1114, -44, 221, -344, -61, -311, 566, -24, -488, -86, 1220, 555, 137, -149, -1436, -153, -2071, -1041, 180, 765, 1014, 913, 877, 675, 416, 399, 150, -79, -1404, 1819, -213, -542, 705, 40, -41, -413, -352, 276, 481, 400, -436, -920, -988, -555, 4, 902, 618, 295, 818, 1175, 603, -48, -353, -428, -1462, 602, -938, 122, 631, -874, 368, 450, 2178, 85, 214, -779, -279, -270, -1187, 1359, -832, -117, -186, 274, 2214, -291, 1056, -1125, -300, -1585, -440, -761, -1057, 712, -1117, 1847, -279, 845, 204, 940, 1394, 182, -767, -414, -306, -399, -975, -1066, 494, 403, 82, 653, 1473, 551, 1503, -1223, -1770, -651, -443, 19, 87, 1464, 1228, -240, -688, 221, 89, -128, -943, -1423, -933, -250, -960, -64, 1659, 278, 352, 119, 178, -711, -35, -532, 504, 1230, -1317]
607a317K247j632J211m12j304K469n22j588P76l80K18J047m42m17J99p29J044
624D68O62j160K151j725M10o69M31k74l24K05j863K764k007J014o43N93J536k003
642d34q7j452P17P15J405j49j434K60p4L13R59Q8r52k53K007k741K140o12p1q97
662e52l4J986j144m33N81N59j141J670k024n58Q73J030j154M39J515K07j765p35
680f80K302k258M20Q20n33P51j879O60J072n50r74J48J501j012L11l02j052J600
698C45j29N19p09J096r64m00M26j177K821k121O03j531M27J08K728j860j286J324
716B20P4J19m93Q73j230r64J791n49J081n99l02P87j532L016l156J369j507L47
734f55J126l88O99p23k72m44J319n32p15J396k359J693J44l97Q64j738J054Q3
$$ y = [-1317, 930, -702, 509, 97, -1207, 1262, 740, -848, -72, -452, -234, 813, 371, -46, 153, -576, 468, 1130, -30, 2121, 396, 806, 137, 568, 294, -30, 175, -1688, 1076, -931, 83, -560, 33, 1569, -434, -521, -1973, -1256, -541, 864, 715, -719, -459, -533, -220, 739, 827, -125, -378, 1629, -1112, 1028, 416, 345, -552, -586, 1400, 256, -177, 404, 963, -178, 1492, -532, -1090, -217, 813, -341, 98, 1613, 1820, 55, -680, 1622, -636, -216, 604, 71, 822, -1057, -397, 675, 125, -849, -701, 800, -212, 99, -203, -1255, 345, 216, 735, 26, 1122, 158, -242, 184, -993, 1828, -293, 310, -1221, -794, -686, 2042, 182, -1104, 220, 294, 413, -80, 793, -437, -1401, 390, -159, 922, 323, 21, 808, -724, 2292, -864, 505, -1002, -655, 471, 83, 782, 59, -213, -657, 662, 130, -585, 811, -1548, 145, 289, -108, 756, -982, 72, 155]
752A55J834j712q87K69J269N5k901J735m76J3l8J020j04j432J472k15M11j572
770a104J131J618j396j355J499n68m71L34k44J422j548J431l48K99j78Oj77j178
788h27J596n73O91m37j18j151K25J321j147o4J064O05r91m64O71q80K60k59N84
807A06R9J33O2j410J350r80rJ220k130K229o98J128j926j247L125j278J052j174
825c48p91J708r43n23k97J948o06l11l43l84N53J044j309k52O6K04P38M01R57
844A512j310N31j106R25o34Rj937L095p16j56N30r05O13n77k07J077m69j272J995
863I98k25O14j200J017j264l13l86P63l44N48j593N24J0K033j419j960J567J568
881I38J35j676q1J928j228q07P58J88j45j296K030j522k83P87p40J721j075J380
$$ y = [155, 1989, 277, -610, -341, 928, 983, -1918, -183, -659, -646, -684, 336, 232, -1200, 272, 57, 468, -1104, 27, 1645, 249, -1106, 393, -175, -646, -312, -556, 866, -682, 749, 401, 700, 522, 528, 351, -827, 769, 196, 887, 450, 332, -819, -594, 727, -420, -484, 580, 1185, 194, -270, 401, -479, -219, -478, 106, 205, 338, 400, -1010, 340, -640, -649, 571, -1559, 670, -28, 1100, -826, -2073, 1052, -226, 826, -348, -1139, 569, -374, -897, -1194, 754, 148, -163, -506, -890, -337, 707, -602, -854, -788, -584, 154, 555, 1512, 202, 733, -373, 552, -82, -73, -2010, 1085, 369, 213, 743, -162, 451, -126, -333, 744, 275, -997, 998, 773, 1387, 187, 1204, -60, -373, -759, 4, -340, 208, -1385, -861, -851, 1182, -237, -2197, -630, 938, 1073, -603, -684, 1244, 16, -791, -33, 155, 10, -1286, 744, -778, -1061, -274, -1014, 707, -368, 1012]
899A012j984R44O63q02k16J08J30l91J100N4r64L53j734J879k98r40J188Q73k08
918G67q53J31j119J489j039N48P00j51O84j804N70M27R7j702J726j559J500j832
936a420J459M81q82R7P60q15k62J65R31K34j699R99r39J927j413n7l85R5N61n71
956g34L13Q48l35J07j8r6J070j31m15n70l93n51M18J481k486J838m02J481j580
975a55P28l99j463K363j105K30o66R94O47j845J666r47L98l81Q1j54M16r9k6k54
995B9L55k66o99p78J035n64J808K46j666L63M55R35j172K23k42J58k49m70N61
1014F2o98J657j458j33R92j150J497N33j598K03p48J892j166j074K724j661j80
1031c06L70M87Q38j036m90M39K03j300J022r51R61J14p53K151k111K54L3j238
$$ y = [1012, -972, -28, 635, -167, -383, -275, -145, -536, 564, 618, -346, 7, -1727, 152, -146, -1086, 102, 975, 767, -86, 45, -1074, 415, -624, -76, 624, 473, 1157, -647, -77, 350, 447, -1255, 471, -1088, 412, -1420, 39, 520, -362, -265, 495, -320, -582, -417, 514, 748, -951, 48, -891, 1036, -377, -434, -819, -724, -163, -734, -421, 427, 92, 199, 181, 85, 1155, 1024, 609, 39, -354, -905, -487, 994, -1492, 346, -56, 1425, -155, 573, 174, -1289, 1074, -31, 199, -467, 527, 1174, -671, 995, 48, 446, 65, 146, -8, 408, 309, 283, 29, 384, 118, -581, -1359, -324, -888, 920, 1166, -500, -137, 318, 1253, 81, 304, 62, 220, -29, -499, 62, -636, 1021, -437, -570, 422, -728, 769, 1302, -296, -93, -841, 1051, -115, -1189, 1535, -126, -306, 64, 551, 1389, 353, -137, 302, 505, -795, 227, -724, 237, 351, -402, 1749, -362, -108, -75, -1313]
1049a313n59J392J193k13L71j676J242K83j328J889k032j01l45J492P18j029m56
1066d72o59J288j76j056L082k519J421j380J63R01j579J952r39M97q41J290k332
1083a359J443J92q85O20k089Q83J383j568K407J90L89l137L621j758k016K057
1099C73j792J005L34J694r06o91O44P05j982N16j66O4l44Q43k7n33J169n58j470
1118a122J391j065Q39kq45P36N29l60j69K07k01m9K63j011M49L68Q99q81P14k96
1138C94j146Q81o31j54l6M33j0O68j014O13J150j433J349j347k01j004J503O32
1156F47L80j454Q36m86o38J639l12L40j350Q86M80j714J445j192R97q59K7R07
1174E79o37O91j897L77P66j97M05q24k78P48j67N05O62Q27j894Q27l85J4J244
$$ y = [-1313, -1872, -480, 713, 500, 871, -805, 437, 720, -608, 1281, -751, -852, -1197, 295, 1013, -16, -472, -1131, 157, -19, -1075, 2007, -512, 909, -471, -308, 593, -986, 966, 27, 524, -317, 973, -1359, 84, 276, -609, 11, -2078, -1195, 188, -1380, 1027, 1217, 1606, -1531, 2090, 332, -1684, 373, -1419, -414, -80, 1614, 708, 17, 661, 1366, -616, -100, -266, -202, -546, 297, 270, -263, 906, 348, -1122, 269, -796, 43, 41, -804, -68, 461, 101, -68, 139, -62, -111, 152, -859, -410, -42, 857, -24, 690, 394, -752, 129, -502, -656, -692, -259, -269, 399, -615, -2, 1148, -285, 1064, -283, -484, -1488, 15, 647, 1027, -427, 409, -77, -715, 924, 612, 952, -398, 488, 968, -746, 699, -493, 504, -355, -328, 579, -58, 633, -1264, -887, -121, -318, 87, -737, -1015, -267, -434, 71, 733, 1560, -334, 493, 108, 122, 1366]
1193A366r60J42k102J383l75K18J035n85K42j629K023j302O39K38J306r30k336
1210a627K021k61o91M86l39K50q78R89l19o83R31n33j6K296j304j8j378J338K55
1229E19j363J258L67L02j966J869j836Q68M14N21J69j186K7M56j080J019M26j398
1247f14q53J093p23J090J074k91q7j688J487J75j784J359j185J255n96P69K58
1264G39r93J56n0K91j26P71p26P58j409o50J575j154K058j161j43n08j662L811
1282A577k059j453K133k81J464r51j110Q79N1K60P2n44r92P6K248j591P78j721
1300a164J554m55R67o89R25L37k101N61o69P24P49j013K71n69J570j267r56Jp25
1319a949J818n96K351k497K140j849K213k034M11J411j948J020P94k237J198k502
$$ y = [1366, 406, 548, -1554, -171, -546, -328, 707, 122, 364, -1265, 758, -544, 95, 333, 1639, 709, -1627, 394, 133, -558, -72, -411, -161, -1039, -50, -369, -1052, -121, -654, -670, 1626, 322, 304, -1074, 264, 519, -844, 414, 781, 1083, -883, 986, -850, 18, 432, 953, 1122, -64, -37, 419, -661, 358, 784, -614, -1467, -374, -1097, -7, 1067, 776, 689, -999, 488, 663, -1121, 238, -947, 308, -288, 481, 739, -254, -98, -148, 143, 17, 788, 62, 820, -589, -1239, 336, -818, 1240, 79, -64, -572, -2234, 1577, -482, -1935, 198, -83, 1381, 430, -680, 199, 250, 510, 582, 38, -954, -878, 1370, -221, 557, -1164, 390, -65, 902, 213, 1138, 1475, -626, -65, -734, -10, 739, -274, -3, -572, 998, -269, -1225, -1224, -1949, -131, -727, 1624, -873, 1267, -582, 1631, -403, 8, 1419, -529, 491, 1285, -952, 246, -2256]
1335b256K840j306N58n43J42J830j312O23k349J034K848k161M9j433K397l75j095
1352e09M07J266j503n87l21j88J900J66J93j78J67K53k117Q81j118J760K73l95
1370C50k05r49jJ074j09l36k35L24l18J29N11q42J17J557l31o32J90k175K42K025
1390C86j087M17R09N30L1j160o96O22L80j30J74M08j36j437N83N83l3r14J552
1409I82j867J305p65j60P52J38P83j144J18r53o6J441p47P04n50m22N26J070j084
1428F1q01J405o97j70J27q04L149l639N74M45P10j866J274p50j267J705K15L91
1446F2P77J25J87j345J00q98l46L353j538j329N00j40o52L056j176j228R34M3
1464D85j410J205J130n26k4L27j529r33N61Q88R6j190q8J426j187Q02L2l62R22
$$ y = [-2256, 584, -722, -164, -707, -565, 1265, -47, 576, -1773, -739, 2109, -52, -3, -1436, 961, 586, -509, -102, 1164, -339, -926, -1247, -1435, 465, 631, 824, 646, 813, 1066, -1051, -170, -1288, 472, 745, 350, 145, -804, -805, 269, 160, -176, -411, -87, -405, -276, 235, -607, -490, 1067, 736, 104, 294, -1881, -1639, 386, -701, -284, 625, 1155, 1186, 26, -670, -48, 332, 202, 376, 784, 648, -789, -206, 377, 344, -570, 982, -885, 420, -345, -505, 247, 385, 1168, 24, 142, -811, -877, 564, -183, 521, -29, -451, 75, 1145, 61, -740, 665, -32, -202, -75, -879, 2270, -1369, -795, -350, 360, -1506, -232, -982, -2249, -544, -329, 62, 839, 964, 1151, -194, -94, -992, -1338, 2015, 477, -852, -352, -492, -1144, 1912, 736, -492, 442, 485, -925, 280, 1410, 884, 860, 1187, -342, -1275, -714, 174, 270, -920, -1008, 418, -769, 33, 65, -297, 625]
1483F25r04J171j150o18K44P36K81K5L56J284k640J54Q61j224P15Q66j216K3K7
1502c84l00O09M08n26l17R9J072M82j948j65P89L88L30k96R47n51J82j499k17
1521h97L17r16K556o73o65L20L33J288n13k96l19P98l053K218j8R8P92k055N26
1540a59Q0j115J029K47J146j655M90P77j953P95l1p28Q62n31R42J8Q19j49q92
1559hJ455j206r74K49N32K17r99j67J57J588k476K841n05q1k793P62K117j174
1577d65O70l91l64J814j150J24j494J779o1p99R84o13J498j515o50p15J907l62
1595A97n6J178q29j53K52o61J822k715J183q30J390j503M00P0j623K747j012Q73
1613G30j683N37R58p63L46r41K474l123K211j968K174l20j210l47q27M179l224
$$ y = [625, -279, 892, -258, -876, -632, 104, 385, 410, 766, 2050, -590, -436, 425, -799, -84, 782, -434, -411, -384, -684, -75, 333, -193, -510, -411, 661, 1143, -805, -970, -181, 207, 537, 241, 1188, 637, 819, -680, -897, -580, -1496, 1060, 387, -278, 42, 375, 1663, 1150, 854, 535, 1333, -1720, 498, 480, 578, 1370, -685, -159, -79, -1194, -165, 82, 1228, -427, 63, 840, -1113, -318, -349, -1077, -215, -746, 196, 214, 1033, 884, -8, 1447, 241, -733, -484, 48, 265, -734, -901, -744, 844, -1632, 1209, 704, 623, -2170, -1408, 709, -465, 205, -186, -550, 1264, 114, 238, -1256, 523, 462, -337, 647, 34, 1532, 17, -633, -1348, 559, 197, 141, 1319, 490, 337, 589, -72, 1750, -965, 218, -612, 778, -725, -325, -255, -1878, 869, -143, 730, -953, -416, 542, -221, 125, -816, 1658, -1465, 746, -1222, 952, 632, -578, -925, -1752, 2427, -797]
1630g97M57J695l329N20J470M04j87m25Q95lo08L52j362J521q68K60n87J265J21
1649G94j492J550j633J00J742j086p71J064l37o19N66j1k14O44k31M91M29j475
1667d89K35L97o86R48m00J136p74n88n15J671j047J713k902J256n75l94J85J371
1685E42mj483J493l4j821J032K09L5N83j30j630K72K515j907R07j24j163P06n75
1704e77J005P31j276j246J227j68r58J534j167N55J78K35M79j03j84j990L252
1721A527j671L64p76P16J96r31N55k78J06k9Q30k070J931N38l2j165P32j64M5
1740D24L02n68N48j294R09J126j682J14M1m92J334j112k98j11O38o67J260j040
1758e68J930q9j462r27M95J369j773R76l62M76O35O80n73j253Ko65J985L7j409
$$ y = [-797, -340, 1355, -1974, -1454, 16, 420, 233, -192, 703, 700, 92, 444, -918, 603, -265, -5, -592, 673, 794, -698, 852, -781, -681, 1061, -25, -796, 268, -69, -688, -122, -133, -347, 297, 66, 557, 986, -489, -254, 143, -543, 405, 5, 1141, 367, -221, -736, 935, -112, 1601, -1301, -45, -620, -1014, -829, 542, 538, -945, 548, 514, -1307, -275, -66, -31, 552, 422, -1208, -936, 1579, -328, 579, 455, -708, -2, -577, 428, 1159, -117, -1363, -136, -304, -1262, 272, -895, -340, -162, 73, 552, 449, 265, -1725, 1527, -144, 220, -556, 160, 356, -575, -20, -298, -192, -221, 609, -1461, 470, 1008, 976, -189, 543, 379, 424, 726, 158, 706, -588, 321, 1447, -235, -121, -80, -572, 762, -350, -648, -759, -121, -788, 472, -568, 1362, 1273, -189, -1116, -621, 748, -1025, -49, -411, 65, 700, 1380, 807, -446, -444, -1109, 876, 913, -496]
1777d96J991l807K899J61k60m0o04P20j559J715r89p76R47L28j34q01O31J69l37
1796b42L09n59N81L51j441K398r24j056J327r8k98P82k19k653K194j31J04m0L00
1815F85m94q90K154j945Q63L47j427n09K056j207km60K098r71m19R7L69j97k61
1834a13K0n04J264k249P58K28J329j112K12J014o12l19J433j438J60j135K063
1851I99q84M38o07M83l64k27M01J47J748k479J537l085K59P93q9J29l61J904j221
1870d79R09n20J270j344O6j18j359J538J162j716Q42q02Q54L38j52Q68q30l51
1888A76K3J287k399Q5L72O59M95o73l40l90J057m2j069J151O97k178J255Q33j276
1907b77Q9K55j87N02q83P09l06J21m29J188J43j997O33J848j051o75Q90r98M31
$$ y = [-496, 1495, -2312, 587, 748, 488, 448, -156, 564, -995, 720, -269, -1045, -98, 230, 96, -705, -74, 95, -242, 67, -492, 89, 440, -1001, 1397, 473, -583, 744, 646, 348, 1130, 911, -1742, 452, 321, 425, 385, 685, 191, -699, 1455, -490, 373, 720, -707, -1216, 840, -367, -369, -829, 1269, 298, -121, -24, 345, 148, -113, -93, -597, 667, -1582, -824, -596, 733, -379, -167, 847, 235, -84, 1349, -89, 71, -1064, 999, 115, 553, -54, 429, 65, -162, 239, 386, 2134, -345, 1192, -1893, -1634, -841, -930, -801, -1162, 742, -479, 430, -90, 1180, -164, -98, -216, -1575, -37, 1125, -591, 251, -551, 303, 641, 489, 1357, 527, 176, 199, 1486, -913, -828, -456, 203, 698, 25, -315, -705, 352, 310, -759, 392, 1089, -1089, 166, 999, -277, -188, 67, -120, 382, -501, 208, -98, 23, -406, 782, 925, -1072, -439, 1409, 358, -317, 573, -425, 6]
1926Fo23J091k19r31J008j52l27j59p2J24p65K016q14R68j366N93k21L04L20j903
1946a122K245j728P02R51k018j437J910L38N15P59k132Q21J459j573J726k181
1962g65J154k4j503K00j33J138j141J602o91O28Q1o61O37n05r34k2O15O0J029
1981G65j500Q69J088j178O28j074o94J763q30k57o87J236R77j021j878J206K216
1998A629k288M63J37q32J120m31k30K525j750l50k57N88k06j80K581l606P53N89
2016B55j63mM92o63J269q78k18R04j005L07l06N6J593j637N68k83j840K461j168
2035b60J963k359J521j747K68L34N19L55p63l50J123j69O16j627P79n14P96j632
2053a147J64J613Q5n20p37j40J49L73J90n81N63n06J359o88l03k62m52K115j224
$$ y = [6, -617, 474, 255, -676, 332, 180, -147, -306, -378, -254, -1019, 997, 183, 1151, -215, 378, 157, 461, 781, -1122, 1123, -605, 97, 1048, -970, -2407, -497, -159, 356, 1115, -1017, -196, 1263, -310, 1416, -765, 389, 365, -1138, -938, -1071, 67, -1074, 528, -163, 465, 546, -115, 522, 17, -917, -939, -324, -264, 765, -735, 134, 1222, 44, 672, -402, -1096, 667, -163, -420, -1107, 129, 1106, 85, -1793, -587, 1629, -659, -196, -59, -891, 229, -202, -432, 2093, 343, -7, -264, 324, 118, -62, 2519, -1087, -334, 255, 92, 88, 580, -83, 1186, 308, 90, 994, -11, 296, -10, 46, 1639, 2, 570, 287, -1553, 908, -260, 1703, -656, 865, -882, -614, -280, 239, 594, -169, -519, 604, 435, 1051, -576, 203, -311, 485, -1147, -983, 630, 715, 195, -542, -682, -533, -160, 30, -551, 12, -494, 865, 177, -126, -388, -840, 1275, 51]
2072E1J506k157n51J346l23j15j185J247q49M15J576j417J925k546R05R18o8j391
2090g13M76L36R9l92l6m44J452m98p70R72O64j912M86R06P23j174n05j152K260
2109G78n97j326K693j639R26j101J180k912J506R37q74P41r71J55j96R05j341
2126a136k68J235p86J715j726j11o12K450R06o06m02j167K96J168j531Q53j231
2143i53J170n93O28m8j442J830j830J049j69q50l99K350o57j953K500M71j258
2160a54l75j177J075j342K651M50j281n03O82O72k730K638j022J125p77KJ565
2177A499m89K64j265O09M07k080J329K18m75Q24k39m27O88j429p72J535j528M80
2195h51J875j355K05J20P97j097j132K734j566P89k405J672J960p10n17j16k67
$$ y = [51, 1557, -600, -1151, 195, -128, -243, -1428, -181, -1030, -615, 961, -456, 1469, -1077, -172, 746, 678, -713, -237, 99, 198, -194, -230, -674, 778, 280, -490, 482, 1146, -766, -280, 626, 1349, 175, -330, -1482, 778, 181, -1145, 1548, -91, 835, -266, 914, -1998, -492, 445, -429, 312, -659, -504, -700, 205, -1136, -1404, -169, -955, 760, -966, -1077, -1689, 761, 1667, 1061, 659, -508, -212, 956, -575, 278, -953, 217, -376, 252, 204, -1238, 592, -1238, -189, -358, -1208, -1607, 743, 86, -1867, 633, 1104, -154, -529, -1706, -631, -1973, 678, 1128, -153, -656, 26, 698, -2032, 606, -416, 709, -68, -66, 1499, 1010, 1274, 9, 618, 1025, -1055, 274, 492, 17, 841, 602, 175, 863, -566, -1338, 197, -1331, -851, 1024, -331, -126, -6, 791, -306, -1438, 1296, -270, 519, -1886, -214, 1746, 1036, 519, 403, 136]
2212A36o75J775K85k977K452j380P6l88O50K007m544M173k294K599j114n64m77
2229b60j482K181j003L75J427l68j464O17k29l38L29L9q26K809j517j208j19K353
2247A316q95k283J419n77R13J42k19P98p52J142j797J100n47O90j008J822j257
2264Gl03P67l83L58O42n43j8n48l09O97L87p35j27J483j112j045O67R27j025o8
2284b81o37J610j01q01N14k20M01n61k00O43j78j1J300m58l468K709j368P23K42
2303a42Q63j861J921j179O87j67M9m57J251j239j059L75n13J123N07k08J040j458
2321d67p0J290j140J034j463J4m65J195M07n58L06n18P49l91N15r83R81J046R17
2340B399j833j516P72Q34j674P78q44O08Q09Q9j741J52n18L117j310P3j474J177
$$ y = [136, -539, 1236, 1521, -1456, 996, -384, -308, -696, -46, 1961, -2583, 1590, -704, 1895, 781, 217, -260, -1742, 439, -564, -189, 1238, 870, -594, 23, -206, -544, -215, -176, -1002, 1807, 290, -918, -1037, 1316, 421, -1862, -443, -1020, -107, 35, -184, 614, -138, 1004, -793, 307, -240, 450, -558, 1264, 7, -296, 471, 88, 446, 1088, 545, 527, -21, -330, 367, 754, 19, -108, 1375, 263, -782, -115, 812, -213, -281, -918, 692, 591, -210, 304, 84, 485, -76, -276, 367, 189, 178, 1478, 1020, -2448, 261, -1107, -384, -142, 721, -1140, 781, -398, 289, 122, 171, -286, 965, -274, -1333, -958, -1471, -348, 159, -49, 991, -467, -537, 753, -387, 647, -816, -802, -1267, -72, 335, -223, 83, -435, 314, -77, 438, -545, 436, 1482, 2399, 566, -950, -178, 656, -1018, -240, -1084, -476, 333, 422, -1319, -1167, -1685, 1432, 122, 195, -1279, -102]
2358a02N11q62N31p56J265j922J078J818k631M18q73J595q1J238j778M26j823
2375a948J491R76o0m29R60j408J646j924J325q44j004Q34o48R65j180J579p11
2392c80L00P6k102K713k13n28j818J973m37m93J515r93K031k605K853l018J560
2409D34j11k7m91M16Q37k10j650K901j003l9Q7j359K61m35k8j787L390k69q44
2428G3L73m4o75p26R61l55O5l89k06J693L37R8j530k06N67k90l42M21N3K98n83
2449d07k38R45Q83k097R18l29J4J723l096J721nq52N71J40o1j96M28J78p01J171
2469G10j036j12p47L08J148l74K01j326J379o69Q64Q9k89M63q32J724k164J343
2487F80r08j26K93n99J690j488l74Q92p25O79m5N74k094J685N50J1j938K29K328
$$ y = [-102, 409, -453, 78, -678, 587, -1335, -257, 1561, -1070, -652, -1525, 70, -11, 1227, -551, -125, -1948, -457, 519, 459, 30, 990, -418, 1228, -696, 629, -215, -1219, -385, -1033, -68, -1248, 331, -380, -80, -4, -2106, 607, 394, -134, -1952, 21, -416, -909, 606, -387, 1644, -961, 1892, -1126, 434, 323, 296, -195, 221, 1058, 848, -802, 2099, 1096, 1057, 1144, -215, 46, -389, -417, -2204, 1186, 917, 73, 446, 402, -273, -999, -38, -393, -328, -717, -923, 770, 1107, 1205, -325, -531, 36, -254, -596, -175, -122, 176, -407, -645, 300, 1183, -914, 4, -325, -311, 1412, -1684, 37, 32, -820, -249, -109, -170, -366, 62, 240, -461, 710, -326, -438, -1185, -877, 271, -103, 98, -1228, 151, -518, 346, 435, 146, 609, -223, 1501, -663, 680, -228, -354, -61, -660, 1030, -458, -832, 60, -665, 14, -31, 543, -1551, 134, 684, 695, -1243, -1014, 1314]
2506A314k469O27k44K492k126J30l39k32J927m75m62j04r62R62q86J329j199N22
2524a95J389k009J550j064O84J088m44P08j402p78r40L74J969n96j400J031m77
2541e12r11L00J829m72K27o66J022M25q51O37j146J030q47K70J85j495O01j52
2559e26J595j581K38J713j080k71R53J0k274J484J081k753J749p66J820j149R45
2576A188j737O16J834j822R84k611K490k421R58J094o28q30J046J326k473K73
2592g13P08R22j300j773K736p21N00p63M01K32l54J112J94k71m99o07M4r70P71
2611c51l64P74m34J33%j35m15L46J05J99r82J548L17K65j036n20J002R6P85k013
2631f80J03J29J63N15r14O53M47j826J102J0R50M42l5r05j525K328k583J801p81
$$ y = [1314, -1155, -528, -772, 1720, -406, -276, -615, -847, 1080, 605, 143, 39, -923, 39, -847, 482, -717, -195, 1194, -815, 735, -329, 355, 1443, 999, 1707, 305, -473, -1413, -1039, 930, 334, -1066, -35, -512, -1423, -1123, 706, 234, 461, -205, 817, 1242, 391, 1028, -118, 912, 65, 335, 520, -975, -374, -526, 1069, -512, -274, 1439, 359, 88, 1041, 1051, -1223, 261, 1342, -1411, 338, -428, 1392, 243, 1188, -549, 67, 1901, 79, 1063, -1548, 942, -1479, -521, 573, -55, -885, 161, 1487, -986, -713, -5, 917, -383, -2156, 580, -141, 359, -404, -3, 229, -125, 987, 1181, 910, 411, -196, -152, -1122, -351, -715, 59, -375, -242, -242, -377, -792, -446, -341, -142, -1124, 424, 741, 1006, -30, -550, 452, 548, 1333, -680, -577, -448, -285, 230, -684, -31, 416, -1410, -308, -298, 652, 1094, 1059, 154, -1371, 957, -1626, 175, -606]
2650f06J05J595k784K213o28J194j408J66l72nJ75m64K320j684K36q75m63Q14
2668d71L52j80o62L91J090j83r92R84l34M4j191R35o76K751r37j109n26J682o44
2687C24j659J781j034J710m78q75O32r74O02O04m20l04M69n38J115k612K642j618
2705f33O90q41J509M05j859J315n95j004K07J414j017J7N92j494J415k06O84n9
2723E40j13J55j317O46q96J649j587J131m75J178j708R22K481j835j104L64J83
2740B14j5m66r78J358N31N18k441J594j241J316q8o00P89j813K495j701L04R36
2758G12p41p81Q57m28k72R58p10j8L12j04O54j045J008q97L25O41o81K05p33J064
2778C26r90R54J176j801K91j168P63r07J303J431j506J087k509K220j72j221J307
$$ y = [-606, -501, 1094, -1690, 523, -105, 1089, -319, -153, -525, -530, -355, -819, 1501, -183, 53, -822, -1285, -471, -119, -299, -961, -570, 520, 337, -655, 329, -5, 39, -1152, -217, -893, 1858, 921, -188, -714, 968, 324, -1335, 446, -588, 1122, 644, -231, 401, -573, 29, 633, 213, -91, 378, -160, 955, -1657, 985, -633, 57, -784, 725, 1130, -729, 586, -9, -1013, -806, 608, -409, -392, 200, -1294, 121, -85, 599, 540, 427, 582, -735, -89, -985, 664, -923, 208, -267, 911, -797, 125, 2606, 771, -333, 31, 214, 199, -267, -1245, 113, 644, 1162, -1279, 315, -926, 390, 302, -298, 491, -1322, 1173, -528, -224, 712, -29, -810, 47, -381, -653, 305, -405, -423, -111, -215, 439, -606, 402, -495, -170, 471, -210, -5, -738, 326, -664, 290, 1466, -335, -44, -1212, -449, -1356, -53, 1378, -128, 959, -1550, 670, 498, -723, 584]
2795E84r92L87k48p90M98J50R0L46l51n29J468r56k20L81q37J614k48n68J21o70
2815g70M15O69j374J139o35J197j464O73O49J93K66j800K527k280K1J789m24m25
2833C66j447K065j811m13P13m69Q38o79J165j513K789k213R72k80j81N54j137
2850f81N88p65n64R53J06O83l56Q6R27L13o14j237J930j777N10o26J492j406O27
2869A89J007j560J315j11j828K039q82j426J781k032J794P33j098J578k332M76
2885c57K286k005m10J007j312J149j136O64P35r99k13M34M4O84n72j121N63J362
2903H03mp84k2j46P67k14N45k91j922J744j519J446r76R66P80r37J460k074N94
2922B16j326K147k212J259j99O1K51j670K177k642J910o6P36O24o35j803j49J159
$$ y = [584, -408, -21, -269, -1059, -561, -411, -321, 25, -326, -855, 613, -343, -563, -182, -1019, 595, 347, -221, -100, -770, -355, 314, -1060, 79, -556, 641, -823, -150, 499, 692, 958, -842, 1685, -595, -574, 1215, 791, 366, -1081, 984, -827, -1240, -527, -996, -158, -837, 328, -1185, 1604, -609, 363, 83, -98, 456, -681, -93, -858, -1422, -469, -363, 320, -36, 50, 977, 1290, 676, -561, 1369, -408, 102, -524, 968, -438, 189, 1196, -364, 951, 840, -988, 1051, 169, -1257, 524, -1508, 286, 1019, -79, 1499, -833, -357, 1929, -76, -486, 521, -791, 358, -778, -114, 621, -378, -591, -157, -113, 571, -1, -1122, -559, 803, 799, 15, -7, -153, 614, 400, 945, 654, -1268, 476, -1043, 403, -573, 393, 1173, 236, 1696, -378, 216, -1110, 1037, -1175, 84, -115, -54, 197, -1473, 704, -1938, -28, -94, 642, 1266, 631, -1172, -1321, -162]
2940a62J823q54O5j253J96j157O48Q73O32k110K70J391p97J364j546J057J326
2957A766j435j75p14O18n2J015j050j066J058j28N77l35j77o63J118j657J167
2974a33M83j601m50K132j087K21L57N80j71j02o35K00J79J060j158J452k499J699
2992E27j483J162O68q74J73p71N67M59k49n16o00Q27J69J064j128q33R65j286
3010a159K946k995O26M34l65j73j075K414j280J502j002k43N95o64J878k214L92
3027c83K28j507J486M70K59j373J255p26P40P34j455K19j606J11K001k14J406
3044A645k810J223J277j531P83m9O5j264J606L90j27m24q53O0M63j568J887J27
3062I00j347j890K457L57N1P20k106K81J20r01P23J871P82j605j107J287j5j109
$$ y = [-162, 1661, 807, 872, -381, -185, -1342, -694, 179, 811, -1299, -1029, 362, -435, 929, -617, 440, 1766, 331, 156, -558, 60, 8, 1023, -27, -1093, -35, -163, 414, 79, -98, -761, 357, -1300, -133, 350, -1251, -1701, 431, -656, -435, -78, 502, 331, 229, -406, -206, -27, 1033, -125, 1327, -1172, 527, -956, 206, 874, 0, 173, -598, -31, 428, 179, -337, -937, -110, 59, 1123, -5, -838, 127, -1159, 1787, -1208, -582, -148, -513, -686, -1761, 653, -627, 875, -127, -370, 225, -439, 1439, -775, -383, -155, -1662, -176, 294, 553, -820, 435, -291, 449, 1183, -272, -53, -1659, -1548, 453, 239, 1645, -1165, 58, 1335, -196, 587, 538, 603, -661, 945, 1335, 1208, 784, -69, -9, 454, -1114, 773, 900, -447, -2337, 120, 477, 528, 1248, -858, -577, -457, -1358, -635, 1236, 2018, 413, -694, 593, 578, -531]
3080e31M56l8n71J648j940N95M66P24j252J52O23l4J21n04o17L41p49J765j780
3099a125J185j719R79m4q77L88N11J574j409N77L81j663J052m07O75p50M31o46
3117h87r72J629J61J247k384J685L75p35J083r83j219K538k032Q79k195J967o61
3134e04P59n30O03l75r11K09M49L15k08N1P36o73m2l93j39J56L61p10m10J782
3154E26O53j432L21r92k1R8O31m6J26M62n47J15j06m89J69J736j167l72K069j528
3174B06p52N94L75k14j155O30o53M78k91k60J957j000K79j352k15J933j920J072
3192b88J29J727k391J213n03N88R47k660K428j394R87k66m99J61j247l8K16O46
3210b44K39N12o89J905j754n4j32j020L37J347r02J057m95j278N55l3J130q98
$$ y = [-531, -75, -113, -684, 964, -976, -381, 85, 809, -443, -291, 332, 298, 419, -85, -702, -361, -1110, 655, -1125, 60, -1659, -680, -724, -1601, -1213, -702, 872, -537, 40, 421, -1242, -190, -597, 78, -672, -241, -887, -1859, -230, -69, 1178, -1206, 479, 854, 119, 1202, 219, -1000, 1538, -494, 385, -1810, 157, -504, 255, -275, 328, -47, -958, -749, -300, 15, -193, -142, 594, -79, -121, -514, -653, -497, -136, -846, -1256, 526, 1179, -253, 68, -924, -945, -847, -216, -262, -136, 326, -221, -106, -212, -701, -532, 1204, 37, -335, 1734, 206, -546, 48, 423, 209, -946, -316, -969, -491, -782, -1042, 915, -85, 194, -1158, -1373, 560, -1360, -288, -159, 1568, -823, 390, -113, 475, 1422, -1238, 1190, -204, 783, 517, 18, 179, -1068, -1106, -890, -244, -5, 507, -182, 1723, -31, -85, -217, -1237, -900, 447, -455, 602, 107, -1171, -616, -649, 481, -417]
3228d17k07k97O84J302r17l87J544q60K34l66q20j25M10o33J5K305j229m04J63
3247er96J384K55M53j424n21J109m66P0k51K60j40n67J694j205L94J89J152j324
3266F1J084k122p3J326N1k68j501K392j559N11L31p59K614k141o5o43p68K120
3284E91r00K250k341o29J113N9J129j811O07j049Q14l54R81J216j009j024j274
3301a631K542p16k43J65k47N35p1j65o99J696m20r52O78l42r76N20M44m18J337
3320A037j145j61n05L45J09R24m15k75J77n86n93O37K75o36J343m16J96N63l65
3339E09p29J336r67j825j47J926K71m08k7N55J359m86r09m90L10J40J66j622J766
3358G28q36n70J665L88K5j397m53J845k366J762j391J370l95l31Q43j916J409
$$ y = [-417, -624, -921, -237, 1065, 148, -239, 1305, 445, 679, 313, -507, -632, -222, -855, -840, 1465, 236, -168, -5, -1001, 383, 638, 1091, -333, -854, 255, -211, -141, -392, -132, -272, -839, 855, -350, 44, 233, 1385, 61, 1145, -977, -1050, 276, 327, 59, -1442, 950, -609, -98, 233, -526, 2088, -53, -118, -761, -1529, 591, -309, 1941, -400, -1029, 84, 143, 1272, -539, 68, -981, -167, -521, 460, 1676, 667, -357, -1631, 911, 195, -48, 117, -130, 405, 334, 169, -530, 1166, 746, -206, 472, 130, -846, -326, 118, -300, 1037, -108, -269, -774, -429, -320, 604, 189, -86, 91, -495, -1088, -451, -176, -812, 531, 115, 311, 874, 509, -220, 1116, 149, -1676, -1823, 103, 374, -34, -61, 494, 1853, 1367, 458, -32, 278, 418, 584, -1038, 728, -108, -678, 987, 1375, 1400, 3, -450, 1395, -971, 791, -600, 770, 375, 44, 887, -1029, 380]
3375C80q3l47M22j439J715j654J057Q55p37N3o98l33n80K539r42o54j08L9K64
3394b51m71K3m02J640j765K505j188Q0L30j799J26K424j617o4P40Q01j158R68
3412I22l77j416J899k292L001n15q48M01K8o18p6L24n32j186K051j987R54L71
3430A04O36k41j293N96j523L066j564j136J317k9M67j752J884J62n62K23k16M05
3448E44p0j552J143j690K812k321R43M84j042J034l1L93j035J924k242J233r84
3465d57l19J766j25O0j595O10q4l93J336r25o0R03l76l16j11o7P38n09k25J810
3485A661k431n22K043j161J032O3L29j503J60K53m06Q93m13J023j467p13Q37J742
3503A420j381j02m44o99M29N99J04K92R07p04K94p09R3k11L18j187K22P05n06
$$ y = [380, 297, -50, 372, -1067, 648, -1006, 51, 906, 169, 222, -476, -809, -1389, 1150, 208, -446, -554, -515, -251, -722, -699, -1101, 539, -1226, 1279, 91, 171, 501, -1298, -1172, 1252, -365, -429, 311, 1112, -46, 922, 545, -871, 1028, -1264, 1737, 1222, 374, 775, 803, 185, 109, 433, -99, -1285, 766, -1221, -267, 104, 740, 499, -794, -198, -1721, 1345, -219, -1355, -38, -67, 400, -1352, 532, 694, 132, 355, 139, 544, 474, -1078, 65, -1625, 1187, -1134, -191, 293, -749, 285, 254, 647, -388, 1536, -706, 527, -457, -776, 990, 865, 925, -670, -60, -144, -537, 799, -126, -186, 717, 341, 25, -86, -153, 585, 76, -149, 1661, -770, -1292, 751, -410, 622, 685, 1014, -489, -329, -76, -482, 411, -2, 1021, -446, -1159, -322, 1420, 39, -63, -507, -1206, -777, -178, -74, 218, 1125, 421, 715, 6, 99, -112, 206, -981, -759, -54, -560]
3522e60P02K43j717N16R13M38r01k81J741n38j088j301J640j381K833k830O28
3539i43J868j907J047l88J563o02o90P74j916K476k211Q61r17m48J576l8n4m42
3557c91J233N31m62o98j22M89j327K40p29J022L18J284j703M10L19l18m17P90
3575D69j118K47n22J719r60N72o07j406K803p17J21p3j974M30N22m69N91L68p39
3594g43J37P92P8n78R71k52k4r14M50J020k170L54P88q70J203J00j241Q12j56
3613b43J7J209k183K267j008M85j100n29J018n10J984j125M76j322m60J115q3
3630HJ308q31j344J581j953K529o45J76j377J225J022j327J32j604J933j68P7
3647G42P44j694M15R6O83k001J478j01n38k8n77J131j05j073J490r58Q06j688
$$ y = [-560, 142, 385, -1332, -816, 97, 535, -366, -647, 1094, 556, -532, -1833, -193, -1574, 1259, -1571, -943, 925, -982, 65, -323, 1240, 638, -52, 722, -1194, 1282, -929, -68, -985, -1433, 143, 105, 51, -391, 842, 1373, 911, 213, 91, 580, -747, -507, -1236, -214, 104, 1388, -315, 95, 414, 96, -321, 469, -649, -402, -924, 795, -165, 407, -200, -1606, 1197, 480, 601, 528, -1446, -1016, -494, -963, -372, -4, -743, -606, 186, 264, -314, 657, 405, 381, -533, -83, 937, -1233, -879, -91, -961, 242, 342, -899, -87, -243, -226, 983, -1200, 1067, 59, 544, -556, -1085, -67, -577, 1407, 282, 758, -564, -1024, 91, 8, 1316, 485, -859, 722, -1231, 1298, 653, 829, -548, 677, 1699, 372, 504, -1100, 833, 665, 742, 1486, -208, 207, 303, 986, -1015, 463, 362, -176, -204, -781, 350, 245, -828, 662, -296, 510, -1178]
3665a178R42k26N65J322j203J602k080P21r55K41m44J772l89j782Q70N32N20J000
3683A830j626j596J672k0J029j394K31k440L220k93K5j240R93m17o76m15J757
3700F40J40o81O80j708L054j542J32l97N38j709J153J251k088N71j279P64J73
3717c08K49p6l54O71l73P76q59P86J11N11q63m49ro43J504m43J45J151l204L165
3737A488j984J794k423K650j492o16Q82o61n40J350j024J148L74o68M68j346o28
3754a228J242J154p32l19M23j56N41K04l85j504L144k658N45k36j782J335n40
3771i52J103N47l40M9p29P16j208N06j374N04J814j119P22L44j73m37m72P23j31
3790I3O4N47J301k394M48J001j736J083j127n54J349n84O41j024l09J063J172
$$ y = [-1178, -236, -462, 103, 1425, 222, 1824, -256, 465, -490, -249, -693, 1079, 690, -1092, -222, 310, 830, 1830, 204, -1392, 280, 260, 1289, -105, 126, -2314, 906, 613, 638, -602, 391, -26, -702, -1117, 640, 780, 99, 779, -929, 2125, 583, 715, 318, 856, -853, 300, 1551, -537, 34, -1245, -481, -308, -59, -135, -489, 182, -191, 585, -274, 512, 623, 1134, 271, -178, -187, -830, 674, 231, 376, 1527, -1677, 1488, -496, 1298, -1125, 1525, 33, -583, 299, -362, -902, 448, -576, 572, 946, 278, 746, -600, -1228, 14, 1168, 436, 117, 540, 384, 925, 1129, 744, -760, 2384, -274, 271, 35, -1747, -412, -952, 151, 698, 358, 407, -322, 394, -814, -308, -1682, -1178, 636, -483, 239, 583, 410, -27, -499, 224, 93, 157, 704, 2005, -389, 59, 1060, -676, 407, -720, -1274, 75, -509, 132, -892, -1201, -138, 1034]
3807A034j732k96K259j974J549r70o1N31j003Q01o78J856j857p20J111L0R79j11
3825G48R03j903J584r42j011kM21P85rp59J339p62K31n93N17J93p16Q97m17n7
3845D47k57q25q2J219J5j283J890r94j70j47N78n39m41o86J008j095J169r8M51
3864A60J70K69j143N37K75j546K251j420O38m62L27q46J055o7o25J034j329l03
3882a025J931j244J372k782J017j28J087O89j825J162j632K124m98m21j024K330
3898A133j479r35J607P51j782O29M98M74j828J713j344N47l75O02Q25j090J031
3915I77m02Q32p9q56R28j809Q42p45J801j939J098J332j822r87k06J161m06J191
3933I11n07j635J390K8M7J62o74P26k16K85o97l94J194j551l12J705j269J257
$$ y = [1034, -698, -994, 1265, -709, 840, -130, -191, 340, -663, 138, -540, 1316, -541, -1261, -150, -120, 859, 748, 1651, -252, 1332, 390, -621, -623, -202, 583, 574, -185, 1154, 392, 623, 30, 547, 740, 24, 921, 504, 447, 190, -635, -717, 502, 517, -766, 1124, 130, -40, -187, 391, -148, -589, -1275, -267, -1362, -193, -291, 160, 330, 599, -544, -7, 268, -1278, 973, -447, 191, -271, 56, -790, 265, 198, -427, 607, -722, -1025, 906, -338, 1034, -1748, -731, -859, 228, 917, -908, 254, -1378, 746, 248, -173, -1197, 1133, -346, -1281, 326, 1077, -705, -76, 422, 896, -932, 781, -563, -16, -391, 211, 1036, -54, 977, 575, 1407, 1328, 472, 1400, -409, 433, -312, 1489, -450, 648, 1980, 158, -829, -1035, 126, -280, 911, 404, -1231, 159, 187, 234, 396, -278, 448, 232, 517, -180, -574, 620, -931, -1243, 462, -807, 450]
3951D50j612K104k71n42R6o18o2J427p60P18K97k476K534o21m64k87m02M95K62
3970B68m05J441m99M10j120m83O88K72jq59P93j875J323N1k4J222r61Pj512J51
3990a113K089j074J583j903K204j025J14o29j426J616j871R68J194j217Q00Q04
4006A114j457p4J167j297M56J413j774J74K34R0m11l16M05J773k320J395r56P58
4024C74m1K86p14J139q07n78R64j945Q97P82q6Q06j466P45j006L66N16k12j19
4043i9q28J505o40K19j68R75r77m71J184Rr47j327K325q85r25J390k031K272j113
4062e32MJ069j197P70O56q18l67P19j269M38J738j640J01K29n5J534j524J057
4080I13r56J164j508p64J069k070L139k055J456p4n13K44l94R83r39P32o07N67
$$ y = [450, -1162, 942, 671, 129, 225, -393, -455, 972, 212, 930, 1227, -1249, 1285, 664, 200, -87, -489, 6, 268, -137, 1304, 805, 1215, 95, -388, 300, 572, 571, -288, 505, -1370, -47, 4, -20, 1202, 241, 248, -1264, -1113, 976, -98, 1485, -418, 1786, 761, 875, 246, -1180, 436, -1435, -467, 727, -490, 310, 1114, -343, -417, 750, -547, -91, 1322, -452, -278, -44, 46, -365, -681, -276, 1497, -823, 572, -384, 374, 333, 619, -95, 1044, 237, -341, 623, -1322, -425, 357, 271, 1077, -389, 356, -650, -284, 232, 20, -99, -927, 578, -62, 157, -11, 964, -13, -484, 700, 709, -238, -1565, 760, -125, -1050, 340, -1691, 581, -532, -528, 541, -656, 114, 770, -48, -415, 304, -965, -527, 1211, -429, -328, -99, -154, 1380, -144, 913, -43, 1121, -387, -1151, -82, -2152, 987, -1068, 388, 314, -199, 45, -349, 634, -305, 427, -180, 387]
4098C87q86J37Q68p31R02l71m71M48p15N2K79k24L33J38q68N89O02q87J057K05
4118H44p07O84n36r87l25Q88L09M94j080J055n81o3j916K622p84M41j011Q23M57
4137F27K42n77n60M05q35L09N49n25J002k87m93R21n69L38r92J602k504N99J746
4156I98j347R64m83p95M94J435j127P58k23p64j652K90R95n9K63k15P05J473k147
4175d37P37j473K187j764j19N73J194m10j162J039L73n20k67J84o55k22P48J496
4193A502k114L04l14M19K3J464j438m6M71k88j60Q5L97j003j15L43J611r40Q13
4212A014j808K96M86J32K31j462J181j619J609k68K52j80M80O91p79m5m9j172
4230a010J441j568J364R25j763J131j12j157M63M71j832L412j588J209j822J273
$$ y = [387, -499, -362, 506, -225, 677, 306, -165, 283, -432, -380, -101, -325, 8, 146, -722, -133, 469, -418, 639, 844, 137, 821, 285, -702, -1027, -139, 170, 664, -416, 639, 58, -5, -1921, 701, -83, 358, -653, 170, 627, 869, 292, -268, 137, -698, -389, 160, -365, 637, 350, -143, 778, 209, 547, -445, 1157, -1347, -748, 998, -349, 615, 132, -663, -169, 1266, 139, 897, 674, -90, -1742, -1452, -457, -516, -253, -468, 237, 1710, -437, 300, -1173, 1014, -750, -869, -296, 898, 488, -674, 365, 738, 218, -49, 135, -520, -742, 6, 1502, -612, -308, -622, -203, -180, 1284, -154, -200, 271, -17, -177, -92, 305, -698, -813, -470, 1141, 201, 1014, -794, -498, -12, 120, 351, -1111, 70, -1549, 60, -208, 44, -136, 344, 1035, 256, 211, 162, -1010, 431, -1137, 227, 1152, -611, 520, 408, -749, -286, 185, -1647, 1765, 177, 1386, -436, 837]
4246H37o16l78J03p63J450l83k39J140j019M67o43J114j158L55j37j336K079j611
4264g38J223k28N04o44k036J869q06K095j185P25j10j667J033q85K57O47n99J167
4282F22o66O41k28m79P58K73l99q20o92M71M28l65P09L54j29q12j27o86R33j539
4302a753K080m68J65n85l9O42m22K03o18P59o79M50J121n95m74Q39r32L75r12
4321h43N88l05J279l38q13Q45j267K737j654r69N37o78J192j433J790k732J544
4338e20P04n96R98q00J733k400R60m09j21K61j233J525J78j581K13k09M70K379
4356A552P15k231P22R10j116j448R14l00k59J244N19q22m04j42J131k030J010
4373c5O43n88K05l64J490j806o5O48j166J443q64P91M12j489J323r48Q08n40O61
$$ y = [837, 221, -157, -54, -817, 633, 250, 11, 1151, 132, 599, -44, 1070, -88, 267, 130, -1206, 873, -738, 485, 257, 761, 117, -1919, -50, -856, 1239, 54, 779, 669, -998, 35, -850, -593, 54, -545, 622, -44, 597, 369, -110, 648, 921, 522, -298, -990, -519, -91, -456, 253, 607, 478, -334, -461, -1147, -214, -1753, 327, -141, 24, -561, -600, 42, -380, -177, -795, -36, -715, -265, 856, 261, -213, 626, -306, 69, -843, -255, -560, 719, 381, -432, 413, -854, 1883, 229, -740, -203, -881, 311, -1122, 668, -2064, -520, 184, -412, 586, -214, 1519, -881, 79, -330, -451, -190, -1423, 102, 280, -1301, -1088, -1297, -827, 1552, 2267, 36, 758, 1668, 552, -896, 18, -282, -541, 703, 1222, 400, -4, -146, 985, -1045, -35, 608, 20, 225, -139, 1351, -455, -520, 128, -1038, 405, -459, 332, 744, -745, 578, -370, 438, -102, 559]
4392E59O7j154J234j710J041j060K61R85j11o67O08k58P15r38q2J701k49j291
4410c49J232j57N31m48j755J578k525J542L11l53R15j814K286j055k47j9J308
4427I81k76j880J544k179J499J735j040J514k591O24j063J726j543J871K13j852
4443g17R33lj325J403J6q08J161l83k40P34m80j639M26P15O3l08L02k52J472j010
4463F0K53q36N78L3J58j033L47j8l4L50o43O56r62O26R11j264P52J48K7l70O83
4484D22Q60r86O50j686M26j96J397r28J066q3j450N27j222L020k871L34K34o9
4502e55K44n43J508j009q94J629j345J534j435Q70Q53j377O06O8K89j50M51m79
4520B65j153O52m11J374j39n50k273J364Q10n07L261l681K7K7P62J191l62q69
$$ y = [559, 626, -528, 706, -1004, 37, -1023, -762, 223, 112, -555, 53, -205, 510, -428, -510, 1191, 942, -349, 883, 726, 1257, 809, -946, 632, -1893, -351, -40, -393, 522, -1292, 994, -61, -308, -327, 981, 705, -1175, 369, -1810, -311, 1424, 384, 1898, -693, -69, -1132, 594, -949, 922, 1135, -717, 216, 213, -1112, 291, 307, -501, 660, 277, 37, 771, 291, -1348, -922, -207, -144, -452, -150, -402, 1070, 60, 313, -523, 55, 88, 246, -787, -440, -458, -492, -142, -785, -129, -1091, -465, 446, -818, -66, 82, 109, -261, 422, 1282, 296, 946, -740, -314, -510, 887, -41, 1025, 942, -508, 19, -1203, 1817, -1054, -720, -486, -555, -311, -854, 654, -355, -1249, 380, -965, 569, -866, 4, 857, -520, 86, 154, 443, 293, 744, 265, -888, -236, -647, 727, 588, 38, -2235, -871, -61, -568, 2693, -988, -961, -934, -172, 1019, 657, -212]
4538b12l12O37R68j562M16l40J158j448L0m75P07M84q94K13K38P89P3j706P65
4557d71O65M56j215K04O02n42M06J71Q06k666Q34J518p59J50q66K213j162J81
4575E25n69N79J34p36p75O86N61N38j406K396j276k017Q06m22K354j351Q12r77
4593a38n93m50J185N47L47p69k68O07j378N74J393n64k05k77O70p46n89J219q92
4612c27K288j630K93k5o87P88n16J69j060L67r82J501R12k20l54k237J058O14
4630d8n1O66o23K8m22p1R54j185L82K4O1k0J147l6J28r98o56J10J593j123m9k29
4652d18J876j790m03J103O1Q9J52j688P08J801o60j220O14j036o24K206m75L83
4670F79l91L77j817J635K53j255n30M43J714k526P86P19K84k98r61M90p02J406
$$ y = [-212, -524, 113, 1081, -481, -65, -405, 753, -695, -665, -1140, -433, 51, -843, -630, -392, 397, 470, -1236, -471, 194, 650, -565, -361, 241, -301, 105, 276, 1082, -1584, -750, 768, 9, 159, -707, 1506, 344, 525, -44, 535, 669, -67, -842, -156, 405, 943, -463, 1933, 657, -1360, -554, -976, 1378, 27, 839, -138, -731, -1181, 4, 551, 898, 129, -139, 468, -910, -336, 1057, 493, 288, 11, 681, -65, -654, 565, -327, 1961, 331, 624, 599, -88, 700, 184, 353, -707, -340, -1322, 179, 1091, 871, 517, -1720, -662, -48, -99, 567, -56, -28, -450, -521, 433, -752, -370, -346, -285, -305, 842, 806, 934, -64, -720, -610, 983, -140, -189, -418, 1458, -332, -735, 368, 429, 518, 670, -1018, -310, 1491, 831, -389, 225, -811, -1435, 771, 296, 679, 288, 665, -1152, 483, 736, -519, -1049, -606, 1108, -1418, -632, 87, 371, 73, -888, -398, -1100, 306]
4688C06Q86n97L17r58J05J156j18j969P17j44m51J287Q6N2j365n55J803j529N59
4707d12K64O3p78J527R9j206l14J3O47j232J303Q16o54J174q25m82R78j425P5
4726c69m45R69j530K085n60j368N72k79J041j8k00j060J682n32m35Q82j042N53
4744e4n13L46r20N08K13J373p58r50J047j255R23l57J386r96j27q99J948j099
4762a84k12j59J545J3j198k28N81m05J046j715K535j631m68m08J746j21j109J224
4780H52k79l24j114J984j220j31j06M4K62P65n36j230P12QL26M63M05l81j44R
4800C65M75l569L263j334M81P04l31j006J501j319K023o10j978K237l98n80L24
4817B48r68O03K00j129J865L03j593R53n60J45o7l04K61Q60j879J013N12K61k23
$$ y = [306, 1192, 595, 912, -46, 59, 1215, 1097, -872, -155, -299, -750, 537, 623, 675, -690, -1245, 558, -971, -412, -148, -85, -863, 664, 763, -443, -757, -744, -97, -1329, -26, 790, 136, 1310, 485, 3, 981, -444, -369, -814, 155, -1375, 710, 150, -1218, -646, -925, 116, 98, -102, -1162, 520, -12, -447, 435, -607, -54, -567, -221, -1141, -633, -420, 953, 195, -755, 292, -963, -40, -397, 989, -7, -134, -1033, 915, -184, -396, -555, 990, 1003, -195, -423, 158, -247, 799, -916, 1619, -12, -480, -888, 858, 737, -372, 852, 573, 249, -865, 1119, -101, -232, -338, -294, -32, 733, 197, -1033, -321, -313, 13, 476, 881, 500, 356, 365, 840, -2729, 534, -800, -319, 385, 54, -952, 549, -770, 1253, 643, -1335, 902, 504, -76, 248, -720, -117, 83, -1046, 819, 1122, -471, 482, -78, 67, 0, -304, -43, 817, -1062, -49, 463, 724, 501]
4836E01j655J308j12n84K200n42j078k96k8o45l83N41J025K96j430J269r8j720
4854a431J994q33P4K63J115r11j327K487k670J20O31m68L013l129J733p82o77
4871g98J173p87J91N7J337j957L85N37p75O54j02J854j808K52j08Q5N67j950J704
4890E11o67l11n75J458j196R94n7J097j81m20l60m86n08R44k75m56Q3N16J112
4909A223j066m30p8m97J481j175R82J66j886K985j727J95q5J39N36m74J075n11
4927H53j621k99J259k93j23J059j963J869o72l46M05l25J532j923k19L355j130
4944A418j294r53J007n41J455r18l96J477k083J109J197j061J60l7M21k45o95
4961B1j050J792j474J234p88M81O6j195J968j345K86q2K94R64j799K885k447K189
$$ y = [501, -1154, 154, 42, -542, 1658, 1116, 38, -258, -286, -931, -1314, -773, 252, 548, -882, 387, 289, -1431, 563, -270, -196, 67, 1182, 271, -1056, 1431, -1239, -1119, -488, -956, 2057, -1072, 661, -121, -798, 375, -412, -221, -164, 1173, -784, -399, 138, -637, 17, -85, 1769, -39, 213, 105, 190, 757, -1193, 511, -156, -467, -1042, 416, -780, 214, 157, 1254, 1073, 653, 293, -193, -701, 243, -32, -488, -405, 111, 1223, 157, -273, -351, -848, 633, -542, 440, 606, -1280, 1705, -22, 173, 88, 227, 763, 289, 1364, 853, -768, -1067, 192, -101, -224, 835, -1128, 741, 69, -277, 128, -197, 1335, -588, -807, 2548, 1418, 124, -829, 178, -363, 1092, 174, -222, 1255, -828, 281, 1478, 417, 577, 540, 961, 716, 21, -1029, 763, -711, 523, -265, 216, 282, -913, 1055, -290, -4, -86, 208, 1172, -627, 2258, -189, 2000]
4979B000k103n32R55j555J721k79P86q87n11N84N34l72p99j37L08r14K131M62
4997A392j747J83K12j45k01n40J021M60j593N79Q02K19n89q87J297J0j932J486
5015B7p58M84L59N88Q1j332J83O53N72k486P5O16Q19j35L41m22q50M51J260q13
5035b87J78j099J514k344J522Q35n42N00j200K163p46J18k33q6o88n00J140K89
5053E34j263J124j195O9Q78O28M27j787J229n04J124j630N91r26q6J236J11N65
5071A125k820K008O90p83r59P2L15R0J345r54M0L09o50J111j867n50J009K12N83
5090C26J420k277Q50P5n59n62J573j34n99J601j274j76m47J69J44m96J698l9q03
5109D90l37q75N51l81j67j282L293j839J220j126j127K508k146J629k69j211J243
$$ y = [2000, -103, -635, 320, -1235, 486, 207, 993, 106, -405, 179, 713, 341, -458, -595, -287, -1201, 930, 1392, -355, -172, 40, -105, -306, -846, 175, 635, -958, -379, 423, 642, 53, -834, 463, 473, -1459, 27, -731, -247, 112, 700, 781, -551, -368, 285, 857, -1629, -1554, -938, -119, -254, 87, -335, -1185, -734, 526, -287, -109, -1208, 306, -2038, -516, 319, -223, 277, -923, 1240, 494, 612, 379, 293, -395, -895, 245, 534, -729, 395, -800, -731, 147, 775, 1202, -585, 644, 140, 1264, -366, 225, -701, -787, 449, 560, 1125, -1695, 313, 1003, 220, -739, -667, -352, -262, 1083, 129, 169, 478, -172, 939, -928, -1478, -469, -257, 326, 1746, -531, 319, 394, -165, -727, 846, 712, 113, 1714, 440, 264, -183, -14, 130, -366, 1332, 1293, 490, 153, -722, -171, -552, -719, -2001, 1292, -547, 673, -453, -1580, 928, -1218, 411, 142, -1069, 174]
5126A74q60J081j299k8J107N91j042M72r59N16Q76l77Q54k595K590j541m48K408
5144A520j708R01p58Q25m30o96p12N49O77j049O72O09p07K187k750J170j065Q17
5162E2R37k698J120R33q35J623j469N1N49J10j352Q01j72J089l1o02j274Q86J088
5181H06o67K64j164J169j909J337q99J306l6J114j437o86J297o80ol6Q9M57n28
5200b09J838j860L66j50J091j891J101p38P2Q07j808O42J788o85q07r5K305j487
5218B80M94k027J026J164k296J652r35J702r50L52o21n18L009k093j205Q14j50
5235c02J000l54j254l61K353k132J827P45k252O91L07J89j161L90J24J019o37
5252A92q10j55L156l328l00J095K168k534K352r94l030J960K41R22n65m34J048
$$ y = [174, -686, 395, -904, -932, 175, 766, -276, 196, -763, -247, 629, 252, 1106, -1489, 1101, -440, -888, 1520, -188, 713, -45, 780, 350, -346, -1058, -509, 168, -881, -209, 400, -307, 1880, -870, 300, -765, 52, 989, -1709, -589, 344, -491, 1132, -337, -286, 263, 373, -979, -178, -350, 739, 708, 106, -1168, -282, 806, 139, 403, -761, 408, -1501, -164, -1063, 243, 207, 1321, -116, -802, 495, -185, -191, -227, -138, 319, -209, 1629, -231, 135, -15, 1076, -815, 286, -452, -380, 427, -1381, -739, 1049, 364, -443, -538, 1767, 280, 774, -1253, -227, 937, -1359, 293, -642, 1060, 110, 462, -159, -677, 2332, 239, -966, -152, -302, 698, 344, -910, -1271, 1082, -1050, 777, 1522, -730, -39, 268, 457, -704, -314, -190, 829, 192, -618, -773, 2383, -945, -1245, -150, 2018, -516, 1836, 842, -2188, -228, 13, 935, 370, -64, 984]
5269I84j411J112j030M63l16l15J64k29M32J057n16K08J22J48j53Q78j728R16
5287G86j151o88K166j557K011o57j110n56o6l34J766R60j492P76j602J268j295
5304g75J343J018k564J154P36k647K531j266Q24q9n69m82J700J11r21K028l087
5321i55J247o01L1l52N52R89j456k54J353p92K58k098K612n07o19N59N32l03j722
5340a526L009m99j189J084o64J235j226N69o25m33J022J398j074j735M08k47N68
5357G5l57n94R51Q41j670J495j880K051j162K89Q4j438J570j454J188j46n23o36
5375a316R34J187k374K079j362J423p00o82M69J11J07m65J261p91o9M0o25J330
5393E57l47n43r45J663Q71k889J313K11K93m7j4p81M13O71j526P25M16L68j034
$$ y = [984, -427, 685, -345, 118, -198, -513, -349, -578, -146, 911, 395, 603, 725, 873, 720, 1598, -130, 786, -365, -1053, 1113, -444, 1567, 910, -200, -756, -822, -1156, 610, 1570, 78, 854, -748, 520, -775, 568, 1586, -978, 176, 912, -1735, 796, -470, 354, 265, -304, -786, 914, 1025, 104, 2132, -955, 292, -309, -278, -630, -78, 911, -545, -799, 554, -238, 20, -2078, 534, 27, -592, -33, 499, 196, -1526, 1483, 984, -205, 879, 215, 1450, 224, 793, 168, -265, 757, 2155, 1081, -654, -246, -493, 75, -282, -876, 75, 916, -754, 741, -1139, 912, -250, 39, 123, -1315, 255, -1199, -11, -157, -680, -1316, -382, 805, -1569, 510, -852, 571, -129, -811, -342, -231, -124, -589, 672, -119, -188, -148, -773, 557, 210, -333, -1278, 385, 1256, -1633, -320, -109, 184, 137, 123, -658, -245, 426, -1100, -375, 41, 409, -625]
$$ [...]
##END NTUPLES=NMR FID
##END=
