##TITLE=31Pdec_De-80H2
 D2O, 64 sc
 12.2.2025
##JCAMPDX= 6.0         $$ Bruker NMR JCAMP-DX V2.0
##DATA TYPE= NMR SPECTRUM
##DATA CLASS= NTUPLES
##ORIGIN= UXNMR, Bruker Analytische Messtechnik GmbH
##OWNER= root
$$ XWIN-NMR		Version 3.5
$$ Thu Feb 13 14:48:35 2025 Russian Standard Time (UT+4h)  she@DPX200
##.OBSERVE FREQUENCY= 81.013821
##.OBSERVE NUCLEUS= ^31P
##.ACQUISITION MODE= SIMULTANEOUS
##.ACQUISITION SCHEME= undefined
##.AVERAGES= 64
##.DIGITISER RES= 17
##SPECTROMETER/DATA SYSTEM= spect
##.PULSE SEQUENCE= zgpg30
##.SOLVENT NAME= CDCl3
##.SHIFT REFERENCE= (INTERNAL, CDCl3, 0, 198.062)
##AUDIT TRAIL= $$ (NUMBER, WHEN, WHO, WHERE, WHAT)
$$ ##TITLE= Audit trail, XWIN-NMR		Version 3.5
$$ ##JCAMPDX= 5.01
$$ ##ORIGIN= Bruker BioSpin GmbH
$$ ##OWNER= she
$$ F:/spectra/data/she/nmr/P31/2/pdata/1/auditp.txt
$$ ##AUDIT TRAIL=  $$ (NUMBER, WHEN, WHO, WHERE, WHAT)
(   1,<2025-02-13 14:47:15.06 +0400>,<she>,<DPX200>,
      <created by zg, POWCHK disabled, PULCHK disabled
       configuration hash MD5:
       00 E9 B6 7A A2 85 ED C7 34 08 36 98 17 FE 4E 26
       data hash MD5: 32K
       F9 07 E5 46 44 A0 B5 FE 54 D4 16 58 9C D2 39 AF>)
(   2,<2025-02-13 14:47:18.07 +0400>,<she>,<DPX200>,
      <Start of raw data processing
       efp BC_mod = 2 LB = 1.5 FT_mod = 6 PKNL = 1 PHC0 = 1714.344 PHC1 = 150.6954 SI = 64K 
       data hash MD5: 64K
       AF A2 38 6A C2 2C 7E 33 43 57 52 5F 49 88 16 40>)
(   3,<2025-02-13 14:47:59.85 +0400>,<she>,<DPX200>,
      <pk PHC0 = -2.373027 PHC1 = 0 
       data hash MD5: 64K
       DD 0C 8B E4 45 04 C2 C0 7A 76 B2 A4 6B D3 3D 9A>)
$$ ##END=
$$ 
$$ hash MD5
$$ E9 E8 0B 95 77 6E 66 2C 30 75 B2 6A 1A 31 08 2C
##$RELAX= 
##$RELAX= 
##$RELAX= 
##$RELAX= 
##$RELAX= 
##$RELAX= 
##$RELAX= 
##$RELAX= 
$$ Bruker specific parameters
$$ --------------------------
##$DU= <F:/spectra>
##$EXPNO= 2
##$NAME= <P31>
##$PROCNO= 1
##$TYPE= <nmr>
##$USER= <she>
##$AMP= (0..31)
100 100 100 100 100 100 100 100 100 100 100 100 100 100 100 100 100 100 
100 100 100 100 100 100 100 100 100 100 100 100 100 100 
##$AQSEQ= 0
##$AQ_mod= 1
##$AUNM= <au_zg>
##$AUTOPOS= <>
##$BF1= 81.014009
##$BF2= 200.13
##$BF3= 200.13
##$BF4= 200.13
##$BF5= 200.13
##$BF6= 200.13
##$BF7= 200.13
##$BF8= 200.13
##$BYTORDA= 1
##$CFDGTYP= 0
##$CFRGTYP= 5
##$CHEMSTR= <none>
##$CNST= (0..31)
1 1 145 1 1 1 1 1 1 1 1 1 1 1 1 1 1 1 1 1 1 1 1 1 1 1 1 1 1 1 1 1 
##$CPDPRG= <waltz16>
##$CPDPRG1= <>
##$CPDPRG2= <waltz16>
##$CPDPRG3= <>
##$CPDPRG4= <mlev>
##$CPDPRG5= <mlev>
##$CPDPRG6= <mlev>
##$CPDPRG7= <mlev>
##$CPDPRG8= <mlev>
##$CPDPRGB= <>
##$CPDPRGT= <>
##$D= (0..31)
0 1 0 0 0 0 0 0 0 0.06 0 0.03 2e-05 3e-06 0 0 0.0002 0 0 0 0 0 0 0 0 0 
0 0 0 0 0 0 
##$DATE= 1739443634
##$DBL= (0..7)
120 120 120 11 120 120 24 19 
##$DBP= (0..7)
150 150 150 150 150 150 150 150 
##$DBP07= 0
##$DBPNAM0= <>
##$DBPNAM1= <>
##$DBPNAM2= <>
##$DBPNAM3= <>
##$DBPNAM4= <>
##$DBPNAM5= <>
##$DBPNAM6= <>
##$DBPNAM7= <>
##$DBPOAL= (0..7)
0.5 0.5 0.5 0.5 0.5 0.5 0.5 0.5 
##$DBPOFFS= (0..7)
$$ [...]
##$SUBNAM3= <"">
##$SUBNAM4= <"">
##$SUBNAM5= <"">
##$SUBNAM6= <"">
##$SUBNAM7= <"">
##$SUBNAM8= <"">
##$SUBNAM9= <"">
##$SW= 400.765351723535
##$SWIBOX= (0..15)
0 1 3 0 0 0 0 0 0 0 0 0 0 0 0 0 
##$SW_h= 32467.5324675325
##$TD= 32768
##$TD0= 1
##$TE= 0
##$TE2= 300
##$TE3= 300
##$TEG= 300
##$TL= (0..7)
0 120 53 12 22 120 120 120 
##$TP= (0..7)
150 150 150 150 150 150 150 150 
##$TP07= 0
##$TPNAME0= <>
##$TPNAME1= <>
##$TPNAME2= <>
##$TPNAME3= <>
##$TPNAME4= <>
##$TPNAME5= <>
##$TPNAME6= <>
##$TPNAME7= <>
##$TPOAL= (0..7)
0.5 0.5 0.5 0.5 0.5 0.5 0.5 0.5 
##$TPOFFS= (0..7)
0 0 0 0 0 0 0 0 
##$TUNHIN= 0
##$TUNHOUT= 0
##$TUNXOUT= 0
##$USERA1= <user>
##$USERA2= <user>
##$USERA3= <user>
##$USERA4= <user>
##$USERA5= <user>
##$V9= 5
##$VALIST= <valist>
##$VCLIST= <CCCCCCCCCCCCCCC>
##$VD= 0
##$VDLIST= <DDDDDDDDDDDDDDD>
##$VPLIST= <PPPPPPPPPPPPPPP>
##$VTLIST= <TTTTTTTTTTTTTTT>
##$WBST= 1024
##$WBSW= 4
##$XGAIN= (0..3)
0 0 0 0 
##$XL= 0
##$YL= 0
##$YMAX_a= 14853
##$YMIN_a= -13357
##$ZGOPTNS= <>
##$ZL1= 120
##$ZL2= 120
##$ZL3= 120
##$ZL4= 120
##$ABSF1= 0
##$ABSF2= 0
##$ABSG= 0
##$ABSL= 0
##$ALPHA= 0
##$AQORDER= 0
##$ASSFAC= 0
##$ASSFACI= 0
##$ASSFACX= 0
##$ASSWID= 0
##$AUNMP= <proc_1d>
##$AZFE= 0.1
##$AZFW= 0.5
##$BCFW= 0
##$BC_mod= 2
##$BYTORDP= 0
##$COROFFS= 0
##$CY= -3
##$DATMOD= 1
##$DC= 0
##$DFILT= <>
##$DTYPP= 0
##$F1P= 0
##$F2P= 0
##$FCOR= 1
##$FTSIZE= 65536
##$FT_mod= 6
##$GAMMA= 0
##$GB= 0
##$INTBC= 1
##$INTSCL= 9.790993e-09
##$ISEN= 30
##$LB= 1.5
##$LEV0= 0
##$LPBIN= 0
##$MAXI= 10000
##$MC2= 0
##$MEAN= 0
##$ME_mod= 0
##$MI= 50
##$NCOEF= 0
##$NC_proc= -9
##$NLEV= 6
##$NOISF1= 182.463
##$NOISF2= 159.3651
##$NSP= 0
##$NTH_PI= 0
##$NZP= 0
##$OFFSET= 198.0616
##$PC= 4
##$PHC0= 1711.971
##$PHC1= 150.6954
##$PH_mod= 1
##$PKNL= yes
##$PPARMOD= 0
##$PSCAL= 0
##$PSIGN= 0
##$REVERSE= no
##$SF= 81.0140089999434
##$SI= 65536
##$SIGF1= 159.3651
##$SIGF2= -187.1042
##$SINO= 113.3802
##$SIOLD= 16384
##$SREGLST= <1H.CDCl3>
##$SSB= 0
##$STSI= 65536
##$STSR= 0
##$SW_p= 32467.5324675325
##$SYMM= 0
##$S_DEV= 0
##$TDeff= 32768
##$TDoff= 0
##$TI= <>
##$TILT= no
##$TM1= 0
##$TM2= 0
##$TOPLEV= 0
##$USERP1= <user>
##$USERP2= <user>
##$USERP3= <user>
##$USERP4= <user>
##$USERP5= <user>
##$WDW= 1
##$XDIM= 65536
##$YMAX_p= 305630384
##$YMIN_p= -399054093
$$ End of Bruker specific parameters
$$ ---------------------------------
##NTUPLES= NMR SPECTRUM
##VAR_NAME=  FREQUENCY,     SPECTRUM/REAL,   SPECTRUM/IMAG
##SYMBOL=    X,             R,               I
##VAR_TYPE=  INDEPENDENT,   DEPENDENT,       DEPENDENT
##VAR_FORM=  AFFN,          ASDF,            ASDF
##VAR_DIM=   65536,         65536,           65536
##UNITS=     HZ,            ARBITRARY UNITS, ARBITRARY UNITS
##FACTOR=    0.49542278885378, 1,            1
##FIRST=     16045.7642231865, 0,            0
##LAST=      -16421.768244346, 0,            0
##MIN=       -16421.768244346, -399054093,   0
##MAX=       16045.7642231865, 305630384,    0
$$ Real data points
##PAGE= N=1
##DATA TABLE= (X++(R..R)), XYDATA
$$ [...]
7359i304920o950005j293044K434055J255348o09880J771090N488465L387893
7351c820998m090916p465171j342661P056359P638175J251328k901851j098193
7343d773928J404251N10898r30394K69067K080716J985480J641584K538536K048192
7334F774402j103438k146916K480843O933963K865794p339348j2616495q469248
7326a2620443j938116j2340j299154k079575k645646l070637M0749O609653R238803
7317g776706L505522l197326j535878N076119N472616j563064n374057j76550
7309e569324O534399N922463l39290n046685n541302l476986K4326L466264L582918
7300d43217J30842j714485J258684M461196K481719k047963k895105n5159J992601
$$ y = [-9304920, -16254925, -17547969, -15113914, -13858566, -14468446, -12697356, -7208891, -3820998, -7911914, -15377085, -16719746, -9663387, -2025212, -773884, -3675735, -4773928, -3369677, -2858779, -3789173, -3520106, -1439390, 546090, 2187674, 4726210, 6774402, 5670964, 3524048, 6004891, 12938854, 15804648, 8465300, -4151195, -12620443, -14558559, -14570899, -15870053, -17949628, -20595274, -23665911, -23625162, -17015509, -7776706, -4271184, -7468510, -9004388, -3928269, 1544347, -18717, -5392774, -5569324, 965075, 6887538, 6548248, 1501563, -4039739, -7516725, -7492399, -4026135, -443217, -312375, -2026860, -768176, 3693020, 6174739, 4126776, 1231671, 1176512, 3169113]
7291C169113K894126N057157N733563J06336p733709p202619K772248R821315
7283A4617530M999834m723496p154802j300610M289364M601476J520158k838145
7275A4011309p969550j1033309q275763j109299M558309N615201M016282K019517
7267A832697l2618j144953N1564J804593R17846j169534P87816P118141J0624566
7258B0790118N998827k395182o287918m117947j381509j937568l584182k691503
7250D393136J95666J084686k330122p411613q738038l872965L280220O218250
7242g180780L181850j092180j878157m11649r33161l367785k799843K971127Q783081
7233b727497P966287J367827l214058j193681K941476K573885j285713j985577
$$ y = [3169113, 6063239, 11120396, 16853959, 16960295, 9226586, 2023967, 4796215, 14617530, 19617364, 14893868, 7739066, 6438456, 10727820, 15329296, 16849454, 14011309, 6041759, -4991550, -13267313, -14376612, -9818303, -4203102, -186820, 1832697, 1800079, 655126, 706690, 2511283, 3429129, 2259595, 3047411, 10165552, 20790118, 26788945, 24393763, 18105845, 13987898, 12606389, 10668821, 7084639, 4393136, 4588802, 5673488, 3343366, -4068247, -12806285, -16679250, -13399030, -7180780, -3998930, -5091110, -6969267, -7380916, -8314077, -11681862, -14481705, -11510578, -2727497, 5238790, 6606617, 3392559, 2198878, 5140354, 7714239, 6428526, 4442949]
7225D442949K087034M804324J845433k742638l196158o26309M5564j622993k195155
7216B842051j225129j481670l227912m137798m446204o121891p016716k652417
7208b7467686N151819Q591834N189073J795263L623707N929153J968601n997624
7200a215860r956559p108235j708618J930925L024862K230424M86721p94674j432572
7191a4543586k870195m533486k878473K643456O385719L962514l82921M37093
7183a1779879N586147P559729L050782l397617o252529m255906Q08625N587875
7175c092773N837876P13674m020114k230817L630064N455292J073334l407049
7167C959487l385420j294290o50040q11277l08596j05153o60022j96247J548571
$$ y = [4442949, 6529983, 11334307, 13179740, 10437102, 7240944, 6614635, 6660199, 5037206, 2842051, 1616922, 135252, -3092660, -7230458, -11676662, -17798553, -24815269, -27467686, -22315867, -13724033, -8534960, -6739697, -3115990, 2813163, 4781764, -1215860, -11172419, -18280654, -19989272, -18058347, -15033485, -12803061, -12316340, -13111014, -14543586, -17413781, -21947267, -24825740, -22182284, -15796565, -11834051, -12216972, -11779879, -6193732, 1365997, 4416779, 1019162, -5233367, -9489273, -8680648, -3092773, 2745103, 3458777, -561337, -2792154, 837910, 6293202, 7366536, 3959487, 574067, -720223, -1370263, -2181540, -2490136, -2595289, -3255311, -3451558, -1902987]
7158a902987K005655M35016l50042R28036J667201M67095j17751J331568J939901
7149F403692k50241k370723j709938l82455r26986j204189J548985M766143L793359
7140I667647r54948m784881n244214l662546j425474J092337K435927P88689k802981
7131d890444m545819j886315L740651Q064350P626557L226543n48152q70972n42591
7122I373808l081589n635444k560085M334493O651419K214757j137730J741349
7114A1900978N083240K476431k331623k690629p77195k868677p319171p008985
7106c535631j405660K982573K938999R95897j370615m771228o742393l687017
7098a4595075K015943M377052L133111L211828N211309M561617M72355k517262
$$ y = [-1902987, 102668, 537684, 187642, 1115678, 2782879, 3249974, 3132223, 4463791, 6403692, 6153451, 3782728, 2072790, 1690335, 763349, -440840, 1108145, 5874288, 9667647, 8712699, 3927818, -1316396, -4978942, -6404416, -5312079, -2876152, -2087463, -4890444, -9436263, -11322578, -7581927, 482423, 8108980, 11335523, 10787371, 9916399, 9373808, 6292219, 656775, -1903310, 2431183, 9082602, 11297359, 10159629, 11900978, 16984218, 19460649, 17129026, 14438397, 13661202, 10792525, 3473354, -3535631, -4941291, -1958718, 980281, 1976178, 605563, -4165665, -10908058, -14595075, -12579132, -8202080, -5068969, -1857141, 3354168, 7915785, 8388140, 5870878]
7090E870878k737322l166732m254276l075589l40785K88244L31647M295257Q738548
7081E949870N102539m325880o271091K878443R541394L659145n728396n944222
7073D861802n24832p74960o046038o794181k018350O12942p06842p15261P25409
7064a1380311j889298p500356p755461n00532O483170P630284N852334M152272
7056d907898P18875l886311l829717K513196P737797N731330P06799K45071M298585
7047I327727O873884N014044P80631l153279n324786m774970k235301n62335j328920
7038D616695k705161k733700k297002k652824k692364j242692L08428M10691L05030
7029h682899J874822M237821N048615L927738K432476J691166J771248K314740
$$ y = [5870878, 3133556, -33176, -4287452, -7363041, -7703826, -7415582, -7083935, -2788678, 5949870, 11052409, 6726529, 455438, 3333881, 12875275, 16534420, 10806024, 4861802, 4336970, 3562010, -2484028, -9278209, -11296559, -10683617, -11390459, -12105720, -11380311, -13269609, -20769965, -28525426, -29025958, -22542788, -14912504, -9060170, -4907898, -4189023, -8075334, -11905051, -9391855, -1654058, 4077272, 4784071, 5029142, 9327727, 16201611, 21215655, 21996286, 18843007, 13518221, 8743251, 6507950, 5945615, 4616695, 1911534, -822166, -3119168, -5771992, -8464356, -9707048, -9398620, -8987929, -8682899, -6808077, -2570256, 2478359, 6406097, 8838573, 10529739, 12300987, 14615727]
7021A4615727K480210J410382l32385j172941q53614n11743k10450R81491J975763
7012A8382440O5334m325048o553480l459103K434417O272038O066632L037197
7004B1920427n75189k350145j005186J443702J385487j345021l341455l588078
6996A2544542n102518q535285r138337l771750L374083O284902M629336J611843
6988A896816j515240l782963j733736N053468R167338L946336n252021o888536
6980H91462L45589O022121L895529j12588O81941L085290Q50712m354329o177257
6971E128470l909329k204168k316333p75236L011327M277603K84550m520105m221344
6962e244565K72185K458340q70148n492047n650619j377722K611096L765637L768115
$$ y = [14615727, 17095937, 18506319, 18173934, 17000993, 16147379, 15635636, 15425186, 16406677, 18382440, 18447774, 14122726, 7569246, 4110143, 6544560, 12816598, 18883230, 21920427, 21345238, 18995093, 17989907, 19433609, 20819096, 19474075, 16132620, 12544542, 7442024, -1093261, -10231598, -14003348, -10629265, -4344363, 284973, 1896816, 381576, -3401387, -5135123, -81655, 9085683, 13032019, 7779998, 891462, 1237051, 7259172, 11154701, 11042113, 11724054, 14809344, 15660056, 11305727, 5128470, 1219141, -985027, -3301360, -4076596, -1065269, 3212334, 3496884, -1023221, -5244565, -4972380, -2514040, -3384188, -8876235, -14526854, -15904576, -13293480, -9527843, -5759728]
6953e759728L847455K564221K94998J433535P799335J3038433R417298j023572
6945C1611975q145065o724770j846757l6138j058674j366917m24382L05127O29814
6936A2944213J754l673149r380121j0770699l928038N152289O719913j79020o899388
6927a0012246o743171j959472J488309J279516o96748j392489J198027N879936
6919a0958338P752801L423089k969963l655427J720308M676338M75832l885241
6911c420601P1387Q544014R769571P17631q619670r157635l871196j263432l059313
6902a0289244l860196l42286M771610P533248P148029M867195J795748j108534
6894A0515570l085381m360213n102527l723202J025730O029781N669634n47270
$$ y = [-5759728, -1912273, 651948, 946946, 2380481, 10179816, 23218249, 32635547, 31611975, 23466910, 16742140, 14895383, 14859245, 13800571, 12433654, 12009272, 12314399, 12944213, 12945967, 9272818, -107303, -10878002, -14806040, -9653751, -2933838, -3112858, -10012246, -16755417, -18714889, -17226580, -15947064, -16643812, -18036301, -16838274, -10958338, -3205537, 217552, -2752411, -6407838, -4687530, -11192, 464640, -3420601, -3349214, 5194800, 14964371, 15682002, 7062332, -2095303, -5966499, -7229931, -10289244, -14149440, -14491726, -9720116, -2186868, 4961161, 9828356, 11624104, 10515570, 7430189, 3069976, -2032551, -5755753, -4730023, 1299758, 6969392, 6422122]
6886F422122n788163m316468Q28538K510783l69142k535139j456825j036291m488852
6877a0229437q366510p070606n35357N930359P980547N723368J997384l69399
6869d939651j87100J275100J567956L51139Q4746J893011K661117r22413o602575
6860d818670q284012l644183K925056N739896L900603J036106P65269L393431
6852A013496O015085N384444J450186k300840l157528k742862l934290n325727
6844c598036k788022K966779N111114j62000o875539o059994K361708R196807
6836A52817P632200R47901l122348k288647p09342j648826k998210j136336L342729
6827A71938O098504M393341l06606n057095q265759q876392n515260R03878N556799
$$ y = [6422122, 633959, -3682509, -2853971, -343188, -712330, -3247469, -4704294, -5740585, -10229437, -18595947, -25666553, -26201910, -20271551, -12291004, -6567636, -4570252, -4939651, -5126751, -3851651, -2283695, -1932556, -1847810, 45201, 2706318, 1783905, -4818670, -13102682, -16746865, -13821809, -8081913, -4181310, -3145204, -2379935, 1013496, 7028581, 12413025, 13863211, 11562371, 8404843, 5661981, 1727691, -3598036, -6386058, -3419279, 1691835, 1529835, -5345704, -11405698, -9043990, 152817, 7785017, 8732918, 5610570, 3321923, 2612581, 963755, -2034455, -3170791, 171938, 6270442, 10663783, 10357177, 5300082, -2965677, -11842069, -17357329, -16453451, -10896652]
6818a0896652M424708K91494J15183N506943R654525O029491k814232q322309
6810C989151o166083k32046K926294Q08809l908871o794477n682111k345102j99333
6801a7603769p5321M06027K478163L549852J105627k633633l114033M41548M458361
6792a0987178N982710N124911K985876N51890l89702J296496L510845L237417
6784A1313265J472456J699980L209365J276347m368906p109685l020190K319467
6776F792099J585482l687483o085856l268413J82213N56313j159992k834557l292023
6767a1212217j097661L640037O517323L452806j899131j629866M620693Q208680
6759A0600664M131241j829016k514506M63528J381135j29744p91306j035745l606955
$$ y = [-10896652, -6471944, -6180450, -6065267, -558324, 9096201, 15125692, 12311460, 3989151, -2176932, -2408978, 517316, 1326125, -2582746, -9377223, -15059334, -17404436, -17603769, -17679090, -17273063, -14794900, -11245048, -10139421, -12773054, -15887087, -15445539, -10987178, -5004468, 120443, 3106319, 3658209, 3268507, 4565003, 8075848, 11313265, 12785721, 14485701, 17695066, 18971413, 14602507, 7492822, 4472632, 6792099, 8377581, 4690098, -1395758, -4664171, -4481958, -3925645, -5085637, -7920194, -11212217, -12309878, -8669841, -2152518, 1300288, -598843, -2228709, 2391984, 10600664, 14731905, 12902889, 10388383, 10851911, 12233046, 12103302, 11311996, 10276251, 6669296]
6750F669296o992571p019348l920724j594189n57267K036398N503938N339335
6742e35132Q42539k982562k799903p56145P55365K464000M036151K395834k219297
6733A200850l878652P31211N962098M442162k509317p118211n629669j231770
6725h031298K035480K941155J181113k960935o443033n232077M93251N793472
6717a0222872O383189K425347k898675o131197n324713j842255J73804j108236
6709a8545608j828624K271555Q568244J0467117O913498L140117J609811j013608
6701A1582502n870841q035303m823348j628289l512631o032077j847091O707032
6693a3460046R945108M872768j192047k126028n60942r67545j758028P27652M636826
$$ y = [6669296, -323275, -7342623, -11263347, -12857536, -13414803, -11378405, -5874467, -535132, 307407, -2675155, -5475058, -6231203, -5475838, -3011838, 1024313, 3420147, 1200850, -2677802, -1946591, 4015507, 8457669, 5948352, -1169859, -6799528, -8031298, -5995818, -3054663, -1873550, -4834485, -11277518, -16509595, -16016344, -10222872, -3839683, -1414336, -4313011, -10444208, -15768921, -17611176, -17437372, -18545608, -20374232, -18102677, -9534433, 932684, 7846182, 10986299, 12596110, 11582502, 5711661, -2323642, -7146990, -8775279, -12287910, -18319987, -20167078, -13460046, -3514938, 1357830, 165783, -1960245, -2521187, -3488732, -5246760, -4519108, 117718]
6684A17718M728135M12615l196078k202447J643486L987383K901159J30610j262774
6675G259807Q8K126535K389132Q33739L39699J871219J819546l202145j0321570
6666C116050j2891073q928053l223777j61783J433881M013661N881289M240366
6658f519439J150032J318139M683261O289099M025890J484701J557933K113678
6650A6103294P30722q89961j043653k282598o459119r070435n134264J393756
6642f652258J718204m407667p340777j542410O611738Q791076N918947M199376
6634G296229N119942N580739M500866L031821L32945m961616j0341784j1836030
6626a276888r857064p723949n639333j601264K706560L193188O47464N62274M607849
$$ y = [117718, 4845853, 5258468, 2062390, -140057, 1503429, 5490812, 8391971, 8522581, 7259807, 7259895, 9386430, 11775562, 12609301, 12949000, 14820219, 16639765, 13437620, 3116050, -9775023, -18703076, -21926853, -22088636, -20654755, -16641094, -10759805, -6519439, -5369407, -4051268, 631993, 6921092, 10946982, 12431683, 13989616, 16103294, 16834016, 15944055, 14900402, 12617804, 6158685, -2911750, -8046014, -6652258, -4934054, -9341721, -16682498, -18224908, -11613170, -2822094, 3096853, 7296229, 12416171, 17996910, 22497776, 25529597, 25862542, 20900926, 10559142, -1276888, -11133952, -18857901, -24497234, -26098498, -23391938, -20198750, -19551286, -18989012, -14381163]
6617a4381163P952735O597582K155693k234115n586994p014071n329222k638784
6609b0478339k829701m425392j203593P153031J1967797P729629P14961o09667
6601a981274K119474J837964j894406m121838m409575o171295p647317l219489
6593b5487756N700345J0085161N817084q29686l014114j752458j039255o70433
6585a1191112J548496M664235N797045L844076m67669n316164p254491m078325
6577a2453909L76237n10139o028026p459587r77242N495199L973836j113646l6336
6568a8733613O704984R095744K678630n726280q322508n093974l32843L385709
6560a6344151N010979L680797O06702j117545p86945j012086k729381k914247
$$ y = [-14381163, -6428428, 169154, 2324847, 90732, -5496262, -12510333, -17839555, -20478339, -23308040, -27733432, -28937025, -21783994, -9816197, -2086568, -1371607, -1981274, 138200, 1976164, 81758, -4040080, -8449655, -14620950, -22268267, -25487756, -19787411, -9702250, -3885166, -4714852, -7728966, -9481424, -10520679, -11191112, -9642616, -4978381, 818664, 4662740, 4195071, -1121093, -8375584, -12453909, -12077672, -12587811, -18615837, -26075424, -27052666, -21557467, -17583631, -18697277, -18733613, -12028629, -2932885, -254255, -5980535, -14303043, -19397017, -19729860, -16344151, -11333172, -7652375, -7045673, -8163218, -8950163, -9962249, -12691630, -15605877]
6552a5605877N59430N179071P414356P077506N550645K697660j378565m098033
6544G396193l417624j237113n09617p16055K20262J181216n48599l648100l639002
6535d918439q8631J783338j276650n341856m794686r4764L609244L732967K059606
6526e329871J89289k247236m154753k267699L560497P724350N284919q05402l140775
6517a186681q5703K056353j492435o639070o092254J29535M514593K271564k590342
6508i114440l274983P73469M032824K870978j42220o40776J501983K641847O88232
6499f63086k392764l541812k262607n72514m28167j838610k693083l38962N169814
6490i561791R171383O212004k871830j0233742r684921l723735J032321K766843
$$ y = [-15605877, -15046447, -9867376, -2453020, 4624486, 10175131, 12872791, 11494226, 7396193, 3978569, 2741456, 2231839, 1515784, 1736046, 2917262, 2368663, -1279437, -4918439, -5007070, -3223732, -4500382, -9842238, -14636924, -14731688, -11122444, -7389477, -5329871, -5140582, -7387818, -11542571, -13810270, -10249773, -2525423, 2759496, 1954094, -1186681, -1272384, 783969, -708466, -7347536, -13439790, -13310255, -8795662, -6524098, -9114440, -12389423, -11615954, -7583130, -4712152, -4854372, -5495148, -3993165, -1351318, -663086, -3055850, -6597662, -8860269, -9432783, -9860950, -11699560, -14392643, -14731605, -9561791, -390408, 5821596, 2949766, -7283976, -16968897, -20692632, -19660311, -16893468]
6482a6893468M291507O036364N444004L079629K578396L280209N3796o764120
6474A106317q778940j917170N503221M197339k193424l460269Q55470J992120
6466b695336k435176m567551r8757M311476K178407k484391k329272J718266K978674
6457c423660l48209l652075l509609j398810r6778k52029o85287J81274K777138
6448a0408045M992781L814871n45973m428434n683910n656474m862967j222857
6440b4001008M602543P060121L447541n83868R42851M506782K383931m729605
6432f370712q574433o145423l069673k900509j596458L733749Q115885O370332
6424a0437242K041483K135098O232653P514539L283947j759772l022297j402184
$$ y = [-16893468, -12601961, -6565597, -1121593, 1958036, 4536432, 7816641, 7870437, 1106317, -7672623, -9589793, -4086572, 110767, -2082657, -5542926, -4687456, -2695336, -5130512, -9698063, -9796820, -5485344, -3306937, -5791328, -8120600, -6402334, -3423660, -3771869, -7423944, -10933553, -12332363, -12429141, -12681170, -13366457, -13185183, -10408045, -5415264, -1600393, -2146366, -6574800, -12258710, -17915184, -22778151, -24001008, -19398465, -12338344, -8890803, -9474671, -8531820, -4025038, -1641107, -6370712, -14945145, -21090568, -24160241, -27060750, -28657208, -24923459, -16807574, -10437242, -8395759, -6260661, -28008, 7486531, 10770478, 9010706, 5988409, 4586225]
6416D586225K59148J612540L137068L296108P17904k341922k058300J535988L934036
6407A4678795J821526k691628m949469l481758j016916m26375j673422k945017
6399f84264l100057k376852j800399k296340l468860l330312n67035L116823M679725
6390i827571L600004J850796K36490k118094m209942k948951J835754N765096
6382e816418N536141K880931O16445j384766l147779j780313L617711P747247
6374H269199N423971m14841k887705j304581o52583k336629k732239j023050j047262
6365A294280l690445m130582N84062O542018Q308296M969665j089887p011241
6357E776166r352181n974038r7084K104448k43516j716009O15737L221653L191135
$$ y = [4586225, 4845373, 6457913, 9594981, 12891089, 13608993, 11267071, 9208771, 10744759, 14678795, 16500321, 13808693, 8859224, 5377466, 4360550, 3934175, 2260753, -684264, -3784321, -6161173, -7961572, -10257912, -13726772, -17057084, -17624119, -14507296, -9827571, -6227567, -4376771, -4140281, -6258375, -10468317, -13417268, -11581514, -5816418, -280277, 2600654, 3217099, 1832333, -1315446, -3095759, 521952, 8269199, 13693170, 13278329, 10390624, 9086043, 8433460, 6096831, 3364592, 2341542, 1294280, -2396165, -6526747, -5942685, 599333, 8907629, 13877294, 12787407, 5776166, -3576015, -9550053, -9647137, -7542689, -7786205, -9502214, -8886477, -5664824, -2473689]
6348b473689K882461M163702M290621J633779n25115m41384j980971p050087j0280158
6339i780841p499689l321613l006832k849913K492623Q496200P204401J482803
6331f782861J136576O338499P048768k57896p008176o513737k927754j927714
6323a0894295j846194L70033K139450L60530k373116k384586q78336l26780L36927
6314a5496367K040479J882964j555171l647103k61366M939432N811817L076981
6306c208334J894024K728307J777370q26520o73916K613986L531580q43728n900265
6297A092504n748685o04777M681463O538353M659075M88051l551017m703351k319945
6288E31671O91640O31569k756610o003699n917166k830154M30493J846578J670707
$$ y = [-2473689, 408772, 4572474, 8863095, 10496874, 9971759, 9530375, 7549404, 499317, -9780841, -17280530, -20602143, -23608975, -26458888, -23966265, -15470065, -8265664, -6782861, -5646285, 692214, 7740982, 7483086, 474910, -6038827, -8966581, -10894295, -12740489, -12370456, -10231006, -9870476, -12243592, -14628178, -15506514, -15833294, -15496367, -13455888, -11572924, -13128095, -16775198, -17036564, -12097132, -6285315, -3208334, -1314310, 1413997, 3191367, 2364847, 1690931, 4304917, 7836497, 6992769, 1092504, -4656181, -5260958, -579495, 5958858, 10617933, 11105984, 7554967, 2851616, 531671, 1223311, 1854880, -901730, -6905429, -12822595, -15652749, -15222256, -13375678, -11704971]
6279a1704971J172992J086331J206140M42313k383795n952184n144007L833727
6271a7443454J5627964J7862636N508853j0355299j4196039m490546O263539Q913306
6263G690960O464507M247575Q89918n621041j0498514q308809k000503J462518
6255e673389J362737K101380M165635L706722L82674j462815k3449J613992J284384
6246G457871M67917L3002j522384l888993l851458o72228J538314n70931m900880
6237e909770p271170o601498m263318q67395L324868O325195N693472J832420
6229g737196j641750j319845K314334M755580K112998l474690n057727N10779
6221i537517P397732P611011J267020m310315m602007j716740J495404M834870
$$ y = [-11704971, -10531979, -9445648, -8239508, -7797195, -10180990, -16133174, -21277181, -17443454, -1815490, 16047146, 21555999, 11200700, -2995339, -7485885, -1222346, 7690960, 14155467, 18403042, 19292960, 13671919, 3173405, -5135404, -7135907, -5673389, -4310652, -2209272, 1956363, 5663085, 6045759, 4582944, 4559495, 6173487, 7457871, 7925788, 7958790, 6436406, 2547413, -1304045, -1976273, -437959, -1008890, -5909770, -13180940, -19782438, -24045756, -24913151, -21588283, -15263088, -9569616, -7737196, -9378946, -10698791, -8384457, -3628877, -1515879, -4990569, -10048296, -9537517, -2139785, 5471226, 6738246, 2427931, -2174076, -3890816, -2395412, 2439458]
6213B439458O824739L866403l199363o977778k532062N207185P561373K840209
6205A6030164l257750n515366l171780J943154O801216P933131M714193R06556
6197B6383518k58662o89741l464492o676475o311572l517248k987855m749381
6189b271908m066315q7847K199426O13942k90580K594862M914179K003749k784586
6180B824922k991018R49107L031437J199308r67326j551766k789467n310097n898175
6171a1503075l267887r99781j636606k050316J508688O852230Q526004N191564
6163B620821M34627k685260m202864m850041m480614l035172n25729L682287Q967286
6154d074659J1411589P161415j746591q193196p682146k679575J452351K007540
$$ y = [2439458, 9264197, 13130600, 9931237, 2953459, 421397, 5628582, 13189955, 16030164, 12772414, 7257048, 4085268, 6028422, 12829638, 20762769, 25476962, 26383518, 26124856, 25435115, 21970623, 15294148, 8982576, 5465328, 2477473, -2271908, -6338223, -6426070, -4226644, -3612702, -3903282, -1308420, 3605759, 5609508, 2824922, -166096, 783011, 3814448, 5013756, 4046430, 2494664, -294803, -5604900, -11503075, -14770962, -15770743, -17407349, -19457665, -17948977, -11096747, -2570743, 2620821, 3055448, 370188, -3832676, -8682717, -13163331, -16198503, -16724232, -13041945, -4074659, 7336930, 14498345, 12751754, 4558558, -3123588, -5803163, -4350812, -2343272]
6146b343272m71993l939767n510888l212506J038289K773421J040849O7520K502772
6137h055575M471612J199415n074011p561993m073998R56804L169371K429284
6129a2539091j7536l913046p897466q748817n027196P58635N298214P870823R293840
6120a4921640R518773P877754M311445p47994o205867r192333o299888K230592
6112a3429158J0955316J3847927J0034865L755537p16890k769859m285605o082715
6104A1309418o466012l673570P42606K562239j65706m224721m825601r46002M641714
6095a045635R106869J0691941P677696K52106o842696p809723k890556J682191
6087A0822193J858443R1154K0285J007183O87437n27221r80224j346278l109453
$$ y = [-2343272, -2815265, -6755032, -12265920, -15478426, -14440137, -11666716, -10625867, -10558347, -8055575, -3583963, -2384548, -7458559, -15020552, -19094550, -18137746, -14968375, -12539091, -12556627, -16469673, -24367139, -33115956, -38143152, -37384517, -32086303, -24215480, -14921640, -5402867, 2474887, 6786332, 6038338, -167529, -9359862, -15659750, -13429158, -2473842, 11374085, 21408950, 25164487, 24447597, 21677738, 17392133, 11309418, 4843406, 1169836, 1912442, 4474681, 4308975, 84254, -4741347, -5687349, -1045635, 8061234, 18753175, 26430871, 26682977, 19840281, 12030558, 9140002, 10822193, 12680636, 12771790, 12792075, 13799258, 14486695, 13959474, 12979250, 11632972, 8523519]
6078H523519n094484m951947l200187k670759m183007n310585l661331L08823
6070b0239958M009744N378965M786122M277367M473683L316742j89240k473237
6062C340188L94871N439006N075667k020094q048466o938406k442997j056240
6054f256471k087659q39052K215103K513811k43435j588871M94127L661847O075381
6045C944781P673083O964656K180100m229050p452351o824966n526951m270119
6037g540817j127338K537110K715517J72423L18440M022244N481561J684603k897580
6028E366163m183507m149604m779649l366305J125324L710279J512897J3883L998584
6019g51935Q031770M667176k461923l917442l3038R1n672033p826376j374524
$$ y = [8523519, 3429035, -1522912, -4723099, -7393858, -11576865, -16887450, -20548781, -20239958, -16230214, -10851249, -6065127, -1787760, 2685923, 6002665, 5813425, 3340188, 3735059, 9174065, 14249732, 12229638, 4181172, -2757234, -5200231, -6256471, -8344130, -9183182, -6968079, -4454268, -4697703, -6286574, -5792447, -2130600, 3944781, 11617864, 18582520, 20762620, 16533570, 9081219, 2256253, -3270698, -7540817, -8668155, -6131045, -3415528, -3243105, -2924665, 1097579, 6579140, 8263743, 5366163, 1182656, -2966948, -7746597, -11112902, -9987578, -6277299, -4764402, -4750519, -751935, 7279835, 11947011, 9485088, 5567646, 5534608, 5534699, -137334, -7963710, -9338234]
6010i338234O056122N931971R45143j090651P50903J755134P13968N31493J619292
6001G875141J286602n15948k61460L459818P145436O410931N22317p344429j2387524
5992F190884j1150093m679064J374719K103832j227748l124816p65267L618040
5984g659513O961816Q647218Q757589O323449J351795l466115n252048m101976
5976A1562215k320463j644204k484458m459232n963276m550311Q5093M420928
5968e353708M786835K192925Q46640J947685K082773j151425m836009m291987
5960c776271P93744O242079Q428686P077437L591441n43462l156242k027568J851742
5951A8481586L392489j362977r307594j2424365p068359J264669M660677K357170
$$ y = [-9338234, -3282112, 2649859, 3595002, 2504351, 3255254, 5010388, 5724356, 6255849, 7875141, 9161743, 8645795, 8384335, 11844153, 18989589, 25400520, 25922837, 18578408, 6190884, -4959209, -9638273, -8263554, -6159722, -7387470, -10512286, -11277553, -7659513, -697697, 7949521, 16707110, 23030559, 24382354, 20916239, 15664191, 11562215, 9241752, 7597548, 5113090, 653858, -5309418, -9859729, -9774636, -5353708, -566873, 1626052, 2472692, 4420377, 6503150, 5351725, 515716, -3776271, -2982527, 3259552, 11688238, 18765675, 22357116, 21813654, 18657412, 16629844, 18481586, 21874075, 20511098, 11203504, -1220861, -8289220, -7024551, -2363874, -6704]
5943f704J6417L34322l82737m495458p238241l386128L811335O591327M003265
5934g52602K389735M447536N320409J885583j465599q26350j11400m128878r268774
5925b510340q532414k614726J833344K924856M202528N546243K652714l252442
5917B49763m489553Q50822M147824j065555q690793q903295k142467K946365K093733
5908a5003156j263274l204480k930872P0202N903457J0830521R616551K665308
5900F684257l464508l810518K23624M255187N213059J807058m871937r917261
5892c881039p999352k25477N989377N978628L097419K415982L151198J615407
5884A0142143j229249q31707K901634M143099o69487p387929r557978o288446
$$ y = [-6704, 9713, 344035, -38702, -4534160, -11772401, -15158529, -11347194, -4755867, -752602, 1637133, 6084669, 11405078, 13290661, 11825062, 10998712, 10887312, 6758434, -2510340, -11042754, -13657480, -11824136, -8899280, -4696752, 849491, 3502205, 249763, -4239790, -3388968, 758856, -306699, -8997492, -17900787, -20043254, -17096889, -15003156, -16266430, -19470910, -22401782, -22331580, -16428123, -5597602, 4018949, 6684257, 3219749, -590769, -367145, 3888042, 9101101, 10908159, 6036222, -3881039, -11880391, -12105868, -6116491, -137863, 2959556, 5375538, 8526736, 10142143, 8912894, 8081187, 10982821, 15125920, 14456433, 7068504, -2489474, -8777920]
5876h777920j506678K449094O225428R124219Q380982M394766K211612M325420
5868B6826923N488543j89397q926108j0563488k774887M548133K115014o932260
5860I592473j2401202j0065914l921856J527370M846844M818461P08810l908722
5852h803736l481070J605865M516490J649746k081754j079667K160169J091100
5844d422857m493418p726552m380544J366635K729784r83675m001165j469010
5836b3380802N000791R716458R485727O236382L255280J081172j289879l017412
5828G087717k356851m15213l45963k180680k215205P69809K514394l50059m166810
5819a658861l076675J811466L450713q60750n510284m742190m07342J541631p85646
$$ y = [-8777920, -10284598, -7835504, -1610076, 7514143, 15895125, 20289891, 22501503, 26826923, 32315466, 32126069, 23199961, 12636473, 9861586, 14409719, 16524733, 9592473, -2808729, -12874643, -16796499, -15269129, -10422285, -5603824, -4895014, -8803736, -12284806, -10678941, -6162451, -4512705, -6594459, -7674126, -5513957, -4422857, -8916275, -16642827, -21023371, -19656736, -16926952, -17910627, -21911792, -23380802, -18380011, -8663553, 822174, 7058556, 10313836, 11395008, 10105129, 7087717, 4730866, 4315653, 3969690, 1789010, -426195, 343614, 2858008, 2507949, -1658861, -4735536, -2924070, 526643, -334107, -5844391, -10586581, -10993923, -9452292, -10237938]
5810a0237938m133763n280338l717483k22501L765136N739248M339939J896685
5802g851015J690649K874067J784971j529603k705078l34106J126293j412014
5794f355836m311100l394124j236747k466191m949168k801851L208525N891902
5786a6414590K638134j167513j337529m12038j285935j989936o08214M86218m89416
5777b0580819j043570N6012p37111m546298n189732J833464J0552957J2402138
5769g252959Q677272O705391P172022N044159J009458J188487N252418N358025
5761C3154273j085616p236675q216405p371596p379122m387005L341208R044763
5753I863825O691283L51002k693141k969318n437792r068626p920635j099027
$$ y = [-10237938, -14371701, -19652039, -23369522, -23592023, -19826887, -14087639, -9747700, -7851015, -6160366, -3286299, -1501328, -3030931, -5736009, -6070115, -4943822, -6355836, -10666936, -14061060, -15297807, -17763998, -22713166, -25515017, -22306492, -16414590, -13776456, -14943969, -16281498, -16693536, -17979471, -19969407, -20577621, -20091403, -20580819, -21624389, -21568377, -22305488, -26851786, -32041518, -30208054, -19655097, -7252959, 1424313, 8129704, 15301726, 20345885, 21355343, 22543830, 27796248, 33154273, 32068657, 24831982, 16615577, 9243981, 1864859, -2522146, 819062, 9863825, 16555108, 16906110, 14212969, 11243651, 5805859, -3262767, -11183402, -12282429]
5745a2282429N281267O093873K377123j356103j575589J841509N274645M930625
5737A0584921K098718J480329K779608l62647r343510j4899964q941886K861838
5729a3742593Q119099M000227j602448k868135j413271J92370J717151J650990
5721c946610j826357n184554k291412N544274R370807M704763k649293n453804
5713a732186l616200j016764N42922Q79377k42763j219347O61910M254403N001404
5704C512756K341560J049529K798079K996267l90141k083943J137521L430124
5696A4791752n72007n544291l850301Q89674m63305o080593m932399M355466R169732
5687G763728J931147p785006p800063j236965K53776m266814m402995L772695
$$ y = [-12282429, -7001162, -907289, 1469834, 113731, -1461858, 379651, 5654296, 10584921, 12683639, 14163968, 16943576, 16580929, 7237419, -7662545, -16604431, -13742593, -5623494, -1623267, -3225715, -6093850, -7507121, -7314751, -5597600, -3946610, -5772967, -10957521, -13248933, -7704659, 1666148, 6370911, 3721618, -1732186, -5348386, -6365150, -5822228, -4942851, -5185614, -6404961, -5743051, -1488648, 3512756, 5854316, 6903845, 9701924, 12698191, 12308050, 10224107, 11361628, 14791752, 14219745, 8675454, 4825153, 5714827, 5251522, -829071, -5761470, -1406004, 7763728, 9694875, 1909869, -5890194, -7127159, -6873383, -11140197, -15543192, -11770497]
5679a1770497J0641430P430442q34318k999055K623007P343274M975236r44283
5671A6465236l710824k215329n97159k046436n771563q904120r131840n795319
5663b1707354j61434M955476O709154M232917j68686j888934K145474Q849651
5655B966264R956044J086590j0830207j3910944n963023K613633L229428M53544
5647a0398671L367562J0390779J1226155K584112o868806q933985n620331l078587
5639g331772k255045n32902J881455K784547K646143L459688M378973K950985
5631G982072o0881j238149j3019m8773m042923r490378j1165135p182658j606737
5622b6866581k16811l304032m335135J812652J0674032J2658345N770090j688227
$$ y = [-11770497, -1129067, 6301375, 5467057, 2468002, 5091009, 12434283, 17409519, 16465236, 12754412, 10539083, 9941924, 7895488, 2123925, -6780195, -15912035, -21707354, -21868788, -16913312, -10204158, -5971241, -6139927, -8028861, -5883387, 2966264, 12922308, 14008898, 3178691, -10732253, -16695276, -14081643, -10852215, -10398671, -7031109, 3359670, 14585825, 17169937, 10301131, 1367146, -4253185, -7331772, -9586817, -10119719, -8238264, -5453717, -2807574, 652114, 5031087, 7982072, 7921191, 6683042, 6670023, 6621250, 2578327, -6912051, -18077186, -25259844, -26866581, -27083392, -30387424, -34722559, -32909907, -22235875, -9577530, -3807440, -5495667]
5614e495667l003878j437417k566780m301566j454073L880231N006864J925206
5606g447080J047784L442153K565608l629110p056822j237795Q041582J0349964
5598F076284M273502l245287p677031r517568q195197j832892O238105Q584127
5590e295957M129059J018681M942915J0069770P224860k702891j0146790r819250
5582e79603n332126r57597L775269Q742485R367359L393912l084939k871241J492693
5573A3946212J085640n718160j0301966o511897L41071J453747l320296o815034
5565a5840683n298298j944457k25205O11361K205925L528006L052653J915344
5557a1995354K346981M047266M137066P51659m197720o167622k292581M937033
$$ y = [-5495667, -8499545, -9936962, -12503742, -16805308, -18259381, -14379150, -9372286, -7447080, -6399296, -2957143, -391535, -4020645, -11077467, -12315262, -4273680, 6076284, 10349786, 7104499, -572532, -10090100, -18285297, -20118189, -13880084, -5295957, -1166898, -148217, 4794698, 14864468, 22089328, 19386437, 9239647, -579603, -5911729, -6869326, -3094057, 5648428, 15015787, 18409699, 15324760, 12453519, 13946212, 15031852, 9313692, -988274, -7500171, -7159100, -5705353, -9025649, -15840683, -21138981, -23083438, -23308643, -22697282, -20491357, -16963351, -13910698, -11995354, -9648373, -5601107, -1464041, -712382, -4910102, -11077724, -13370305, -8433272]
5549h433272Q991812N582443k643304q964974r718119o784819l356843r5614L384330
5540b2038360N875613N931759M564384L963099L946028K318383r20678k514102
5532A126126o32847J627544Q2496m344877o425490l649308Q50319L452067M691714
5523c222256O338575O960656M408276Q22587K40456J631612l53499o565930j0517033
5514b56556p060093M28378N052878M887684K270451k023367q108874j2041168
5506a6850667q036027L111249J2636578J3019942N578039k650917o682364o422317
5498f296484m260224k329874j235675Q985K335333M662015M859181K896056J238348
5489A877661J401857J794186M1988l665966o386835m966917J009372P623662Q816782
$$ y = [-8433272, 558540, 6140983, 3497679, -5467295, -15185414, -21970233, -25327076, -25422690, -22038360, -16162747, -10230988, -5666604, -1703505, 2242523, 4560906, 3640228, 1126126, 493279, 2120823, 2203319, -2141558, -8567048, -12216356, -11366037, -7913970, -3222256, 3116319, 10076975, 14485251, 15307838, 15548294, 17179906, 16826407, 10260477, -256556, -7316649, -6888271, -1835393, 3052291, 5322742, 3299375, -4809499, -16850667, -24886694, -21775445, -9138867, 3881075, 9459114, 6808197, 125833, -6296484, -10556708, -12886582, -14122257, -14113272, -11777939, -7115924, -2256743, 639313, 1877661, 3279518, 5073704, 5115692, 1449726, -4937109, -9904026, -8894654, -1270992, 7545790]
5480G545790K676070m762824n251651J594551P542577O353120J067553k022127
5472A4743059k619332m791291q431384q399918k686054L651585M921089J836921
5464a775325m64535N65156K382494J054499m274633j0267192j1890437o801744
5456c1471717J971404Q548145R894462P809981M986902J618193k424287m731321
5448c798238l034568O97698K580819K468516L105793L968538J411545l690176
5440C709927m578144J313146O366057K801122n182422o651137N11886P243035
5432E533470O643347J769336j852488l895970n605854m984707q30930K959602
5424b64194K195200j894689n813713q673119r586104n039172N036310J2679460
$$ y = [7545790, 10221860, 5459036, 207385, 1801936, 9344513, 15697633, 16765186, 14743059, 12123727, 7332436, -1098948, -9498866, -12184920, -8533335, -3612246, -1775325, -2239860, -1674704, 707790, 1762289, -2512344, -12779536, -24669973, -31471717, -29500313, -20952168, -11057706, -3247725, 1739177, 3357370, 933083, -3798238, -6832806, -6135108, -3554289, -1085773, 2020020, 5988558, 7400103, 3709927, -868217, 444929, 6810986, 9612108, 4429686, -2221451, -1709565, 5533470, 12176817, 13946153, 12093665, 8197695, 2591841, -2392866, -3223796, -264194, 1931006, 36317, -5777396, -14450515, -24036619, -29075791, -24039481, -11360021]
5416a1360021J0691695L215067Q850K503001L996062K253992K048096M393962
5408A7750704L397867k860103p276288m476160P78062J470941j691717m226725
5400B866581o203643r527546j0898426n218743N517670J3237511J3267048P932095
5392A0972547J606640l006675m332376k518773p37859j935261m205453l003937
5384g161147J967477N557897L374210l343546r199403r182408k690401M867427
5376a5809894O152937L07905m873569k788891K533577K213581m033749p304821
5368b3602924k881999L055473L017144j488431l567968o20601M297128P889507
5360a3902671Q683487N540579r79733o171584m613336K821223Q504557O254273
$$ y = [-11360021, -668326, 2546741, 2555591, 5058592, 9054654, 11308646, 13356742, 17750704, 21148571, 18288468, 11012180, 6536020, 7314082, 8785023, 7093306, 2866581, -3337062, -12864608, -23763034, -28981777, -23464107, -10226596, 3040452, 10972547, 12579187, 9572512, 5240136, 2721363, 1983504, 48243, -4157210, -7161147, -5193670, 364227, 3738437, 394891, -8804512, -17986920, -20677321, -15809894, -9656957, -9349052, -14222621, -17011512, -14477935, -12264354, -16298103, -23602924, -26484923, -23429450, -20412306, -21900737, -25468705, -26089306, -21792178, -13902671, -5219184, 321395, -658338, -6829922, -11443258, -8622035, -117478, 6136795]
5352F136795j798630p922864p163778j606385L107611L860604K043573N60570
5344b782504N52021J471849K799873M134373M407919K878603O84152l84070n44033
5335A3218183j418137k736663k305599n3097R06863p83335j562469J872065O006895
5326A3144706L723834n539272j3173739j1328487k581273L535744K207885k072052
5318a2082654k590811J453364N564852O185808L716922M22435k023079k912708
5310b265871k630218k856855m814877o685703m732712J698898P918276Q569478
5302e799584L786215j341657l184270l113952l794425m163517p95626N965028
5294a2441788J0270661P385138N33866k241361J508634N004187J464354n966814
$$ y = [6136795, 4338165, -3584699, -10748477, -12354862, -9247251, -5386647, -3343074, -2782504, -2230483, -758634, 2041239, 6175612, 10583531, 13462134, 14146286, 13762216, 13218183, 11800046, 9063383, 6757784, 6704687, 7611550, 6828215, 5265746, 7137811, 13144706, 16868540, 11329268, -1844471, -13172958, -15754231, -12218487, -10010602, -12082654, -14673465, -13220101, -7655249, -1469441, 2247481, 2669916, 646837, -2265871, -4896089, -7752944, -12567821, -19253524, -23986236, -22287338, -14369062, -5799584, -2013369, -3355026, -6539296, -9653248, -13447673, -17611190, -18406816, -12441788, -2171127, 5214011, 5747877, 3506516, 5015150, 10019337, 11483691, 5516877]
5286E516877p917096j478623N862383O357875J618096j123251N41932J842956
5278A1221149j561674p443229r922000o530410m93457L580805M589535M606114
5270a953167M709689L374050l72021m479163o409969o219352m706762p01695N952355
5261a0806035J0426872P390969n47681m681550j729825K417760K730455K189249
5253G390214M486992N789604Q06122o779026p958171j323354M988865M718479
5245A2119725L77013k813715m104910n376866o208023m460608j21946L965282
5237f624048M774392J697964k743280m666623k436263J485798L330670K268440
5229b912950O55036N81370J569746J513713q02554l657354l151036K090322P349593
$$ y = [5516877, -2400219, -3878842, 1983541, 8341416, 9959512, 8836261, 9378193, 11221149, 9659475, 2216246, -7705754, -14236164, -14729621, -11148816, -6559281, -1953167, 2756522, 6130572, 5758551, 1279388, -5130581, -11349933, -16056695, -16758390, -10806035, -379163, 7011806, 6464125, 1782575, 52750, 2470510, 5200965, 7390214, 11877206, 17666810, 18472932, 11693906, 3735735, 2412381, 7401246, 12119725, 12496738, 9683023, 5578113, 201247, -6006776, -10467384, -10589330, -6624048, -1849656, -151692, -2894972, -7561595, -9997858, -8512060, -5181390, -2912950, -2257914, -1676544, -106798, 1406915, 604361, -3052993, -6204029, -4113707, 3235886]
5220C235886O498278O62951k586197k77527J708966j131410m012688j128410L938711
5211F908560L992393J21697j194905K962j926499o588557p161969k322084J380114
5202f788288R89716J428775N187621O831909K353756l664776n179628k656363
5194a497278M37325L077617M541991K835043p57849j606069J32525j671759p939938
5185b448392j0112941l210344M683123M029438j583226j653377N206101J0902191
5177E812573J0422695N849967J0573n414073o938793k512347L105136L424806
5169A3760537k42653j275904J476304K855502O82971j623813j856205j537913
5161A2238826j338170k62841O18747k86349o43248K028860L515412j854761r835016
$$ y = [3235886, 9734164, 10397115, 7810918, 7533391, 9242357, 8110947, 4098259, 2969849, 6908560, 10900953, 11022650, 9827745, 9830707, 7904208, 1315651, -5846318, -8168402, -6788288, -5798572, -4369797, 817824, 7649733, 10003489, 6338713, 1159085, -1497278, -1059953, 2017664, 6559655, 9394698, 8636849, 7030780, 7163305, 5491546, -2448392, -12561333, -15771677, -11088554, -7059116, -8642342, -10295719, -5089618, 5812573, 16235268, 22085235, 22095808, 16681735, 9742942, 7230595, 10335731, 13760537, 13517884, 12241980, 13718284, 16573786, 17256757, 15632944, 13776739, 12238826, 10900656, 10637815, 11256562, 10970213, 10326965, 12355825, 15871237, 14016476, 4181460]
5152D181460r853074j007676N661251L613152o19837K15033K955243J880019o30432
5143F395139M21052K551036j6021n780330p813516m077859J256081N281319Q377934
5134F594835R603561O626609O35079m142967o427346q562951j0616911q884335
5126a5174426k162673M624572N847285J810121k324829k689236J24944L033356
5118f910886L844520K775626J490870R20679K83630j380365l304238l749576k486615
5109h516355j078205k73679J371529M939682Q139899P019135J179029m683779
5101H097256o044222l938993k684450l051336j264583M390774R622275R362550
5093A4489271M518929L72707m01925O3424p79459k185181j596554J423630L500734
$$ y = [4181460, -5671614, -6679290, -1018039, 2595113, 1975276, 2190309, 5145552, 7025571, 6395139, 6816191, 9367227, 9351206, 3570876, -4242640, -8320499, -7064418, -1783099, 6594835, 16198396, 22825005, 23460084, 19317117, 12889771, 4326820, -6290091, -15174426, -17337099, -12712527, -6865242, -5055121, -7379950, -10069186, -9944242, -6910886, -3066366, -290740, 1200130, 2120809, 2404439, 1024074, -2280164, -6029740, -8516355, -9594560, -9868239, -8496710, -3557028, 4582871, 11602006, 12781035, 8097256, 2053034, -1885959, -4570409, -7621745, -8886328, -4495554, 5126721, 14489271, 19008200, 19380907, 18978982, 19042406, 18262947, 16077766, 14481212, 15904842, 19405576]
5084A9405576N18601o301375q936345j532835R244835R523634l254282j4598726
5076D069083j1958767k378908j302977q663509r489777J841976J2149152R289520
5068f444207l95778k998565K926057P309948M936930P76430J9557J202343O57576
5059G990291j798388l484899j982118L099883R100604J1254209P233086O48363
5051C2061031k373878k45364K399565M13528n792656j0510036q980102l146852
5043C825236J38930k328488n646409l843730J125787K770497Q65234J264232M328162
5034B499451K656714n772058j1124433n362411M773696P320899K493193L37135
5026b177814L849784N483368O93372n309847o842535n164890l178627j73223L905899
$$ y = [19405576, 19924177, 13622802, 4686457, 3153622, 12398457, 21922091, 18667809, 4069083, -7889684, -10268592, -11571569, -20235078, -29724855, -27882879, -15733727, -6444207, -6839985, -9838550, -6912493, 397455, 5334385, 6110815, 6130372, 7332715, 7990291, 6191903, 2707004, 724886, 3824769, 12925373, 24179582, 31412668, 32061031, 29687153, 29441789, 31841354, 32254882, 26462226, 15952190, 6972088, 3825236, 3964166, 1635678, -4010731, -7854461, -6728674, -3958177, -3092943, -1828711, 2499451, 5156165, -615893, -11740326, -17102737, -12329041, -5008142, -2514949, -2177814, 1671970, 7155338, 7848710, 2538863, -4303672, -9468562, -12647189, -12820412, -8914513]
5017h914513N296059K353813m23260R32888L620694L293111J246793R71879J390902
5008I768366j11661j020352K456309O535379L331069o203379j1218907n730210
5000b193386L075814N756785L160282J876763K604832J081155k451376l339283
4992I571586j278414p48284k205284j034576K973093L502391j459492m786439
4984D534581j465183K633520J29736n772955o752008k564246R972j233795k138044
4975a2618422p29260P23575J718791L826656N277783L006378j24953J463065N304716
4966G848329K691464o830347j2326316o888382K227566M280505q58178n157474
4958a5012833l945631P47686N019461O471801M741387J636847p59802k733292
$$ y = [-8914513, -3618454, -1264641, -1687901, -755013, 2865681, 6158792, 7405585, 8377464, 9768366, 9656705, 8636353, 11092662, 17628041, 20959110, 14755731, 3536824, -2193386, 882428, 6639213, 9799495, 11676258, 14281090, 15362245, 12910869, 9571586, 8293172, 7544888, 5339604, 4305028, 7278121, 10780512, 9321020, 4534581, 3069398, 5702918, 5832654, 59699, -6692309, -9256555, -9246583, -10480378, -12618422, -13347682, -12624107, -10905316, -7078660, -1800877, 1205501, 1080548, 2543613, 7848329, 10539793, 3709446, -8616870, -15505252, -13277686, -8997181, -9855359, -15012833, -18958464, -18210778, -13191317, -6719516, -1978129, -341282, -1101084, -3834376]
4950c834376n030762n397391j857927J811061N61228k838770j290685M402625
4942a3474997O349279L152068J750634L841421K570088l517234n839769o65977
4934e834487L810503K122720P79828M706087P035226K331158k141127M24344L635879
4925A6870131N91036k461123R40559K705926n093278j1659996l192571J1177868
4917I878552J0872769l512215j1414028m767007K826069J414421j665758J155926
4909D788729M895126L506720J68239o41198l08820m32072N67553K290414K339012
4900A7173703J825445K326326j00577p565976j1778605n820954J419127j421866
4892c943377o935853o72866J1794111J2841681L676619J056693N505993J955468
$$ y = [-3834376, -8865138, -14262529, -16120456, -14309395, -13748167, -16586937, -17877622, -13474997, -7125718, -3973650, -2223016, 1618405, 4188493, 671259, -5168510, -5834487, -2023984, 98736, 878564, 5584651, 12619877, 14951035, 12809908, 13234252, 16870131, 17461167, 15000044, 15940603, 18646529, 13553251, 1893255, -1299316, 9878552, 20751321, 17239106, 5825078, 1058071, 3884140, 5298561, 3632803, 4788729, 9683855, 13190575, 13358814, 12717616, 12408796, 11976724, 12544277, 14834691, 17173703, 18999148, 21325474, 21224897, 13658921, 1880316, -3940638, -2521511, -3943377, -10879230, -11552096, 242015, 13083696, 16760315, 17817008, 23323001, 25278469]
4884B5278469q061562p075564L086788K075772q091068k863499J5202885J2562623
4876C2114844j3732696k3437934r968433l0339419j07690687j57713046q8286722
4869c99054093N6863314J38307382R9611117K4574191L693683K3405376K4054614
4862b8544416J155952p178241O120922J3350902M674801k403987J72094J590036
4854a1061937k136167k202080K831120L980407m02493k506129n49581k04291j321842
4845a3572993J821926P599253P991189K284842k242136k887287l593201m993643
4837g592050l249536R41426K041795p94980k383579n38377J015915k80963k150083
4828a2990432j869360M38098L239760M777623L619274Q44352l42816M46447j89913
$$ y = [25278469, 17216907, 10141343, 13228131, 15303903, 7212835, 4349336, 19552221, 32114844, 18382148, -5055786, -15024219, -45363638, -153054325, -310767371, -399054093, -342190779, -203883397, -104272280, -79698089, -76004406, -52599030, -28544416, -27388464, -34566705, -28445783, -15094881, -10420080, -12824067, -12651973, -11061937, -13198104, -15400184, -12569064, -8588657, -8991150, -11497279, -12046860, -12251151, -13572993, -11751067, -4151814, 3839375, 6124217, 3882081, 994794, -2598407, -7592050, -10841586, -9900160, -7858365, -8653345, -11036924, -11575301, -10559386, -10840349, -12990432, -14859792, -14421694, -11181934, -6404311, -2785037, -1940685, -2283501, -1837054, -2026967]
4819b026967k941052l602559j110702j225714o454409r001629j883993Q302506
4811a9944519R387873J189760m866178k484460K646402L372594Q1127k896302
4803a3513703l410384j528266J946396M924869N194018L208252J290984J86386
4795a701448r09742j499843j37116K509101L710920K046767r69710k441622n31411
4786G5896L521759N550779K741907k155597l978016k431111j922209l973208n431572
4777h001372n092998n353218n508858j318560N611794O850917O40992k798241
4769a4969544L223845R991136O900239p99521k46018P881059J0215458J584542
4761B3781196p966364q826303l525135N03337R48854n96067l031487m882194l807739
$$ y = [-2026967, -4968019, -8570578, -9681280, -10906994, -17361403, -26363032, -28247025, -19944519, -10556646, -9366886, -14233064, -16717524, -14071122, -10698528, -10617401, -13513703, -16924087, -18452353, -16505957, -11581088, -6387070, -3178818, -1887834, -1701448, -2611190, -4111033, -4248149, -1739048, 1971872, 4018639, 3048929, 607307, 75896, 3597655, 9148434, 11890341, 9734744, 5756728, 3325617, 1403408, -2569800, -8001372, -13094370, -18447588, -23956446, -25275006, -19663212, -12812295, -12171303, -14969544, -11745699, -1754563, 5145676, 4346155, 4100137, 11981196, 22196654, 23781196, 15814832, 6988529, 3463394, 3966731, 4915585, 4319518, 1288031, -3594163, -7401902]
4752g401902j4913L231575L848522K409778n11575m243886n611195j689169M704069
4743e278696P077275L368392k247856n611309o180624m575237j309825J681437
4735a3076443K380822J574539J001602K511j950635j774902K699877P099441O018566
4726C975378K103314J918111M348662K340341l902535n667312O3350M930983J996803
4717A2107095m162649n539898k078075Q17553Q24118r08547l788660o948962p490204
4708a7168229l988042Q16261M111827O626551R031418Q657434L980342r10676
4700A1156886j109657J900384K348380j629485n899442o232642l197930o65396
4692c328902j188366l523300m484697l121122j916540k715583l299750p52132
$$ y = [-7401902, -7416815, -4185240, -336718, 2073060, 1561485, -2682401, -8293596, -9982765, -5278696, 1798579, 5166971, 2919115, -2692194, -8872818, -13448055, -14757880, -13076443, -10695621, -9121082, -8119480, -8116969, -10067604, -11842506, -9142629, -2043188, 3975378, 6078692, 7996803, 12345465, 14685806, 10783271, 5115959, 5179309, 10110292, 12107095, 7944446, 2404548, 326473, 1144026, 1968144, 1059597, -2729063, -9678025, -17168229, -21156271, -20340010, -16228183, -9601632, -570214, 8087220, 12067562, 11156886, 10047229, 11947613, 14295993, 12666508, 6767066, 534424, -2663506, -3328902, -4517268, -8040568, -12525265, -15646387, -17562927, -20278510, -23578260, -24330392]
4684b4330392L368053N069719M089985L427707L275181Q40936l237956m013062
4676a1509829L78826N388487O500172M861488M145001N364086O895748O660199
4668B8684178L071036l027530p074819n507229j657524j642806m353397k562214
4660E929695M500410P671837R02895r133048j1708600n083515M060285R495116
4652F635075Q882623K856897m085571n519824p39130L108085P88733l579465l844074
4643D503349j584614j907588l601662j516034L385214M499914m6103m662837m919235
4634e849596k880315k100894k212347j005729J263526K179355N86608j631155
4626a1650547j200532K750155O583923N431205r09851p210484q452057m205343
$$ y = [-24330392, -20962339, -15892620, -11802635, -8374928, -5099747, -4258811, -7496767, -11509829, -11131003, -5742516, 757656, 5619144, 9764145, 15128231, 22023979, 28684178, 31755214, 28727684, 21652865, 16145636, 14488112, 12845306, 8491909, 5929695, 10430105, 18101942, 19004837, 9871789, -1836811, -6920326, -2860041, 6635075, 15517698, 18374595, 14289024, 8769200, 8030070, 11138155, 11926888, 8347423, 4503349, 2918735, 1011147, -2590515, -4106549, -721335, 3778579, 3732476, -930361, -5849596, -8729911, -10830805, -13043152, -14048881, -12785355, -10606000, -10019392, -11650547, -12851079, -10100924, -3517001, 1914204, 1004353, -6206131, -14658188, -18863531]
4618a8863531K414501P070074N930869m76904n255508k395088M006954M761155
4610b807478P4877n25693M880247N414828m538211j3443939q808239L849994J0026686
4601e876928P138515L521649K042325j050948m023038j119793M502477L362738
4593H496997m070935p299138l644429k211256o617486p831454j19215Q607978
4585a4688938R841652O711736N047030K593004l347194o579578j287234O078085
4577D368563N353179j548196m196317K35751M944656N741049N037519L797299
4569B3733503q64022q351097j2700839j0503466m939930j35522L279280N329020
4561e153073M472160N98888l437383n262983n168887l866247j198649J840620
$$ y = [-18863531, -16449030, -9378956, -3448087, -3924991, -9180499, -11575587, -7568633, -2807478, -2732601, -3258294, 1621953, 7036781, 2498570, -10945369, -19753608, -15903614, -5876928, 1261587, 4783236, 6825561, 5774613, 1751575, 631782, 5134259, 8496997, 4426062, -2873076, -6517505, -8728761, -15346247, -23177701, -23296916, -14688938, -4847286, 1864450, 6911480, 9504484, 6157290, -422288, -1709522, 4368563, 9721742, 8173546, 3977229, 4212980, 9157636, 14898685, 19936204, 23733503, 22869481, 14518384, 1817545, -8685921, -13625851, -13761373, -10482093, -5153073, -680913, -82025, -3519408, -8782391, -13951278, -17817525, -19016174, -17175554]
4553a7175554K944297J775877Q82697K107996M329699N673840N642245M186138
4545A0367235J266355j429299j054230K095545L217455j090748o864928o362432
4537A44953J886682R943033R583011K324414l130761k620434j015515l461248
4529A3654135o989652n392288O00950M217179L066974K141388M842038P073006
4521B3213730L806815k949290p034305o110782k871682m67209k93067k445139
4513D849071m946105m161239P76241N547926N719980K371874n65371k294579m322021
4504B975777n646356l895249m32244P93141m96812n81976J972874M397076M751479
4495C837710M141888K788608j166953o906628r612557o703695j505799K189591
$$ y = [-17175554, -14231257, -12455380, -11572683, -9464687, -5134988, 538852, 6181097, 10367235, 11633590, 10204291, 9150061, 11245606, 14463061, 13372313, 6507385, 144953, 2031635, 11974668, 21557679, 23882093, 20751332, 18130898, 17115383, 13654135, 6664483, 1272195, 1873145, 6090324, 9157298, 11298686, 16140724, 23213730, 27020545, 24071255, 17036950, 10926168, 8054486, 7587277, 7294210, 4849071, -97034, -4258273, -3482032, 2065894, 7785874, 10157748, 9592377, 7297798, 2975777, -2670579, -6565828, -6998072, -6204931, -6701743, -7283719, -5310845, -913769, 3837710, 7979598, 10768206, 9601253, 2694625, -6917932, -13621627, -15127426, -12937835]
4487a2937835N287886R419480J1525220P697522O39175k248350J385988N273027
4479B6042113K183456p425142j5851407j5934204p675106K101938O449875M832120
4471e276357K193826J633837Q28095k476924m877445j802671M074575M870433
4463h32631j118358n719662j793219O409214Q426308R72601q614326j1780209
4455a4050282p238958N37758P143713J0289610Q934922L813826j726754m047779
4447C656056k910366j316988j267881j340389M08488K677673K380101n18439k494780
4438g26525j824289j519630m352649p316825n198092J192854N153920L148434
4430a1442802j029165k893391l097591l379158j484873M623932J0747991J0709707
$$ y = [-12937835, -7649949, 1769531, 13294751, 20992273, 21631448, 19383098, 20769086, 26042113, 28225569, 20800427, 4949020, -10985184, -18660290, -16558352, -10108477, -5276357, -3082531, -1448694, -620599, -3097523, -7974968, -9777639, -5703064, -832631, -1950989, -7670651, -9463870, -3054656, 5371652, 6344253, -2270073, -14050282, -21289240, -20751482, -13607769, -3318159, 5616763, 9430589, 7703835, 3656056, 745690, -571298, -1839179, -3179568, -2771080, -93407, 2286694, 1768255, -726525, -2550814, -4070444, -8423093, -15739918, -20938010, -19745156, -14591236, -11442802, -12471967, -15365358, -18462949, -21842107, -23326980, -18703048, -7955057, 2754650]
4422B754650N100659L7824j797065k828828l720794j689005K988793N197700K406230
4413H450164j334869j674904L05208J450438J270448L90118j548211l396504k071454
4404A840434K179046M283694J606977j569309o80590K363930L482798L171619
4396A6678599L786781L903775R81957l487261o782849r490574j1770955r224725
4388a5405252N56894J0799272J2749333P549482L001142J056469k320912o584866
4380A1401562o395362k277425j119336m217234m738579O6285L850684K423728
4372a005677P20081L049574M744580M47701n782282o102879l19160M929033N439402
4363F120373K553430n11276j198812J085429L210819J059934l723850m452095
$$ y = [2754650, 7855309, 7893133, 6096068, 3267240, -453554, -2142559, 846234, 6043934, 8450164, 7115295, 5440391, 5745599, 7196037, 8466485, 8856603, 7308392, 3911888, 1840434, 4019480, 8303174, 9910151, 8340842, 7660252, 10024182, 13506980, 16678599, 20465380, 24369155, 25351112, 21863851, 15081002, 5590428, -6180527, -15405252, -14848358, -4049086, 8700247, 16249729, 19250871, 20307340, 17986428, 11401562, 5006200, 2728775, 1609439, -2607795, -7346374, -7280089, -3429405, -1005677, -285596, 2763978, 7508558, 7956259, 2173977, -3928902, -4248062, 680971, 6120373, 8673803, 8162527, 6963715, 8049144, 11259963, 12319897, 8596047, 4143952]
4355D143952L70082L418189n35175n987424m838915J649307N515298L232960j971290
4346D996984o147445p235789m112431J589320M866464L273455R33417K245598
4338D09573M977321M647371K102028Q47957L40907j458260k001736J865207O082124
4329A7812492L602294m367698r089063o421377j107094J729666K471492K814223
4321G444935J847922j114654m162517n359675m614387k108737K057720O236073
4313B26680Q125670P349048M828582Q10181l746727n901437m478536k766280l354493
4304A092688l185224R59029N045183K818146l535330n353668J46321O646973Q322485
4295A2956603O043537L233716J617201J809735K540996o23579r559266j7033951
$$ y = [4143952, 4514034, 7932223, 7397048, 1409624, -3429291, -1779984, 3735314, 6968274, 4996984, -1150461, -8386250, -12498681, -10909361, -6042897, -2769442, -1836025, 409573, 5386894, 10034265, 12136293, 12984250, 13325157, 11866897, 9865161, 11730368, 17812492, 21414786, 17047088, 7958025, 1536648, 429554, 2159220, 4630712, 7444935, 9292857, 8178203, 4015686, -1343989, -5958376, -8067113, -6009393, 226680, 8352350, 15701398, 20529980, 21340161, 17593434, 11691997, 7213461, 4447181, 1092688, -2092536, -1133507, 3911676, 6729822, 3194492, -2159176, -2012855, 4634118, 12956603, 19000140, 22233856, 23851057, 25660792, 28201788, 27578209, 18018943, 984992]
4287I84992j3484754r80978P525227M599022l663018q033336o587200j808580
4279b1448625M604217R536913Q093610P05891m886898l495308P65645J962509
4271d162046J190346K664621N493376N126725L17124n767508r076929o567484
4263a0781775J828843J0370034J1167667M067197j966636j112686J300250j677725
4255A3195169o746951n592726J597481O241899L954221n90340k064911j292314
4247H701528j512883k568588j847857J125995L468932K253347j555128l301833
4239D763513j85497M000326K788397l721297p564907l120193N085200Q244404
4231A0289946M233813j305073l265395k296165j679935k142691j188143K999870
$$ y = [984992, -12499762, -13480740, -5955513, -1356491, -5019509, -13052845, -19640045, -21448625, -16844408, -7307495, 786115, 1492006, -3394892, -6890200, -6124555, -4162046, -2971700, -307079, 5186297, 10313022, 10630146, 4862638, -4214291, -10781775, -8952932, 1417102, 12584769, 16651966, 14685330, 13572644, 14872894, 13195169, 6448218, 855492, 2452973, 8694872, 12649093, 12058753, 9993842, 8701528, 7188645, 4620057, 2772200, 3898195, 7367127, 9620474, 8065346, 4763513, 4578016, 8578342, 11366739, 7645442, 80535, -3039658, 2045542, 10289946, 14523759, 13218686, 9953291, 7657126, 5977191, 3834500, 2646357, 5646227]
4223E646227P645923O764320j763281j1604444j3797242p087572J203453M840684
4215h151932M625650L501240J063081l480305o632966l553833N193319J2678035
4207E242289J1595365J005985j1714937j6176964q624156L905549J1222366J0432963
4199F888460N783403P94242l778700n770294k605462L036179N011946K113852
4191A1473626j027754j558355p24448R92608L869898M576365L6359m810727k519819
4182A0307753L908925M502216j051108k927676J236730K651232j330824j671433
4174A5625815M825261Q135480L032813j038387K317253M346788j712192o550234
4166B8982597j477979M817518J279136o389531p111508k989665q46138K479989
$$ y = [5646227, 13292150, 20056470, 18293189, 6688745, -7108497, -14196069, -12992616, -8151932, -3526282, -25042, 1038039, -2442266, -9075232, -12629065, -7435746, 5242289, 16837654, 17843639, 6128702, -10048262, -18672418, -14766869, -3544503, 6888460, 12671863, 13466105, 9687405, 3917111, 1311649, 4347828, 9359774, 11473626, 10445872, 8887517, 8163069, 9155677, 13025575, 17601940, 17638299, 12827572, 10307753, 14216678, 18718894, 17667786, 14740110, 15976840, 18628072, 17297248, 15625815, 20451076, 28586556, 31619369, 30580982, 32898235, 37245023, 35532831, 28982597, 27504618, 32322136, 33601272, 27211741, 20100233, 17110568, 16264430, 18744419]
4158A8744419J0034695J2911641N971078J431944P755575J0843276j242170j2057413
4150E4393045k766643J2625239J0629153O87137N796428J6022376Q239368l72041
4142A05254062K1580855M2651465q615364j22382351j82884208j12392213J7738631
4135b39049123P9239638M7443615K662277M8481J4862255J3396732N816302R401438
4127f6178385J3155122N210750j657970M588880J2508350R429583K733216J954012
4119a8256442J173678m954616p460583n74425N146432J556666k668957l29116
4111b6367363n10240r569683j4634702m130823J0109099J0615743J812011k94685
4103c2970643M199766L012806l548761l403731M549941Q699233N627621M264633
$$ y = [18744419, 28779114, 41690755, 47661833, 49093777, 56849352, 67692628, 66450458, 54393045, 51626402, 64251641, 74880794, 75567931, 81364359, 97386735, 105626103, 105254062, 126834917, 169486382, 160871018, 38488667, -144395541, -256787754, -239049123, -159809485, -112365870, -109703593, -109655112, -94792857, -81396125, -75579823, -66178385, -53023263, -47812513, -49470483, -44881603, -32373253, -22943670, -20210454, -18256442, -17082764, -22037380, -29497963, -30072388, -24925956, -23369290, -26038247, -26367363, -26877603, -36447286, -51081988, -55212811, -45103712, -34487969, -32675958, -32970643, -28770877, -25758071, -29306832, -32710563, -28160622, -19461389, -13833768, -9569135]
4095i569135P362356O146082k449779q585672n414277P44374K529333K434238
4087f802480M358173M380227j284526o816527m731787J696047L090750j792308
4079g902431n129652k461130J875686K856077J594560J235430J060405j147632
4071h018687l672418k419999K518052N801878L603736j385404l887366l071036
4063a0531244k515087l668573l181999J489665O798466O938836K024073j486410
4055d132273M64489L886980K637369k542017n261915l112269p37576j605095k111073
4046a2513380J752525O107946M072033l155997p401806n450462k173276n43008
4038a9305425K944285R203044J1195849L996104o081483r626796o512734k720377
$$ y = [-9569135, -2206779, 3939303, 1489524, -7096148, -12510425, -11766051, -9236718, -6802480, -2444307, 1935920, 651394, -6165133, -10896920, -9200873, -6110123, -7902431, -13032083, -15493213, -13617527, -10761450, -9166890, -7931460, -6871055, -8018687, -11691105, -14111104, -11593052, -5791174, -2187438, -3572842, -7460208, -10531244, -13046331, -16714904, -19896903, -18407238, -11608772, -4669936, -2645863, -4132273, -3667784, 219196, 2856565, 314548, -4947367, -8059636, -8797212, -10402307, -12513380, -10760855, -4652909, -580876, -3736873, -11138679, -16589141, -18762417, -19305425, -16361140, -7158096, 4037753, 8033857, 1952374, -7674422, -14187156, -16907533]
4030a6907533M94216N278106Q433657M498741l135136m519316J911588O044094
4022B098417Q19488p831264j0041867m564944K423368O283693P057497O649371
4014B893759O388047N706096K068306n240898j1377723j0298771l172604K617039
4006a0416749L468851K748248L022279K199140k9393O35542M930196N775778j545601
3997A0788291j0085948r348924J96678P700888N914824j484563o656783o574834
3989i550371l794990j502311P3580K691412O238525P163473K670214m350563p834143
3980h195174n982020k533495m59311J071383K636441K660177J322600J257977
3972h221422K285574Q77049k727916l134796R87577L048506j001900m935287j887930
$$ y = [-16907533, -16413317, -11135211, -2701554, 1797187, -1337949, -5857265, -3945677, 2098417, 2917905, -4913359, -14955226, -19520170, -17096802, -10813109, -3755612, 2893759, 9281806, 14987902, 17056208, 11815310, 437587, -9861184, -13033788, -10416749, -6947898, -4199650, -1177371, 1021769, 992376, 1627918, 6558114, 12333892, 10788291, 702343, -8646581, -8449903, -749015, 5165809, 3681246, -2975537, -9550371, -13345361, -14847672, -14774092, -12082680, -5844155, 1319318, 3989532, -361031, -8195174, -14177194, -16710689, -17170000, -16098617, -13462176, -10801999, -9479399, -8221422, -5935848, -5058799, -7786715, -10921511, -9933934, -6885428, -7887328, -12822615, -14710545]
3963a4710545L828678L058066l713799p321016l800989J486386L665809M012162
3955a3495248M204057K217997k805170o817460n651472n56259L784573M854000
3947a4264982L974316L524547L844479K994362j23030k838392j218839L855354
3939b52185O402258L077729k181346l982556k453879r15093j33974O19281j38897
3930D1338l587450o604583n442122j660059L92984P5005m04284r04235j897151
3921a9990557o37493M723158R336799P271704J383675m13699K146035J680611
3913E500233l635528o376275j883664M766178P437740O633826M394999o15758
3905A6221751p473049r556649l575451L368647K720776l690515p558001o182439
$$ y = [-14710545, -10881867, -7823801, -11537600, -18858616, -22659605, -21173219, -17507410, -13495248, -9291191, -7073194, -9878364, -16695824, -22347296, -22903555, -19118982, -14264982, -10290666, -6766119, -2921640, 72722, -50308, -2888700, -4107539, -252185, 6150073, 9227802, 7046456, 3063900, 610021, -305072, -439046, 180235, 41338, -3546112, -10150695, -15592817, -17252876, -16859892, -16784887, -17189171, -18093406, -19990557, -20628050, -15904892, -6568093, 703611, 2087286, 1673587, 3819622, 5500233, 1864705, -4511570, -6395234, -1629056, 5808684, 12442510, 16837509, 16221751, 8748702, -807947, -4383398, -1014751, 1706025, -1984490, -9542491, -15724930]
3897a5724930l363444r66309K372003N062451L045954k487021m652473l98009
3889a7111778N029857N971133M017104L953302N415261L544561k840493q289184
3881c10237p513326k368533O25905j171522l449100j320342L738368N792235K138544
3872c838008l771792p058828o320550l152092O22855L667400M867269M222122
3864a0761624L263362L321452L832276L151787O22373k670084m817345m579994
3856h637797k363857K95174K359206L725978L861882J711588j851565l449492
3848d348883j256943J939822K314770J80822j392312j688320k302596k938762
3840i492402j589082J164815K284448J072854k04770p53402j775523k048563J666069
$$ y = [-15724930, -19088374, -20054683, -17682680, -12620229, -9574275, -12061296, -16713769, -17111778, -12081921, -6110788, -2093684, 1859618, 7274879, 10819440, 7978947, -310237, -7823563, -10192096, -9566191, -10737713, -14186813, -15507155, -11768787, -5976552, -3838008, -7609800, -14668628, -20989178, -24141270, -23518415, -19851015, -14983746, -10761624, -7498262, -4176810, -344534, 2807253, 3429626, 759542, -4057803, -8637797, -11001654, -10706480, -8347274, -4621296, -759414, 952174, -899391, -4348883, -5605826, -3666004, -1351234, -1170412, -2562724, -4251044, -6553640, -9492402, -11081484, -9916669, -7632221, -6559367, -6764137, -7517539, -9293062, -11341625, -9675556]
3831i675556Q000909J0056384M196358m459832q647239p410264m604514k483119
3823a5026873q21662J61950J60472M98827K107874L168984J764841n79514r68872
3814i533973N17484J402977P11466l36429p34044n60201j18173J43068k14728
3805h722553m04288J009336L228827L359703J055277J37835L034637O261530M779945
3796A3740249r25748n379576m603916N25238O145426Q201961M775439j900842
3788B0578231o859123p625631o327103n151141k872129J327880L922575J201344
3780a805097m748544q514171q299026o309626l741135n919L778362N100619L936672
3771b0607865K622679K047291J504303J812332M494259P811546P694115L329193
$$ y = [-9675556, -1674647, 8381737, 12578095, 8118263, -528976, -7939240, -12543754, -15026873, -15848535, -15686585, -15526113, -15027286, -12919412, -9750428, -7985587, -8565101, -9533973, -9016489, -7613512, -6902046, -7238475, -7972519, -8532720, -8650893, -8507825, -8722553, -9126841, -8117505, -4888678, -1528975, -473698, -335863, 2698774, 8960304, 13740249, 12814501, 7434925, 2831009, 3356247, 9501673, 17703634, 22479073, 20578231, 13719108, 6093477, -233626, -5384767, -8256896, -6929016, -3006441, -1805097, -6553641, -15067812, -23366838, -29676464, -33417599, -33423518, -29645156, -24544537, -20607865, -17985186, -15937895, -14433592, -12621260, -8127001, -315455, 7378660, 10707853]
3763A0707853j591633l876555m018276l801365l629230k997820j430822J311168
3755i326680M151208M558882J744593j292288j778600j549545l573161n746784
3747a2812375l327597K919869O519804M010779j008710l661040l055964n83496
3739a0998730K454531L881683J666509k197337k779654J051734M846407N022385
3731B947528K818841K43643k843548n130558k793714L998536Q222843M515491
3723A1979062k935516n852027k376268K561655M627736K758396l017364j0467467
3715b721793j3337473p081719L478373Q135958L992923j168763Q8745N537288
3707c076461P840905M341935j397526n210351n758714l772097j220123o85103
$$ y = [10707853, 9116220, 5239665, 1221389, -2579976, -6209206, -9207026, -10637848, -9326680, -5175472, -616590, 1128003, -164285, -1942885, -3492430, -7065591, -12812375, -16139972, -13220103, -6700299, -2689520, -3698230, -7359270, -10415234, -10998730, -8544199, -4662516, -2996007, -5193344, -7972998, -6921264, -2074857, 2947528, 5766369, 6010012, 3166464, -1964094, -4757808, -759272, 7463571, 11979062, 9043546, 3191519, 815251, 3376906, 8004642, 10763038, 7745674, -2721793, -16059266, -23140985, -19662612, -11526654, -7533731, -8702494, -8613749, -3076461, 4764444, 9106379, 7708853, 2498502, -3260212, -7032309, -8252432, -8937535]
3699h937535k681789l726990J65101P494922J1326046O954992j960409o950752
3691A683586m012190K466994N327693K561586j444660j641654K108291N241322
3683A2290968L561801k061560o099103m092240J912639N021322J494598m391812
3675G636613n350279M634N714305N957989J533376k118284j618313J144053J984009
3666A4888103n50934l656801l898298j669994m76178j668620k475986p44374J231566
3657I78484O28506n72280J457988N404443N945900K006918j430491j205313o27305
3648A2586850l517767p751772q321271m068779J937426O557334Q061886N562017
3640A1045924L72468l402310k888967k72906J73064j920363l020919j476137j60890
$$ y = [-8937535, -11619324, -15346314, -15181213, -7686291, 3639755, 10594747, 8634338, 1683586, -2328604, 138390, 5466083, 8027669, 6583009, 4941355, 7049646, 12290968, 15852769, 13791209, 7692106, 3599866, 5512505, 10533827, 12028425, 7636613, 2286334, 2290968, 8005273, 13963262, 15496638, 13378354, 11760041, 12904094, 14888103, 14337169, 10680368, 6782070, 5112076, 4635898, 2967278, 491292, -253082, 978484, 1606990, 1034710, 2492698, 7897141, 13843041, 15849959, 14419468, 13214155, 12586850, 9069083, 1317311, -7003960, -11072739, -9135313, -2577979, 5483907, 11045924, 11418392, 8016082, 5127115, 4854209, 5027273, 3106910, 85991, -1390146, -1551036]
3631a551036k180136n818795n644161J105107R981642J2580445N446595n192793
3623H726868r550585m740676L062204O490167M062983o80773l699166l128057
3615E42965l91977N70598j962274l678757N15199P297663P152146k178976j1055909
3606c189322j0638766l995292P35634K353033M641852O962451N279849M41343
3598B590782k575127k767012l179012l555129m43455N116912P340510M257385
3590F785854j0934k529410m386039n075332j552602M464426N476850j451993r276386
3581g555566j0216207n283195k60342K809355N022543N706012L776947J302492
3573d697961P08199O57172q75599j960454o4240K144018m8252n371144p186275
$$ y = [-1551036, -3731172, -9549967, -15194128, -14089021, -4107379, 8473066, 13919661, 8726868, -823717, -5564393, -2502189, 3987978, 8050961, 7370188, 3671022, 542965, 150988, 721586, -1240688, -4919445, -4404246, 2893417, 10045563, 7866587, -3189322, -13828088, -17823380, -17087746, -14734713, -10092861, -3130410, 2149439, 2590782, 15655, -2751357, -5930369, -9485498, -9928953, -4812041, 2528469, 6785854, 6774920, 4245510, -140529, -5215861, -6768463, -2304037, 3172813, 1720820, -7555566, -17771773, -23054968, -23315310, -20505955, -15483412, -9777400, -6000453, -4697961, -3989762, -3332590, -4208189, -6168643, -6232883, -4088865, -4137117, -9508261, -16694536]
3564a6694536k425495M680182Q586625Q227592N728213K784751J20467j622398
3556I385401k100185j466063M1374J599188J099919l111489r206726j2201007
3548a5959588q613188m55525O196756O877879K868234o44204m04349K054774L840158
3539d239053M745900N631536M933291R55283l317392l010285M31923k98110p312267
3530a479174j2705995r052318O9062N530169N071481L816855M358153L413777
3522i77990j065315n397117n068086o11561L391620L277438o02354m438213m740613
3513a6232191k436261j577578k747779j200107N210707J0187969O772575j772537
3505c795202n955202l633114j534172k885670k529888K607412O707705M280373
$$ y = [-16694536, -19120031, -14439849, -5853224, 2374368, 8102581, 10887332, 11007799, 9385401, 7285216, 5819153, 5860527, 7459715, 8559634, 5448145, -3758581, -15959588, -24572776, -25028301, -18831545, -11953666, -9085432, -9729636, -10133985, -8079211, -4239053, 506847, 6138383, 11071674, 12026957, 8709565, 5699280, 6131203, 5833093, -1479174, -14185169, -23237487, -23168425, -17638256, -12566775, -8749920, -4391767, -977990, -2043305, -7440422, -12508508, -13120069, -9728449, -6451011, -7053365, -11491578, -16232191, -18668452, -20246030, -22993809, -24193916, -18983209, -8795240, -2022665, -3795202, -9750404, -13383518, -14917690, -17803360, -20333248, -17725836, -11018131, -6737758]
3497f737758m84776m70660K984481K961247j617000n090699m653563l588260m167408
3488b0864396l695832J79212N099081P623291P569926O054709K372330l769304
3480E69017q891148q424468k572662L388992N244245M105900L592656M618920
3472A631452M943640L122432N20301j212064k664403n107696p652351p939711
3464a4358400n211309r14361L369184O602486P186761L826741j771424n367431
3456f637753m578765j200012J610142K474976J290391j833133n247009n607209
3448a9728372j651521L144243M210897J521678n90806J123634N361847P936191
3440A327791N594728j135729p651753q893662m747521m69329K315q98103J037640
$$ y = [-6737758, -7222534, -7693194, -4708713, -1747466, -3364466, -8455165, -13108728, -16696988, -20864396, -24560228, -24381016, -19281935, -11658644, -4088718, 1965991, 4338321, 569017, -8322131, -16746599, -19319261, -15930269, -10686024, -6580124, -2987468, 1631452, 6575092, 9697524, 10217825, 9005761, 6341358, 1233662, -6418689, -14358400, -19569709, -20484070, -17114886, -10512400, -3325639, 501102, -1270322, -6637753, -11216518, -12416530, -10806388, -8331412, -7041021, -8874154, -14121163, -19728372, -21379893, -18235650, -14024753, -12503075, -13093881, -11970247, -6608400, 1327791, 6922519, 5786790, -1864963, -10758625, -15506146, -15975475, -15973160, -16871263, -15833623]
3431a5833623M108835K484168m286390q737516m874557L678472Q352704O227436
3423h880471K213194J474941L441067M271850K473742j30751j907468l468385
3415e12281n654963p150482n808318k006135J105311J312356n8221j90055J743105
3406a7219683M437493O809342Q690142R471658P844338L392116k452499p327759
3398A3645148r434109q504333n926146l427517j177869J784192M634617M205415
3390d200602p80953o500027p682672l652305J801884N574249P096547N882447
3382b461432J539831l162938l545737Q18354M690779M063240J221098L51588J231590
3373D746373P83306j365727k823008k700794k198912j548821K0998J439915N57461
$$ y = [-15833623, -11724788, -9240620, -13527010, -22264526, -27139083, -23460611, -15107907, -8880471, -6667277, -5192336, -1751269, 2520581, 4994323, 4863572, 2956104, -512281, -6167244, -13317726, -19126044, -21132179, -20026868, -18714512, -18772733, -18962788, -17219683, -12782190, -5972848, 2717294, 12188952, 20033290, 23425406, 20972907, 13645148, 4211039, -4293294, -10219440, -13646957, -14824826, -13040634, -8406017, -4200602, -4981555, -11481582, -19164254, -22816559, -21014675, -15440426, -8343879, -2461432, -921601, -4084539, -7630276, -6811922, -2121143, 1942097, 3163195, 3514783, 4746373, 5529679, 4163952, 1340944, -1359850, -3558762, -5107583, -5086585, -3646670, -3089209]
3364c089209j727268j596368K069806N215237L890665j21326j653073P62921K908031
3355F659416O10491m456912o507363k861897K480388L736163N31481k207795j457201
3346c473229m1265j649344m590631l920882J116639N379995M304728n67445l982458
3337g423892l248667m86479P53142k63678r53293J209344N411029Q238108P467250
3328A0702864L932749l97520m219439o034415m151590L41744K987727J364649
3320D526769r57534K42690K399028l55441o621546p567179J45403P632686N129843
3311D574719m257314q568051k811407N834851Q808726N899639J991466p32072
3303A0740557l183754m940919m234932j852244r54436k088474j731633K091875
$$ y = [-3089209, -4816477, -6412845, -4343039, 872198, 4762863, 4641537, 2988464, 3751385, 6659416, 7269907, 2812995, -3694368, -6556265, -4075877, -339714, 191767, -2016028, -3473229, -3514494, -5163838, -9754469, -13675351, -12558712, -7178717, -2873989, -3441434, -7423892, -10672559, -11159038, -10405896, -10669574, -11622867, -10413523, -5002494, 3235614, 10702864, 14635613, 14238093, 10018654, 3984239, -167351, 174393, 3162120, 4526769, 3569235, 3811925, 6210953, 5855512, -766034, -8333213, -8187810, -555124, 4574719, 317405, -8250646, -11062053, -5227202, 3581524, 9481163, 11472629, 10740557, 7556803, 2615884, -1619048, -3471292, -4425728, -6514202, -8245835, -6153960]
3295f153960N333206K608389m446214p696104k797954M617903O143947J552787
3287h38000j722173P05499M732854M203007j250859p145634r935689r011144n022176
3278b5284315N85817N194599O746235N656729L581778J262284q58157j343830
3270d458860N72638K975876L294782J779880P85364J149749J534829R55265k48248
3261H341275j655482k905107l034698j846622j295618k952936m694972l088762
3253a3132922J004660K759630J20958l116790k490187J555080N008758N120041
3245c170772K230453j465583l427235k353574N72880L085858M733811O520267
3237F726105P553069N080916q67001n823457o005849k925713p47899r16049j621691
$$ y = [-6153960, -820754, 1787635, -2658579, -10354683, -13152637, -8534734, -2390787, -838000, -2560173, -1854674, 2878180, 7081187, 5830328, -1315306, -11250995, -20262139, -25284315, -24698498, -19503899, -12757664, -7100935, -3519157, -2256873, -3115030, -4458860, -3886222, -910346, 2384436, 4164316, 4949680, 6099429, 7634258, 8589523, 8341275, 6685793, 3780686, 745988, -1100634, -2396252, -5349188, -10044160, -13132922, -12128262, -9368632, -9247674, -12364464, -14854651, -13299571, -8290813, -3170772, -940319, -2405902, -5833137, -8186711, -7613831, -4527973, 205838, 6726105, 14279174, 19360090, 18493089, 12669632, 6663783, 3738070, 2990171, 2074122, 452431]
3228D52431j131000N42414K345365L017746K079401O51426j68265j602481m865488
3219A321549o642487k040379O289979Q309536J20185q710623p803603p05652J603062
3210h258433j917941k358849K839715N673947K175812m47504L098639O280064
3202G085450K038878m424986m319172m96156k181780p850964o454464L798963
3194a2804231J0615135N701902l180873m952740j265980r64491m468648m260104
3186a5580030J121671M083385O67059k586034J110844P964903R018376K924395
3178H724569l022898l645439j629801j284467j810308k97325J938194R37025k754302
3169b844752l479581J354144O423473N144341j116095m717365k116042J970259
$$ y = [452431, -678569, -136155, 2209210, 5226956, 7306357, 7957783, 7789518, 6187037, 1321549, -5320938, -7361317, -1071338, 7238198, 7358383, -1352240, -9155843, -9861495, -8258433, -10176374, -12535223, -9695508, -4021561, -1845749, -2293253, 805386, 7085450, 9124328, 4699342, 380170, -115986, -2297766, -10148730, -16603194, -12804231, -2189096, 3512806, 331933, -4620807, -5886787, -6851278, -11319926, -15580030, -14458359, -10374974, -9707915, -12293949, -11183105, -3218202, 5800174, 8724569, 5701671, 2056232, 426431, -858036, -2668344, -2965669, -1027475, -90450, -2844752, -6324333, -4970189, 1453284, 6597625, 5481530, 764165, -1351877, 618382]
3161F18382K136377j77496j15954K450247L040275J61725k329940j865038j393612
3152B524966l659410n098322q11390O105383O613463j844762j0745346j1139619
3144a8055037m093028L345028P996928J0697537J0147667M408691k397486l136454
3136H913846J187209J286654o232340j2361746q687040P9098L932701K401029
3128i480589K392294M836011M086278j47323j185990K439242L505222j221710
3120E223435m324630K12283O454572N769984L42371j337109J818559L496854J341441
3111A8997760p25162q26793j436232l019965k934859j383420j355557k029714
3103E286058J73304L112285L34342o722975p632934J098870Q323065L776916o479223
$$ y = [618382, 2754759, 2577263, 2461309, 4911556, 7951831, 8113556, 5783616, 3918578, 2524966, -1134444, -6232766, -7044156, -938773, 5674690, 3829928, -6915418, -18055037, -22148065, -18803037, -10806109, -108572, 10039095, 14447786, 12050300, 8913846, 10101055, 11387709, 5155369, -7206377, -15893417, -15814319, -11881618, -9480589, -7088295, -2252284, 1833994, 1686671, 500681, 2939923, 6445145, 5223435, 898805, 1111088, 7565660, 13335644, 13678015, 12340906, 14159465, 17656319, 18997760, 18272598, 17445805, 16009573, 12989608, 10054749, 8671329, 7315772, 5286058, 5459362, 8571647, 8905989, 2183014, -5449920, -4351050, 3972015, 7748931, 1269708]
3094A269708r239511k830840L635525N617514O369560O377988J458325o927092
3086E731177j0090479m709741J667940K189270K3803Q03350K779799J393655j596153
3077a807379j168768J976370K875378J022479O76271K928001L828553J039314
3069A1370219k977793n350261n797126m397961q43548K888220L333605N59307
3061a215338j411845o27187K84672o97022j618430r72480j248187m296545o602235
3052a8404597l828922K063625N024654L206200N60307M58768K031326L350807
3044e537832M332345N187263N094341L930425L015825K866097K195210K55345
3036B1339019j691082k297631j883909j385988j155300j486376k621123l617684
$$ y = [1269708, -7969803, -10800643, -7165118, -1547604, 4821956, 11199944, 12658269, 5731177, -4359302, -9069043, -7401103, -5211833, -5188030, -4384680, -1604881, -211226, -1807379, -2976147, -999777, 1875601, 2898080, 3574351, 6502352, 10330905, 11370219, 8392426, 3042165, -2754961, -7152922, -7996470, -5108250, -1774645, -1215338, -2627183, -3254370, -2969698, -3666720, -5285150, -6257630, -7505817, -11802362, -18404597, -22233519, -20169894, -15145240, -11939040, -11378733, -10919965, -8888639, -5537832, -1205487, 3981776, 9076117, 13006542, 16022367, 18888464, 21083674, 21339019, 19647937, 17350306, 15466397, 14080409, 12925109, 11438733, 8817610, 5199926]
3028E199926l085708j592254j214392k201529k665578k199017k497665l206179
3020a3462396j201512L550743N695236K067603k126011k47036N090657N007076
3012D374360k323401q295102n849098R93261L306012q75578n175909l749608K029699
3003a5565364N787368L282581k992933o324429l400545J649374K838161N60218
2995a4165569L14647L437129M350094q50903p670892q679959k755351M546983
2987b1473821P592172M644566k263836p923266o504578K451194J1626415J2940029
2979A088875O267799j468228m456670k243438K397077N955995N580465J736896
2971A4858771j229178m90784P95838j506598m891709l338896K594083N533495
$$ y = [5199926, 2114218, 521964, -692428, -2893957, -5559535, -7758552, -10256217, -13462396, -14663908, -11113165, -5417929, -3350326, -5476337, -5723373, -632716, 4374360, 2050959, -6244143, -12093241, -11099980, -7793968, -8669546, -13845455, -17595063, -15565364, -9777996, -6495415, -9488348, -15812777, -19213322, -17563948, -14725787, -14165569, -13850922, -10413793, -6063699, -6914602, -14585494, -23265453, -26020804, -21473821, -13881649, -9237083, -11500919, -19424185, -25928763, -23477569, -11851154, 1088875, 7356674, 5888446, 1431776, -811662, 1585415, 7541410, 13121875, 14858771, 13629593, 13138809, 13934647, 12428049, 7536340, 4197444, 6791527, 12325022]
2963A2325022K330729j357069n06768J259351k111378r048393j2160439q363221
2955a7632166k340365j8816k050658m335070l032766J399989M478763K413061
2947b1118028l197081o708148m907519m10220K049396Q15293j889692k305079
2939c7671078K226693J0304166J5510180J1923446K125582m103124j592971L539206
2931B262100K634702l651297p354947m814746k12524K190106L207912M240724
2923a497970K835690l228760j0118116j0833244m076444L231759M108064J09442
2915a9469579j247203K713430N709902J663212n573867o873170r25887L897943
2907b0105219K189546q06468J513957N793519L774088l975344p380488q31990
$$ y = [12325022, 14655751, 13298682, 12791914, 14051265, 11939887, 2891494, -9268945, -17632166, -19972531, -19991347, -22042005, -26377075, -29409841, -28009852, -23531089, -21118028, -24315109, -31023257, -35930776, -36340996, -34291600, -33476307, -35365999, -37671078, -35444385, -25140219, -9630039, 2293407, 4418989, 315865, -1277106, 2262100, 4896802, 1245505, -6109442, -10924188, -11136712, -8946606, -5738694, -1497970, 1337720, -1891040, -12009156, -22842400, -26918844, -23687085, -19579021, -19469579, -20716782, -18003352, -12293450, -10630238, -16204105, -23077275, -24003162, -20105219, -17915673, -18722141, -17208184, -11414665, -7640577, -11615921, -18996409, -19828399]
2899a9828399Q706422J0698662L974725l111148l412872J706187N602326M173578
2891H509481p62700m715421n322672l395842o03676K105091M071429M723141M040908
2882H649739J975404j997978o721238p899905k662653M494123N196876j834001
2874g99633q188350o863976j231410J033228j213045k952672j361557J689138
2866a9888277M024377N161338M645078K406579R9583j046739k177672l622174
2858a0397907k539590K035691M878730J135600m890134m232419M026759J1116788
2850A133518J0258266M037945j293410l743944n553339q509146j1039251q845940
2842b3555301M64547J1835999J5353163Q061331r23414k407187N16299m36501
$$ y = [-19828399, -11121977, -423315, 3551410, 440262, -2972610, -1266423, 4335903, 8509481, 7746781, 3031360, -2291312, -5687154, -6290830, -4185739, -114310, 4608831, 8649739, 10625143, 8627165, 1905927, -5993978, -8656631, -4162508, 1034368, -799633, -8987983, -15851959, -17083369, -16050141, -17263186, -20215858, -21577415, -19888277, -15863900, -10702562, -6057484, -3650905, -3551322, -4598061, -6775733, -10397907, -12937497, -10901806, -6023076, -4887476, -9777610, -14010029, -9983270, 1133518, 11391784, 15429729, 14136319, 10392375, 4839036, -3670110, -14709361, -23555301, -23090754, -11254755, 4098408, 12159739, 11236325, 8829138, 9345437, 8908936]
2834H908936m070227k647563L305216N318279J749085l25299P07652j925762q820858
2825B199459j0357657k907770L799577L053288K462721R045844J4403542P414514
2817B9113518o651689j3276869r526529m713938l911480l567599j791507j029246
2809a5355339o83018K417676N921928L905101k666960o376829m723734k379619
2801a9940794j613739N76910M582200O322923N377199O566727J0613500J1053200
2793B3538126M148658m782098q794772p508012m438091j374551J021055J496334
2785C306649N07246N77538J805240Q58111l148198n865538l744926O44678K380510
2776b678690N25025k062091l060695k372034r52527K14137Q23067J533959K626948
$$ y = [8908936, 4838709, 2191146, 5496362, 10814641, 12563726, 12238427, 12946079, 11020317, 2199459, -8158198, -11065968, -7266391, -4213103, -1750382, 7295462, 21699004, 29113518, 22461829, 9184960, -341569, -5055507, -8966987, -12534586, -14326093, -15355339, -16038357, -13620681, -7698753, -3793652, -6460612, -12837441, -17561175, -19940794, -21554533, -20977623, -16395423, -10072500, -4695301, 1871426, 12484926, 23538126, 27686784, 22904686, 14109914, 6601902, 2163811, 789260, 1810315, 3306649, 3813895, 4391433, 6196673, 7054784, 3906586, -1958952, -5703878, -5059200, -2678690, -2153665, -4215756, -7276451, -9648485, -10601012, -10386875, -9563808, -8029849, -5402901]
2767e402901K859542J247585r53129k080490k612195l541768l901696k641057
2759a7026109r68049J05020J875044M311835M104315Q52806N78652O538586J1087597
2750A1459697N422753n806219r692243l304247L710249M357331J377863j598943
2742E926241m932372o919486l510937K989641M885315J440836l2241K055557O35038
2733B537592n350874o477758O91930N722692J367921l821176l86159N781014M422840
2724D488022j195873j015918M087162M972246j12292n135272p570016q363274
2716i845215m927453L705268Q939462K878521o938493o830999J715810M935584
2708f367515l73957l075639J904992N649366K036035k306631j123168J241500
$$ y = [-5402901, -2543359, -1295774, -2248903, -4329393, -6941588, -10483356, -14385052, -17026109, -17994158, -17889138, -16014094, -11702259, -7597944, -6745138, -6166486, 372100, 11459697, 16882450, 11076231, 1383988, -1920259, 1789990, 6147321, 7525184, 5926241, 993869, -5925617, -9436554, -6446913, -1561598, -120762, -153003, 1902554, 2537592, -2813282, -9291040, -8599110, -2876418, -1508497, -5329673, -5715832, 65182, 4488022, 3292149, 2276231, 6363393, 11335639, 11223347, 6088075, -1481941, -9845215, -14772668, -11067400, -2127938, 750583, -6187910, -13018909, -11303099, -6367515, -6741472, -9817111, -7912119, -2262753, -226718, -2533349, -3656517, -2415017]
2700b415017M252r01796K220272M476339J443781j661711J326618O360259N574704
2691A6427701j41038l450291j978090K63697O33451L98966O71135Q66663M92297
2682A4184491p31940l018769m734731l322676J7085M02633l523114o758322n312664
2673a2798007j976205j159753k236701k066236m04751J252836K887001M275119
2665a2226697L460976M65362r78486J090879L379833K897741J842097K886053
2657B817758L885163J995138r09630j909261k299618l970956m408162j126465
2649e926033K500925K212336M60068K180413N663831N129142O64050k048311j091214
2640I745207M9852r7528N98639J727691K9217l720924m712904k543654k531363
$$ y = [-2415017, -2410765, -3312561, -1092289, 3384050, 4827831, 3166120, 4492738, 10852997, 16427701, 16286663, 12836372, 10858282, 11121979, 11755430, 12154396, 12825531, 13692194, 14184491, 13452551, 10433782, 5699051, 2376375, 2393460, 2796093, -727021, -7485343, -12798007, -14774212, -15933965, -18170666, -20236902, -20641653, -19388817, -16501816, -12226697, -8765721, -8300359, -9278845, -8187966, -4808133, -1910392, -68295, 2817758, 6702921, 8698059, 7788429, 5879168, 3579550, -391406, -4799568, -5926033, -3425108, -1212772, -752704, 1427709, 7091540, 12220682, 12884732, 10836421, 9745207, 9795059, 9697531, 10296170, 12023861, 12053078, 8332154, 3619250, 1075596, -1455767]
2631a455767o459385r185276p509397n329292n796914n120467J76301N588879
2623c5091318N242026K166415M169087J1168910J4345006Q545912q45955n484408
2615D215675l658545L26541K717460K867820J144767k201561n821375o963079
2607g372297l590822L179290Q962144R049254K567440n964583j0132440p441880
2599a0743894j289759L226201M567120M769917N104045M138434R87789j763555
2591H996298r07760K296803K703892k213977q497385r838789m454219L571164
2583h343973Q987252R848057P531735M074111O39430j777383j668440J428667
2575B0719456M781289L968139j959097q267584r556137n899155j636684O69517
$$ y = [-1455767, -7915152, -17100428, -24609825, -29939117, -35736031, -40856498, -40680197, -35091318, -29849292, -27682877, -23513790, -12344880, 2000126, 10546038, 9700083, 4215675, 557130, 883671, 3601131, 6468951, 7613718, 5412157, -409218, -7372297, -10963119, -7783829, 1178315, 10227569, 12795009, 6830426, -3302014, -10743894, -12033653, -8807452, -4240332, 529585, 5633630, 9772064, 10759853, 8996298, 8088538, 10385341, 13089233, 10875256, 2377871, -7460918, -11915137, -8343973, 643279, 10491336, 18023071, 22097182, 22736612, 20959229, 19290789, 20719456, 25500745, 29468884, 27509787, 19242203, 9686066, 3786911, 2150227, 2819744]
2567B819744J557584P65210l019366p413499o408113J740724J0339783J1560781
2559A1942848N456499j438448m065758k108575K178202N315662L558447l137109
2551A7701768r030657q495988l273801Q7310q13073k424197k157810j857220l050734
2542a3314402l475183q96416K965945N014466M913422M320403L954309L690700
2534G173244L962162M705848L974519j0206n628282q659406o877025k742511o40018
2525d741675j711460k567560J4465M077760M436855j17592m473912l787474K51854
2516h618739K479650J316428p89441k158505k688777r62112M128872Q669935O469035
2507G846346j574821o391003k554839L577853K653043m135062o916339j833204
$$ y = [2819744, 4377328, 5142538, 2123172, -5290327, -11698440, -9957716, 382067, 11942848, 17399347, 15960899, 11895141, 9786566, 11964768, 17280430, 20838877, 17701768, 8671111, 175123, -3098678, -3011368, -3824441, -6248638, -8406448, -10263668, -13314402, -16789585, -17686001, -14720056, -9705590, -4792168, -471765, 3482544, 7173244, 11135406, 15841254, 19815773, 19805567, 14177285, 5517879, -1359146, -4101657, -4741675, -6453135, -9020695, -9006230, -4928470, -491615, -609207, -5083119, -8870593, -8618739, -6139089, -4822661, -5612102, -7770607, -10459384, -11421496, -7292624, 1377311, 7846346, 6271525, -119478, -2674317, 903536, 3556579, -578483, -7494822, -9328026]
2499i328026L209774K50845o614468o366957L437902J2409402J0545299J118757
2491H662528m194405q69065L762550K075964l656914o263198m077606p90389K155650
2482c194885O237531R654547P551104J25110n501143m519776p33897o4571j941981
2473G612039j752090J003567K236089O601k961671l903334l376900k822994j681317
2464e640010J002125L620478L098271p08006l376172m69301O369412J0004628
2456A3901425N880753k191687o545894m662491p74867N91460j041559m050129
2448A107011o606858n705927R63173R726655J1864676L767773o822713r145729
2440h51939k296226M588965M243974j067373m440275l112109l41153m22944l866888
$$ y = [-9328026, -6118252, -5867407, -12481875, -18848832, -15410930, -3001528, 7543771, 8662528, 4468123, 3599058, 7361608, 9437572, 5780658, -482540, -4560146, -5350535, -3194885, 3042646, 12697193, 20248297, 20373407, 14872264, 10352488, 9618591, 9554020, 7612039, 5859949, 6863516, 9099605, 9106206, 6144535, 2241201, -1135699, -3958693, -5640010, -4637885, -1017407, 2080864, 1372858, -2003314, -2472615, 3896797, 13901425, 19782178, 17590491, 11044597, 6382106, 5607239, 6198699, 5157140, 1107011, -5499847, -11205774, -10242601, -515946, 11348730, 15116503, 8293790, -851939, -3148165, 1440800, 5684774, 4617401, 177126, -2934983, -3276136, -3699080, -7565968]
2431g565968p319187p319408l716886O42479L019933K804419J104218j13038J045464
2422a7417974M068710M888518J94576o619130p731650r65806O278055O248887
2414a1055814O58416k875084j655770Q7153p54449j634615O38399M469604N803403
2405f318757L838572J746482K067331L402956K648429l68682k381481j484791
2397C150059j95525j335707k907031j265549J760531Q30735l330374l445348K358190
2388d380019N599569Q9971p133559n657975K282038N505420J353040j351042K396035
$$ y = [-7565968, -14885155, -22204563, -25921449, -25278970, -22259037, -19454618, -18350400, -18463438, -17417974, -13349264, -8460746, -8266170, -14885300, -22616950, -23582756, -17304701, -11055814, -10397398, -13272482, -14928252, -14841099, -15595548, -17230163, -16591764, -12122160, -6318757, -2480185, -733703, 1333628, 4736584, 7385013, 7016331, 4634850, 3150059, 2954534, 1618827, -1288204, -2553753, -793222, 37513, -3292861, -6738209, -4380019, 1219550, 1309521, -5824038, -11482013, -9199975, -3694555, -2341515, -3692557, -1296522]
$$ [...]
##END NTUPLES=NMR SPECTRUM
##END=
