##TITLE=31Pdec_De-80H2
 D2O, 64 sc
 12.2.2025
##JCAMPDX= 6.0         $$ Bruker NMR JCAMP-DX V2.0
##DATA TYPE= NMR SPECTRUM
##DATA CLASS= NTUPLES
##ORIGIN= UXNMR, Bruker Analytische Messtechnik GmbH
##OWNER= root
$$ XWIN-NMR		Version 3.5
$$ Wed Feb 12 14:11:09 2025 Russian Standard Time (UT+4h)  she@DPX200
##.OBSERVE FREQUENCY= 81.013821
##.OBSERVE NUCLEUS= ^31P
##.ACQUISITION MODE= SIMULTANEOUS
##.ACQUISITION SCHEME= undefined
##.AVERAGES= 64
##.DIGITISER RES= 17
##SPECTROMETER/DATA SYSTEM= spect
##.PULSE SEQUENCE= zgpg30
##.SOLVENT NAME= CDCl3
##.SHIFT REFERENCE= (INTERNAL, CDCl3, 0, 198.062)
##AUDIT TRAIL= $$ (NUMBER, WHEN, WHO, WHERE, WHAT)
$$ ##TITLE= Audit trail, XWIN-NMR		Version 3.5
$$ ##JCAMPDX= 5.01
$$ ##ORIGIN= Bruker BioSpin GmbH
$$ ##OWNER= she
$$ F:/spectra/data/she/nmr/P31/2/pdata/1/auditp.txt
$$ ##AUDIT TRAIL=  $$ (NUMBER, WHEN, WHO, WHERE, WHAT)
(   1,<2025-02-12 14:08:22.53 +0400>,<she>,<DPX200>,
      <created by zg, POWCHK disabled, PULCHK disabled
       configuration hash MD5:
       00 E9 B6 7A A2 85 ED C7 34 08 36 98 17 FE 4E 26
       data hash MD5: 32K
       3E 92 3C 64 F9 27 36 BF 92 03 65 A3 E7 8D CA 75>)
(   2,<2025-02-12 14:08:34.17 +0400>,<she>,<DPX200>,
      <Start of raw data processing
       efp BC_mod = 2 LB = 1.5 FT_mod = 6 PKNL = 1 PHC0 = 1608.703 PHC1 = 351.2954 SI = 64K 
       data hash MD5: 64K
       E0 96 57 52 7C F5 1B B6 43 46 E5 E6 B7 B1 98 CC>)
(   3,<2025-02-12 14:09:23.89 +0400>,<she>,<DPX200>,
      <pk PHC0 = 105.6411 PHC1 = -200.6001 
       data hash MD5: 64K
       52 42 5F C9 61 C1 8F A8 7E 89 6A 15 32 DE 7B C4>)
(   4,<2025-02-12 14:09:31.10 +0400>,<she>,<DPX200>,
      <abs ABSG = 5 
       data hash MD5: 64K
       0B 29 E6 B8 E8 7E D2 DA D7 24 CC B2 0F 55 94 53>)
$$ ##END=
$$ 
$$ hash MD5
$$ 69 B1 94 09 2D AA 13 89 58 7B AB C2 DE 9F 88 77
##$RELAX= 
##$RELAX= 
##$RELAX= 
##$RELAX= 
##$RELAX= 
##$RELAX= 
##$RELAX= 
##$RELAX= 
$$ Bruker specific parameters
$$ --------------------------
##$DU= <F:/spectra>
##$EXPNO= 2
##$NAME= <P31>
##$PROCNO= 1
##$TYPE= <nmr>
##$USER= <she>
##$AMP= (0..31)
100 100 100 100 100 100 100 100 100 100 100 100 100 100 100 100 100 100 
100 100 100 100 100 100 100 100 100 100 100 100 100 100 
##$AQSEQ= 0
##$AQ_mod= 1
##$AUNM= <au_zg>
##$AUTOPOS= <>
##$BF1= 81.014009
##$BF2= 200.13
##$BF3= 200.13
##$BF4= 200.13
##$BF5= 200.13
##$BF6= 200.13
##$BF7= 200.13
##$BF8= 200.13
##$BYTORDA= 1
##$CFDGTYP= 0
##$CFRGTYP= 5
##$CHEMSTR= <none>
##$CNST= (0..31)
1 1 145 1 1 1 1 1 1 1 1 1 1 1 1 1 1 1 1 1 1 1 1 1 1 1 1 1 1 1 1 1 
##$CPDPRG= <waltz16>
##$CPDPRG1= <>
##$CPDPRG2= <waltz16>
##$CPDPRG3= <>
##$CPDPRG4= <mlev>
##$CPDPRG5= <mlev>
##$CPDPRG6= <mlev>
##$CPDPRG7= <mlev>
##$CPDPRG8= <mlev>
##$CPDPRGB= <>
##$CPDPRGT= <>
##$D= (0..31)
0 1 0 0 0 0 0 0 0 0.06 0 0.03 2e-05 3e-06 0 0 0.0002 0 0 0 0 0 0 0 0 0 
0 0 0 0 0 0 
##$DATE= 1739354901
##$DBL= (0..7)
120 120 120 11 120 120 24 19 
##$DBP= (0..7)
150 150 150 150 150 150 150 150 
##$DBP07= 0
##$DBPNAM0= <>
##$DBPNAM1= <>
$$ [...]
##$SUBNAM3= <"">
##$SUBNAM4= <"">
##$SUBNAM5= <"">
##$SUBNAM6= <"">
##$SUBNAM7= <"">
##$SUBNAM8= <"">
##$SUBNAM9= <"">
##$SW= 400.765351723535
##$SWIBOX= (0..15)
0 1 3 0 0 0 0 0 0 0 0 0 0 0 0 0 
##$SW_h= 32467.5324675325
##$TD= 32768
##$TD0= 1
##$TE= 0
##$TE2= 300
##$TE3= 300
##$TEG= 300
##$TL= (0..7)
0 120 53 12 22 120 120 120 
##$TP= (0..7)
150 150 150 150 150 150 150 150 
##$TP07= 0
##$TPNAME0= <>
##$TPNAME1= <>
##$TPNAME2= <>
##$TPNAME3= <>
##$TPNAME4= <>
##$TPNAME5= <>
##$TPNAME6= <>
##$TPNAME7= <>
##$TPOAL= (0..7)
0.5 0.5 0.5 0.5 0.5 0.5 0.5 0.5 
##$TPOFFS= (0..7)
0 0 0 0 0 0 0 0 
##$TUNHIN= 0
##$TUNHOUT= 0
##$TUNXOUT= 0
##$USERA1= <user>
##$USERA2= <user>
##$USERA3= <user>
##$USERA4= <user>
##$USERA5= <user>
##$V9= 5
##$VALIST= <valist>
##$VCLIST= <CCCCCCCCCCCCCCC>
##$VD= 0
##$VDLIST= <DDDDDDDDDDDDDDD>
##$VPLIST= <PPPPPPPPPPPPPPP>
##$VTLIST= <TTTTTTTTTTTTTTT>
##$WBST= 1024
##$WBSW= 4
##$XGAIN= (0..3)
0 0 0 0 
##$XL= 0
##$YL= 0
##$YMAX_a= 11141
##$YMIN_a= -10738
##$ZGOPTNS= <>
##$ZL1= 120
##$ZL2= 120
##$ZL3= 120
##$ZL4= 120
##$ABSF1= 198.0616
##$ABSF2= -202.7028
##$ABSG= 5
##$ABSL= 3
##$ALPHA= 0
##$AQORDER= 0
##$ASSFAC= 0
##$ASSFACI= 0
##$ASSFACX= 0
##$ASSWID= 0
##$AUNMP= <proc_1d>
##$AZFE= 0.1
##$AZFW= 0.5
##$BCFW= 0
##$BC_mod= 2
##$BYTORDP= 0
##$COROFFS= 0
##$CY= -3
##$DATMOD= 1
##$DC= 0
##$DFILT= <>
##$DTYPP= 0
##$F1P= 0
##$F2P= 0
##$FCOR= 1
##$FTSIZE= 65536
##$FT_mod= 6
##$GAMMA= 0
##$GB= 0
##$INTBC= 1
##$INTSCL= 9.790993e-09
##$ISEN= 30
##$LB= 1.5
##$LEV0= 0
##$LPBIN= 0
##$MAXI= 10000
##$MC2= 0
##$MEAN= 0
##$ME_mod= 0
##$MI= 50
##$NCOEF= 0
##$NC_proc= -9
##$NLEV= 6
##$NOISF1= 182.463
##$NOISF2= 159.3651
##$NSP= 0
##$NTH_PI= 0
##$NZP= 0
##$OFFSET= 198.0616
##$PC= 4
##$PHC0= 1714.344
##$PHC1= 150.6953
##$PH_mod= 1
##$PKNL= yes
##$PPARMOD= 0
##$PSCAL= 0
##$PSIGN= 0
##$REVERSE= no
##$SF= 81.0140089999434
##$SI= 65536
##$SIGF1= 159.3651
##$SIGF2= -187.1042
##$SINO= 113.3802
##$SIOLD= 16384
##$SREGLST= <1H.CDCl3>
##$SSB= 0
##$STSI= 65536
##$STSR= 0
##$SW_p= 32467.5324675325
##$SYMM= 0
##$S_DEV= 0
##$TDeff= 32768
##$TDoff= 0
##$TI= <>
##$TILT= no
##$TM1= 0
##$TM2= 0
##$TOPLEV= 0
##$USERP1= <user>
##$USERP2= <user>
##$USERP3= <user>
##$USERP4= <user>
##$USERP5= <user>
##$WDW= 1
##$XDIM= 65536
##$YMAX_p= 428478071
##$YMIN_p= -399011026
$$ End of Bruker specific parameters
$$ ---------------------------------
##NTUPLES= NMR SPECTRUM
##VAR_NAME=  FREQUENCY,     SPECTRUM/REAL,   SPECTRUM/IMAG
##SYMBOL=    X,             R,               I
##VAR_TYPE=  INDEPENDENT,   DEPENDENT,       DEPENDENT
##VAR_FORM=  AFFN,          ASDF,            ASDF
##VAR_DIM=   65536,         65536,           65536
##UNITS=     HZ,            ARBITRARY UNITS, ARBITRARY UNITS
##FACTOR=    0.49542278885378, 1,            1
##FIRST=     16045.7642231865, 0,            0
##LAST=      -16421.768244346, 0,            0
##MIN=       -16421.768244346, -399011026,   0
##MAX=       16045.7642231865, 428478071,    0
$$ Real data points
##PAGE= N=1
##DATA TABLE= (X++(R..R)), XYDATA
$$ [...]
42249 395710 -1653105 -8495587 -16527353 -19513433 -16770839 -16533969 -24712776 -33838638
42241 -33838638 -31270003 -16621954 -2422340 2431024 1159405 -188750 -1546493 -4567036
42233 -4567036 -6928887 -6216966 -4739751 -5735683 -8147769 -8918152 -7401108 -4256444 889342
42224 889342 7245945 10982891 8988487 2849588 -3234007 -6701665 -7208330 -5332264
42216 -5332264 -2271485 1446287 7571976 17117398 25469897 25698178 18294020 11748808
42208 11748808 10626225 9457458 2974104 -4073207 -4125465 1108787 3894518 2791819
42200 2791819 3220465 6832389 8702750 5920604 1682171 -1035609 -3725530 -7886944
42192 -7886944 -11460810 -12537586 -12851045 -15158755 -19864883 -25423647 -29050437 -26519002
42184 -26519002 -15465211 -383571 9705312 10653874 6898788 4109880 2043126 -2728368
42176 -2728368 -10465522 -17864724 -21613149 -19739744 -11972836 -1667284 4880808 4331557
42168 4331557 238677 -1329236 1540829 6649538 12071073 16930991 19323130 17634349
42160 17634349 13867630 12036676 12625229 11634740 6178100 -1399291 -6323372 -6603096
42152 -6603096 -4151816 -2040300 -2143269 -4831809 -9305372 -13719653 -15920444 -15145491
42144 -15145491 -12992945 -11656781 -10975829 -9037222 -6981955 -10574218 -22925745 -36603401
42136 -36603401 -38753626 -26249375 -10702235 -4432225 -5663445 -3382233 6054983 14973972
42128 14973972 17109548 16053588 17228854 17787117 10851435 -3081732 -15392031 -19773126
42120 -19773126 -18321732 -16367912 -15793565 -15746016 -16441795 -18493927 -19678907 -16076289 -7426390
42111 -7426390 764864 2298717 -2793309 -7617847 -5409721 3107168 10218724 9563819
42103 9563819 3159787 -1236567 511911 4326890 3708070 -1859657 -6640921 -5852019
42095 -5852019 -226454 6768687 13116646 18069022 20382764 19541449 17670814 17669507 19770720
42086 19770720 22077040 24073678 26976472 30214865 30157861 23785876 12293937 57442
42078 57442 -8935889 -13131890 -13444971 -12303527 -11666658 -11260327 -9676904 -7384106 -6965592
42069 -6965592 -9778914 -14194281 -17944037 -20156521 -20125038 -16950761 -12595641 -12401209 -18777596
42060 -18777596 -25893663 -24922483 -14538722 -2513338 3548361 3490260 1773012 1132768
42052 1132768 1296315 1409228 1140670 618059 936737 3519400 7854982 11637549 14326278
42043 14326278 18072536 22981938 24059008 16471116 2675763 -9236076 -13841164 -11779247
42035 -11779247 -5518712 3736778 13719336 19848021 19310258 14435193 9809247 7576323
42027 7576323 7177659 7594208 7559609 5433252 1589947 -542613 1257609 4114674 3967585
42018 3967585 2323701 4485354 10644281 13633530 7780899 -3800468 -13565653 -17970922
42010 -17970922 -18158807 -14994652 -8176137 363058 6423400 7778934 5974211 3713570
42002 3713570 2756851 4131932 7513250 10125218 9177713 6003471 4939880 7311459
41994 7311459 9496191 8065927 3585112 -2445206 -10820602 -21503078 -29846742 -30297951
41986 -30297951 -23345004 -15345637 -11358784 -10981688 -11486207 -12023407 -13233742 -14473892
41978 -14473892 -13263803 -7598317 1316250 8657446 9496343 3983453 -1909409 -2667953
41970 -2667953 374131 1224668 -2370073 -5664473 -3294241 3427889 7900590 6081705
41962 6081705 898226 -1272282 2976626 11626402 19738852 22925903 19044899 9128703
41954 9128703 -1893318 -7529013 -5934402 -3239005 -7164741 -16895913 -23172821 -19892394
41946 -19892394 -11318501 -4969319 -1909163 1011943 3061810 785011 -4236744 -6238253
41938 -6238253 -4246862 -2895227 -2824687 1647730 11401874 16833231 10199736 -1664894
41930 -1664894 -5192371 1997513 9181161 7879558 1217084 -3343578 -3515384 -1379532
41922 -1379532 1460842 4014077 4831801 4368713 5632580 9337784 11208202 7844632
41914 7844632 3034152 3710141 10503494 16791855 17490652 14650719 12881427 12888851 12382743
41905 12382743 11041241 10798129 11386815 8920709 615075 -10550563 -17803026 -17260230
41897 -17260230 -11661571 -7246945 -7732700 -11870173 -16173941 -18555770 -18664213 -15961127
41889 -15961127 -9667968 -1234722 5067698 6174901 4371984 5115447 10210401 15251194
41881 15251194 14990427 9390120 2825113 -781983 123362 5492634 12659484 15718803
41873 15718803 10661256 1715851 -2065134 1689826 5103092 974272 -7002286 -9656232
41865 -9656232 -5024946 175531 600000 -2328011 -5760839 -10300369 -16736882 -22149108
41857 -22149108 -23008946 -20004189 -16649550 -14508771 -12596518 -10682129 -10466734 -13166537
41849 -13166537 -17350398 -19492892 -16585147 -9289723 -2882656 -3067549 -9447320 -15085612
41841 -15085612 -14623971 -10963136 -10843413 -15128112 -17717078 -14505548 -9093121 -7330862
41833 -7330862 -9552260 -11789188 -12821577 -15605633 -21391830 -26330770 -26034813 -21219838
41825 -21219838 -16326717 -13686262 -11518561 -7394427 -1384110 4512406 8042113 7220877
41817 7220877 1252895 -7703951 -15112404 -18014479 -17802374 -18004822 -20043152 -22067169
41809 -22067169 -21107518 -15614117 -7169514 -580056 -330608 -5346324 -9429878 -9132210
41801 -9132210 -8519400 -12430099 -17608460 -16453387 -8818124 -3076924 -3910185 -6111267
41793 -6111267 -4296130 -2096925 -5312997 -10717353 -9943632 -2753966 1828485 -1680043
41785 -1680043 -8578770 -12265273 -12673873 -12917261 -12884995 -10953803 -8448141 -7374862 -5945377
41776 -5945377 -1268141 4692487 6709264 3844265 1054441 2300531 5633829 6651947
41768 6651947 4010459 -306594 -4007584 -5751734 -4908046 -2248766 -373439 -1788588
41760 -1788588 -6471427 -12021603 -15982118 -17686282 -18449853 -20184088 -22835099 -23071136
41752 -23071136 -17388771 -7477448 -224669 -99839 -3243068 -2358754 3367144 7320974
41744 7320974 5048961 398531 -640375 1097226 -622287 -8327183 -17486200 -22655088
41736 -22655088 -23353102 -22462296 -21754450 -21269455 -21263054 -22102504 -22694077 -21085782 -16875055
41727 -16875055 -11764474 -7500908 -4252939 -1507181 3152 -1841873 -8053269 -15910683
41719 -15910683 -20086805 -17662711 -11305281 -5809983 -2308890 1321950 4625499 3502528
41711 3502528 -3071230 -9430735 -10204973 -7899741 -8515407 -11537395 -10543113 -3784030 2537342
41702 2537342 3805614 3699645 7205830 11769576 11094921 5002804 -430348 -1504129
41694 -1504129 -163585 1216112 2924830 4797821 4925990 3531357 4156533 8545894
41686 8545894 13539531 15544146 15285620 15539171 16704154 17397248 17103700 15384704 10941735
41677 10941735 4934897 2744460 7808914 15317043 17390195 14053249 13180965 18606719
41669 18606719 24362042 23533985 17470625 11777309 7230771 352296 -8929556 -15990081
41661 -15990081 -18061883 -17565638 -17976383 -19861887 -22032902 -23468835 -22768495 -18563717
41653 -18563717 -12362510 -8754244 -10612656 -15515784 -18844600 -19155229 -18278619 -17010024
41645 -17010024 -13647260 -7545516 -1857955 -710787 -4136411 -7592447 -7120253 -3761431
41637 -3761431 -1600918 -2158431 -2730317 -585955 3451417 7080780 10280573 14487951
41629 14487951 18890356 20354837 17366379 11945859 7299803 5389914 6811734 10511294
41621 10511294 12939531 10270320 3197277 -2501329 -2134473 2579833 6031899 5000490
41613 5000490 357084 -6116181 -13802266 -22238197 -30161506 -35920760 -37665705 -33524418
41605 -33524418 -23264154 -9867901 1857827 8507915 9498011 6309046 1683870 -1504581
41597 -1504581 -2789276 -5118369 -11096891 -18423958 -21669682 -18891146 -13615226 -9252392
41589 -9252392 -4684416 2197699 9002131 10572752 5794427 -568983 -3659884 -3851445
41581 -3851445 -4950430 -8543577 -11795111 -10641321 -4343515 3049714 5634339 841109
41573 841109 -7718762 -13365792 -13072187 -10225129 -9693040 -11450007 -11405431 -7985132 -4529702
41564 -4529702 -4010550 -4549037 -2837850 221899 804811 -2020494 -5544687 -8345696 -11991322
41555 -11991322 -16812625 -19635504 -17752021 -12487626 -6951325 -2949806 -2276374 -7820150
41547 -7820150 -19473098 -30750304 -33999861 -29069459 -23369338 -22903217 -26236516 -28061011
41539 -28061011 -25822517 -21203388 -16942514 -14088964 -11886406 -9291192 -6434983 -4417758
41531 -4417758 -3490158 -2357223 -166461 1779543 1546578 -1053253 -4727020 -7941272
41523 -7941272 -8477014 -4055267 3673281 7872656 3714210 -4019121 -5681817 314912
41515 314912 4743634 -50501 -9914394 -14782552 -11108970 -3751815 2244213 6333766
41507 6333766 9105108 9361308 6941056 5656710 10271072 20587167 30265780 32392292
41499 32392292 25804943 15252262 5751140 -1586642 -7738128 -12232846 -13649231 -12027249
41491 -12027249 -8021672 -1021223 8389965 15293658 14594178 8409795 4154226 4307445
41483 4307445 3774237 -623981 -4486064 -3595050 -1162768 -1462563 -1475995 3506390 9658015
41474 9658015 9094206 3353001 2905614 11674818 20579600 20079099 12250694 5755995 4134653
41465 4134653 4394805 3614640 1592792 -1204021 -3909324 -4459063 -1826946 1874553 4024509
41456 4024509 4719023 4830214 2800154 -3261723 -11577597 -18189509 -21542613 -22376448 -20270326
41447 -20270326 -14582147 -8637366 -8145504 -13776259 -19172645 -18901930 -15495136 -15377324
41439 -15377324 -19512691 -21772686 -16734551 -6218836 3246917 7878735 9812931 13098593
41431 13098593 18102882 21095465 19123898 13827518 9424083 7862209 7696050 7526125
41423 7526125 8205176 10491512 12535109 12083735 10405128 11345009 16127034 21425651 23501526
41414 23501526 21942365 17737707 10190339 -922210 -11284906 -14420741 -9226703 -1885891
41406 -1885891 1585180 2026702 3930937 7872520 9899135 7993659 5474770 6569426
41398 6569426 10580555 12145948 7077838 -2482783 -8978400 -6634359 1537457 5638705
41390 5638705 -374491 -11482603 -17842618 -16560132 -12875090 -10232368 -5365439 4121101
41382 4121101 12763103 13278187 7082239 3217537 7206360 15579993 21706741 22616139
41374 22616139 19036229 13060308 8032148 7121673 9041532 8011021 1220866 -6351859
41366 -6351859 -8733896 -8175245 -11606865 -18493783 -19645112 -10868673 -995949 -622426
41358 -622426 -7707746 -11911773 -10576531 -11217402 -17532107 -22508286 -19976412 -15357111
41350 -15357111 -17790712 -26255017 -31298332 -28327232 -21681744 -16312132 -12858306 -11641232
41342 -11641232 -14151122 -18036460 -16967601 -9260548 -1690896 -627363 -3500815 -3585057
41334 -3585057 209767 3509319 4139754 4113930 4743972 4790390 3737143 2627721 890708
41325 890708 -3780167 -10894353 -15674793 -14283971 -8786640 -4982884 -5981219 -9031535
41317 -9031535 -8494037 -1755882 7305750 10976047 4730396 -8342015 -20579042 -26627698
41309 -26627698 -26773000 -24826211 -24387200 -26373750 -28379522 -26820237 -21145970 -15201598
41301 -15201598 -12904406 -13834728 -15237839 -16699585 -19238193 -20695274 -16816016 -7813492
41293 -7813492 585308 4530119 6307429 8469927 8037164 1504701 -6861160 -7815689
41285 -7815689 1487936 13903665 21459268 23680783 24229582 23254136 17847065 8795949
41277 8795949 1978183 1699215 5651447 8208269 6638086 2251842 -2762455 -7090977
41269 -7090977 -9817569 -10980486 -12642692 -16877785 -22007609 -23003081 -16818594 -5995222
41261 -5995222 3707695 7879927 5598774 -386382 -4544662 -2349205 4945968 11494805
41253 11494805 14327514 16414347 19833564 20176810 12957652 2567036 -2122017 -87958
41245 -87958 1504291 -61927 1303743 8687599 14367918 10738048 2960270 1792620
41237 1792620 7054516 8225693 1425516 -4294305 -1078861 5793743 6441919 1336135
41229 1336135 1926 6717076 14601035 14774269 6292168 -4710947 -12088839 -13982887
41221 -13982887 -12753841 -12608330 -15662338 -19190850 -18551071 -13617199 -9669973 -10314160
41213 -10314160 -12463293 -11110106 -6387028 -1930589 1736317 6883768 12255582 13398998
41205 13398998 10998887 12625797 22009855 31404247 30320204 18948218 6899759 442196
41197 442196 -2369978 -4402797 -4795100 -3460753 -3414185 -4992125 -3417928 3255919 8609551
41188 8609551 6103320 -622832 -2457978 1981548 5160448 2857415 369709 3819265
41180 3819265 10900321 14395902 11525902 5907216 2298896 2795087 6804282 11614269
41172 11614269 13594748 11334527 7229805 4256313 2175810 -1047941 -5275373 -8332623
41164 -8332623 -9463274 -9715473 -9010501 -5958718 -1291829 1494734 500495 -1785476 -1841123
41155 -1841123 428450 2511049 3248614 3727166 4722236 5336480 4431596 2125136 -340153
41146 -340153 -1399387 -4465 3451698 7156033 9380439 9469024 6963782 1362500 -5705040
41137 -5705040 -9838453 -8516262 -5793604 -8674640 -18082072 -26979682 -29056780 -25784476
41129 -25784476 -22279327 -19621204 -15587085 -10883062 -9175963 -10768297 -11197747 -7761108
41121 -7761108 -3479772 -2355069 -4024265 -5890761 -7673093 -10258958 -12046015 -10692713
41113 -10692713 -7931675 -8421620 -13040137 -16862646 -15444185 -10481208 -7309999 -8685210
41105 -8685210 -12929149 -16640369 -17108209 -13242571 -6574072 -1038188 228336 -2062454
41097 -2062454 -4701931 -5594493 -4255854 88563 7665331 15433959 18853548 17596832
41089 17596832 16161238 16985262 16629516 12003941 6961165 7608499 12826798 15360867
41081 15360867 12394452 8989802 9210719 9635874 5510031 -1115449 -4424297 -3365688
41073 -3365688 -1948399 -2316578 -2711653 -2334236 -3350221 -6635518 -9191851 -7669244 -2006118
41064 -2006118 5730705 13621221 19496856 20709701 16521858 9369135 2025746 -5170290
41056 -5170290 -12499320 -17714220 -17596237 -12910511 -9397132 -12052649 -19019868 -22828624
41048 -22828624 -18378014 -8690291 -1531074 -948500 -3997616 -5637421 -4136299 -750428
41040 -750428 2751580 3928576 5041 -8026178 -13764606 -12177891 -6739694 -5157142
41032 -5157142 -8762261 -11477435 -9388401 -5348593 -2654224 -308180 2488239 2874398
41024 2874398 -307542 -2403288 591489 4863029 3452276 -4247875 -12695712 -17798297
41016 -17798297 -19093965 -16201598 -9059858 -1120067 3321916 4961413 7429607 9711733
41008 9711733 6913468 -498789 -4980787 -2236008 2596184 2921940 -106130 -1088931
41000 -1088931 806304 1936611 654683 -1629561 -4343488 -7366309 -7481346 -979989
40992 -979989 9321081 15020878 12423751 7593738 8022835 12759853 14933412 11833444
40984 11833444 7594593 6251936 6810008 6364821 4227798 880394 -4033782 -9996588
40976 -9996588 -14276779 -15211403 -14905659 -15671709 -15906789 -13421012 -10835895 -12194224 -15019476
40967 -15019476 -12395126 -4044415 1639911 -277891 -3723473 -1108348 5316242 8099487
40959 8099487 6296275 4946876 5443139 4510035 2025881 1959765 4797832 6187664 4546621
40950 4546621 3412118 4586895 5706685 6778605 11750999 19789194 22092091 13098839
40942 13098839 -432391 -7458147 -5546687 -70034 5201494 9841134 12221280 10710821
40934 10710821 8030594 7689987 7152812 1335389 -7858528 -12968742 -12201853 -11314913 -12675186
40925 -12675186 -10778372 -2610828 5014430 4557660 -1140691 -3566470 -730670 2317717
40917 2317717 2958624 3528576 4584914 2760094 -2902400 -8369928 -11146265 -14406392
40909 -14406392 -20871157 -26570136 -25712506 -19621528 -15417001 -15999816 -16467841 -12193986
40901 -12193986 -6335223 -5852631 -11914175 -17819139 -16672742 -8816866 -767181 1958263
40893 1958263 -71794 -1852271 255999 5020738 8710635 10009298 11080719 13734976
40885 13734976 16521620 16886177 14673136 11543101 7854357 2580781 -3612692 -7544041
40877 -7544041 -6825843 -2760325 960998 1778836 121547 -1505692 -991020 1221648 2429707
40868 2429707 740689 -2554589 -4708786 -5204930 -6321058 -10119123 -16108242 -21581510
40860 -21581510 -22924838 -17458601 -6491632 3561195 6082546 1387417 -3200158 -1509378
40852 -1509378 5133974 10675131 11200150 7394596 1957321 -3177313 -7410160 -10516554
40844 -10516554 -11219685 -7216125 1894358 11903984 16470983 12943474 4055114 -6030337
40836 -6030337 -14727506 -20112568 -20854487 -18545951 -16740842 -15820416 -12026756 -3633773
40828 -3633773 5357276 10268855 11066775 9523542 4615348 -4897434 -15696925 -22230813
40820 -22230813 -22574478 -18651067 -12681425 -7178375 -6021998 -10555038 -15963675 -16369922
40812 -16369922 -12549794 -9991294 -10550769 -11352167 -11162016 -11946004 -13857284 -14337695 -13029196
40803 -13029196 -12439663 -13056290 -13060613 -13390536 -16921320 -21374774 -19901257 -11506645 -4478861
40794 -4478861 -5597876 -11560983 -15330876 -15614599 -15112777 -14319063 -12838357 -12730221 -14232719
40785 -14232719 -11556553 35967 15072402 22994459 21633803 18679339 19728818 22032925
40777 22032925 21671854 20096197 19875809 18928620 13650084 5305434 -723729 -1251273 1823575
40768 1823575 4581371 5244600 5299461 7326889 11683489 15429055 15253705 11156569 6113462
40759 6113462 2684541 1775755 4211949 10469771 17810630 20492171 15393330 6398004
40751 6398004 951552 2389089 7354462 10925689 12407772 14674422 18771913 21593198
40743 21593198 20016140 15739429 13699943 15894326 19104089 19347841 16300329 12029036
40735 12029036 7638852 3484162 1169556 2349201 5673644 7348077 5316448 1547082
40727 1547082 -19906 3180597 10512538 18023665 20373167 14803228 3882568 -6573914
40719 -6573914 -12458374 -13704650 -12584715 -11373624 -11358530 -12117441 -11318620 -6798620 595060
40710 595060 7507872 11854776 14676166 17509778 19374846 17829568 12414073 5650159
40702 5650159 674913 -997707 608992 4478707 7850421 6608261 -516011 -8123119
40694 -8123119 -8392220 -1270836 3286063 -2549380 -12968962 -15401553 -7869514 -1661451
40686 -1661451 -4826072 -11100751 -10348297 -3275149 1700110 1807986 1565857 3134340 3911773
40677 3911773 3983902 7587597 14913275 19538485 17371655 12465038 10284937 10037307 7708599
40668 7708599 2851883 -1794246 -4556628 -5053200 -2831207 673002 1275525 -3108077
40660 -3108077 -8516924 -9045955 -3165121 6644760 17650077 26418420 27549601 18565629
40652 18565629 5334866 -2644334 -2816773 -1146423 -2830359 -6157445 -7004002 -4993503
40644 -4993503 -2508873 -748844 256315 -131557 -1859309 -2338702 1083012 6925697
40636 6925697 10301671 8590148 4890136 4679878 9463746 14678825 14321901 7387508
40628 7387508 -832639 -3939678 -370674 5977026 10133371 10291958 8336956 7357758
40620 7357758 8792092 11418259 12905130 12233183 10253110 8253692 7154883 7950334
40612 7950334 10908993 13628311 12299469 6870208 3071203 6551566 15794129 23292209
40604 23292209 23191501 15575552 4330548 -5791655 -10158380 -6366003 2834267 11070547
40596 11070547 14298958 13619672 11749909 9417803 6436745 3349087 -339304 -7224216
40588 -7224216 -18251410 -29021821 -32789242 -27267484 -16796774 -7883208 -3744395 -2709959
40580 -2709959 -746126 4161516 9605738 11608946 9968323 8569699 9610853 10610794
40572 10610794 9163798 7230324 7238600 7119713 4167930 1398254 3652504 8331694 7409680
40563 7409680 -236038 -6007002 -4028563 771023 1757278 1170344 4732607 10541545
40555 10541545 11701660 7709897 4887365 6019438 7595182 8106485 11043685 16943860
40547 16943860 19542037 14099257 4378749 -2985718 -6970557 -10893019 -16242300 -21942638
40539 -21942638 -26775927 -28629309 -24405624 -15031451 -7752209 -8514979 -14037329 -16225146
40531 -16225146 -12676181 -7792497 -5208237 -5060059 -8013054 -15444753 -24650071 -29635383
40523 -29635383 -28488868 -25200272 -22639142 -18806882 -12246558 -6003318 -2785775 -454154
40515 -454154 3752711 7994293 9109080 8376253 9382962 11876732 12346236 9901295 7148958
40506 7148958 5175066 1791770 -4131689 -9841594 -11882664 -10023382 -6459821 -2602775
40498 -2602775 1637793 5966264 8683395 8131251 4699990 720707 -1839652 -2936067
40490 -2936067 -3161668 -1917590 1533749 5674724 7587928 6556367 4800209 4121041
40482 4121041 4046611 4168253 5777730 9446388 13048035 14285026 13634122 12697050 10983125
40473 10983125 6741931 385957 -5049547 -6997210 -5933144 -5071078 -7583079 -12874457
40465 -12874457 -15606834 -10700678 161016 9821108 14189551 15634165 16227512 12987669
40457 12987669 4468952 -2340156 1172108 12926537 21425228 19639518 11738232 5247219
40449 5247219 2668453 2956289 5397452 8141798 7155203 1205161 -4481771 -3546251 3774872
40440 3774872 11269987 13928664 11721030 7208699 2325640 -2393461 -7207891 -11861316
40432 -11861316 -14158197 -11061482 -2564365 6895397 12739803 14830051 15710241 15546645
40424 15546645 11940458 4802840 -1753221 -3877856 -2329902 -544496 328479 2113122
40416 2113122 5491399 7677382 5653160 316438 -4663154 -7615501 -10030573 -12512079
40408 -12512079 -12385687 -7399497 30811 4948460 5458598 3832744 2649736 2486434
40400 2486434 3228853 4725250 5535330 3660169 -450880 -3833356 -5058530 -6281209
40392 -6281209 -9868658 -14761195 -17771437 -17192683 -13628461 -8337874 -2434417 2584205
40384 2584205 4656709 1869755 -6136937 -16507027 -23458664 -22383929 -14406406 -5445582
40376 -5445582 -219486 1480277 2432368 4074120 5929579 7191326 7568677 7560593 8605640
40367 8605640 11887434 16428942 19311920 18058460 12273575 3967852 -2433721 -2502926
40359 -2502926 2636009 5110121 -583642 -8548472 -7975527 1271638 7505020 4149940
40351 4149940 -770013 2139989 8470140 6813227 -3923119 -13909936 -17349319 -18256516
40343 -18256516 -20625324 -21884776 -19128176 -14610009 -11007361 -6704428 -160217 5082197
40335 5082197 4224486 -2334753 -9875807 -14826911 -16455324 -14828419 -10223151 -4182381
40327 -4182381 743109 2424348 392378 -2975049 -2876163 3478495 12267332 15943315
40319 15943315 11865870 4951054 283043 -3192004 -8820295 -15448107 -18751794 -17873203
40311 -17873203 -16526616 -17384705 -18553957 -16494163 -10391151 -2571760 4470677 10577298
40303 10577298 17213710 24159473 27774253 24272497 14782422 5184472 337559 277080
40295 277080 2469787 5186385 7483561 8535771 8833643 9856772 10951135 9239701
40287 9239701 4761402 2488515 5682808 9795462 7618313 -616730 -7087089 -6580881
40279 -6580881 -2539768 -1523956 -4952896 -8482992 -7889520 -3780702 -788362 -2440917
40271 -2440917 -6731980 -7883744 -3513433 1715691 1780577 -2945710 -6652657 -5696895 -1611664
40262 -1611664 3032720 7705104 12244771 15760209 18225701 20087879 19669337 14587636
40254 14587636 6680210 1402008 653489 411317 -2273848 -4570585 -3694544 -2937403 -6574865
40245 -6574865 -11812228 -11946671 -6243564 -688970 843898 284134 -446557 -2836480 -6964059
40236 -6964059 -8497565 -4285428 2615951 7379840 10232448 14749612 21094146 25375894
40228 25375894 25404149 23153199 20985472 18817479 16198059 14237767 13503188 12108752
40220 12108752 8356674 4124394 2963007 4976369 6253813 4339182 1880589 2632007
40212 2632007 5313367 4819204 -86700 -3681116 -183742 8381027 14380440 13895399
40204 13895399 10631649 10228861 13769540 18273326 21045083 21337166 19300026 15780770
40196 15780770 12736448 11910350 12967106 14053217 14032417 13117912 11485127 8412054 3148599
40187 3148599 -3742415 -10029085 -13060038 -12130020 -9547895 -8217107 -8144303 -6989119 -4200939
40178 -4200939 -2024085 -1322150 437578 4297987 5470279 -1938848 -16511362 -29604822
40170 -29604822 -34077726 -29838403 -20741420 -10010316 -391608 4529113 2481577 -4519280
40162 -4519280 -11050252 -12524865 -9102409 -6321951 -10803773 -22997313 -34605629 -35949527
40154 -35949527 -25977173 -12335192 -1936541 4598277 8848584 10269842 8678053 6790595
40146 6790595 6472041 5370394 1136811 -3344251 -3060216 2292462 8493985 12799547
40138 12799547 15969354 18942523 21218623 22530365 22919154 21068144 15477765 7509011
40130 7509011 802532 -2357601 -2183985 56117 1946361 -177851 -7235733 -13790932
40122 -13790932 -12740789 -4064602 4963672 8708574 8135185 6171393 3137172 -869683
40114 -869683 -3346754 -2499725 -105664 1629366 3438551 6404963 8792246 9019434 9627466
40105 9627466 14153487 21038949 24551545 21721079 15206041 9250860 5959900 6114507
40097 6114507 10409280 17845448 24598731 26620150 23146886 16638344 9746876 3793485
40089 3793485 400879 2620472 11996453 24567691 32615600 32144384 26611028 21066308
40081 21066308 15071265 5462952 -5486176 -10637684 -7749584 -3102429 -2761164 -5214044
40073 -5214044 -6500399 -7956755 -13045207 -19317175 -20360742 -15490536 -11459404 -13330060
40065 -13330060 -18673991 -22712327 -24616084 -25634322 -24546063 -19276039 -11756151 -7380693
40057 -7380693 -9208384 -14936406 -20023497 -22021228 -21195905 -18509105 -14542928 -10132936
40049 -10132936 -6810980 -5958986 -7587055 -9976861 -10525863 -7603185 -2488169 986849
40041 986849 458330 -1110989 1956715 10179173 16268334 13221273 3066791 -6254639
40033 -6254639 -11251326 -15041508 -19438386 -21179308 -18369139 -15109341 -15615066 -17720304
40025 -17720304 -16785771 -13175063 -11203017 -12715715 -16114309 -19832174 -22094204 -19000263
40017 -19000263 -8492926 4252076 10964628 10305095 8739306 10801019 13934011 14544870
40009 14544870 13455894 12237021 9236687 3815642 651656 4120453 10339220 10808624
40001 10808624 3969423 -2573143 -3093005 -1749092 -5462254 -12260705 -12803463 -3514558
39993 -3514558 7530724 10582581 5936698 1463872 1036633 814482 -3333869 -9956056
39985 -9956056 -14861763 -15711733 -12196378 -5325615 1811344 6090270 8571011 12769719
39977 12769719 17604396 17523517 11998426 8418130 11171931 14232015 10772010 4331345
39969 4331345 2513304 4403658 3797537 1789014 5348795 13940438 18062155 12629208
39961 12629208 2822200 -5031535 -9707527 -10587666 -6424831 -1576479 -3952591 -12337614
39953 -12337614 -14742914 -4940963 7615847 10765948 4940941 -1683189 -6370914 -11603136
39945 -11603136 -16708167 -18402658 -16692237 -13224315 -7078461 1136772 5017353 42414
39937 42414 -7597321 -7965852 -909991 5288532 6630495 6143999 5102610 684671 -6737861
39928 -6737861 -11884882 -11827402 -8843642 -5421027 -2555849 -2978222 -8823170 -15299385 -14199881
39919 -14199881 -5540432 1385838 771995 -2921193 -3709345 -2390787 -1903231 -710822
39911 -710822 3791708 9748974 13831221 16433718 19455064 21860976 21767518 20419697 19797717
39902 19797717 18144956 12164703 2890096 -4188593 -4949594 -481427 4766176 7341682
39894 7341682 7516385 8041913 9696450 9146095 3564109 -3589554 -5296999 210842 7436031
39885 7436031 11263350 12155248 11956026 9280623 2617798 -5191831 -9371921 -8540974 -5223590
39876 -5223590 -2753884 -3462419 -7694662 -12601764 -14005937 -11363821 -8852336 -9970424
39868 -9970424 -13387701 -15614679 -15056834 -11675494 -5540265 1951177 7597082 9024384
39860 9024384 6146925 -212004 -7894598 -11649296 -7148037 1640410 4934350 -92789
39852 -92789 -4927327 -2015758 4700553 6969235 4035463 142481 -4758883 -12895273
39844 -12895273 -20205774 -19616035 -12280565 -6675926 -5710634 -3286221 4076052 10211464
39836 10211464 8071136 -516185 -8525479 -12877088 -15230494 -16592611 -15948205 -13465770
39828 -13465770 -11473628 -11467234 -11478573 -7335377 2556514 13294795 16338363 8428734 -3903693
39819 -3903693 -11246247 -10797708 -5899210 932836 8932528 14803070 14626675 10633187
39811 10633187 9523723 12711311 14679937 12784985 11374050 12819910 11973369 5061309
39803 5061309 -2423154 -3965257 -3259565 -8764905 -19805940 -26939954 -25660397 -21420104
39795 -21420104 -19871070 -19745329 -18073711 -15779077 -14085672 -10655228 -4105287 1397558
39787 1397558 1127549 -3138536 -6168208 -7687182 -11899330 -18534077 -20520110 -13425667
39779 -13425667 -2794555 2223653 232105 -2089518 -395235 1546897 -1779601 -9319520
39771 -9319520 -14845853 -14766408 -10869236 -5753890 617460 8334036 14286474 14367052 8489536
39762 8489536 1425904 -1877412 -986931 260210 -1948385 -7690480 -13473717 -15509460
39754 -15509460 -12651478 -6516472 498579 6829946 11805683 15033495 16236741 15442940
39746 15442940 12827090 8279565 1677961 -5840296 -11339179 -12182458 -9096747 -5799258
39738 -5799258 -4708350 -4484092 -3057830 -1004383 645798 3850957 10460368 16521748
39730 16521748 15249169 6880182 85458 812513 4854983 5586291 4280327 6687228
39722 6687228 12339036 14295950 9090965 903668 -4794438 -6698394 -5810749 -2694173
39714 -2694173 1807643 6420523 11034763 15575220 17227405 12590832 3146695 -5224151
39706 -5224151 -8882461 -8892240 -6625315 -1773554 3980813 6457642 4793661 3561465 6175438
39697 6175438 9872281 10330861 7932674 6020795 5668085 5648667 5572363 5861975 6053838
39688 6053838 5582238 4922719 4362307 3550215 3373968 5288029 7358887 4930055 -2308044
39679 -2308044 -8073186 -7774611 -5067513 -5791653 -8970217 -9189478 -5346993 -1291083 675940
39670 675940 1295463 368317 -3016710 -6602275 -7006654 -5968891 -8779628 -15241342 -17966962
39661 -17966962 -12427496 -3912214 -720294 -3826155 -7618698 -8967303 -10712161 -15611926
39653 -15611926 -20698855 -20468243 -14474063 -8562107 -7278087 -7375761 -1891885 10094425
39645 10094425 21509541 25839724 24003521 20989133 19258821 18347133 18006529 18076842
39637 18076842 17030202 13985215 10907551 10132196 11148883 12082704 12277978 11241844
39629 11241844 8082461 4800530 6272630 12904970 17265402 13172275 4298257 -2212304
39621 -2212304 -6225472 -10515287 -10186576 2258911 21545161 31251976 24148907 10916430
39613 10916430 4161505 3063366 17664 -5678979 -8921999 -8242854 -6195178 -3429301
39605 -3429301 879599 4995033 6859701 8324313 11791526 14724481 13103005 8885015
39597 8885015 8293361 12957506 17732064 17757365 13763623 9742449 8359646 9382319 10842395
39588 10842395 11477710 12422003 15097516 17349208 15059644 8841759 4763747 5843348
39580 5843348 7569927 5752529 3858344 6962036 12776489 15839167 17397747 22638601
39572 22638601 29373797 28657976 18050713 6219782 1420787 1929866 1346950 -2205255
39564 -2205255 -6210853 -8671165 -8657503 -5067229 1360112 7034959 9702729 11767170
39556 11767170 16788169 24400676 30933455 33235486 29987716 21695370 12059552 7238300
39548 7238300 10446826 18113531 23663875 24026662 20455307 14815950 8185580 2054809
39540 2054809 -2427422 -6163643 -10092554 -11673052 -6931879 3042825 11030433 11390308
39532 11390308 6770530 4645715 8500849 15191087 20444377 23726585 26666254 29224666
39524 29224666 29430240 25713719 18044283 8060699 -316915 -2197337 3354831 10379718
39516 10379718 11249251 5028031 -2261981 -5690849 -5937440 -5042063 -2372547 2410253
39508 2410253 6305350 6884041 6666153 9497509 14436288 17462988 17939565 18884383 21391193
39499 21391193 23303623 23753257 24829473 27624075 29901775 28929551 24303688 17669890
39491 17669890 12228601 12240976 19230041 27955452 30092021 23722322 16064754 14779057
39483 14779057 19237609 22674008 20840249 15932250 12926152 14165624 17699158 20308220
39475 20308220 21961036 26170623 34731516 43666082 47102043 44190224 38840686 33339270
39467 33339270 26586320 18949185 14030012 13851638 16202336 18570455 21016158 23511005
39459 23511005 24815678 26482142 33382820 46467207 58724818 62674795 59005433 53529550
39451 53529550 48408119 41623181 33532331 28409725 29142352 34051817 38920132 39426998
39443 39426998 33011901 22200641 14952304 17130676 24877901 28824864 25703617 20938214
39435 20938214 19459195 19857279 19868505 21972555 28944030 37307213 40477590 37277705
39427 37277705 32848616 31099218 30304100 27521303 24170021 24546918 30144468 38123814
39419 38123814 45353604 51444646 56776147 59904556 59455834 57305387 56572179 56593430 53683868
39410 53683868 47968434 45233399 48955018 54010515 53039418 47203881 45082990 50644445
39402 50644445 57597623 57846430 51596462 45956034 45926851 50084611 54120272 55548660
39394 55548660 54517834 51906728 47695522 41036232 31993059 23235026 19027066 21548319
39386 21548319 28624127 36127839 42464115 49461134 58447492 66785998 69897320 66545890
39378 66545890 60373731 55511620 52411885 49524028 47285567 47427602 48855535 47735163
39370 47735163 42576092 36418063 32926464 33052307 36420970 42240328 46830863 44537747
39362 44537747 34981695 26129865 25508730 30877030 34782824 36066678 40023803 47715843
39354 47715843 52859447 51494919 47988909 47578709 48408938 46021383 41880996 41580781
39346 41580781 46224912 50882518 51419276 48552997 44524632 39252032 31316311 21046577
39338 21046577 11689194 8062123 13188062 24528698 34278421 35822005 30114977 23836878
39330 23836878 21346323 20851911 19037537 16772049 18157251 24963837 33798117 38750014
39322 38750014 36143276 27182592 16914719 10555283 10066650 13720095 18380079 21589091
39314 21589091 21871700 18625416 12614510 5783273 -35156 -3378957 -2064533 5575790
39306 5575790 16325591 21604744 15892259 5081798 1129930 6940293 12098647 7211321
39298 7211321 -2746765 -5528089 1490220 9606172 13258252 17297150 26878846 37320837
39290 37320837 39266012 29921675 14873277 2005429 -2636684 3434400 16697864 28907240
39282 28907240 34682763 35950138 36163285 34028166 27432823 19663883 15450815 13451529
39274 13451529 9463359 5325458 7069989 14533299 20407393 20692792 19048607 18918851
39266 18918851 18118333 14142843 8927064 4847515 962053 -3300640 -5154321 -2648555
39258 -2648555 2172941 7650849 15885121 27715938 37984856 40567661 35989451 29917368
39250 29917368 25653834 21773255 16073979 8616615 1264513 -3686600 -4980651 -3716378
39242 -3716378 -2222364 -1217956 145018 1572748 1944755 2318846 4651257 7149960
39234 7149960 5850649 2022467 2378431 9514669 17690609 21149231 20894582 19468002
39226 19468002 15280371 7631795 1774505 2097261 4267173 1147518 -6387090 -11252456
39218 -11252456 -10338048 -6324229 -1417115 4058568 8263904 9405178 9596940 11427132
39210 11427132 12278377 8119744 1149535 -3028295 -4298549 -6842904 -10049712 -8339768
39202 -8339768 -231594 9404692 16280751 19312993 17143155 9867505 3830407 5916074
39194 5916074 12630528 14167628 10175576 10577812 17983750 21403227 13795804 4971224
39186 4971224 7700704 18914529 25053629 21020810 13583244 8767769 5663183 2355813
39178 2355813 -97946 -773279 -373527 1092945 3957252 6404082 6323242 5222472 6390517
39169 6390517 9421696 10242964 6760434 1583762 -1101737 510248 4645467 7345999
39161 7345999 5985203 2196940 -307327 -836512 -1300737 -611223 4842104 12978232 14901500
39152 14901500 6917517 -1839730 -268377 10182266 18738163 19970370 17733552 16361248
39144 16361248 15995096 16681920 19700515 23419178 23832360 20715989 18063541 17262550 15279456
39135 15279456 11379586 10227097 15174982 22391491 25017094 20876618 13662238 8275970
39127 8275970 6923626 8551893 10707321 12250506 13935739 15546727 14244223 8376320
39119 8376320 1598586 -370742 3186942 7449949 8446562 6701082 4407313 2340850
39111 2340850 418269 -1116319 -1774410 -787310 2297963 5589310 5482236 1664995 -1349508
39102 -1349508 -1163682 -2417725 -9340790 -16583945 -15005736 -5120511 3614928 7048123
39094 7048123 10853907 18661955 24583129 22301903 14754647 9329623 8493615 10195089
39086 10195089 13208247 17005822 19633905 20114760 20147676 20137023 17288705 11229317 7126411
39077 7126411 8500713 10846871 7873412 1082371 -2555219 -365046 4138175 7794142
39069 7794142 11015406 14886263 19188494 23121627 25295154 24363218 22030754 22728199
39061 22728199 27257800 30211143 27575391 22794618 20114001 16564805 8166792 525223
39053 525223 3404299 15347724 23502962 20439046 12378085 8071149 8142537 9830473
39045 9830473 14237875 22028113 27216499 22708836 9953547 -2331635 -7590236 -5616168
39037 -5616168 419325 6511573 8787793 6431732 3418600 4218033 8427709 12324598
39029 12324598 14300509 15383074 15619792 14054370 12032427 12428262 14876642 15381616
39021 15381616 12008946 7917424 6914928 8538941 9961878 10961120 13744565 17936871
39013 17936871 18850636 12651803 1922079 -6174749 -7310836 -3675604 236353 3126702
39005 3126702 6271313 9373625 10419145 9399352 8984352 10858260 14051017 17556232
38997 17556232 21751582 26253179 29403020 31259663 33864283 36772591 36085164 30713047
38989 30713047 25662139 24865942 24239229 17547374 6893598 644645 1537800 3882046
38981 3882046 3555456 3729187 7871408 13373625 16379778 17994908 20893873 23689792
38973 23689792 23730981 22232010 21253730 18468757 11206889 3811961 3831545 10981485 16833406
38964 16833406 16617448 14520336 14736213 13907605 7185415 -2998045 -9896478 -11559234
38956 -11559234 -11592618 -11984603 -10171918 -3771710 5274023 12426580 14765294 13229091
38948 13229091 11687782 13223017 16471270 16985389 13242759 9158384 8821173 11096289
38940 11096289 12048474 10474137 7772345 4377402 399924 -1537117 1303151 6794286
38932 6794286 9557456 7658959 3813942 -19909 -4679152 -9607282 -11223476 -7545590
38924 -7545590 -1257526 3424278 4244913 637878 -6387628 -12935500 -14603253 -11841053
38916 -11841053 -9593233 -10407258 -11807566 -11717346 -11561087 -11753517 -9345148 -3518005 1559653
38907 1559653 3444275 6082123 12780765 19200317 19526238 15681865 13263449 11444790
38899 11444790 5309529 -3224829 -5901272 -527661 5186887 4477346 -718276 -5460274
38891 -5460274 -8566791 -10107005 -8376553 -4239539 -3525388 -9483413 -16288523 -15793541
38883 -15793541 -8613633 -2918166 -3280894 -6255429 -7246518 -6499861 -6240129 -5772887 -2798595
38874 -2798595 1936193 4450934 2455668 -1354088 -2173357 1409365 6328944 9731574
38866 9731574 12923956 18882195 26737638 31292221 28730257 21133221 14182487 11191748
38858 11191748 10382694 7862529 2627208 -1977365 -2198676 1366557 4571973 5214878
38850 5214878 5139314 5807091 4933505 254144 -5915381 -9571533 -10741153 -12163918 -13296374
38841 -13296374 -10201771 -1502190 9594112 19447506 26297637 28349516 24135403 15980791
38833 15980791 9230293 6742314 7387754 10217876 15561091 21039464 21600150 15699850
38825 15699850 7192461 -783480 -9004460 -16968320 -19970350 -15383794 -7639207 -2726985
38817 -2726985 -1093550 305122 2521647 5190425 8899553 12511988 11646163 4881863
38809 4881863 -1679282 -1683850 2166448 2112594 -3099400 -7059395 -5707499 -2646195 -3760998
38800 -3760998 -10969096 -21684567 -30707050 -32814006 -27248895 -19368657 -14542603 -11664240
38792 -11664240 -6507709 640213 6199427 10545801 17191381 24758956 27040633 22887034
38784 22887034 19502073 22802498 29764354 33786766 33248267 30919653 28229311 24100691
38776 24100691 17730138 9702519 1688589 -3252399 -1966029 5339577 14337408 20517785
38768 20517785 22570577 21511945 18671012 15304384 12141977 8571852 3876935 -849347
38760 -849347 -3957951 -5568553 -5992708 -3245962 3897097 11416394 13474949 9925742
38752 9925742 5312556 1053873 -4821444 -10003488 -8090857 1057094 8938674 10317909
38744 10317909 10259475 14394374 19411717 19853677 17932925 18249184 17554385 9434661 -3143446
38735 -3143446 -9732509 -7053923 -3220030 -5621048 -11772315 -14912865 -13005797 -8971886
38727 -8971886 -6071137 -5984655 -8522186 -10828301 -9141646 -3261837 2442992 3807702
38719 3807702 1263034 -1242851 -401982 3522063 6431563 3277840 -6885476 -18644003
38711 -18644003 -24560287 -21653713 -12564648 -1741933 7258640 11991271 11988645 9641370
38703 9641370 7972525 7502686 6912915 5850046 4809634 3235426 481639 -1956869
38695 -1956869 -1885727 330463 2296756 2626134 1231455 -1854022 -4920958 -3690691 3719005
38686 3719005 11934126 13252673 7453658 2066981 2382805 5866898 7657317 7013727
38678 7013727 6147501 6235431 6917217 7192065 5211643 -331805 -7346382 -11350808 -10330679
38669 -10330679 -6136483 -755180 5349196 10497048 11521294 7957740 2948756 -1580940
38661 -1580940 -6704373 -11728802 -12647575 -8895093 -7182718 -13459982 -23792670 -28616752
38653 -28616752 -24643779 -17300723 -11879030 -7861490 -3388098 -405462 -1826686 -5888435
38645 -5888435 -7073624 -2863001 2621353 2808936 -4098725 -12759991 -15374947 -8543154
38637 -8543154 3805117 13394206 14191174 7856383 2765832 5707612 14266823 19750454
38629 19750454 17798182 12335141 7912105 3462883 -2666273 -6794321 -5381735 -2879367
38621 -2879367 -6471838 -14649306 -18928699 -16555312 -13248143 -12383602 -9934181 -2934458
38613 -2934458 4574795 7800469 7148109 4600151 466349 -2749443 35643 8436679
38605 8436679 14316703 12509121 8158026 8433828 12774128 16662768 18915677 19017771
38597 19017771 13547045 2833441 -4381513 -1322704 6424904 9364368 8164541 9651329
38589 9651329 13119624 12255116 8433985 9732099 16481488 19689334 15850932 12261301
38581 12261301 14068464 16065313 12254467 5252094 722456 -920930 -1905099 -1380859
38573 -1380859 2752554 9862346 17650457 23896748 25634593 21175212 14393390 11840759
38565 11840759 14142912 15692272 13768612 11187500 8599494 2432214 -6452791 -10461640
38557 -10461640 -6231055 -248644 1628622 2717699 7464784 12236088 11883625 9601386
38549 9601386 11725296 16738783 17598398 12359080 5427707 527251 -1446038 -194104
38541 -194104 2448612 1634523 -4158125 -9346855 -9580645 -9270694 -13487399 -17118955 -11763754
38532 -11763754 -539106 4490642 -984680 -9091641 -12187509 -10342439 -5700433 1022929
38524 1022929 6246416 4661304 -2080058 -5434642 -1913338 2200855 1251916 -1946461
38516 -1946461 -2594645 -1317402 -303344 1913791 6420900 9380613 6665896 -574959
38508 -574959 -8960512 -17319592 -24007407 -24351206 -16012115 -3596105 6800313 14446063
38500 14446063 20920027 24194135 21907583 17926261 18967608 25424886 31082123 31492459
38492 31492459 27569333 21419873 14293904 9206106 9898781 15046769 17941974 14759673
38484 14759673 9890173 9942063 14643710 17186101 12994835 5065461 -236847 -503713
38476 -503713 1525257 3256901 5918933 11417321 17450445 18937605 14481264 8547302
38468 8547302 5981536 6624813 7083543 5907916 4498805 3666545 1872542 -2454196 -8227058
38459 -8227058 -12351224 -12900039 -10899347 -8260624 -4440868 2846211 12786365 19908785
38451 19908785 19992601 15710265 12940716 12790737 11685014 8928281 8851863 14069396 21261849
38442 21261849 25776282 26386456 23315582 15746819 4405506 -6716163 -14180416 -17783723
38434 -17783723 -17406930 -11529713 -2061262 4149572 3479294 1188394 3277076 6324017
38426 6324017 2581131 -6958370 -12689865 -9733990 -3546492 -520663 -4503 1079479
38418 1079479 1760055 177353 -748495 3366753 10580234 13206547 7183716 -2385990
38410 -2385990 -6900416 -3757017 2039006 5247746 6335578 8267734 10086673 8132506
38402 8132506 3245931 1356808 4814350 7987071 5157130 -1167201 -4328243 -2616695
38394 -2616695 908004 4973999 10277370 14516971 13726255 8624439 4048206 1934061
38386 1934061 340714 -584590 2022569 7522289 11371809 12723933 16103289 23003298
38378 23003298 28097402 27299708 23712768 21249039 17829882 10443630 2709336 1153987
38370 1153987 6213969 12257232 15082762 15105671 14723650 16446417 21706224 27521623 26606708
38361 26606708 15572740 1295774 -5962730 -4607278 -1694599 -1808617 -2083802 890263
38353 890263 5081939 6638740 5522473 4463432 4445604 3701384 497270 -4012392 -5447024
38344 -5447024 110815 10230653 15598706 9083936 -5138529 -15694484 -17538660 -16640493
38336 -16640493 -19548178 -23360152 -20335582 -9628690 670686 3173436 -906702 -4821728
38328 -4821728 -4958466 -4148004 -6445497 -10754041 -12054150 -9009334 -6991413 -10677181
38320 -10677181 -16013629 -14570034 -5823285 666149 -2000725 -8157877 -7419380 647953
38312 647953 6253488 3623024 -1172191 284340 6330618 7674695 461872 -8822293
38304 -8822293 -12594288 -11614304 -12009269 -15795881 -18751820 -17011591 -11485269 -4854161
38296 -4854161 1918578 7886878 10195514 7415941 3229436 3196905 8202365 13939769
38288 13939769 16517248 15556938 11997197 6639257 1927354 1570397 6086992 11123060
38280 11123060 12527423 11249032 10901092 12257522 13134952 12747675 12873383 14413439 15474027
38271 15474027 13832357 9598568 4687960 1109555 377518 2946044 7028183 9145901
38263 9145901 7306587 3270980 815164 2174116 6753001 12343189 16392503 16896216
38255 16896216 13836656 9663531 6764801 4560378 1082656 -2517997 -2191187 2515756
38247 2515756 5184882 -499027 -11758480 -18875725 -16426983 -8211865 -47492 7466670
38239 7466670 15828525 22489758 23330177 19740035 17615168 18837115 18821759 14414827 9805443
38230 9805443 11197097 18410445 25602402 28887996 29459472 29515061 28850075 26498696 22883322
38221 22883322 18647028 13340597 7204312 2845479 2736552 5402281 6450998 4075293
38213 4075293 1714782 3820984 9873172 14266036 12278605 4991003 -2301702 -5845419
38205 -5845419 -6655741 -7975524 -10502701 -11377594 -8150888 -2448242 1673719 2267022 332892
38196 332892 -3661162 -10962741 -20675102 -27717986 -27997764 -24070035 -21896811 -22610343 -21662381
38187 -21662381 -16491906 -10467537 -7297994 -5557068 -1942061 2860348 5255379 4210449
38179 4210449 2335200 2095243 3377793 4198909 1984367 -4546397 -12510567 -15327492
38171 -15327492 -9017372 2645301 11872307 15069914 14835292 14753107 15297541 14621760 10763408
38162 10763408 3411394 -4295519 -7007663 -3167929 1858434 2670625 2219905 7732056
38154 7732056 18741567 25953987 23737571 17357208 14520202 15348170 15186131 12706316
38146 12706316 9653548 5540403 -1491861 -9522372 -13357530 -10100760 -1041692 11025837
38138 11025837 23011140 31204015 33694476 32932869 32758400 33420602 32629637 30484936
38130 30484936 29293522 28877715 26587795 22654021 21196342 24254174 28323902 28828815
38122 28828815 25339855 20636181 17132825 16023400 17565470 20206531 21344777 20626576
38114 20626576 20426587 21489968 20810426 16299290 10937217 8887981 9546310 9529893 9050475
38105 9050475 11057202 14092816 12045811 3563445 -3309703 -229877 10866578 20977956
38097 20977956 25628382 27737410 29817451 29869961 26877578 24694121 26789161 31127052
38089 31127052 34275054 37133517 41644908 44487254 40304859 30549185 22855457 20729695
38081 20729695 19678042 15551733 11047723 10311152 11752868 11171171 9199907 10568604
38073 10568604 17139270 25979398 33656708 38337549 37844187 30118925 17178409 5514720
38065 5514720 408171 1265875 3954385 6414503 10136786 16290104 22197654 23267325
38057 23267325 18432189 11918057 8338747 7684316 7470156 8043731 11464268 15679694
38049 15679694 15573945 11449603 10604561 16932071 24299147 25282458 21825916 20782184
38041 20782184 22515800 21837538 18485441 18091771 22227552 25461401 24249635 21558446
38033 21558446 19892506 16646969 10596956 7219491 12252398 23678160 34634623 41046670
38025 41046670 42253714 37753288 28770724 20808230 19047351 21890199 23449529 21716533
38017 21716533 20008082 20931524 23572900 27006600 32083024 38252007 42207868 41736568
38009 41736568 38387696 34427975 29399227 22188137 15059520 12421655 15092240 18206048
38001 18206048 16541284 10760959 6236444 6008884 7663157 8114537 8448065 11331674
37993 11331674 15891650 18916570 19975788 21251126 22842438 22786753 21823576 23060465
37985 23060465 25959342 26189453 23494323 23806597 29856345 35152199 32640284 25319008
37977 25319008 22264965 26670082 33595047 37783483 38006587 34850439 29921967 26956797
37969 26956797 28600806 32089878 32535341 29891756 27934165 27358131 25914561 25241793
37961 25241793 30628709 42131003 51950930 53449196 48076111 41128346 35670157 33486783
37953 33486783 36847741 44823104 51204044 50437768 43868987 37365319 34957075 37031642
37945 37031642 41830864 45893917 45717292 41909765 39369945 40947317 43787381 44407482
37937 44407482 43822185 44449825 45842934 47714359 53324335 64186103 74201098 75531944
37929 75531944 69027293 62631421 60188709 58449702 55646009 56246270 64650678 79003489
37921 79003489 93666690 103893905 106319657 99447303 86689500 75448811 70079629
37914 70079629 68274411 66664503 66710436 71622764 79802865 85325846 84474890 79309938
37906 79309938 75151361 76085510 82079402 89162620 93371853 95181519 98144555 102369513
37898 102369513 102518962 94843847 83731297 77764179 80316349 87051120 92142952 94225280
37890 94225280 96207915 101233391 108942532 114931736 115042866 111036904 109613215 113919854
37882 113919854 119041166 119212944 116488586 117070679 120865168 121322654 116315301 112846963
37874 112846963 118229009 131253427 145184591 155577984 161682421 163589756 162587559
37867 162587559 162668647 167349049 175047069 180516170 180971366 178915443 179224632 184988077
37859 184988077 195589147 207428620 217211878 225476284 235431770 247268171 256118037
37852 256118037 258138011 256557937 258431627 266553354 277856275 289030270 300105617
37845 300105617 312160433 324421383 334565122 340444392 341691166 340875531 341870347 345422577
37837 345422577 348576948 351128294 359281491 377521392 399008578 411350725 412220279 411810903
37829 411810903 417745523 425141077 426063781 422207739 421415469 425479790 428478071 425876222
37821 425876222 419465748 413537511 410727981 411601721 414589062 416316633 414800572 411621233
37813 411621233 408507482 403732659 395416962 386291121 380511655 377120733 371691129 363473403
37805 363473403 355315226 346883581 334297844 317423667 301302594 288442790 275801235
37798 275801235 262331167 253516901 253769527 258739547 260244094 255759919 248252044 239246918
37790 239246918 227558868 213923163 201982185 194158904 189506104 185605959 180522069
37783 180522069 173947145 168702932 169320612 175927788 181163563 177232682 165357842 154183546
37775 154183546 148965257 146592805 142027241 135419934 130667138 129702443 130711816 130819177
37767 130819177 128940527 126437178 125427342 126042347 125975087 123823001 121602903 121740282
37759 121740282 122680156 120647719 115361666 110372506 107296116 103470624 96743450 89256290
37751 89256290 84379579 82356558 81040058 79016824 76319150 74015648 74707374 81214897
37743 81214897 92663090 103595448 108938363 108343952 104227104 97978537 90457253 83826252
37735 83826252 79623320 76459461 72713675 70163027 71528066 75384194 77252703 75490695
37727 75490695 72513308 70113591 67323544 63658486 60852427 59820352 58800101 56261543
37719 56261543 53374190 51994477 52191230 53074130 53943880 53356951 49671397 44503098 43065118
37710 43065118 48166177 55622955 58817559 56764331 54326222 54792125 55841081 53856991
37702 53856991 49299960 45684680 44648437 44177252 41686120 37463790 34318683 34147968
37694 34147968 35681435 36120136 34439455 32049651 30546482 30443570 32210330 36184220
37686 36184220 40155554 39408600 32003333 23121585 21088771 28342877 38156786 41211166
37678 41211166 34596163 24040571 18051849 20152072 26502238 30936113 31571451 31036512
37670 31036512 30731342 28283723 22393076 16874900 16335759 19822161 22734073 23734859
37662 23734859 25311143 28073060 29494930 28863196 28506629 28611233 25579844 17966480
37654 17966480 9810640 5107850 2811352 869805 1688544 8865240 20452703 30048499
37646 30048499 33903797 33388296 31150034 28503387 26671892 27513197 32138105 40044644
37638 40044644 49202217 56146189 57844168 55233042 52830674 52729125 51589124 46410003
37630 46410003 40061741 36686664 34348888 28030823 18466112 11627830 9643525 8805063
37622 8805063 7607678 9980265 17640754 24980241 25734424 20955048 16541694 15751838
37614 15751838 17549782 19826037 20828433 19238042 15847349 13886869 15512894 19346842
37606 19346842 22888196 25142689 25470330 22995575 19443459 19164769 22968913 24815510
37598 24815510 18799178 7572479 -366313 -673220 3472594 7157026 8617212 7971763
37590 7971763 4803951 -1183992 -8402956 -13003320 -10438904 651962 14814812 22740640
37582 22740640 20948244 16571363 18763900 26789449 31278449 27104801 20033255 18912448
37574 18912448 25093529 32207150 34168084 30715466 25801365 22602018 20713194 17722379
37566 17722379 12669258 6929165 1938644 -1914152 -3481228 -597539 6452194 13625428
37558 13625428 17866845 20868510 24881022 27194043 23536540 15905064 11797012 15140233
37550 15140233 22376612 28348409 31745987 33254241 32342394 28372091 22424176 16297796
37542 16297796 11609112 10317798 13061529 16199735 14318307 7494271 2549847 4670624
37534 4670624 10914326 14917771 15330059 16078028 19931411 25278272 28757851 28506565 24987295
37525 24987295 20355714 16746777 14261703 11579912 9090433 9244941 12373286 14712952
37517 14712952 13326108 11084624 13178258 19263116 22854870 19679751 13991740 14343393
37509 14343393 23664432 35316203 39842037 34938533 27158522 23393785 23085028 21287258
37501 21287258 17474957 16560805 20516596 23773415 20128490 11472969 6047453 8912675
37493 8912675 16727267 21661481 18960116 11201405 6043886 8798462 16666425 21915954
37485 21915954 21023754 17784659 16323873 14995953 10380674 4251930 2108490 5906837
37477 5906837 12108374 16624948 18592086 19343400 20174173 21073668 20069851 14953167 7449920
37468 7449920 3525681 6391039 11084637 10116443 3426270 -1741064 -519353 4701382
37460 4701382 9474538 12601351 14774120 16105996 17091004 18637473 19151398 14908725
37452 14908725 5758759 -2554355 -4724804 -2266490 -505119 -936859 34584 5393873
37444 5393873 13549619 20332307 22988905 21869513 19402407 17603682 16068360 12884773
37436 12884773 7890700 3714987 2579960 3553652 4682719 6518241 10877500 16407490
37428 16407490 18412127 14471679 8265936 5667778 7675879 9392791 6487423 698905
37420 698905 -2824394 -2557811 -2222564 -4877984 -8238562 -8178151 -5180575 -4084602 -7543470
37411 -7543470 -12705158 -15280805 -14594863 -13269784 -13588028 -15521765 -17024255 -14987219
37403 -14987219 -7275164 4468079 14856823 19339635 18502310 16635883 16619917 17797271
37395 17797271 18511068 18531087 18156344 16624746 13110446 8830297 6601105 7799988 10453000
37386 10453000 10807284 6595753 -1118776 -8497736 -11136495 -7083282 1121227 8208797
37378 8208797 11354162 12804130 15593843 17742305 14052295 3913727 -6579312 -11977166
37370 -11977166 -13168103 -12970035 -10015259 -2028125 7267144 10955577 8701561 7592187
37362 7592187 11448713 14809868 10916656 1363515 -6668504 -10134202 -12323496 -16376546
37354 -16376546 -20958849 -22741683 -19914492 -12479037 -1697724 9466238 17022268 18519699
37346 18519699 14773935 9046149 5032685 5015969 8502763 12488604 14015898 12526426
37338 12526426 9161230 4724403 65284 -2174438 939196 8260418 13806170 12396223
37330 12396223 5333057 -968062 -1386068 4150626 12274695 19116638 21509618 17903779
37322 17903779 9838309 1420216 -4013378 -6063152 -5556185 -2557601 2116671 5271914
37314 5271914 4474728 2252836 3622864 8995078 13045720 11821293 7463806 3975491
37306 3975491 1858943 -46260 -617966 1472659 3862693 3354952 1572678 2781847
37298 2781847 6101441 5137881 -2905946 -12100839 -14664395 -10271783 -5508152 -5283907
37290 -5283907 -7394184 -5966679 609012 6182795 3005713 -7813866 -14931056 -9266157
37282 -9266157 4210225 12232122 9841142 4791370 4416978 5600268 2180506 -3659611
37274 -3659611 -4101241 3150655 12728212 19284268 21613550 19801436 14284006 8682926
37266 8682926 8198328 12842442 16139880 13048186 6184808 1774020 2145171 5102578
37258 5102578 8312904 10450010 9222768 2891450 -5375192 -8596501 -3780946 4008550
37250 4008550 8057210 8152080 8691832 10435623 9504041 4981017 1748375 3121226 5662793
37241 5662793 5320415 4397790 7162724 11945858 13959360 13640708 14961447 16602859 13047106
37232 13047106 5255561 1954829 7480545 15579598 18874265 17823387 16189417 14244776
37224 14244776 11739088 11619723 14699819 15838565 11942918 8845812 12834854 19807085
37216 19807085 21487888 18970589 20038888 24564299 23531887 14017077 4926661 3920387
37208 3920387 6957219 6203908 2070610 1132162 5677092 11088621 12340545 9073199
37200 9073199 4565123 2068084 2068026 2273894 732419 -1427611 -1700643 344991 3637524
37191 3637524 8396505 14951157 20541335 21304319 17408412 12527196 8596808 5180003
37183 5180003 3253103 4225120 5163314 1079681 -6874959 -11500566 -9529964 -5418255
37175 -5418255 -2994764 -47955 5220949 8974801 8111286 6365145 8183375 10867403
37167 10867403 8909210 2664137 -3374132 -7838564 -11572810 -12106972 -6421205 1852488
37159 1852488 5291044 3077296 1917567 5476440 9268231 8464869 5265983 4794210
37151 4794210 7299700 8318567 4856383 -1385518 -6027197 -5702270 -1012742 2944224
37143 2944224 618111 -7741027 -15122680 -14944419 -8469937 -3054015 -3130496 -5185485 -2798525
37134 -2798525 5050394 12948072 15671752 12938336 7025761 -641078 -7809008 -9497469
37126 -9497469 -2682588 8006685 14001811 12352100 7402381 3266940 114163 -1523177
37118 -1523177 510635 4316715 3587329 -2783482 -6690779 -2072464 4898056 3776845
37110 3776845 -5609271 -14046421 -16127591 -14868727 -13914189 -12641080 -9868797 -6263637
37102 -6263637 -1936533 3168077 6021817 3195742 -2514248 -3920392 860254 6160810
37094 6160810 7580693 7012043 6831592 5584444 3023736 3458678 9099802 14699120 14372622
37085 14372622 10425936 9618298 12767723 14016758 9996598 4439074 2615035 4949701
37077 4949701 7819599 8524563 7859319 8292455 10295446 11095697 8045760 2644886 -1139272
37068 -1139272 -2581016 -4782152 -8378093 -8847579 -3277105 3620804 4768408 112952
37060 112952 -3852973 -3035483 361783 2699377 3063003 1786042 -975130 -3695610 -4136944
37051 -4136944 -3258693 -4938346 -9567512 -11550511 -6650951 1020296 3807871 694297
37043 694297 -2290731 -1520941 -106111 -988492 -722885 5812451 17225978 26386130 28325176
37034 28325176 23923848 16624203 9253677 4031310 2039191 1941058 2007073 3407253 7968169
37025 7968169 12675705 11395458 3693339 -3118753 -3651459 -1273893 -1209813 -1618164 2287417
37016 2287417 8422394 9482874 3603379 -3428091 -7000486 -8352623 -9138426 -7592733
37008 -7592733 -2940415 1456729 2868465 3222905 4744994 4744894 -1030092 -11408553 -19954148
36999 -19954148 -22048104 -19491814 -17698240 -19241263 -20465686 -15156293 -2524591 9864091
36991 9864091 13748473 9754001 5658738 5607640 6005472 3111606 -758369 -1671234 -418209
36982 -418209 -497124 -2606973 -4819744 -6055562 -6018833 -3633526 1021926 4708315 4300675
36973 4300675 1169405 -557593 582049 2143111 1475258 -1171253 -2851571 -507798
36965 -507798 5317005 9126479 5667967 -2667295 -7417936 -4801674 -412236 -60274
36957 -60274 -811218 3472322 11230533 14643502 10707483 4452261 883528 -554701 -2156573
36948 -2156573 -3388454 -2444254 607314 4217241 7346851 10152928 13570115 17871504
36940 17871504 20871171 19315687 13610634 8562508 6920827 5411459 960698 -2804307
36932 -2804307 -1135438 2482778 124006 -8011972 -12559373 -7757237 1715597 8659282
36924 8659282 11363281 10794539 6331778 -1139534 -6666769 -6447998 -2396485 1849086
36916 1849086 5729795 9224539 9858527 6782064 4150095 5355369 6888922 3440143
36908 3440143 -3117567 -5701950 -1819940 4363037 9376203 13944571 18100553 18275489
36900 18275489 12223035 3789592 74467 4890685 15679173 25279477 26787342 19284067
36892 19284067 9495860 5557439 8572441 12646081 13427540 13004471 14745638 17109346
36884 17109346 16271770 12820809 11389306 13610856 15305495 12176065 5632604 776923
36876 776923 23597 854274 -705032 -6188042 -13884984 -20136318 -21685994 -18875273 -16645836
36867 -16645836 -19844775 -26643768 -29421396 -24245071 -16941991 -16319114 -22668566 -27181512
36859 -27181512 -23198676 -14101647 -7947480 -7084862 -6509181 -2044447 3031287 1585357
36851 1585357 -7837231 -17522588 -18441023 -10536608 -2397785 -641574 -3322250 -5432739
36843 -5432739 -6541333 -8815978 -10738421 -8808770 -4596581 -4067511 -9102560 -14947471
36835 -14947471 -17544673 -18434741 -20118168 -21019255 -18198262 -11944322 -4927613 766485
36827 766485 3899360 4243133 4098754 6253221 8777758 6127097 -2112309 -8333707 -6579297
36818 -6579297 -800157 1183551 -1839777 -5404485 -7442183 -9024049 -9195733 -6161274
36810 -6161274 -3241357 -6861293 -17341847 -27100273 -29553221 -25283684 -18178057 -10422424
36802 -10422424 -3648541 -545788 -1515804 -2019121 3202798 13575612 22233379 22376910
36794 22376910 13869764 3687949 -705362 1304435 4247870 4996237 6841691 12564203
36786 12564203 17514221 15161986 7382931 2654637 4329158 7298295 7239640 6389988
36778 6389988 7451177 7786877 3819050 -3042349 -8838668 -12090584 -12906903 -10538706
36770 -10538706 -5860319 -3289128 -5569368 -8529452 -5608243 3368764 12036396 15533508
36762 15533508 14758182 12629016 10040458 6774753 3709135 2470065 4088056 8660399
36754 8660399 15177931 21184631 23777259 21896527 17377465 13199144 10573613 8108935
36746 8108935 4443694 1384227 2559145 8004312 12464085 11715137 8723261 9739350
36738 9739350 15434004 20645382 22681827 24222801 26763067 27170917 23642537 19519849
36730 19519849 17101650 12752460 3649584 -4580668 -3580411 6234713 15778848 17895847
36722 17895847 12834587 4677578 -1829417 -1807797 5698495 13473101 12143486 2196575
36714 2196575 -5485102 -3238594 4485990 8757238 7764777 6616245 9049791 13983125
36706 13983125 18529827 20488719 18772382 14607090 11724918 12649520 15291791 15747094
36698 15747094 14030522 14205314 18367498 23046143 23144454 18192150 12864881 11262055
36690 11262055 12183633 11273431 7091647 2937224 2100062 3721220 5354370 7523847
36682 7523847 12169657 17252144 17243092 10472614 2679280 715492 4632628 8634732 8978335
36673 8978335 8288273 11511972 19196732 26156763 26920927 21557551 14932050 10615837
36665 10615837 7829201 5111981 3802033 5079363 6181207 3797370 -178870 -993605
36657 -993605 1597221 3568725 4124150 6613629 10612169 10141294 3394610 -2436386 -1758212
36648 -1758212 -433750 -7318629 -19274856 -23562010 -14962423 -2142933 5296376 8939100
36640 8939100 16169114 27295549 33845400 28971115 15686306 3761521 -12083 2565641
36632 2565641 5059418 4798516 5363794 10367882 17767501 22839909 24343721 23945480 21227392
36623 21227392 14246191 5027843 -447444 888479 6217883 11879349 17230929 21828473
36615 21828473 23249082 20735328 17442673 15777220 13649729 8953768 4659132 4732176
36607 4732176 7038680 5685882 -83269 -4560645 -3922541 -1223862 -1105519 -3274824
36599 -3274824 -4093912 -2218600 517700 2801877 5438679 8899309 11360275 10483129
36591 10483129 6504614 2361087 437105 21627 -1125914 -3249669 -4235631 -2924629
36583 -2924629 -900162 -66797 -250229 -524386 -943155 -921621 2037600 8749983 14740533
36574 14740533 14269548 8025062 2889378 3223623 6230582 7386821 6281703 4299660
36566 4299660 435497 -6153266 -11971012 -12894388 -11223224 -13424893 -19864329 -22188643
36558 -22188643 -14143559 -1184825 5177729 1021205 -6416077 -8739837 -5680928 -2583337
36550 -2583337 -2108863 -2324622 -2098957 -4057587 -10169482 -17037733 -18978813 -15356170 -11667136
36541 -11667136 -12410454 -15535954 -15746984 -11075710 -3586485 4751508 13287811 20186286
36533 20186286 22533166 19993245 15407012 10730826 5692993 2078594 5158316 16785419
36525 16785419 29674454 33670461 27167772 17747192 11518528 7047181 1511090 -2251031
36517 -2251031 1015420 11197485 22112312 27517659 25154244 16459034 5889150 -160393
36509 -160393 2156583 9610935 14552405 13371819 10424964 12427448 20545764 29221848
36501 29221848 31731759 26056065 16305134 9154934 8069429 10550053 11822564 10986572
36493 10986572 11689683 16436966 22721613 26301662 26270821 24721637 22889653 20356504
36485 20356504 17467604 15695990 15221132 14508798 13206927 13584274 17772438 24720162
36477 24720162 31082535 34371164 34241807 31506350 27339419 23358421 21149874 21034616
36469 21034616 21710752 21558886 20223970 18717696 18031494 17991266 17898928 18315420 21474614
36460 21474614 29105923 39976066 50371893 57051468 58993436 56589577 51039438 45456058
36452 45456058 44442935 49763128 56790413 58189451 52136866 44630807 42180233 44362526
36444 44362526 45940298 44539467 42717556 42918015 44323416 45735873 47987640 51343889
36436 51343889 53450927 52787384 51941157 53967056 56913500 55854528 49802681 42625093
36428 42625093 37110965 32632446 29771151 32318588 41440643 51383868 55094808 52194732
36420 52194732 47616681 43890977 39164279 32523517 26823237 24960795 26495481 29347160
36412 29347160 32283212 34318243 34049784 31468963 28741198 27450751 26489130 24378340
36404 24378340 22337029 22953548 26516289 30556552 32690497 32344660 30074068 26871287
36396 26871287 24004424 21930011 19435334 15506314 11976578 12220535 16670865 21767807
36388 21767807 24509410 26008009 28635866 31265122 30055440 23529976 14407212 6377032
36380 6377032 1446406 705444 4735884 11638536 16848480 17098760 13524316 9476834
36372 9476834 6857918 6285344 8792850 14367487 19904454 21761977 19905337 16762437
36364 16762437 12928829 7766855 3718903 5068550 11275302 16252913 16450108 15384521
36356 15384521 17391567 21022347 22294913 20807740 18307993 14482124 9259495 6524009
36348 6524009 9470575 14000658 13479604 9588962 11138532 20714586 29634449 29607311 23642400
36339 23642400 20623895 22883333 24280511 19009909 8341867 -888413 -2218788 5093424
36331 5093424 15004423 20052442 18549605 14448803 10019036 3072313 -6404247 -11836897
36323 -11836897 -7259758 3734942 11467571 11662535 9066595 10006050 15413248 21510102
36315 21510102 24027219 21257323 15606717 12343387 14438601 18799719 20037094 17503044
36307 17503044 15666063 17644639 21523204 23558212 22317074 19135147 16984540 19229371
36299 19229371 26679679 35006937 37572062 32036540 22614419 15485702 13880518 17495405
36291 17495405 23762500 28873988 30297065 29630962 30975289 35551238 39996762 40737125
36283 40737125 37729521 32986192 27815506 22648090 17312202 10519996 1635392 -6130126
36275 -6130126 -7575375 -2325211 3489770 4790282 3678906 5088789 9436735 13570117
36267 13570117 16523012 19488144 21455695 20147097 17226963 17502612 21891909 25783043
36259 25783043 26237047 26639850 31285924 38441609 42289717 40194209 35099245 31583418
36251 31583418 31764132 34249434 35179256 31251075 23602791 17553695 16510447 17767491
36243 17767491 17155323 15968084 18679679 24338319 26059793 21049358 15839427 17615616
36235 17615616 24214619 27758831 25785361 23039334 23025896 23829163 23558406 24614039 29480985
36226 29480985 35610527 37794711 34200817 27963347 23786610 24021685 26831954 27760293
36218 27760293 24668038 20721336 19794537 19848346 15796873 9221473 8490843 16179416 22991265
36209 22991265 19632648 9317073 1678141 -1185592 -3953118 -6207206 -1789061 9061661
36201 9061661 16585248 14332686 7789986 5426741 6830266 5514828 162344 -2899078
36193 -2899078 1785686 11305918 16303836 10010223 -4047288 -14216359 -12741827 -4382559
36185 -4382559 550202 287747 2729677 11995921 20850543 19955757 9427474 -2844472
36177 -2844472 -10349677 -11585498 -8224371 -3892016 -2254018 -2943248 -1813411 2258812
36169 2258812 4431872 1110741 -3508071 -2311923 5903215 16150435 23152490 24118934
36161 24118934 18800783 10861600 6537080 8000746 10480911 9094926 4952208 905912
36153 905912 -4018401 -10762045 -15367837 -14359405 -11030632 -9378156 -5769189 4688500
36145 4688500 16448086 18474822 10381763 3496920 4593486 8323247 8696628 8647817
36137 8647817 12717188 17230852 14533305 3722101 -7923172 -12856799 -9924315 -4323663
36129 -4323663 -2057192 -3468073 -3389328 481477 2895768 -599629 -4746108 -1871096
36121 -1871096 4801000 5341694 -295412 -1629100 4940942 10687207 10623100 12078932 19846857
36112 19846857 24673985 17088416 3493887 -3364567 -3136779 -4565067 -8393345 -7129896
36104 -7129896 -42398 4742777 4081163 4190052 8561138 11515672 7839033 789495
36096 789495 -4056172 -6623977 -9347511 -11176064 -9294836 -3953127 2083566 7136568
36088 7136568 11296300 14882036 17581576 18102576 14874637 9018607 5761764 9710089
36080 9710089 18919390 26892848 30276006 31059515 31298158 29860495 25320889 18327327
36072 18327327 9803101 74897 -8766763 -12625572 -9522730 -2321844 3876653 5981474
36064 5981474 4408159 1779271 168179 -1202081 -4300568 -7273419 -4028880 7937913
36056 7937913 21803929 27963545 24818229 18501775 13438296 8900745 4433734 2245677
36048 2245677 2709860 2621222 -193640 -4384327 -8035354 -10031353 -8229705 -1411964 6080621
36039 6080621 7158074 984420 -6079928 -9874382 -12582805 -15359241 -14044671 -6754422
36031 -6754422 467921 1555897 -461303 1596013 8233223 13637533 14810767 14234501
36023 14234501 14069060 13037813 9664516 4956178 1271161 572544 3143209 6160091
36015 6160091 5096351 -1081501 -7642391 -9293043 -5941761 -1273645 1847233 1970863
36007 1970863 -1811501 -7544298 -9773131 -5475883 1359203 5198533 6686062 9891531
35999 9891531 13825049 13000966 6350541 -326119 -1885313 1020194 5357444 9487381
35991 9487381 12011722 11516780 9805670 11315119 16336192 18160761 10742063 -2569057
35983 -2569057 -11467431 -9486506 148468 9399079 13853030 15274286 17149079 19958403
35975 19958403 21809542 22035956 21452844 19346204 13768876 6029108 1135715 1268794
35967 1268794 2407253 990433 262641 4732244 11085579 11383279 4486070 -2591036
35959 -2591036 -5278940 -6632795 -10170627 -14072116 -15607514 -15750943 -15725332 -13890908 -10079415
35950 -10079415 -8342706 -10565688 -11373390 -5049118 5291381 11274287 10305194 7422979
35942 7422979 7094824 8643565 9706410 9203024 6570359 2751024 2340727 9678662 21378973
35933 21378973 27428350 22046189 9920354 -291472 -4933463 -5402510 -3069355 1876403
35925 1876403 8378005 14670202 19554645 21497284 18373939 10732961 3429377 829987
35917 829987 1768898 2445499 2732966 5388614 9812443 11622324 9224059 6139205 5027792
35908 5027792 3676404 -354832 -4765603 -5779610 -3802272 -2043633 -1205806 735210
35900 735210 4522909 8867499 12829252 15541831 14510797 8229654 156873 -4204383
35892 -4204383 -4454211 -5149269 -7949450 -8996298 -5913311 -2226328 -1559635 -1935929 -22974
35883 -22974 2772521 3455906 3648942 6737402 10533634 9238757 2869147 -1145812 2799740
35874 2799740 12300191 21345908 26405434 26416770 21421359 14132096 9085738 6907518
35866 6907518 2458187 -7863702 -19702066 -25636255 -24552078 -21786561 -20973231 -20357342
35858 -20357342 -17501937 -13425356 -10504155 -9218543 -8705897 -8463154 -7973568 -6328014
35850 -6328014 -3611356 -1170276 795336 4213437 9877196 14711460 15011539 11982700
35842 11982700 11126746 15256281 20469266 20710320 14752125 6709753 778375 -2016295
35834 -2016295 -2219180 -252642 2384601 2586782 -1450814 -7765731 -12786217 -15053606
35826 -15053606 -15075414 -12671193 -7310144 -1017007 2119184 666720 -1932413 -1358992
35818 -1358992 2783493 7527570 10547517 11835473 12139981 11591158 9961858 7201665
35810 7201665 3693777 635253 -259687 1716506 5440214 9409021 13215892 16319739
35802 16319739 16281111 10643671 1048263 -6575229 -7260870 -1518824 6069406 11302654
35794 11302654 12221881 8305711 613306 -7326342 -11381279 -10759673 -8606011 -7723589
35786 -7723589 -7265351 -5028277 -1487052 738235 897746 1239073 3665772 6925107 7832696
35777 7832696 4385426 -2513360 -9455710 -12791551 -11787969 -9403141 -8529745 -8016531
35769 -8016531 -4633632 1402019 6063398 7184435 6879222 6850469 5266678 1201496 -1576327
35760 -1576327 128343 2248621 -2303635 -12945478 -20326642 -17494298 -8143696 -1481675
35752 -1481675 -1712156 -5211626 -6518530 -4440643 -2059813 -2072151 -3300993 -2629899 114392
35743 114392 1538493 -54188 -1564119 234656 3434982 3993068 1996447 645304
35735 645304 586345 342833 1179377 5349131 9790122 8785480 4011853 3931262 10139015
35726 10139015 12657434 4453254 -6741199 -8946728 -2836797 937001 -2048910 -6134897
35718 -6134897 -6652266 -5008351 -1789422 5745710 15980116 20609984 14735521 3700937
35710 3700937 -4375217 -7840742 -9051387 -8089008 -4985104 -4312189 -10372063 -19141573
35702 -19141573 -21400073 -13916785 -2265576 7546221 14594679 19052082 18602675 12381497
35694 12381497 4641094 469332 -64067 -196325 -860712 -547546 445241 -77717 -1861563
35685 -1861563 -1777484 959286 2567233 -190926 -5279506 -8249990 -7900686 -6523314 -6165009
35676 -6165009 -7563741 -11436095 -17214026 -20994598 -18651150 -11557394 -5670908 -3941022
35668 -3941022 -3257829 -548331 2078484 1448835 -583493 364027 3966871 5007801 676705
35659 676705 -5811531 -10117326 -12092678 -13989407 -15432661 -13196428 -5942640 3121507
35651 3121507 9470010 11837940 11799960 9345475 1862788 -10743787 -22301750 -25184744
35643 -25184744 -18384424 -7735510 1427502 7964764 11309395 9633441 4198192 788599
35635 788599 2682890 5622831 4306558 920844 1678264 6796300 10421951 10457415 11880725
35626 11880725 18262657 25448305 27135087 23080641 18074930 15039361 12838026 10073352
35618 10073352 7782795 7619100 8946061 8877446 5434744 528881 -1064740 3420146
35610 3420146 11460976 17808870 19653147 18275919 16816166 17915062 22090023 26270375
35602 26270375 25415526 18222258 9617737 4340368 95723 -7951451 -17169621 -18648471
35594 -18648471 -9523217 2335240 8650335 9823651 9854241 8044744 1969384 -5151791
35586 -5151791 -7418364 -5392340 -5446321 -9577389 -12309381 -9905327 -7028351 -10022483
35578 -10022483 -17006706 -19737504 -14490607 -6561209 -2855591 -3401904 -2627181 2786956
35570 2786956 10212725 14812122 14397128 10331284 5991151 4859661 7488453 9411650
35562 9411650 5326332 -2803696 -5690536 1546658 10975221 10628082 -85975 -9815652
35554 -9815652 -9740883 -2352685 5113160 9572324 11635697 11498437 9171141 5790121 2077043
35545 2077043 -1821320 -3681949 -484448 5928929 9388631 8332448 9002459 15723092
35537 15723092 22896202 22036398 13217726 4049311 39722 1388498 6892640 15047903
35529 15047903 22356934 25778445 26347347 26426716 25010557 20199660 14412026 11887287
35521 11887287 12361321 12441804 11906905 12999418 14600680 13258190 9451405 6543191 3779794
35512 3779794 -2768510 -11619426 -15235114 -9855488 -21234 8344531 13331884 13963971
35504 13963971 8700923 174246 -4741783 -3298760 -159803 622930 926079 2241076
35496 2241076 655194 -6440042 -14177725 -16846074 -16062806 -16059232 -15234627 -9800732 -2642369
35487 -2642369 -572873 -4241635 -8056821 -9174580 -9388959 -8680389 -4611653 1183216
35479 1183216 3536350 2630317 5082610 13138786 19581411 17861843 11623798 8617709
35471 8617709 9446363 8732990 4879672 1768098 1184936 209934 -2017554 -492569 8671481
35462 8671481 20461702 24801579 17808760 5711375 -2980186 -5947071 -6115649 -5461939
35454 -5461939 -3632320 -1730732 -3017235 -8335594 -13867660 -15495567 -13261512 -9515545
35446 -9515545 -4923488 705384 5121097 4906973 329780 -3836006 -3170605 2356292
35438 2356292 9483019 14944869 16967788 14958121 9099397 613048 -7524600 -10994356
35430 -10994356 -7400792 200701 5401745 5548699 4189632 4325906 2690278 -4905113
35422 -4905113 -15092318 -19911109 -17752003 -15034323 -15941055 -16884433 -13935761 -9755495
35414 -9755495 -8482175 -8253350 -4558550 1559968 4421150 1890379 -2129093 -2932103
35406 -2932103 1241403 9574088 17971751 18911553 8342422 -6102084 -10135285 710594
35398 710594 14711214 18005034 10438499 2190080 -1395285 -4002605 -8455884 -10834955
35390 -10834955 -7181602 -282683 4078349 3888076 462050 -5340226 -12361125 -17261478
35382 -17261478 -18052392 -17859802 -20348664 -22449223 -17136582 -3730871 10097142 18054034
35374 18054034 21651479 24465676 25255296 21041226 13226463 5864735 396795 -3359886
35366 -3359886 -3447488 1636073 8057988 10081611 8043193 7484840 10262685 12307124 11230309
35357 11230309 10177601 11814109 14026149 14913403 17091114 22677095 27820301 27036778
35349 27036778 20553677 13162812 8056179 5962595 8086978 14893602 23007286 27826367
35341 27826367 28726978 28083770 26442420 22896239 19013011 17596314 18391174 19939747
35333 19939747 24443146 34267256 43830410 42911589 30478921 18122289 15977186 21547215
35325 21547215 26918298 30483544 34765482 37715175 34936430 28741935 26736488 30899251
35317 30899251 34872211 33523931 29383666 27394888 28208483 29664917 31289126 33872175
35309 33872175 36489104 36839094 34091502 29961354 27229704 27555775 30179919 32890172
35301 32890172 34731576 36723364 39078107 39766627 37754289 35321733 34402401 33329601
35293 33329601 31159786 32149286 39872825 48958749 50415267 44920262 42234986 45836917
35285 45836917 47380520 40468597 30985032 27244253 27576454 26094542 24620114 28602659
35277 28602659 34827964 34419893 27528889 24378656 29876078 36751547 37677776 35906996
35269 35906996 38341983 44150777 46769542 43828839 39117437 36132718 34631836 33515443
35261 33515443 33486475 35910718 40668173 45563936 47386723 44171885 37137971 29992312
35253 29992312 26080707 26396682 29350310 31191105 27987423 19692645 11643212 9457629
35245 9457629 12955161 17696262 21415686 25152237 28688154 29741588 28523482 28639080
35237 28639080 31953574 36357974 39891134 43050611 45611015 45594133 43441589 42747172
35229 42747172 44201186 43137278 36384123 27728048 23039776 23361600 26221645 30199022
35221 30199022 34240956 35807908 34123967 32538188 33435448 33695664 29899564 25266785
35213 25266785 25915941 32032163 38171912 41027354 41512221 40212478 36599573 32677277
35205 32677277 31762251 32737548 30353629 22647885 14344584 11684608 16568965 25858777
35197 25858777 33549227 34224687 27870184 20719106 17930655 16879074 12188503 5583308
35189 5583308 4143957 8913574 12473114 9697265 4414996 2456470 3783442 5222360
35181 5222360 6329638 8425748 11113684 13231091 14557122 14124180 10235909 4785802
35173 4785802 3715072 9658092 17273190 19361122 14831857 7550757 805217 -3150361
35165 -3150361 -1607395 5233176 11621304 12387844 10435431 12847859 20369490 26550372
35157 26550372 27735844 27888638 31196518 35037470 34312928 29536811 25847203 25136530
35149 25136530 23992831 20399360 18112394 21017309 25655094 24297139 15627549 7434744
35141 7434744 6395494 9628855 10504073 9119528 10778950 15668695 17241761 11882790
35133 11882790 3885083 -1356337 -3512892 -3930513 -1535477 3814330 8155482 8009650
35125 8009650 5045464 2424305 -111003 -3392488 -4633889 -1383659 2738336 1850430
35117 1850430 -3802485 -8309633 -8281109 -5904071 -4148712 -3385597 -2959323 -2189771 578500
35108 578500 6509405 13530502 18087191 19786677 21428860 24352719 26485158 25114802
35100 25114802 19354954 10348346 1408460 -2996405 -1420941 1917494 1500969 -2970646
35092 -2970646 -6800345 -5807753 1040053 12497289 24595911 30899068 27943075 20007483
35084 20007483 14385338 12686663 11137289 8191970 6107058 5246177 3144404 255887
35076 255887 563708 4512863 6839431 3949264 -1289719 -4439095 -4413634 -1159792 6238081
35067 6238081 15463900 19680568 15014576 6275498 1103179 951419 1615031 236341
35059 236341 -2268116 -4182569 -4853118 -4559769 -4935659 -7985888 -12616200 -14275850 -10359152
35050 -10359152 -3639796 2037523 6695242 11880400 16206733 17019724 14546023 10926874
35042 10926874 7167576 4602966 6905284 15753924 25804826 29083022 24414798 18208494
35034 18208494 15595969 14921239 11992914 6319997 1495308 1315525 6277443 12549509
35026 12549509 14755500 11517398 7348238 6818536 8230739 6434474 890216 -3507349
35018 -3507349 -3942620 -3489813 -5766946 -9585515 -11450594 -10629439 -8845143 -6655567 -3185909
35009 -3185909 916655 2767087 354894 -4511171 -7062911 -3563700 5320011 15021162
35001 15021162 21025964 22397415 21846356 23152120 28230912 35133862 38628522 34859390
34993 34859390 26607006 21944218 25971252 35470990 43115195 44505254 38973732 26886692
34985 26886692 10806521 -2495053 -6884471 -4247554 -2445178 -4984760 -7215487 -4438460
34977 -4438460 786044 2675934 284623 -2462419 -3121692 -3170340 -4201266 -4929063 -3192579
34968 -3192579 805155 4726187 7119967 9035567 12085052 15512558 16413736 13137045
34960 13137045 7297767 1927135 -903129 72081 5372719 12374302 14833788 8453658
34952 8453658 -3253693 -11542503 -11123485 -4295558 2917326 5995050 3792545 -1409897
34944 -1409897 -5201422 -5006205 -3005890 -2861121 -4373235 -4779135 -4345027 -5794372 -8197434
34935 -8197434 -7200229 -2718965 -418480 -2792390 -4662351 -1730357 1792555 -178937
34927 -178937 -5482814 -7041090 -3979846 -2220410 -4283428 -5296261 -902069 6011019
34919 6011019 9258687 7063638 3413951 2974418 5710884 6186749 -896361 -13352799
34911 -13352799 -21864128 -20301878 -13350390 -9762917 -10136229 -7387714 982247 8117707
34903 8117707 7597606 1994893 -2286167 -4185312 -7135222 -11839389 -14934421 -13955397
34895 -13955397 -9783897 -4574132 -268080 1386155 266186 -1066196 -503302 -130753
34887 -130753 -3696300 -10368702 -14559216 -13014929 -8839613 -6482423 -5508231 -2526137
34879 -2526137 2065735 3007170 -3446719 -14623169 -24157988 -27754163 -24824503 -16611022
34871 -16611022 -5885859 2137396 2743306 -2510952 -5819930 -1812507 5571320 8236092
34863 8236092 4919561 2863505 7982114 17459739 24226956 25601775 24399037 23339529
34855 23339529 21784255 17835082 11425349 5140680 2890386 6750952 13846152 17858770
34847 17858770 15530319 10128996 6339266 4097064 1366986 863823 7446518 17940981
34839 17940981 20460300 8252034 -10146192 -19725101 -15412847 -4742393 3583732 7286315
34831 7286315 6797464 1166439 -8723975 -17259267 -18876745 -14076320 -7701185 -2862759
34823 -2862759 490495 2451468 2334079 1008848 992843 3314045 6224215 7713710 7676586
34814 7676586 6846906 4934424 806633 -5920625 -13697807 -19101428 -18738634 -12396946
34806 -12396946 -4127194 1058335 1529826 -687680 -2850517 -2714377 2170024 12977193
34798 12977193 26693634 37419182 41638756 39930024 33129934 20845943 5926111
34791 5926111 -3898259 -3598421 1926969 3161348 -2070408 -6742615 -5094750 62171
34783 62171 2611003 1547927 689429 2474693 5786804 8830301 10611591 9549629 3917925
34774 3917925 -4945800 -12027470 -13288927 -10228852 -8078189 -9564503 -12301173 -13088705
34766 -13088705 -12735703 -14097408 -16266306 -14605037 -7931070 -1960243 -2161160 -5604410
34758 -5604410 -4486959 3211189 11658352 15967795 17404741 17925510 15563043 9830680
34750 9830680 7003240 13257586 24452625 29687615 25370613 19341359 19009797 21226197
34742 21226197 17957043 8053768 -1595185 -4888551 -1957217 3731517 9537242 14008459
34734 14008459 16245437 16686970 16948942 17612398 17295287 14787386 10821988 6655802 2305667
34725 2305667 -1951966 -3301114 1486552 10831408 17764286 16900480 10999264 8107466
34717 8107466 12252319 19374416 22976928 21123235 16282354 10764622 5246780 618234
34709 618234 -1932236 -2736830 -3036258 -2364982 979303 6389720 10381651 10575499 8194970
34700 8194970 5649800 3756091 2573548 2884490 5063379 7824976 9448222 9124109
34692 9124109 6619884 2722307 557282 3215515 8560899 10255740 6643633 4314053
34684 4314053 8335799 13050640 9521162 -92354 -4072345 2380676 10694317 11962989
34676 11962989 8579398 7404918 7753617 4009009 -3107215 -6285529 -2605908 2205099
34668 2205099 2239710 -1122382 -2662754 -340955 3963619 8124118 11356090 13431466
34660 13431466 14383548 14304644 12353212 7217262 -142126 -5605769 -5753550 -2055147 657803
34651 657803 -228893 -2936958 -4939835 -6371712 -8007502 -7716685 -2527983 5418152 8766600
34642 8766600 3367310 -5807677 -10710039 -10307873 -9886741 -11081313 -9052637 -1733017
34634 -1733017 4311499 2273560 -4613009 -7229678 -3199087 670188 -1552850 -7917474
34626 -7917474 -12886162 -14128477 -13003977 -11585434 -11438576 -13207060 -15537487 -15719917
34618 -15719917 -12503037 -7419073 -3350678 -2973442 -7489919 -14313794 -17025808 -11467842
34610 -11467842 -1911894 2840007 61396 -4426409 -5339842 -4471732 -5635346 -7772374
34602 -7772374 -7170798 -3450747 749967 3861452 5314805 3285984 -3355287 -11803942
34594 -11803942 -17773163 -20742902 -23513806 -26915037 -28252568 -25302333 -19161645 -12639344
34586 -12639344 -7868925 -5890148 -6807027 -9592544 -12263109 -12268345 -7274295 2274520 10895915
34577 10895915 11632503 4093705 -3861429 -5340342 -2624442 -2577813 -6522851 -9707883
34569 -9707883 -9449259 -8112160 -7635602 -6247448 -2258631 2625773 5337880 3973398
34561 3973398 -2294849 -12378058 -21505613 -24120229 -20285080 -16104319 -16118211 -18258320
34553 -18258320 -17967231 -14028493 -8021721 -1148104 5150313 7574283 3756482 -3655320
34545 -3655320 -8338310 -6180376 1110919 7877404 9329221 5396355 637821 -250155
34537 -250155 2891387 6138792 6011276 2021440 -4290400 -9990470 -10875070 -4864958 3936840
34528 3936840 8494922 7625300 7512945 12310402 17657019 17340272 12686954 10113702 11258212
34519 11258212 10973572 5027066 -4646851 -12971483 -16502077 -14569945 -8891765 -3123271
34511 -3123271 -326494 169899 1564863 4825111 7290346 6591782 3539225 -140815
34503 -140815 -4802753 -11589479 -19210039 -24113633 -24074176 -20419025 -16219710 -12915112 -9498001
34494 -9498001 -5046570 -1087578 -405284 -3753165 -8955927 -13431116 -16332665 -17725332
34486 -17725332 -16982269 -13147232 -6458621 1085675 6603206 8263208 7239751 6967248
34478 6967248 8904393 10072336 7257726 2415847 -167226 -1534168 -7059416 -16272502
34470 -16272502 -20168842 -12966046 -1196185 4849846 4793243 6296099 12015500 16379314
34462 16379314 15194274 10911009 6840806 2863694 -576064 -232622 4567415 9101160
34454 9101160 9726350 9229704 11518916 14408304 12767727 6874100 2300360 1682879 1212786
34445 1212786 -3474134 -11156869 -16573237 -16397919 -12243277 -8577890 -8690571 -12263557
34437 -12263557 -16027178 -16621857 -13287747 -8376908 -5434481 -6243125 -9214756 -10909546
34429 -10909546 -9294222 -4874970 1231810 8400303 14738021 16706013 13060223 7574060
34421 7574060 4783417 4107752 1692251 -2522280 -3752459 902638 8332532 13309496
34413 13309496 13635603 10359268 5741613 2238310 982394 330808 -1713437 -3559310
34405 -3559310 -1961039 1933058 3063835 38559 -3060227 -4497850 -8425082 -16499146
34397 -16499146 -21782920 -17465588 -7878783 -3491405 -6690083 -9949729 -8251545 -6176343
34389 -6176343 -10137973 -18638194 -23796517 -20331476 -10749159 -2663547 -1761876 -6487663
34381 -6487663 -9909142 -7858578 -3772585 -3439810 -6895695 -8992867 -6779906 -2228933
34373 -2228933 1966193 5083029 6479724 4935469 885181 -3714663 -8282695 -13420363
34365 -13420363 -17723343 -18204755 -14199791 -7515762 1032200 10932212 18039637 17211470
34357 17211470 10477384 6737432 10249431 14565076 11858586 3852930 -1196562 1028903
34349 1028903 8237001 16446178 22429921 23243636 18694701 13650828 13436004 17282973
34341 17282973 20030389 19323533 16971353 14171422 10543886 8092732 10798013 18476050
34333 18476050 25168173 25796681 21215165 14710406 6852120 -3110786 -12873155 -17716187
34325 -17716187 -15612392 -9686440 -5070995 -4107942 -5027897 -5205543 -5070727 -7467203 -12765389
34316 -12765389 -16721778 -15219419 -9707687 -5288311 -4208830 -4117001 -2385442 837551
34308 837551 3929910 5291593 3472798 -1268892 -5508242 -5927686 -4015246 -3740070 -4513425
34299 -4513425 -1401717 6392545 12599140 12135957 7486290 3438376 165793 -4022367
34291 -4022367 -7380602 -7855583 -8253084 -11986177 -15947961 -14424013 -8795620 -5924241
34283 -5924241 -6793025 -4592104 3766313 11420972 10794627 3666747 -2320316 -3138739 -123707
34274 -123707 4328280 8313248 10025225 9877671 11183693 15175664 17422136 13161869
34266 13161869 4509794 -1927867 -3663098 -4450218 -8266438 -14950814 -21634930 -25029890
34258 -25029890 -22547074 -14733470 -6582618 -3022387 -3291895 -3343406 -3057809 -6021080 -11935679
34249 -11935679 -15358676 -14056841 -12571490 -13691134 -12024172 -2044858 11238163 16885123
34241 16885123 12131388 5108781 3113217 4721329 5645032 6275707 9004636 12109063
34233 12109063 11799506 8848304 8104809 11120118 13460514 10971816 5776942 3720096
34225 3720096 7253560 12890554 15205977 11885099 5023072 -1331896 -4622809 -5195786
34217 -5195786 -4340985 -1397382 5601315 15698338 23444460 23816832 17699874 9920076
34209 9920076 2600829 -5941721 -15338521 -20623992 -18318332 -12100276 -8870461 -10677123
34201 -10677123 -13759966 -14381124 -12037245 -7458744 -1283140 4698051 8138439 8916685
34193 8916685 8903081 8563819 6582725 3347953 1553982 2169434 2941454 2400665 2161202
34184 2161202 3294665 3686745 1684736 -582527 -721622 -184371 -1026278 -1017943 3010256
34175 3010256 8199336 7731763 479028 -6584421 -7457916 -4226226 -2453198 -3199031 -3307098
34166 -3307098 -1213807 1696953 4611008 8162671 11406052 11256229 6399664 -325358
34158 -325358 -4794167 -5278110 -2339440 2647658 6800024 5758995 -1772282 -10013072
34150 -10013072 -10865818 -3876930 2461672 1596118 -2813508 -3301206 159947 1212849
34142 1212849 -2024007 -4125074 -1722044 639789 -2478167 -9095450 -12858629 -11642768
34134 -11642768 -9025861 -8686149 -10584850 -11729523 -8560533 -186453 8793389 11002976
34126 11002976 4287885 -5344031 -11254882 -13609782 -16014413 -18326731 -17998142 -16201317
34118 -16201317 -16531479 -18179094 -16007404 -7982756 1942930 8877152 11161995 9672642
34110 9672642 6968608 6924770 11097316 15832502 17151339 17303720 20903704 25478879 23068124
34101 23068124 12138283 718164 -4540247 -5770200 -7678029 -10547194 -12968167 -15301677
34093 -15301677 -16336325 -12503499 -5066256 -2151660 -7989285 -15413442 -15277984 -8541109
34085 -8541109 -2237191 1938946 6799267 10743657 9107079 3746373 2446728 7285960
34077 7285960 10686218 5519190 -5880060 -14904144 -15425175 -8593652 -2086622 -4282723
34069 -4282723 -15611912 -26513599 -27903207 -22073257 -18188072 -18967756 -19007584 -15769059
34061 -15769059 -13760632 -15667017 -17044738 -13758103 -8546672 -5712749 -4241436 -1031387
34053 -1031387 2839582 4061327 2916412 2752254 4871845 7207068 7355211 5122091
34045 5122091 3196693 5937222 14935074 24996974 28000820 22156129 13823839 8886413
34037 8886413 7101534 7089785 10737729 17834437 21569169 16195980 6320486 1710386
34029 1710386 4220061 6466862 3278869 -1932970 -3322853 414054 7114417 14526875
34021 14526875 20088395 20961898 17184208 12400894 9079701 5102431 -2303524 -10867448
34013 -10867448 -14712374 -11564685 -6156825 -5364050 -11033333 -18667306 -22574845 -20850294
34005 -20850294 -15204732 -8071765 -1738597 1242406 86394 -1738671 616547 7002270
33997 7002270 11826375 11396185 8340415 6430395 4528550 -498127 -7350895 -11375044
33989 -11375044 -10919753 -8253811 -4679782 724051 7139451 11290102 12206834 13042456
33981 13042456 16100736 19001458 18186021 14067763 10108790 8073295 6721853 4838621
33973 4838621 3385471 3987728 6230443 7274221 4513428 -1240181 -5775778 -5677403 -2598032
33964 -2598032 -2323209 -8749376 -18903070 -24589192 -19823832 -7172626 3909337 6163367
33956 6163367 1518776 -2489830 -2442497 -1933349 -4351526 -7154682 -6325124 -3215862 -2558535
33947 -2558535 -5229242 -7452239 -6821391 -4990468 -3898280 -2867442 -524914 2987523
33939 2987523 6598924 9127861 9281141 6921072 4320309 3967149 5363463 6302537 6568303
33930 6568303 7276161 7262475 4162853 -829201 -3538586 -2865662 -2033565 -2728580 -2556942
33921 -2556942 -179279 1633913 921194 469398 3400273 8120905 11305215 13168632
33913 13168632 16020367 19710451 22121584 22435034 20644269 15729907 7805146 320290
33905 320290 -3565011 -5353637 -8274525 -11432474 -11034550 -6550357 -1395929 2182597
33897 2182597 4804865 6592440 6302887 4503610 3985801 6080247 9388673 12352293
33889 12352293 13879876 11610316 3877127 -5790491 -10604983 -8698732 -5351481 -5195926
33881 -5195926 -6742120 -7668501 -10814917 -19577062 -30075711 -34079053 -29452205 -22390876
33873 -22390876 -18340968 -15485493 -9517187 -989366 5757947 8974320 10761574 12157437
33865 12157437 10792892 5239266 -884385 -2265551 1173821 3743534 1320952 -3330261
33857 -3330261 -4679173 -2092512 -256928 -2287088 -5769606 -6837748 -5365496 -3832205
33849 -3832205 -2968767 -1709879 -888057 -3278563 -8430618 -10267499 -3205847 9729503
33841 9729503 18140614 15114848 4872580 -2474149 -2414010 556253 571178 -2255790 -3778273
33832 -3778273 -2290441 -122603 114283 -1802075 -4582962 -6859607 -7615471 -6830232 -5881417
33823 -5881417 -6078590 -6814669 -6218361 -3352344 1256495 6602091 11335392 13634132 12691808
33814 12691808 10013554 7758118 6279989 4614645 2318392 -862373 -5605392 -10865637
33806 -10865637 -12826881 -9363110 -4104187 -1954632 -1827111 950470 5692006 6536872
33798 6536872 2634338 744957 4355536 7272630 3530841 -2264604 -1752320 4075747
33790 4075747 6808820 3855313 1485496 4406821 9870613 13921220 16814261 19098782
33782 19098782 17632728 9566818 -2835364 -14514243 -22343172 -25259551 -22540260 -15017423
33774 -15017423 -6295072 -151516 2247887 1186961 -3337235 -9824745 -13563266 -10006589
33766 -10006589 -12438 10231203 15047366 14405327 13269878 16096118 21882691 25276663
33758 25276663 23181417 18661337 16157564 14563435 9161866 86677 -6294814 -6118626
33750 -6118626 -3439146 -3959850 -7265960 -8960446 -7257566 -3119878 3630860 13215761
33742 13215761 21906707 23993885 18153131 8463802 -858947 -8415708 -13505469 -15000205
33734 -15000205 -13427506 -11322662 -10380784 -10206225 -10173418 -10290951 -10041966 -8766191 -7364360
33725 -7364360 -7079854 -6448947 -2459426 4554408 10089645 10696906 7524268 3515892 -411216
33716 -411216 -4855691 -9664274 -13891889 -16849401 -18313588 -18855168 -20005664 -22231041
33708 -22231041 -22959577 -19364637 -13130855 -8988890 -8036726 -6760322 -4050359 -4165660
33700 -4165660 -9422586 -14352456 -12068370 -3857505 2541537 2778508 -646713 -3836261
33692 -3836261 -5578579 -5765306 -4034738 -1253438 477696 238452 -1095784 -2351269
33684 -2351269 -2043967 1951606 9342789 14877419 13236278 6732362 3622981 7493174
33676 7493174 12529601 11314382 3554255 -5282839 -10445432 -10061480 -4113317 4681289
33668 4681289 10627887 9471113 2723980 -4507998 -8729901 -9007590 -5149181 1061759
33660 1061759 4026564 -1381239 -12688505 -20732789 -19534416 -12712699 -8255333 -9042710
33652 -9042710 -10943970 -9253374 -4507940 -1390048 -3054155 -7458540 -9522592 -6685922
33644 -6685922 -1531024 1676691 2044632 2022680 2785019 2250252 -980900 -3685667 -743687
33635 -743687 8038980 15910531 15483025 6632038 -3135918 -6561662 -3974336 -1832999
33627 -1832999 -4569465 -9808334 -12418746 -11295450 -9694903 -9484817 -8114367 -2548808
33619 -2548808 5863770 12472029 14357528 12442761 8998054 5013159 437412 -4502193
33611 -4502193 -9089035 -12397758 -13184881 -10333235 -4240344 2723912 7915780 10334620
33603 10334620 10446794 8849849 6149163 3732003 3208887 4676609 6467921 7031828
33595 7031828 6217337 4273440 697272 -4777679 -10611021 -14292647 -15011732 -14502093 -14637862
33586 -14637862 -14770003 -12280566 -5854340 2340214 8079441 8477147 3728037 -3881826
33578 -3881826 -11430230 -15734584 -14310457 -7953817 -1530639 375080 -1006031 258193
33570 258193 7162219 15407106 18358922 14557628 8076781 2815569 -656597 -3026667
33562 -3026667 -4204008 -4283852 -4262481 -4455610 -3673521 -1202699 1507079 2438978 1697465
33553 1697465 1473257 3452408 6918111 9360984 8624674 4642551 -480839 -3886603
33545 -3886603 -3622854 358792 5884459 9373567 8511591 4957031 3219052 5732472
33537 5732472 9984359 11612333 9255592 5011059 1325396 -707665 -865848 350160
33529 350160 1798047 3033495 4615682 5800397 4001044 -1045101 -4906232 -3951828
33521 -3951828 -1331623 -2767727 -7574224 -9445184 -6037169 -1671006 465083 2302333
33513 2302333 4669862 3484000 -3639976 -11927418 -15258772 -13717576 -11181919 -9148207
33505 -9148207 -7338893 -6665849 -6564880 -2872265 5955226 13404080 11867878 3004136
33497 3004136 -4923033 -8114285 -9097167 -9255557 -7359804 -5528661 -8623390 -15821749
33489 -15821749 -19665776 -15981181 -8734630 -2638592 2736482 8067014 9688046 5048015
33481 5048015 -1478345 -3398411 -7171 4677949 8035889 9388819 6883273 -779269
33473 -779269 -9994044 -14190876 -10930633 -4289069 327075 1649087 2491779 5838939
33465 5838939 11436816 15678208 15130564 10462286 5943489 4679231 5618448 5790492 3994022
33456 3994022 1481809 243908 1197769 3094505 3540592 2712405 4948422 13364118 23364229
33447 23364229 26042200 19132504 10208291 7056862 9072267 10765569 9632541 6908165
33439 6908165 3897172 1630737 1637943 3121510 1629691 -5320403 -13094941 -14635168 -9062415
33430 -9062415 -1696818 3201729 5385920 5195807 2088096 -2740516 -6143144 -6556749
33422 -6556749 -4990154 -2033354 3046526 9300423 13122716 12153960 8610491 7089562
33414 7089562 9538794 13281271 14054455 10720814 6294433 3555794 813133 -5360893
33406 -5360893 -13402549 -16661673 -11758821 -3636042 445614 -633704 -2228975 -583647
33398 -583647 3796847 7772289 8198233 4536486 252035 -1067925 -1924996 -8424082 -19368321
33389 -19368321 -24271017 -17032078 -5167610 1415673 4395146 10108049 14116964 6297716
$$ [...]
##END NTUPLES=NMR SPECTRUM
##END=
