##TITLE=31Pdec_DE-80
 D2O, 64 sc
 22.1.2025
##JCAMPDX= 6.0         $$ Bruker NMR JCAMP-DX V2.0
##DATA TYPE= NMR SPECTRUM
##DATA CLASS= NTUPLES
##ORIGIN= UXNMR, Bruker Analytische Messtechnik GmbH
##OWNER= root
$$ XWIN-NMR		Version 3.5
$$ Wed Jan 22 16:36:07 2025 Russian Standard Time (UT+4h)  she@DPX200
##.OBSERVE FREQUENCY= 81.013821
##.OBSERVE NUCLEUS= ^31P
##.ACQUISITION MODE= SIMULTANEOUS
##.ACQUISITION SCHEME= undefined
##.AVERAGES= 64
##.DIGITISER RES= 17
##SPECTROMETER/DATA SYSTEM= spect
##.PULSE SEQUENCE= zgpg30
##.SOLVENT NAME= CDCl3
##.SHIFT REFERENCE= (INTERNAL, CDCl3, 0, 198.062)
##AUDIT TRAIL= $$ (NUMBER, WHEN, WHO, WHERE, WHAT)
$$ ##TITLE= Audit trail, XWIN-NMR		Version 3.5
$$ ##JCAMPDX= 5.01
$$ ##ORIGIN= Bruker BioSpin GmbH
$$ ##OWNER= she
$$ F:/spectra/data/she/nmr/P31/2/pdata/1/auditp.txt
$$ ##AUDIT TRAIL=  $$ (NUMBER, WHEN, WHO, WHERE, WHAT)
(   1,<2025-01-22 16:34:08.67 +0400>,<she>,<DPX200>,
      <continue with go, POWCHK disabled, PULCHK disabled
       configuration hash MD5:
       00 E9 B6 7A A2 85 ED C7 34 08 36 98 17 FE 4E 26
       data hash MD5: 32K
       B3 7E 82 96 C0 DD 66 B1 31 73 40 11 C2 B3 28 88>)
(   2,<2025-01-22 16:34:10.45 +0400>,<she>,<DPX200>,
      <Start of raw data processing
       efp BC_mod = 2 LB = 1.5 FT_mod = 6 PKNL = 1 PHC0 = 1723.662 PHC1 = 192.0866 SI = 64K 
       data hash MD5: 64K
       83 B7 76 85 65 00 62 3A DE 2D B8 34 3C 7D E5 56>)
(   3,<2025-01-22 16:34:33.26 +0400>,<she>,<DPX200>,
      <pk PHC0 = 261.9363 PHC1 = 0 
       data hash MD5: 64K
       34 EA 0B F7 EA 27 E3 72 41 55 D4 55 EE 85 D6 E4>)
(   4,<2025-01-22 16:35:06.76 +0400>,<she>,<DPX200>,
      <pk PHC0 = 26.22734 PHC1 = -74.99951 
       data hash MD5: 64K
       F9 37 2B 50 39 F5 BB 5F 1B EC A7 06 F5 09 CC 40>)
(   5,<2025-01-22 16:35:09.29 +0400>,<she>,<DPX200>,
      <abs ABSG = 5 
       data hash MD5: 64K
       15 27 DC A1 0F 33 47 66 89 EB BA 58 DD 2A 56 F3>)
$$ ##END=
$$ 
$$ hash MD5
$$ 44 7C 9A 11 FF DF 35 F8 22 92 E9 DD 63 28 62 57
##$RELAX= 
##$RELAX= 
##$RELAX= 
##$RELAX= 
##$RELAX= 
##$RELAX= 
##$RELAX= 
##$RELAX= 
$$ Bruker specific parameters
$$ --------------------------
##$DU= <F:/spectra>
##$EXPNO= 2
##$NAME= <P31>
##$PROCNO= 1
##$TYPE= <nmr>
##$USER= <she>
##$AMP= (0..31)
100 100 100 100 100 100 100 100 100 100 100 100 100 100 100 100 100 100 
100 100 100 100 100 100 100 100 100 100 100 100 100 100 
##$AQSEQ= 0
##$AQ_mod= 1
##$AUNM= <au_zg>
##$AUTOPOS= <>
##$BF1= 81.014009
##$BF2= 200.13
##$BF3= 200.13
##$BF4= 200.13
##$BF5= 200.13
##$BF6= 200.13
##$BF7= 200.13
##$BF8= 200.13
##$BYTORDA= 1
##$CFDGTYP= 0
##$CFRGTYP= 5
##$CHEMSTR= <none>
##$CNST= (0..31)
1 1 145 1 1 1 1 1 1 1 1 1 1 1 1 1 1 1 1 1 1 1 1 1 1 1 1 1 1 1 1 1 
##$CPDPRG= <waltz16>
##$CPDPRG1= <>
##$CPDPRG2= <waltz16>
##$CPDPRG3= <>
##$CPDPRG4= <mlev>
##$CPDPRG5= <mlev>
##$CPDPRG6= <mlev>
##$CPDPRG7= <mlev>
##$CPDPRG8= <mlev>
##$CPDPRGB= <>
##$CPDPRGT= <>
##$D= (0..31)
0 1 0 0 0 0 0 0 0 0.06 0 0.03 2e-05 3e-06 0 0 0.0002 0 0 0 0 0 0 0 0 0 
$$ [...]
##$SUBNAM3= <"">
##$SUBNAM4= <"">
##$SUBNAM5= <"">
##$SUBNAM6= <"">
##$SUBNAM7= <"">
##$SUBNAM8= <"">
##$SUBNAM9= <"">
##$SW= 400.765351723535
##$SWIBOX= (0..15)
0 1 3 0 0 0 0 0 0 0 0 0 0 0 0 0 
##$SW_h= 32467.5324675325
##$TD= 32768
##$TD0= 1
##$TE= 0
##$TE2= 300
##$TE3= 300
##$TEG= 300
##$TL= (0..7)
0 120 53 12 22 120 120 120 
##$TP= (0..7)
150 150 150 150 150 150 150 150 
##$TP07= 0
##$TPNAME0= <>
##$TPNAME1= <>
##$TPNAME2= <>
##$TPNAME3= <>
##$TPNAME4= <>
##$TPNAME5= <>
##$TPNAME6= <>
##$TPNAME7= <>
##$TPOAL= (0..7)
0.5 0.5 0.5 0.5 0.5 0.5 0.5 0.5 
##$TPOFFS= (0..7)
0 0 0 0 0 0 0 0 
##$TUNHIN= 0
##$TUNHOUT= 0
##$TUNXOUT= 0
##$USERA1= <user>
##$USERA2= <user>
##$USERA3= <user>
##$USERA4= <user>
##$USERA5= <user>
##$V9= 5
##$VALIST= <valist>
##$VCLIST= <CCCCCCCCCCCCCCC>
##$VD= 0
##$VDLIST= <DDDDDDDDDDDDDDD>
##$VPLIST= <PPPPPPPPPPPPPPP>
##$VTLIST= <TTTTTTTTTTTTTTT>
##$WBST= 1024
##$WBSW= 4
##$XGAIN= (0..3)
0 0 0 0 
##$XL= 0
##$YL= 0
##$YMAX_a= 11341
##$YMIN_a= -4622
##$ZGOPTNS= <>
##$ZL1= 120
##$ZL2= 120
##$ZL3= 120
##$ZL4= 120
##$ABSF1= 198.0616
##$ABSF2= -202.7028
##$ABSG= 5
##$ABSL= 3
##$ALPHA= 0
##$AQORDER= 0
##$ASSFAC= 0
##$ASSFACI= 0
##$ASSFACX= 0
##$ASSWID= 0
##$AUNMP= <proc_1d>
##$AZFE= 0.1
##$AZFW= 0.5
##$BCFW= 0
##$BC_mod= 2
##$BYTORDP= 0
##$COROFFS= 0
##$CY= -3
##$DATMOD= 1
##$DC= 0
##$DFILT= <>
##$DTYPP= 0
##$F1P= 0
##$F2P= 0
##$FCOR= 1
##$FTSIZE= 65536
##$FT_mod= 6
##$GAMMA= 0
##$GB= 0
##$INTBC= 1
##$INTSCL= 9.790993e-09
##$ISEN= 30
##$LB= 1.5
##$LEV0= 0
##$LPBIN= 0
##$MAXI= 10000
##$MC2= 0
##$MEAN= 0
##$ME_mod= 0
##$MI= 50
##$NCOEF= 0
##$NC_proc= -9
##$NLEV= 6
##$NOISF1= 182.463
##$NOISF2= 159.3651
##$NSP= 0
##$NTH_PI= 0
##$NZP= 0
##$OFFSET= 198.0616
##$PC= 4
##$PHC0= 2011.825
##$PHC1= 117.0871
##$PH_mod= 1
##$PKNL= yes
##$PPARMOD= 0
##$PSCAL= 0
##$PSIGN= 0
##$REVERSE= no
##$SF= 81.0140089999434
##$SI= 65536
##$SIGF1= 159.3651
##$SIGF2= -187.1042
##$SINO= 113.3802
##$SIOLD= 16384
##$SREGLST= <1H.CDCl3>
##$SSB= 0
##$STSI= 65536
##$STSR= 0
##$SW_p= 32467.5324675325
##$SYMM= 0
##$S_DEV= 0
##$TDeff= 32768
##$TDoff= 0
##$TI= <>
##$TILT= no
##$TM1= 0
##$TM2= 0
##$TOPLEV= 0
##$USERP1= <user>
##$USERP2= <user>
##$USERP3= <user>
##$USERP4= <user>
##$USERP5= <user>
##$WDW= 1
##$XDIM= 65536
##$YMAX_p= 401570469
##$YMIN_p= -539086139
$$ End of Bruker specific parameters
$$ ---------------------------------
##NTUPLES= NMR SPECTRUM
##VAR_NAME=  FREQUENCY,     SPECTRUM/REAL,   SPECTRUM/IMAG
##SYMBOL=    X,             R,               I
##VAR_TYPE=  INDEPENDENT,   DEPENDENT,       DEPENDENT
##VAR_FORM=  AFFN,          ASDF,            ASDF
##VAR_DIM=   65536,         65536,           65536
##UNITS=     HZ,            ARBITRARY UNITS, ARBITRARY UNITS
##FACTOR=    0.49542278885378, 1,            1
##FIRST=     16045.7642231865, 0,            0
##LAST=      -16421.768244346, 0,            0
##MIN=       -16421.768244346, -539086139,   0
##MAX=       16045.7642231865, 401570469,    0
$$ Real data points
##PAGE= N=1
##DATA TABLE= (X++(R..R)), XYDATA
$$ [...]
7369D456442O283003K07295p181086j1074271q526777j195185N558032P428025
7361d044522M751547J250870J35369J563831K936159J527545k386282n322489
7353D12028m504262j322267O69349N35114M59583J602376K179852N93796j805362
7344a179793k500116p47268K428768N443021N983475J758470o066629j1588605
7336f468677r631354k429107K243089K97382m265751n453497k571241J173064
7328b7106092M489901Q166109J0692692Q809922L202934q59808m94300J092818
7320G994176L57805r89545J36834J986701O32935k891624l439261M85592M568146
7311H841759M871660K136004q15131k269107j577845N11704J070454j662642m113485
$$ plain form
7369 4456442 10739445 10946740 3765654 -7308617 -15835394 -17030579 -11472547 -4044522
7361 -4044522 707025 1957895 2093264 3657095 6593254 8120799 5734517 412028
7353 412028 -4092234 -5414501 -4745152 -4210038 -3750455 -2148079 31773 625569 -1179793
7344 -1179793 -3679909 -4427177 -1998409 3444612 9428087 11186557 5119928 -6468677
7336 -6468677 -16100031 -18529138 -16286049 -15988667 -20254418 -25707915 -28279156 -27106092
7328 -27106092 -22616191 -14450082 -3757390 5052532 8255466 7395658 6901358 7994176
7320 7994176 8351981 7362436 7499270 9485971 10118906 7227282 3788021 4273613 8841759
7311 8841759 13713419 15849423 15034292 12765185 11187340 11699044 12769498 11106856 6993371
7302F993371j425456L940009L903610l010852q024107m638803J651789K038049
7294A427610k608376m754268k457811k92670J80035K225339N878206O212538J910181
7285G720784j328868O33503L879792K620071k235519n164355m158371k443025
7277d75988l005503m818733m786268j644055K486535M153454K536269P69238J835304
7268b949747M009794L240245j98425j345189J991996N389841L948616r41702m271262
7259H874167m478738m010386m078722k927994L91090L685578M126785J259081
7251B840861l111940o523371o986121m165311k05150J816725J065073k16126L67436
7242a5117924K402672L421724K072650l78740j667540r80074L98415N48509j043863
$$ plain form
7302 6993371 5567915 9507924 13411534 10400682 2376575 -2262228 -610439 1427610
7294 1427610 -1180766 -5935034 -8392845 -8685515 -8505480 -6280141 -401935 5810603 7720784
7285 7720784 6391916 7025419 10905211 13525282 11289763 6125408 1967037 -475988
7277 -475988 -3481491 -8300224 -13086492 -14730547 -12244012 -8090558 -5554289 -4785051 -2949747
7268 -2949747 1060047 4300292 4101867 2756678 4748674 10138515 14087131 13145429 8874167
7259 8874167 4395429 385043 -3693679 -6621673 -6230583 -2545005 1581780 2840861
7251 2840861 -271079 -6794450 -13780571 -17945882 -18151032 -16334307 -15269234 -15485360 -15117924
7242 -15117924 -12715252 -9293528 -7220878 -7599618 -9267158 -10247232 -9848817 -9300308 -10344171
7233a0344171k659914j777580J948901N208594L904346j704264o185796n022644
7225a6632528m36981J452409j129149l601867k029567J565243L127647K560220
7217a5124573K303767K237818L81417k168123j512055L178776P728423Q163789
7209E189239N029019J215141j875925m184320n011790l476185l56530K019817
7201a451534J825092o76729l367301m176419l002791j181058J071690M850460
7193f108590R098959R565808M201283k295501l418514M19249K641434K35363k233454
7184A2106037j61480M073245N071249K349651O4455j32161j693155p203350j2390242
7175B084249r435957K802475J4423011J3900666J651787j0035724j1735054o374872
$$ plain form
7233 -10344171 -13004085 -14781665 -12832764 -7624170 -3719824 -5424088 -11609884 -16632528
7225 -16632528 -17069509 -15617100 -16746249 -20348116 -22377683 -20812440 -17684793 -15124573
7217 -15124573 -12820806 -10582988 -10201571 -12369694 -13881749 -10702973 -2974550 5189239
7209 5189239 10218258 11433399 9557474 5373154 361364 -3114821 -3471351 -1451534
7201 -1451534 373558 -303171 -3670472 -7846891 -10849682 -12030740 -10959050 -6108590
7193 -6108590 2990369 12556177 16757460 14461959 11043445 11462694 14104128 14339491 12106037
7184 12106037 11944557 16017802 21089051 23438702 23503157 23370996 21677841 14474491 2084249
7175 2084249 -7351708 -4549233 9873778 23774444 25426231 15390507 3655453 -2719419
7167b719419j320921K362767O418904P160877O94968o611827m351817N217728
7159F851260Q346173K0277q537662p159924m57866K378420J431517J300137J093284
7150E265616j253368j596057L619445Q988554Q291513N232007N672062N241215
7142C9460987k755392j1996557j0365702j17389M537040j22441l049275J224680
7134A6815951L979749q01671n881687m586322j895937k912163k368414M065498
7126F415004Q822357M497315k297691j892833J365624k788074j1007256j0535754
7118g421308o60334N552921J795181l547302l052809p63175j842167l101244p91918
7109a3832155J220313j100335l246127Q43154P806918R126201L810842p67270
$$ plain form
7167 -2719419 -4040340 -1677573 4741331 11902208 12597176 5985349 1633532 6851260
7159 6851260 15197433 15217710 6680048 -479876 -937742 1440678 2872195 4172332 5265616
7150 5265616 4012248 2416191 6035636 15024190 23315703 28547710 34219772 39460987
7142 39460987 36705595 24709038 14343336 14225947 18762987 18640546 15591271 16815951
7134 16815951 20795700 19994029 14112342 9526020 7630083 4717920 2349506 6415004
7126 6415004 15237361 19734676 17436985 15544152 16909776 14121702 3114446 -7421308
7118 -7421308 -8081642 -2528721 -733540 -4280842 -7333651 -8096826 -9938993 -13040237 -13832155
7109 -13832155 -12611842 -13712177 -16958304 -16115150 -8308232 817969 4628811 3861541
7101C861541p0450K036678j19115o403897j1422968j0277004l111219M563347
7093b0943087O476562K166728j923197N6158N796513P608860K493903l826050
7085b093610m144840J454019O256124N198455M5266l946576m369787l037256k024172
7076f662377p03942K518584P008239R761560Q156370K439710l919395o428396
7068A2170353l633868O40454J012091k829077n667979m144527j275081r31986
7060d659620j311043J354786M873091L157980l815054q416985n655361L82422
7052a4089784L464887L887180N770766Q943042Q924776M254663p92873j785704
7044A8576953M13298J187931j962527o058027n498638J142571P897817P333830
$$ plain form
7101 3861541 3791091 5827769 5708654 -695243 -12118211 -22395215 -25506434 -20943087
7093 -20943087 -14466525 -12299797 -14222994 -14166836 -8370323 -761463 1732440 -2093610
7085 -2093610 -6238450 -4784431 1471693 6670148 6715414 2768838 -1600949 -4638205 -6662377
7076 -6662377 -7366319 -4847735 2160504 11922064 20078434 22518144 18598749 12170353
7068 12170353 8536485 9176939 10189030 7359953 1691974 -2452553 -3727634 -4659620
7060 -4659620 -5970663 -4615877 257214 3415194 -399860 -8816845 -14472206 -14089784
7052 -14089784 -10624897 -6737717 -966951 7976091 16900867 21155530 20362657 18576953
7044 18576953 18990251 20178182 18215655 12157628 6658990 7801561 15699378 23033208
7036B3033208Q23n358750k832420K883125L110412l149506q887222r093081n812626
7027f106037k881354p92533J223333K287829K067236K810822N805378P881862
7019A2296536N076600j307040n805089n665840l366385k076808j933488j883007
7011d664521k141211k773853k130743P61286L709806L891704J931418P05370P22069
7002A1325r679j378626k68538M110709P363780N243212l76681l991534l459103
6993G244865j291533m8660j4422j008331k741042l200829n21061K959808K648813
6984D027608j138991k639241N14790K974406J09629m066044l247859O08909O83785
6975b173008k594668j691231M913700Q732331M068059l050843m362353j382865
$$ plain form
7036 23033208 23034031 17675281 14842861 17725986 20836398 17686892 8799670 -293411 -6106037
7027 -6106037 -8987391 -9779924 -8556591 -6268762 -4201526 -1390704 4414674 12296536
7019 12296536 17373136 16066096 10261007 4595167 1228782 -848026 -2781514 -4664521
7011 -4664521 -6805732 -9579585 -11710328 -10949042 -7239236 -3347532 -1416114 -710744 11325
7002 11325 1646 -1376980 -1645518 2465191 9828971 15072183 14695502 10703968 7244865
6993 7244865 5953332 5904672 5890250 4881919 2140877 -1059952 -1581013 1378795 4027608
6984 4027608 2888617 249376 764166 3738572 3848201 -217843 -3465702 -2856793 -2173008
6975 -2173008 -4767676 -6458907 -1545207 7187124 11255183 8204340 3841987 2459122
6967B459122r39881l705792n401353o009814q431875r391061j978392J1324501
6959b2074545J8057539J2073561J862235k515502k731539n271029q139942m307807
6951a3047029M961013J0183996O839013L53785k774341j949938K93177J654101
6943F513777l33853n949591r701102n657750K595361M816852j031789n075074
6935a3823169m94161O285949O517509K622132K430907N544215N089967J10791
6927A4284140l419032l116539k878809m445701m343131j187966Q72766j025983
6919e260255l483057j808236L581894Q100426P768576K029117n511234q819785
6911c402554m954650K089148N967354N466717L699665J674909j679005m264136
$$ plain form
6967 2459122 1519241 -2186551 -7587904 -13597718 -22029593 -31420654 -33399046 -22074545
6959 -22074545 -4017006 8056555 9918790 7403288 4671749 -599280 -8739222 -13047029
6951 -13047029 -8086016 2097980 8936993 9290778 6516437 4566499 4859676 6513777
6943 6513777 6179924 230333 -9470769 -15128519 -12533158 -7716306 -8748095 -13823169
6935 -13823169 -14317330 -8031381 -1513872 1108260 3539167 9083382 14173349 14284140
6927 14284140 10865108 7748569 4869760 424059 -3919072 -5107038 -4234272 -5260255
6919 -5260255 -8743312 -10551548 -6969654 1130772 8899348 10928465 5417231 -3402554
6911 -3402554 -8357204 -6268056 -300702 5166015 8865680 10540589 8861584 4597448
6903D597448k640580P79106L786l884399k729232N245812J0681150O703553o89056
6894A8067588k521547k41010r81422m558228m636516m45735J788098j067450n151216
6885B52562o475454n266872k571866J540383N023116M493274P21399j146613J056810
6876b373261L139135J074571k751303l236976j84023J588590p00053l877715l239691
6867a0560726R68514L849921K560719o2846m12302l9281k771107p238399p590533
6858b1296040k231818L573566N520908N133699M206168N55967o035542r159617
6850a9732709l492819O329603J0893616P682116J896342j889281k883882j121796
6842b318810K224089L054591j023536n708666n593320k755286k988145n463196
$$ plain form
6903 4597448 1956868 2735974 2739760 -1144639 -3873871 1371941 12053091 18756644 18067588
6894 18067588 15546041 15305031 14323609 9765381 5128865 4683130 6471228 5403778 252562
6885 252562 -6222892 -11489764 -14061630 -12521247 -7498131 -3004857 -2283458 -3430071 -2373261
6876 -2373261 765874 1840445 -910858 -4147834 -4331857 -2743267 -3443320 -7321035 -10560726
6867 -10560726 -9592212 -5742291 -3181572 -3244418 -3656720 -3696001 -6467108 -13705507 -21296040
6858 -21296040 -23527858 -19954292 -14433384 -9299685 -5093517 -4537550 -10573092 -19732709
6850 -19732709 -23225528 -16895925 -6002309 1679807 3576149 1686868 -1197014 -2318810
6842 -2318810 -94721 2959870 1936334 -3772332 -9365652 -12120938 -15109083 -20572279
6834b0572279m222657J008924M196837L342655K751332M044004L780458J756710
6826c914016K502234N647138M053923m039844r621350n426687L269585O568012
6818i61005K788156k582386n600142n552211k335991K118841L420079N36205j610189
6809i778643N58788L856594M328916L386700L178251J647320j977203k700687
6801B500036K167856O045773K441099l568447k670552L522680N107215j51567
6793A5394093m251050k523797M88555O29460K92334J632055J398804l126411q681229
6784A252814j0400382p498765j966405M211263Q185537O876308J289588l113704
6776a163746k738595J89505J581771N27445j013528q68090J966357N968019O868030
$$ plain form
6834 -20572279 -24794936 -23786012 -19589175 -16246520 -13495188 -9451184 -5670726 -3914016
6826 -3914016 -1411782 4235356 8289279 4249435 -5371915 -10798602 -7529017 -961005
6818 -961005 1827151 -755235 -6355377 -11907588 -14243579 -12124738 -8704659 -8168454 -9778643
6809 -9778643 -9219855 -5363261 -1034345 2352355 5530606 7177926 5200723 2500036
6801 2500036 4667892 10713665 13154764 9586317 6915765 10438445 15545660 15394093
6793 15394093 11143043 8619246 9107801 9737261 10029595 11661650 13060454 9934043 1252814
6784 1252814 -9147568 -16646333 -18612738 -14401475 -6215938 660370 1949958 -1163746
6776 -1163746 -3902341 -3712836 -2131065 -1603620 -2617148 -3485238 -1518881 4449138 11317168
6767A1317168K046323m729349o856693l518673l11211n17207q93195J797022M964133
6758C298318M349949N43032k323558k346330j264454j273107k660675m005676
6750e682501l584106j192752J312423K300810K382934K322750N01788m112244
6742e750898p664059m905122K794702P949575O766630L560271L151609L658564
6734I561272O92981m606686o466990k480823L053538M460214J250220j906617
6726C557109j243387J642050K769166J962205K433291L918397J665811m749786
6718A1954856p492363j292079O600309N451293k926934o669623j543159L862440
6710G944740K025261l896547p363980o928069l614054K516868Q834515R862016
$$ plain form
6767 11317168 13363491 8634142 1777449 -1741224 -2052435 -2569642 -3462837 -1665815 3298318
6758 3298318 7648267 8191299 5867741 3521411 2256957 983850 -1676825 -5682501
6750 -5682501 -9266607 -10459359 -9146936 -6846126 -4463192 -2140442 -1638654 -5750898
6742 -5750898 -13414957 -18320079 -15525377 -7575802 -809172 2751099 5902708 9561272
6734 9561272 10254253 5647567 -819423 -3300246 -246708 4213506 5463726 3557109
6726 3557109 2313722 3955772 6724938 8687143 11120434 15038831 16704642 11954856
6718 11954856 4462493 3170414 9770723 15222016 12295082 5625459 4082300 7944740
6710 7944740 9970001 6073454 -1290526 -8218595 -11832649 -9315781 -481266 9380750
6702I380750M819350n45475k977501n548356q959510p605371k3402N142553J401730
6693d915232m428925k294321N413270Q032149K932316k220905k071858M64647
6685I11141J127629J12608k02848J192387L066821K344298k541730o946745l626534
6676d562973N831980J0056785L674707l770621k504493K014410p09748p672273
6668B357774q154957l472789m516652j0503579p617717P655698K0144863J7903790
6660A3796431Q525557M542805M653928R47143m358797k846337L983596N374285
6652C4618611k335736j0273552r669570k409353L651167M598095K454859J86804
6644B0821325j930935m906561p754170p574843l654610N20886J611124R97654
$$ plain form
6702 9380750 14200100 13654625 10677124 5128768 -3830742 -11436113 -11459515 -6316962 -4915232
6693 -4915232 -9344157 -11638478 -6225208 1806941 4739257 2518352 446494 911141
6685 911141 2038770 2151378 1948530 3140917 6207738 8552036 6010306 -936439 -4562973
6676 -4562973 1269007 11325792 15000499 11229878 8725385 10739795 10030047 2357774
6668 2357774 -5797183 -9269972 -13786624 -24290203 -31907920 -24252222 -4107359 13796431
6660 13796431 22321988 26864793 31518721 32465864 28107067 25260730 29244326 34618611
6652 34618611 32282875 22009323 12339753 9930400 13581567 18179662 20634521 20821325
6644 20821325 18890390 13983829 6229659 -1345184 -4999794 -4478908 -2867784 -1870130
6636a870130J809867L280933K602825Q18454J033072J646779j643652o948442
6628G29706p216236j700506K037186N81086K57499N296177R060106M547148l328447
6619A0263719m889448l46095K042413m38370k605099j689604j095732k790808
6611a549024l446871n56570L171203M182597K957244K177539K621086K760084
6603A2317288J196126j320998k058753N36491L546770K131970l378665o701005
6595F269224m422819j202559j991776l587100j91222N952300P216790K532931
6587A0575769j261898k87691J862896K050145K557108M896317N106468j11577
6579B5387537p092369r764474p374222l405600M54223M474359O592113L269428
$$ plain form
6636 -1870130 -60263 3220670 5823495 6641949 7675021 9321800 7678148 729706
6628 729706 -6486530 -8187036 -6149850 -5568764 -5311265 -15088 9045018 13592166 10263719
6619 10263719 5374271 5028176 7070589 6632219 4027120 2337516 1241784 -1549024
6611 -1549024 -4995895 -5552465 -2381262 1801335 4758579 6936118 9557204 12317288
6603 12317288 13513414 12192416 10133663 10670154 14216924 16348894 12970229 6269224
6595 6269224 1846405 643846 -1347930 -4935030 -5126252 826048 8042838 10575769
6587 10575769 9313871 9026180 10889076 12939221 15496329 20392646 25499114 25387537
6579 25387537 18295168 8530694 1156472 -2249128 -1794905 2679454 9271567 12540995
6571A2540995m466753r649105o470356K485165Q163436M627323m443717j0227730
6563g440742r185525o194689o151902o294465j208755O870015R325350L512491
6555a6768222k577798j294613M273165N846777K187958n18842J049559L453704
6547d348312L644634L657023N202538M775212j023085q375782r975979m793099
6539a1236850J057172L174946L283869L611583K488437j271844m322998l579539
6531f795224j489136j561477j850853R53087L475366l86739q000219r357449j957786
6522b6970430M347713J856046l437272j560022O096198R591502N375766k79267
6514d979766k013465j426009j117174L25559M321907Q137569Q235416M947038
$$ plain form
6571 12540995 8074242 -1574863 -8045219 -5560054 2603382 7230705 2786988 -7440742
6563 -7440742 -16626267 -22820956 -28972858 -35267323 -36476078 -29606063 -20280713 -16768222
6555 -16768222 -19346020 -20640633 -16367468 -10520691 -8332733 -8851575 -7802016 -4348312
6547 -4348312 -703678 2953345 8155883 12931095 11908010 3532228 -6443751 -11236850
6539 -11236850 -10179678 -7004732 -3720863 -109280 2379157 1107313 -3215685 -6795224
6531 -6795224 -8284360 -9845837 -11696690 -10743603 -7268237 -7654976 -15655195 -25012644 -26970430
6522 -26970430 -22622717 -20766671 -24203943 -25763965 -19667767 -10076265 -4700499 -4979766
6514 -4979766 -6993231 -8419240 -9536414 -9210855 -4888948 3248621 11484037 16431075
6506A6431075J060143k130077m846014o354170n034740q19388M066928P249160
6498I622917Q218686P459290M193623k899732j1628081j5470832j0293935p48308
6490a1546372M372674L028976J234282K924231M716606L198108J075327J726262
6482A0730094L020617J686121q37329k171739l848616o584428n946871J19401
6474c832750M687797J536832l458709j318604L814299P96880q029128q188197
6466a3991580K886529R382379J432890q757345n685615O203965J1080841N553704
6458H105768j47742n41366m47030k851290l779189j389151q5881k319799m292101
6449g747781l227035k061752l210391l679871o19934L272185M475444M615093
$$ plain form
6506 16431075 17491218 15361141 10515127 4160957 -873783 -1693171 2373757 9622917
6498 9622917 17841603 25300893 29494516 26594784 14966703 -504129 -10798064 -11546372
6490 -11546372 -7173698 -4144722 -2910440 13791 4730397 7928505 9003832 10730094
6482 10730094 13750711 15436832 14599503 12427764 8579148 1994720 -3952151 -3832750
6474 -3832750 855047 2391879 -1066830 -2385434 1428865 2225745 -5803383 -13991580
6466 -13991580 -11105051 -1722672 -289782 -9047127 -14732742 -8528777 2552064 8105768
6458 8105768 7958026 7416660 6969630 4118340 339151 -1050000 -1135881 -3455680 -7747781
6449 -7747781 -10974816 -13036568 -16246959 -19926830 -20546764 -17274579 -12799135 -8184042
6441h184042O599518Q011692M409838k128650m083682R77844O419083N602482
6433A7624083N13430k484132k068663j777391k158259J83193M773551N357664
6425A9963476n64291o088453m396110N76801J95107m926581n763874M18981N259470
6416D674526K090152m189161m978509j06365L637254K605487n56671k062583p57421
6407C56709K342917M843037L927895r15093o612780r325991p546995k099198M358598
6398a0670901P325224L874217k305673l545383J671862N718674K425243l875557
6390F17706m807432J46801M024039K596788j485060l885389k907169J022120N795132
6381A117536P618230M329134j298832m624013m854321m554419m510820k992072
$$ plain form
6441 -8184042 -1584524 6427168 10837006 8708356 4624674 5602518 12021601 17624083
6433 17624083 18137513 15653381 13584718 11807327 9649068 9832261 14605812 19963476
6425 19963476 19399185 13310732 8914622 9491423 9686530 4759949 -1003925 -584944 4674526
6416 4674526 6764678 2575517 -2402992 -2509357 1127897 3733384 3176713 1114130 356709
6407 356709 2699626 7542663 11470558 10555465 3942685 -5383306 -12930301 -15029499 -10670901
6398 -10670901 -3345677 528540 -1777133 -5322516 -3650654 2068020 4493263 617706
6390 617706 -4189726 -4042925 -18886 2577902 1092842 -2792547 -5699716 -4677596 1117536
6381 1117536 8735766 13064900 11766068 7142055 2287734 -2266685 -6777505 -9769577
6373i769577J81540K579731K576787J077059k86326n39725N43861J790823J120565
6364g25262j449670l108408k576266k280439l311649j931610M135968R303645
6356a943691O560843j457259n022312p68937M510726M655106J797595N78909P57668
6347I668648k61286j728626j046209J011238N38575m060169q982470q271437n86275
6338a3718011P370570O552431l397568j1564074p999033L570541J0263560O086452
6330b835132k337799o063924l609955J100237M773549N793728L649852M88480
6322I59036K3318K310631K589625k181495q354921r800482n139990J472850N449076
6313a2672352N944895N650140P029124Q554884O145351k95690m712701k772997
$$ plain form
6373 -9769577 -9588037 -7008306 -4431519 -3354460 -3640786 -4180511 -3636650 -1845827 -725262
6364 -725262 -2174932 -5283340 -7859606 -10140045 -13451694 -15383304 -11247336 -1943691
6356 -1943691 4617152 3159893 -1862419 -2631356 1879370 6534476 8332071 8910980 9668648
6347 9668648 9407362 7678736 6632527 7643765 8182340 4122171 -4860299 -13131736 -13718011
6338 -13718011 -6347441 204990 -3192578 -14756652 -22755685 -19185144 -8921584 -2835132
6330 -2835132 -5172931 -11236855 -14846810 -13746573 -8973024 -3179296 470556 959036
6322 959036 982354 3292985 5882610 3701115 -4653806 -14454288 -19594278 -18121428 -12672352
6313 -12672352 -6727457 -1077317 5951807 14506691 20652042 20356352 15643651 12870654
6305A2870654J176478M68885l222099k994447R15140R52987m754522q736450o335536
6296i658910k271181p48842J769919P660252J0518095M755937l805802o028418
6288B191050l071193k450991m485331l137289J540430K536046k010326n463404
6280a4351008l569796k98715L46556R82938M707208P780865M166204m914522j0734309
6271a5884579o722803L876091J1105963Q958833J707561k294194j825544k846174
6263c924846o795776o537401J292721P592132L214853n462840m765471N124162
6255a0262466J0015175L405426m622327m121965J072249K970816K307996L109348
6247C874252K590796l341571r932635r262525k961882N09533m88532M81416N676398
$$ plain form
6305 12870654 14047132 14516017 11293918 8299471 9214611 10167598 5413076 -3323374 -9658910
6296 -9658910 -11930091 -12678933 -10909014 -3248762 7269333 12025270 8219468 2191050
6288 2191050 -880143 -3331134 -7816465 -10953754 -9413324 -6877278 -8887604 -14351008
6280 -14351008 -17920804 -18219519 -17872963 -16890025 -12182817 -4401952 -235748 -5150270 -15884579
6271 -15884579 -22607382 -18731291 -7625328 1333505 3041066 746872 -1078672 -3924846
6263 -3924846 -10720622 -17258023 -15965302 -8373170 -5158317 -10621157 -15386628 -10262466
6255 -10262466 -247291 3158135 -1464192 -5586157 -4513908 -1543092 764904 3874252
6247 3874252 6465048 3123477 -6809158 -16071683 -19033565 -18524032 -19012564 -18531148 -12854750
6238a2854750R036491O306619J431848l69308J81825l09609k090087l270298l379852
6229e317121k878593j483862P15941K334469K352228J050841j079636l008534
6221g314267k053822L084217P953864N958732k058526o975352l041056M485898
6213C9688P326905N229829L593279L660569J983657j840980m022455l587649m055458
6204H327385o441515o545442k097762K627456L389967K881829N788156R797731
6196A7727805Q010374N5897n579826k826838L216795L185382l545070q232835
6188A2011684n245611L92315J040952k144296j560460M351882P717635K529080
6180A9093181o355767j0013599p319371m362728m367901m690097l374113k064764
$$ plain form
6238 -12854750 -3818259 2488360 3920208 3550900 3732725 3423116 1333029 -1937269 -5317121
6229 -5317121 -8195714 -9679576 -8963635 -6629166 -4276938 -3226097 -4305733 -7314267
6221 -7314267 -9368089 -6283872 1669992 7628724 5570198 -1405154 -4446210 39688
6213 39688 7366593 12596422 16189701 19850270 21833927 19992947 15970492 12382843 8327385
6204 8327385 1885870 -4659572 -6757334 -4129878 -739911 2141918 7930074 17727805
6196 17727805 25738179 25794076 20214250 17387412 20604207 23789589 20244519 12011684
6188 12011684 6766073 7158388 8199340 6055044 4494584 8846466 16564101 19093181
6180 19093181 12737414 2723815 -4595556 -8958284 -13326185 -18016282 -21390395 -23455159
6172b3455159j112924K056009P144985R112815N698766K001033K997966N433348
6164I876839K695900m618822q939562o008928J72497L427006K522532Q39329J382013
6155A348804L557810M214286J657395j618883j856493L45626P01091j407110r92844
6146E949682L965044P093914K404479n354093o411038j04833M598451K541584
6138A4683190j752285l336400m144035p078359r062924n643365R37742L810781
6130a1585655O76608l171654j621297M634226Q598907N300910j453274l275888
6122a897117J432342M875130J590080k786575q92333L141876k59466r150058j1192059
6113a5138180l034643L863214J390942l000867J32128O649725P062764K812668
$$ plain form
6172 -23455159 -24568083 -22512074 -15367089 -6254274 -555508 1445525 4443491 9876839
6164 9876839 12572739 7953917 -985645 -6994573 -6822076 -3395070 -872538 -33209 1348804
6155 1348804 4906614 9120900 10778295 9159412 7302919 7648545 8349636 6942526 5949682
6146 5949682 9914726 17008640 19413119 14059026 7647988 7543155 12141606 14683190
6138 14683190 12930905 9594505 5450470 -1627889 -10690813 -16334178 -15396436 -11585655
6130 -11585655 -10909047 -14080701 -15701998 -11067772 -2468865 2832045 1378771 -1897117
6122 -1897117 -464775 4410355 6000435 3213860 2321527 5463403 5203937 -3946121 -15138180
6113 -15138180 -18172823 -14309609 -12918667 -15919534 -15787406 -9137681 -2074917 737751
6105G37751K574757O635946O781941L78803n998332p331606n531440l159704n283
6096d917167K604410J635448j470460j266965K779644M381875K55707m390970
6088c88478l911353k62497J468296R78902R76909Q68511j854978n383785m530666
6079a2039139J597742P565667Q811757P056053N987006M787451K89723n701792
6071A8354468o734958j050614M216817K052523m712350p835171n416440k757806
6063c883531k440958j229647J872513K386531j352245l832911j216804J812715
6055g884337J08505k658449j74179N334003O402874K335098n22621L95351Q74855
6046D211100j628870l737906k188881J369342L488412K849916K00041k189196
$$ plain form
6105 737751 3312508 9948454 16730395 17109198 11110866 3779260 -1752180 -4911884 -4917167
6096 -4917167 -2312757 -677309 -2147769 -3414734 -635090 3746785 4002492 -388478
6088 -388478 -4299831 -4562328 -3094032 -2115130 -1138221 -269710 -2124688 -7508473 -12039139
6079 -12039139 -10441397 -2875730 5936027 12992080 18979086 23766537 24056260 18354468
6071 18354468 11619510 10568896 14785713 16838236 12125886 4290715 -1125725 -3883531
6063 -3883531 -6324489 -7554136 -5681623 -3295092 -4647337 -8480248 -9697052 -7884337
6055 -7884337 -7775832 -10434281 -10608460 -5274457 1128417 3463515 2940894 3336245 4211100
6046 4211100 2582230 -1155676 -3344557 -1975215 1513197 4363113 4563154 2373958
6038B373958j235226K989587M997712K60409p179723q988963l953256Q40762M06239
6029i488501k677302m083211l029714j99350M061939P476813O732614K669563
6021A462851J09879Q50137J429316m47233k195568j341783N07167J523307L209694
6012E107767O615880Q328231M215899m236542j0361805r129672k575762J757608
6004b78396j289122p800844q649424j615044M646585K660243k637013j430042
5996a6393057N830589R475960N262088j173767m581371n745446n533050k090627
5988a4948681L432033N987672M066587J303975p44227l782221n632284j215905
5980a1533051O934396R059771K847998k171788L25600M074269K017485k268728
$$ plain form
6038 2373958 1138732 4128319 9126031 9386440 2206717 -6782246 -10735502 -9894740 -9488501
6029 -9488501 -12165803 -16249014 -19278728 -19478078 -15416139 -7939326 -1206712 1462851
6021 1462851 1572730 2422867 3852183 3404950 1209382 -132401 374766 1898073 5107767
6012 5107767 11723647 20051878 24267777 20031235 9669430 539758 -2036004 -278396
6004 -278396 -1567518 -9368362 -18017786 -19632830 -14986245 -12326002 -14963015 -16393057
5996 -16393057 -10562468 -1086508 4175580 3001813 -1579558 -7325004 -12858054 -14948681
5988 -14948681 -11516648 -5528976 -1462389 -158414 -902641 -4684862 -10317146 -11533051
5980 -11533051 -4598655 4461116 7309114 5137326 5462926 9537195 11554680 9285952
5972I285952k579624q30688j455293k665576j729817j762788m566423l915873
5964a0220130M322372J1987837R170829n15674o056110n493964m774556m438883
5956f018279l27625M745349L258198l116637m320611J865913N966712K034775
5948D087795l784746m095309o44089J321494K034244M731146Q552948Q981864
5940B1185347L618932n006869j1284249j0943297n387880o75269j20828l07806
5932h921919K523742N749753M924031J559934P9548j63695k754022o293990o232462
5923i529080l253764k109898k774008m24169N839189J1408414J3161079J1340727
5915B3658490N491198l881589j0616424q461190j114354J937081o40039j746655
$$ plain form
5972 9285952 6706328 5875640 4420347 1754771 24954 -1737834 -6304257 -10220130
5964 -10220130 -5897758 6090079 15260908 14745234 8689124 3195160 -1579396 -6018279
5956 -6018279 -6345904 -1600555 1657643 -1458994 -5779605 -3913692 2053020 4087795
5948 4087795 303049 -3792260 -4436349 -3114855 -1080611 3650535 12203483 21185347
5940 21185347 24804279 19797410 8513161 -2430136 -7818016 -8493285 -8614113 -8921919
5932 -8921919 -6398177 -648424 4275607 5835541 5915089 5751394 2997372 -3296618 -9529080
5923 -9529080 -12782844 -14892742 -17666750 -18090919 -12251730 -843316 12317763 23658490
5915 23658490 29149688 25268099 14651675 6190485 5076131 7013212 6373173 4626518
5907D626518L99274o32118o318509q312041j519667P261688R332550N238924R01609
5898A0978228p79689N5116K492255L280938j046622p525564q772576m062584o30808
5889f011306j312861k23379N149683P702368K834257k781100k359483k05579k671524
5880A21076n695037j951413N367258P066913K483391j279711k200733m659018
5872g47274q583646p642376N7998P748218R118642N665403K565920J831610J816888
5863A1831383N57340k017287l902857l183634j057020o66259j863235p02526L709061
5854B704966O263243L274536j435126k295884P8667J574996J452142J160683k91781
5845A2486442l957907o712333n167952j460554J70445k04907n20216j823990m706843
$$ plain form
5907 4626518 5025792 4393674 -1924835 -10236876 -11756543 -4494855 4837695 10076619 10978228
5898 10978228 10198539 10253655 12745910 16026848 14980226 7454662 -1317914 -5380498 -6011306
5889 -6011306 -7324167 -7547546 -2397863 5304505 8138762 5357662 2998179 2792600 121076
5880 121076 -5573961 -7525374 -2158116 4908797 7392188 6112477 3911744 -747274
5872 -747274 -9330920 -16973296 -16915298 -9167080 -48438 5616965 8182885 10014495 11831383
5863 11831383 12388723 10371436 6468579 3284945 2227925 1561666 -301569 -1004095 2704966
5854 2704966 8968209 12242745 10807619 8511735 8590402 10165398 11617540 12778223 12486442
5845 12486442 8528535 1816202 -3351750 -4812304 -4641859 -4846766 -5366982 -7190972 -11897815
5836a1897815m395324K692486J0310364R098531M70659n101428l143005N25442
5828a440090R66954L56084J090248J266477J19521N70448L048223L466142O14451
5819A0058458j042812M77024N37202l464573n883283j567861M391796L296028
5811F801979l626823o240433N6345P827224P755383M47866n495936m856869j206308
5802A462428n71833l059535l785468q75142J847813J404590M03832J792657K802841
5793A422183l23295m120717j644389N815925Q580761K512194m116568k344224
5785E781870M638128O826153K035694k315923j303462J133104J36147j954396
5777A4977315k67672L448215K608816l715757q250472n797857r62521j076333
$$ plain form
5836 -11897815 -16293139 -13600653 -3290289 5808242 6278901 1177473 -1965532 -1440090
5828 -1440090 -473136 -117052 973196 2239673 2359194 2929642 5977865 9444007 10058458
5819 10058458 9015646 9492670 10029872 6565299 682016 -885845 3505951 6801979
5811 6801979 3175156 -3065277 -3008932 4818292 12573675 13021541 7525605 2668736 1462428
5802 1462428 890595 -2168940 -5954408 -6829550 -4981737 -3577147 -3173315 -1380658 1422183
5793 1422183 1098888 -3021829 -4666218 1149707 9730468 12242662 8126094 5781870
5785 5781870 10419998 17246151 19281845 16965922 15662460 16795564 16931711 14977315
5777 14977315 14709643 18157858 20766674 17050917 8800445 3002588 2040067 963734
5769I63734m923503m782491J408274O706298N255825k55715l809105l644312j453373
5760d534368J564712M206107M501407K816524K190603K843867J011928l510758
5752A1090022m642502J80064L792929j0829n355153k975856M273488N365654j418945
5743A0298872o162355k951180K518005L087025j011173n910554q854101p136678
5735a6122139j45140N736977K689946n995854q198166p21125N400154K009913
5727a5345434m225349l878643R56344L302200L879422O629199Q128741K989492
5719B435972m290311m463338J616219M464801J551646K77820M260764P251685
5711A3105258M034101j445032l173744j383722N32345J619589J707491p20416
$$ plain form
5769 963734 -3959769 -8742260 -7333986 -627688 4628137 4372422 563317 -3080995 -4534368
5760 -4534368 -2969656 1236451 5737858 8554382 10744985 13588852 14600780 11090022
5752 11090022 6447520 6627584 10420513 10409684 5054531 2078675 6352163 11717817 10298872
5743 10298872 4136517 1185337 3703342 6790367 5779194 -131360 -8985461 -16122139
5735 -16122139 -16267279 -10530302 -7840356 -13836210 -22034376 -22755501 -17355347 -15345434
5727 -15345434 -19570783 -23449426 -22493082 -19190882 -15311460 -8682261 -553520 2435972
5719 2435972 -1854339 -6317677 -4701458 -236657 1314989 1592809 5853573 13105258
5711 13105258 17139359 15694327 12520583 11136861 11669206 13288795 14996286 14275870
5703A4275870m768309n778020k043449J282745m50551m057021l800539o34029
5695e973303R9996j958816k055443R45133K672688J114554l60895m2561j114447
5686f673094l990946k341589O571237J3182274O710256p557488j2788974l336601
5678a0224925P687599P496941L17433k031668J949634M580839K899651Q18059
5670A3493563m35604l711614p721551o921876j243134K448082R68402q17010Q67917
5661c072825K720078J431900j30722J195937K531593K0376m059417m627064j138424
5652e128568K901665M955784M268191R47270k093076j04418O243983Q515486Q59013
5643B1365330j0371373j3458990o059680K846299N086381J763046j093798p98421
$$ plain form
5703 14275870 9507561 3729541 1686092 2968837 2518286 -1538735 -5339274 -5973303
5695 -5973303 -5873307 -7832123 -9887566 -8942433 -6269745 -5155191 -5516086 -5558647 -6673094
5686 -6673094 -10664040 -13005629 -6434392 6747882 13458138 5900650 -6888324 -10224925
5678 -10224925 -2537326 4959615 5277048 3245380 5195014 9775853 12675504 13493563
5670 13493563 13057959 9346345 1624794 -5297082 -6540216 -4092134 -3123732 -3940742 -3072825
5661 -3072825 -352747 1079153 948431 2144368 4675961 4696337 636920 -3990144 -5128568
5652 -5128568 -2226903 2728881 6997072 7944342 5851266 5746848 11990831 20506317 21365330
5643 21365330 10993957 -2465033 -8524713 -5678414 -592033 1171013 77215 -721206
5635g21206L3932k166280o925117r388818o140434o75001M93161k499398k347048
5626c0336209M182400J0456554R534759L906923J35766j209654l405594n375053
5618a2110108l553742L86116J492441o7322K8081J830263J241217j733247k487322
5609a4973623n4851J508928Q29582R32144K027929L29562l669257l504724K957946
5600a3616364Q419662O089347o63102l472166K51348O013947Q427662N210185
5592A6660519j930742p648724p379154l294307j752675l477721k455862K741392
5584h537274M346992k200223q440473l944662P619427J3033189P815008M09579
5576A0101563j590524j94567k40930j921259l405240m880565o417587o253685
$$ plain form
5635 -721206 -687274 -2853554 -9778671 -19167489 -25307923 -25982924 -25489763 -27989161 -30336209
5626 -30336209 -26153809 -15697255 -6162496 -2255573 -2119807 -3329461 -6735055 -12110108
5618 -12110108 -15663850 -15277734 -13785293 -13852615 -13824534 -11994271 -10753054 -12486301 -14973623
5609 -14973623 -15028474 -13519546 -12689964 -11757820 -9729891 -9400329 -13069586 -16574310 -13616364
5600 -13616364 -5196702 892645 229543 -3242623 -2991275 3022672 11450334 16660519
5592 16660519 14729777 7081053 -298101 -3592408 -5345083 -8822804 -11278666 -8537274
5584 -8537274 -4190282 -6390505 -14830978 -18775640 -11156213 1876976 9691984 10101563
5576 10101563 8511039 8316472 8075542 6154283 2749043 -2131522 -8549109 -14802794
5568a4802794m046174j899269m5017L964116R285778J0080738L609240m352697
5560A793921o850499m926692m172649m924640k312485M623367J0011393Q664216
5552A905932K253641l430595m300651l28922M810667N845845P85563n704347o953206
5543e116073k605575J488408J975278J538987K379683K162067j11609L147N148089
5534F862402R359304N366494m044770r191170o685011k167217j26581J226604
5526F00055L346756L120014j019279m397524k123930L626075O225807K403810
5518A1781784m979197r903473p695420N74719P341422N894139p65863l203894
5510i55783J224147M662200R56865n183061n980067j667845K098671L100203K515727
$$ plain form
5568 -14802794 -18848968 -20748237 -20793254 -16829138 -7543360 2537378 6146618 1793921
5560 1793921 -5056578 -9983270 -14155919 -19080559 -21393044 -16769677 -6758284 1905932
5552 1905932 4159573 728978 -3571673 -3900595 910072 6755917 7541480 1837133 -5116073
5543 -5116073 -7721648 -6233240 -4257962 -2718975 -339292 1822775 1711166 1714313 6862402
5534 6862402 16221706 21588200 17543430 8352260 1667249 -499968 -626549 600055
5526 600055 3946811 7066825 6047546 1650022 -473908 3152167 9377974 11781784
5518 11781784 6802587 -3100886 -10796306 -10221587 -2880165 3013974 2248111 -955783
5510 -955783 268364 4930564 5887429 704368 -5275699 -6943544 -4844873 -1744670 771057
5501G71057J82736l372615l717605J567823O777615N334556L72038l15693K236600
5492I836512m36661r384771j4996878j1141216l529429K16706J305457N122661
5484b3007619J1220886J3798589R555190J018646o195535p175784j199610O537452
5476D552215Q964439M388113k454720o931260q751576r119177p711842m130818
5468b1194626O50144N222535P571826M874978k255351o635199j990522O767518
5460f988697Q511121K065322j654185L341900Q752183N572596j848531l811536
5452A3940173n54378K48543l104580n477083n101803m968906m795074p81783O042778
5443d552113R572307Q015401N823337M578233O2165q257145j2530670o960219
$$ plain form
5501 771057 953793 -2418822 -6136427 -4568604 2209011 7543567 7915605 7599912 9836512
5492 9836512 9399851 15080 -14981798 -26123014 -29652443 -29435737 -28130280 -23007619
5484 -23007619 -11786733 2011856 11567046 12585692 6390157 -785627 -1985237 4552215
5476 4552215 13516654 17904767 15450047 8518787 -232789 -9351966 -17063808 -21194626
5468 -21194626 -20544482 -15321947 -7750121 -2875143 -5130494 -11765693 -13756215 -6988697
5460 -6988697 1522424 3587746 1933561 5275461 14027644 19600240 17751709 13940173
5452 13940173 13385795 13634338 10529758 5052675 -49128 -5018034 -9813108 -10594891 -4552113
5443 -4552113 5020194 13035595 18858932 23437165 23499330 15242185 2711515 -4248704
5435d248704K537194N634910J491562j181586K928504Q730221Q231796R20791
5427B5044688o350283q209207o351549n591910o627903n474204n3057N676674
5419g936751O198580J302330m003426n569106l681502j013533N36549P36102O29833
5410a2800924J581257L526513M560105L498012J852466J438928J296445k98220
5402D654582j744117L05788N132834P431375L918140k406987o177817n590961
5394E522837k990528j575255k915174n843572o591242k213774M685716P282471
5386d638521K834530k944078l124794R50074K006479k077631m954184j129083
5378a3077208O193808R949222Q489367N721968M024328K069858n59667j673127
$$ plain form
5435 -4248704 -1711510 3923400 5414962 4233376 7161880 15892101 24123897 25044688
5427 25044688 18694405 10485198 4133649 -1458261 -8086164 -13560368 -13613425 -7936751
5419 -7936751 -1738171 -435841 -4439267 -10008373 -13689875 -14703408 -14166859 -13430757 -12800924
5410 -12800924 -11219667 -7693154 -3133049 364963 2217429 3656357 4952802 4654582
5402 4654582 2910465 3216253 8349087 15780462 19698602 17291615 11113798 5522837
5394 5522837 2532309 957054 -1958120 -7801692 -14392934 -16606708 -11920992 -4638521
5386 -4638521 -1803991 -4748069 -7872863 -6922789 -4916310 -6993941 -11948125 -13077208
5378 -13077208 -6883400 3065822 11555189 17277157 21301485 23371343 22811676 21138549
5370B1138549q08156r31841l345076m547434j573764K347005J644921l600486
5362A0323718p751081p134580l488550N1376K321891K806990R25790j782690k107670
5353e834806K73547J521819r80350m490600m578660j035386K298448K294450q60282
5344a1391820m609702n892784l400212M72340J528878p36566j631841K384269
5336b3277438P904598Q534038L524663j377248j739365O37453J771515J235207
5328b786577J441741L024997L731018J779369j690423m114446m201583k480068
5320e295972k60993R15047j45729k530578k780394J214927N975606N547169p9449
5311B559634l741530r54827L197345J550059m287797o765197l872339m85646R83674
$$ plain form
5370 21138549 20330393 19398552 16053476 11506042 9932278 12279283 13924204 10323718
5362 10323718 2572637 -4561943 -8050493 -7999117 -5677226 -2870236 -1944446 -3727136 -5834806
5353 -5834806 -5561259 -4039440 -5019790 -9510390 -14089050 -15124436 -12825988 -10531538 -11391820
5344 -11391820 -16001522 -21894306 -25294518 -24822178 -23293300 -24029866 -25661707 -23277438
5336 -23277438 -15372840 -6838802 -3314139 -4691387 -6430752 -5793299 -4021784 -2786577
5328 -2786577 -1344836 1680161 5411179 7190548 5500125 1385679 -2815904 -5295972
5320 -5295972 -5556965 -4641918 -4787647 -7318225 -10098619 -8883692 -2908086 2639083 2559634
5311 2559634 -1181896 -2136723 1060622 2610681 -1677116 -8442313 -12314652 -12800298 -11816624
5302a1816624L062168N402550L398104k188641k974811M127233R530610M044502
5294A2585091o861877j0824088o266190k271955k913880k516061K478389O919870
5286i670701N853939K134302M31999k11345k510500m385194k431590Q61898k45310
5277a0172502n480033p673641k495638N337841Q247437N349980K341234K941888
5269a603434M494868L226447L65871j77432J690442K219860J9031j963707j613973
5260F657973o90111q14334m66825J138957R91534k842011o295381m234974J487918
5251e067254M191069J896543n66138N79730L087254L096779L24350l270290o574914
5242b302871q571984p172906j759949M500378P369393N862621K137909j834677
$$ plain form
5302 -11816624 -8754456 -3351906 46198 -2142443 -5117254 -990021 8540589 12585091
5294 12585091 5723214 -5100874 -11367064 -13639019 -16552899 -19068960 -16590571 -9670701
5286 -9670701 -3816762 -1682460 -1250461 -1461806 -3972306 -8357500 -10789090 -9927192 -10172502
5277 -10172502 -15652535 -23326176 -25821814 -20483973 -12236536 -6886556 -4545322 -1603434
5269 -1603434 2891434 6117881 6483752 6306320 7996762 10216622 10235653 8271946 6657973
5260 6657973 5967862 5153528 4686703 5825660 6817194 3975183 -2320198 -6555172 -5067254
5251 -5067254 -876185 1020358 454220 1033950 4121204 7217983 7542333 4272043 -2302871
5242 -2302871 -10874855 -18047761 -19807710 -15307332 -7937939 -2075318 62591 -1772086
5234a772086n111583n851931j861884N397756R822544O786605n16003m379063
5226B514355k621545j022074l550301n115280N38583R076404R565484N9212q827326
5217F17512q317769k230722Q18210k79807m96462J934428M012781L984794L349146
5208C392111L368600L415009K445573j09621l718241n756271l839133k79022n3092
5199a134087k723279k006860L867024Q181535O519134M033674N457411N481830
5191B7676382j807423j0423217j0533715m346047j768190l428854j449650M146235
5183a934479M394309j700232l738035K320733O598703K029750l658546j234248
5175C077955N142659O170725K247628n22352k714376q596043j4686886j2681904
$$ plain form
5234 -1772086 -6883669 -12735600 -14597484 -9199728 622816 7409421 6893418 2514355
5226 2514355 -107190 -1129264 -4679565 -9794845 -9256262 -179858 9385626 9444838 617512
5217 617512 -7700257 -9930979 -9112769 -9392576 -9889038 -7954610 -3941829 42965 3392111
5208 3392111 6760711 10175720 12621293 12511672 8793431 3037160 -801973 -1080995 -1134087
5199 -1134087 -3857366 -5864226 -1997202 6184333 12703467 16737141 22194552 27676382
5191 27676382 25868959 15445742 4912027 565980 -1202210 -4631064 -6080714 -1934479
5183 -1934479 2459830 759598 -2978437 -657704 5940999 7970749 4312203 3077955
5175 3077955 8220614 14391339 16638967 16116615 13402239 4806196 -9880690 -22562594
5167b2562594k737982N873457P606294N842218M608190L031209J48083j471856
5159C37019j62241J547118J235048O07998K156609M557322M713781K745621J565713
5150A9303988J884812R19456k840062o256516n427048j429274J160144J102266
5142H417766J658002L833177L338130k329052p975805p098680j559011R79828
5134g35645j926709n011015l827418j64394K045718J456079j287711m819749o577046
5125b0847890m443204L83751M858896P818919R097719O785887K72057n519487
5117a593352m999882m12260Q55320k727951n196603k823337J349393L604213L451679
5108h492780N16261n398149r905604p189556N85747M456021J310184k373857j818440
$$ plain form
5167 -22562594 -25300576 -19427119 -11820825 -5978607 -1370417 1660792 1808875 337019
5159 337019 174778 1721896 2956944 3564942 5721551 10278873 14992654 17738275 19303988
5150 19303988 21188800 22108256 19268194 13011678 7584630 6155356 7315500 8417766
5142 8417766 10075768 13908945 17247075 14918023 6942218 -156462 -1715473 -735645
5134 -735645 -2662354 -7673369 -11500787 -11665181 -9619463 -8163384 -9451095 -14270844 -20847890
5125 -20847890 -25291094 -24907343 -20048447 -12229528 -3131809 3654078 3926135 -1593352
5117 -1593352 -6593234 -7005494 -6150174 -8878125 -14074728 -16898065 -15548672 -11944459 -8492780
5108 -8492780 -7976519 -13374668 -23280272 -30469828 -29884081 -25428060 -24117876 -26491733 -28310173
5099b8310173n31354j978775k936044m4145M032536N915518O779945Q022936P866189
5090a183367O181786O147867P357511M552533k636516o553917l090034J492652
5082A2268515Q43101k312608l417065m351466p221667p539281j791217M711444
5074h810244N670047L535017L594489M367555K043037j233673j816433j900359
5066E449436m274760n256451j184404L560203L512575J461101K160113K773447
5058H201260r48491m973009l652179l07679n58965j141080K866548N682037p04157
5049D464285j0385953j0571716j811474L723085K429721K313278N974514O306537
5041B442277J348262j356862J006338J412698l279078n988059k381198J083113
$$ plain form
5099 -28310173 -28841527 -30820302 -33756346 -33800491 -29767955 -23852437 -17072492 -9049556 -1183367
5090 -1183367 4998419 11146286 18503797 23056330 20419814 13865897 10775863 12268515
5082 12268515 13111616 10799008 7381943 3030477 -4191190 -11730471 -13521688 -8810244
5074 -8810244 -3140197 394820 3989309 8356864 10399901 9166228 7349795 5449436
5066 5449436 1174676 -4081775 -5266179 -1705976 1806599 3267700 5427813 8201260
5058 8201260 7252769 2279760 -1372419 -1680098 -2239063 -3380143 -513595 5168442 4464285
5049 4464285 -5921668 -16493384 -18304858 -14581773 -12152052 -9838774 -3864260 2442277
5041 2442277 3790539 2433677 3440015 4852713 1573635 -4414424 -6795622 -5712509
5033e712509j419689n162842l323767K125711M557386K201842j792803m523910
5025a3050581m660995k141841J060748K805731L664648M489727K851720k897029
5017g877872q299778q031499m060611j461511O45973N294959Q558941N230636
5009a0000762O90163M155195J1376475Q516008n420452j4603983q726945L733589
5001a0280712R603731O723158K40717o083065r094779n982800P0569K068843K66202
4992a2468136J914125P479120Q236180J433693l878719j575870K208235P48251
4984D096879k832719l571970l134967l150898L73686Q270160J2471450P043230
4976A9564851k283986o687066n599819l449743k173282k672355o363219r908804
$$ plain form
5033 -5712509 -7132198 -12295040 -15618807 -13493096 -8935710 -6733868 -8526671 -13050581
5025 -13050581 -17711576 -19853417 -18792669 -15986938 -12322290 -7832563 -4980843 -7877872
5017 -7877872 -16177650 -24209149 -28269760 -29731271 -29085298 -23790339 -15231398 -10000762
5009 -10000762 -9310599 -5155404 6221071 14737079 9316627 -5287356 -14014301 -10280712
5001 -10280712 -676981 6046177 6286894 203829 -8890950 -14873750 -14803181 -12734338 -12468136
4992 -12468136 -10554011 -3074891 5161289 6594982 2716263 1140393 3348628 4096879
4984 4096879 1264160 -2307810 -5442777 -8593675 -8219989 50171 12521621 19564851
4976 19564851 17280865 10593799 4993980 1544237 -629045 -3301400 -9664619 -19573423
4968a9573423o233909L973758J0206266O962263J619211J706730M003542L159087
4960E823525J405452J630696p9366o128794r785096m952494L447700P416575P535680
4951F313878Q426007R030036N870563N66155l472128o841595j0354429j0958617
4943a420130p149539k745959n96590R77322J910859r24433m965142k151115P022986
4934a0041741J0625105K799728o809002q192039m536181k974465k591026R8822
4926b1620799L533721O230853R704333J0909568L785655o787869p375060J912619
4918B93021M904715l836302r487592l958535l60255o819531q799313M013213J4911054
4909i139525O627986q375981q555857K078311N357040P45051k40554R77608l427957
$$ plain form
4968 -19573423 -25807332 -21833574 -11627308 -4665045 -3045834 -1339104 2664438 5823525
4960 5823525 7228977 8859673 8780307 2651513 -7133583 -12086077 -8638377 -1221802 6313878
4951 6313878 14739885 23769921 29640484 30206639 26734511 19892916 9538487 -1420130
4943 -1420130 -8569669 -11315628 -11912218 -10934896 -9024037 -9948470 -14913612 -17064727 -10041741
4934 -10041741 583364 3383092 -3425910 -11617949 -16154130 -19128595 -21719621 -21620799
4926 -21620799 -18087078 -11856225 -2151892 8757676 12543331 5755462 -1619598 293021
4918 293021 5197736 1361434 -8126158 -12084693 -12444948 -19264479 -28063792 -24050579 -9139525
4909 -9139525 -2511539 -10887520 -19443377 -17365066 -12008026 -11262975 -11503529 -10525921 -13953878
4900a3953878p227393j531688M370491j239348p887629n12171J0784042P151767
4892a0045807m781295n386401K433358J740022m993054l469443J884607j803925
4884b4421938o770796m33010M324761p095404j5330286l22570J1406613j1046994
4876d9689624l7009817k4131811j4715752q2437155j78916125j52185855L4975595
4869e04110544K13600727K14377691Q1190669j4521548p532430K3439476J4748388
4862B1192429n150065j236135P219410o24155o911079K069669P440175k336091
4854B1664158q609517q84909L196549m900066o491064O571866J3311629K297835
4846B6156481o186873K556177J0812436J379740j1954303j0446143j563370o10929
$$ plain form
4900 -13953878 -21181271 -22712959 -18342468 -19581816 -27469445 -27981616 -17197574 -10045807
4892 -10045807 -14827102 -20213503 -17780145 -16040123 -21033177 -24502620 -22618013 -24421938
4884 -24421938 -31192734 -31625744 -27300983 -34396387 -49726673 -50049243 -38642630 -49689624
4876 -49689624 -86699441 -110831252 -125547004 -207984159 -386900284 -539086139 -504110544
4869 -504110544 -290509817 -76132126 5058543 -9463005 -16995435 6444041 21192429
4862 21192429 16042364 14806229 22025639 21401484 14490405 16560074 24000249 21664158
4854 21664158 13054641 12169732 15366281 10466215 3975151 10547017 23858646 26156481
4846 26156481 19969608 22525785 33338221 34717961 22763658 12317515 10754145 10143216
4838A0143216l148266J188863O148682K309722k923824O50048O069843K331360
4830B2769644n275598n722553j379258l7425Q09382N615671P612101J64838q300888
4821A6255914o405911J616285M255859J631637J437620L117007P24063l787848
4813A8844626l741376k32766L17814k473248m190851m352806m842426l912030
4805d583063r0406K661541J437176N09301L281619M480471r45250p214960n557219
4796f020790K095039O477779M350716J41373k529301l437768k557152m22873R08225
4787i94752J431137L658568O452169M705947j314367m278011j844476j137888
4779F678327n441541o900966n79043M734842L61198o855806n324017K438039N052044
$$ plain form
4838 10143216 6994950 8183813 14332495 16642217 13718393 14368441 20438284 22769644
4830 22769644 17494046 11771493 10392235 10354810 11164192 16779863 24391964 24556802 16255914
4821 16255914 9850003 11466288 15722147 17353784 18791404 21908411 22632474 18844626
4813 18844626 15103250 14870484 15188298 12715050 8524199 4171393 -671033 -4583063
4805 -4583063 -4673469 -2011928 -574752 -65451 3216168 7696639 6751389 -463571 -6020790
4796 -6020790 -3925751 2552028 6902744 7044117 4514816 1077048 -1480104 -1902977 -994752
4787 -994752 436385 4094953 10547122 15253069 13938702 9660691 7816215 6678327
4779 6678327 1236786 -5664180 -6243223 -1508381 -1147183 -8002989 -13327006 -10888967 -5836923
4770e836923J204239l16900L288497N587005L021328p81717k846429l748754k911155
4761c340809P90392M265378L448900K03728p97881Q4280j04664M60277M930597
4752I940198R260557O226658k999627r760686r841075o568277k694528K448491
4744c988289P294229P398244K091289l968484o738265n680014j387253M568103
4736d10440Q202290O477407J344487l291649o234969o903301l066869L828300
4728e4744O157930P4986o954803o681515k784515l154594m884073J90802Q414445
4719i676081P792958j533307n585343J568393Q545739N013945l212941n077788
4711b164425j94399M490596O145443N891926L087739k521789p148011p720686
$$ plain form
4770 -5836923 -4632684 -4949584 -1661087 3925918 6947246 6165529 3319100 -429654 -3340809
4761 -3340809 -2550417 1714961 5163861 5367589 4569708 4653988 4549324 5009601 9940198
4752 9940198 19200755 25427413 22427786 12667100 2826025 -3742252 -6436780 -3988289
4744 -3988289 3305940 10704184 12795473 8826989 2088724 -3591290 -4978543 -410440
4736 -410440 7791850 14269257 15613744 12322095 6087126 -816175 -3883044 -54744
4728 -54744 6103186 6178172 -776631 -7458146 -10242661 -13397255 -18281328 -18090526 -9676081
4719 -9676081 -1883123 -3416430 -9001773 -7433380 1112359 6126304 2913363 -2164425
4711 -2164425 -2358824 2131772 8277215 14169141 17256880 14735091 7587080 -133606
4703a33606o542240o231845m619490R9986L958627K986270K19387O23361K607834
4694g031716J358496k123929k518110O85073K658500J884702K695397P554962
4686E163375J2150029J0918946M156391k853950n710868m102667q70446M35407
4678A9286217j706020m953558m938598l96810M481144M857358J773357P92335
4670A9195425L561306M784196N09443m465055l034346K675116L757478j383002
4662B5600561m063074N45231M986593J239414o444002q504588m526030j631420
4654G202685k119431k420823k310316n018078q443500o197362J261303N589376
4646a2456146K811831j585074k161978k57128J352523K721269K798567r27180
$$ plain form
4703 -133606 -6675846 -12907691 -17527181 -17427195 -13468568 -10482298 -10262911 -9639550 -7031716
4694 -7031716 -5673220 -7797149 -10315259 -9630186 -6971686 -5086984 -2391587 5163375
4686 5163375 17313404 28232350 32388741 29534791 23823923 19721256 18850810 19286217
4678 19286217 17580197 12626639 7688041 7291231 11772375 16629733 18403090 19195425
4670 19195425 22756731 27540927 28050370 23585315 20550969 23226085 26983563 25600561
4662 25600561 21537487 22082718 27069311 28308725 21864723 13360135 8834105 7202685
4654 7202685 5083254 2662431 352115 -4665963 -13109463 -19306825 -18045522 -12456146
4646 -12456146 -9644315 -11229389 -13391367 -13648495 -12295972 -9574703 -6776136 -7703316
4638g703316n656178m361771K456166M791581j816964p925500l945309N401358
4630a8759933Q793298M333504j108568l704188m404324k440202L134372P299627
4622f856414L994594l204890m179402L150577R297686O144365l170385r594184
4614d418053q287718j451300M894859N552069P42455l606368k858265N59317J990649
4605f882355K149514L960160M824220N30266m605531j827791O948886R317572
4597A4414941J191425n976376l243574J575184k143792q586359l995272R877227
4589C113404J5767327N392652r075328j2435511n051226K132859L305818J086002
4581D235997j019715k071376j683603k03952J78732j550461k730203j057331J163450
$$ plain form
4638 -7703316 -13359494 -17721265 -15265099 -10473518 -12290482 -20215982 -24161291 -18759933
4630 -18759933 -9966635 -5633131 -6741699 -10445887 -14850211 -17290413 -14156041 -6856414
4622 -6856414 -2861820 -6066710 -10246112 -7095535 2202151 8346516 5176131 -4418053
4614 -4418053 -12705771 -14157071 -9262212 -3710143 -2967688 -6574056 -9432321 -8873004 -6882355
4605 -6882355 -4732841 -772681 4051539 4581805 -23726 -1851517 5097369 14414941
4597 14414941 15606366 9629990 6386416 7961600 5817808 -2768551 -6763823 3113404
4589 3113404 18880731 24273383 15198055 2762544 -2288682 -155823 3149995 4235997
4581 4235997 3216282 1144906 -538697 -742649 -563917 -2114378 -4844581 -5901912 -4738462
4572d738462Q43576k99232J036605L039155J433280k114445j090400N556556J0767107
4563A4433740R147979L462084j411890n039584p884442o905248q24785M042038
4555I019892L94042q958869j3254263p438349J948650N976024L720293R60333
4547g632247J619546L661511K914244r63418l590735j613392K015718J885846
4539a702927p23736J791033J0885608J6193566Q935789m091526r207556n482454
4531A6597797m270971r385100j0935406l074848M940678L716119r07097J315465
4523b003363O723651L895125o093612j0249650m432906O77756k105791n151658
4515a8740448Q6689Q215556Q408880J151839l471816r08057L605089M827596L516291
$$ plain form
4572 -4738462 -3894886 -4194118 -3157513 -118358 1314922 -799523 -1889923 3666633 14433740
4563 14433740 23581719 27043803 25631913 20592329 12707887 5802639 4977854 9019892
4555 9019892 9413934 455065 -12799198 -20237547 -18288897 -12312873 -8592580 -7632247
4547 -7632247 -6012701 -2351190 563054 -400364 -3991099 -5604491 -3588773 -1702927
4539 -1702927 -2426663 -635630 10249978 26443544 35379333 31287807 22080251 16597797
4531 16597797 12326826 2941726 -7993680 -11068528 -6127850 -2411731 -3318828 -2003363
4523 -2003363 4720288 8615413 2521801 -7727849 -12160755 -11482999 -13588790 -18740448
4515 -18740448 -18653759 -10438203 -2029323 -877484 -4349300 -5257357 -1652268 3175328 6691619
4506F691619K006581L48521j543995k649013l017446l355245k061720K859612
4498g21086Q346760P927147P52876n745756n067037M37690L924682K709237j049011
4489A1515502n030854p696538o870572k187703K307962K561567O22239J615639
4481c162758N099084N021075n91473n392963l140466L644571P182803M291805
4473A2951678q14634k536010K03111L882765M356315P58713l802036n642076m368881
4464D988945k230213k61486K399077N328140O175635M207130J428007j001538
4456B1033697l994066o559466m851178J633478O690009M611425j881312n456591
4448A1225996l850178q70114P46747K029493L536454L549890J391270j369636
$$ plain form
4506 6691619 8698200 9046721 7502726 4853713 1836267 -1518978 -3580698 -721086
4498 -721086 7625674 15552821 16305697 10559941 5492904 5930594 9855276 12564513 11515502
4489 11515502 6484648 -1211890 -8082462 -10270165 -7962203 -5400636 -4778397 -3162758
4481 -3162758 1936326 6957401 6365928 972965 -2167501 1477070 8659873 12951678
4473 12951678 12137044 9601034 9804145 13686910 18043225 18801938 14999902 9357826 4988945
4464 4988945 2758732 2497246 4896323 10224463 16400098 20607228 22035235 21033697
4456 21033697 17039631 10480165 5628987 7262465 13952474 18563899 16682587 11225996
4448 11225996 7375818 6505704 7252451 9281944 12818398 16368288 17759558 16389922
4440A6389922l636152n283590n013360j768809J626468R01405k859924l738716
4432c382756K51756L946971K964054l8788n89140K96005j328599n172188o994103
4423a0046788m972127j666354J00091N3432p96529j534792j299395J39564J848107
4414a8174791L272606N427596Q520779R519678N174341k631169p752079o956999
4406c600038l541847k244944k898829j658858K662219O475071O011105J762166
4398B966045k745951m848921l876492j0928N335600Q564321O541089J078932k112958
4389A0890737o08379J327904r92073n568104o782296m215723l503463p609887
4381a7061284j1700457r426297j664617M336617L880586J80314j2187N209475
$$ plain form
4440 16389922 12753770 7470180 2456820 688011 2314479 3215884 355960 -3382756
4432 -3382756 -3131000 815971 3780025 3741237 3152097 3448102 2119503 -3052685 -10046788
4423 -10046788 -15018915 -16685269 -16585178 -16531746 -17328275 -18863067 -20162462 -20022898 -18174791
4414 -18174791 -14902185 -9474589 -953810 8565868 13740209 11109040 3356961 -3600038
4406 -3600038 -7141885 -9386829 -12285658 -13944516 -11282297 -4807226 1203879 2966045
4398 2966045 220094 -4628827 -8505319 -8516247 -3180647 5383674 11924763 13003695 10890737
4389 10890737 10282358 11610262 10618189 5050085 -1732211 -5947934 -9451397 -17061284
4381 -17061284 -28761741 -38188038 -39852655 -35516038 -31635452 -31455138 -31467325 -26257850
4373b6257850J0412956R232862K327729k907476j036293N045997Q061422N070429
4365I949776j46688k637509j631384k05062j476210n451401q665223p397854k160711
4356a9822266K235515K377383K11107o31575j72297n76922j314406j48946J974031
4347a5868376J762844n33257o67994K996134O345245M766148j217214o943662
4339i360132q128161l858634K497253N140473J336972m634598n756757n99587
4331b3363171N478717P318909M940398J661630O43074L140630O735936N909375
4323A2465498j544715r463989r593982k361898M157275N542342M613170L518156
4315G331857J66301n238564p637982m668497n60219Q42744J071571K103335K720012
$$ plain form
4373 -26257850 -15844894 -6612032 -4284303 -7191779 -8228072 -3182075 4879347 9949776
4365 9949776 9803088 7165579 5534195 5329133 3852923 -1598478 -10263701 -17661555 -19822266
4356 -19822266 -17586751 -15209368 -14998261 -15629836 -15802133 -16379055 -17693461 -17842407 -15868376
4347 -15868376 -14105532 -14638789 -15306783 -12310649 -5965404 -1199256 -2416470 -9360132
4339 -9360132 -17488293 -21346927 -18849674 -13709201 -12372229 -17006827 -22763584 -23363171
4331 -23363171 -17884454 -10565545 -5625147 -3963517 -3320443 -179813 6556123 12465498
4323 12465498 10920783 1456794 -8137188 -10499086 -6341811 -799469 3813701 7331857
4315 7331857 7498158 2259594 -5378388 -10046885 -10607104 -9764360 -8692789 -6589454 -3869442
4306c869442K712761L912351M185673j424128r875956j0148410O6537P848708
4298f591906L506506m342065l020863L743866L441910l287078m105147L770616
4290f884161R225305N511482o35268j386835J920890M711569N855129M780069
4282B3098180J80739n254137o370257l962602l812805n893996l778470L109372
4274b683976O955334M668883K796314M587556L402074m101912r136542m363667
4266B124064L150452L203859j397205j831273N19825j410228m428850P79756J0872763
4257A1583163J1273213r47211j0570465o651569J572162P3303q882796j2061966
4249a4612166n227441L602855P775399Q227945O752194K797837j407800q21891
$$ plain form
4306 -3869442 -1156681 2755670 6941343 5517215 -4358741 -14507151 -14440614 -6591906
4298 -6591906 -3085400 -7427465 -10448328 -6704462 -3262552 -6549630 -10654777 -6884161
4290 -6884161 2341144 7852626 7217358 5830523 7751413 12462982 18318111 23098180
4282 23098180 23278919 18024782 11654525 7691923 3879118 -2014878 -5793348 -2683976
4274 -2683976 4271358 8940241 11736555 16324111 19726185 15624273 6487731 2124064
4266 2124064 5274516 8478375 7081170 5249897 5769722 4359494 -69356 710400 11583163
4257 11583163 22856376 21909165 11338700 4687131 6259293 6332596 -2550200 -14612166
4249 -14612166 -19839607 -16236752 -8461353 -233408 6518786 9316623 7908823 7086932
4241G086932M222898O365865J564542m316020l884629R31646J936406l542695
4233A0364945r353437q941618k841150L233527M996770L094412J406035K507867
4225D467351M524606L381715j253750m506099k695189J232999K019985n2008j14059
4216G005551L161324N378119L205934j126688l833237m246801l361864j072046
4208E110292K323440M181682K072211k650471n898236n175898j865476N40773
4200a361683K16514r61323l2286K362836K573515L16863K69494M167571O186927
4191A3738428J687499m032056l278986J604405K748943P31459K577530P059228
4183B2836450N245418k924616o550105k017836P03795l975283o989636q94747
$$ plain form
4241 7086932 11309830 17675695 19240237 14924217 11039588 11971234 13907640 10364945
4233 10364945 1011508 -7930110 -10771260 -7537733 -2540963 553449 1959484 4467351
4225 4467351 8991957 12373672 11119922 6613823 3918634 5151633 7171618 7119610 7005551
4216 7005551 10166875 15544994 18750928 17624240 13791003 9544202 6182338 5110292
4208 5110292 7433732 11615414 13687625 11037154 5138918 -36980 -1902456 -1361683
4200 -1361683 -1145169 -2106492 -2138778 224058 2797573 3114436 3383930 7551501 13738428
4191 13738428 15425927 11393871 8114885 9719290 12468233 13199692 15777222 22836450
4183 22836450 28081868 25157252 18607147 16589311 17293106 13317823 6328187 5433440
4175E433440O488718N373292k06473j521154k36882k064676l959443n17360M143171
4166A2932633L548370J197790L274808N812105K068286l820940l913784q95264
4158B0204004j951819m753140l490135j869474n260210p481186j509264M858426
4150a252798J853180k642128L395565J2067703Q348087j563542j077048N391694
4142B4520713J829653n344002K745095J7851558J4456047j966713j176228J4995830
4134F7911953J5096935P295883M1491285J12399780J27711558K9663075j02602528
4127B98967941j43253184q1038046j5311326q105290k2275893j2010203N859582
4120B2833581J416060j0335532l397863R582466L483073j2468876j2678669K59896
$$ plain form
4175 5433440 11922158 17295450 17088977 15567823 15330941 13266265 9306822 8789462 12932633
4166 12932633 16481003 17678793 20953601 26765706 28833992 25013052 21099268 20204004
4158 20204004 18252185 13499045 10008910 8139436 2879226 -4601960 -6111224 -1252798
4150 -1252798 600382 -2041746 1353819 13421522 21769609 20206067 19129019 24520713
4142 24520713 26350366 21006364 23751459 41603017 56059064 54092351 52916123 67911953
4134 67911953 83008888 90304771 131796056 244195836 371907394 401570469 298967941
4127 298967941 155714757 74676711 59365385 51260095 28984202 16973999 22833581
4120 22833581 24249641 13914109 10516246 20098712 23581785 11112909 -1565760 -1305864
4112a305864M320574k424071l221348M727555P696470J770838k420153m07071
4104H736930M32637l633885p336043p464526p008904p717712p816771o520692
4096c8328966l888351J258975P571305R988777P820580P420695J0698135R364614
4088A1905764j217601j1198630r593136r11922K957670J052829J131286M069058
4080a804682L639197m75942j836713J010471K597090N96086j383499j368354j098810
4071a25156k77628L436945Q013210P650361J005562o541990r357287o111106J063242
4062a243847P537467Q117604K848080j200875J161473N441006M281005j200188
4054B5741725m075257l070407l154462n739202o608930m046268j415653m02874
$$ plain form
4112 -1305864 3014710 590639 -2630709 2096846 9793316 11564154 9144001 8736930
4104 8736930 9169567 5535682 -1800361 -9264887 -16273791 -23991503 -31808274 -38328966
4096 -38328966 -42217317 -40958342 -33387037 -23398260 -15577680 -8156985 2541150 11905764
4088 11905764 10688163 -510467 -10103603 -11015525 -8057855 -7005026 -5873740 -1804682
4080 -1804682 1834515 1358573 -478140 532331 3129421 3725507 2342008 973654 -125156
4071 -125156 -402784 3034161 11047371 18697732 19703294 13161304 3804017 -2307089 -1243847
4062 -1243847 6293620 14411224 17259304 16058429 17219902 22660908 26941913 25741725
4054 25741725 21666468 18596061 15441599 9702397 3093467 -952801 -2368454 -2771328
4046b771328J411281M363721M350068n86741o030009o361403j159465N170090
4038a613786P721268M591345j344047m290186j788483J813655J242533k026067
4030D306232k378757R74232L184761J863041K66339J059358J940667j54507m202107
4021F859259o820873o261651k950698J573955M717918L975117k59654m309561
4013c476188m793308j780895J867692L214695J377888j655013k416474M07821
4005g253782L871434L874031M04760k041793K1259M340677N009660n10130p379123
3996C36993p933421o19851P613581R403841N265995J088691l39765q38397j236854
3987A2740813N9482K623835L611255K764367K466388J845239k905575j0371512
$$ plain form
4046 -2771328 -1360047 3003674 7353742 6767001 736992 -5624411 -6783876 -1613786
4038 -1613786 6107482 10698827 9354780 5064594 3276111 5089766 6332299 4306232
4030 4306232 1927475 2901707 6086468 7949509 8215848 9275206 11215873 11061366 6859259
4021 6859259 38386 -6223265 -9173963 -7600008 -2882090 1093027 833373 -3476188
4013 -3476188 -8269496 -10050391 -8182699 -4968004 -3590116 -5245129 -7661603 -7253782
4005 -7253782 -3382348 491683 896443 -1145350 -1124091 3216586 8226246 7716116 336993
3996 336993 -7596428 -8216279 -602698 8801143 14067138 15155829 14816064 13977667 12740813
3987 12740813 12800295 15424130 19035385 21799752 24266140 26111379 23205804 12834292
3979A2834292j2896504p286246l88413M07390l167760m815675k950618l02228
3971a8565762J661679K955963L014041K303034K518051K495319r54233n482127
3963a0054035l626188N009854J0190844N779220m50142K58748L410280M68226
3955A0986807n059313l544728L538851N770660Q05822l548179l193052j540361
3947D216507m7686K966651M143410j894332j0541040j0695387j872156M636587
3939i087446L798409K750948N252405M394977k931711p596568k814273M022640
3931b210619L517113j318403k686403j539846k788252m007036m16375L892937
3923g556884J344694n468333o685594o33701M012461K205571n88523J889391P077785
$$ plain form
3979 12834292 -62212 -7348458 -7736871 -7329481 -10497241 -15312916 -18263534 -18565762
3971 -18565762 -16904083 -13948120 -10934079 -8631045 -6112994 -3617675 -4571908 -10054035
3963 -10054035 -13680223 -8670369 1520475 7299695 6849553 7108301 10518581 10986807
3955 10986807 5927494 2382766 5921617 11692277 12498099 8949920 5756868 4216507
3947 4216507 4168821 7135472 11278882 9384550 -1156490 -11851877 -13724033 -9087446
3939 -9087446 -5289037 -2538089 2714316 7109293 4177582 -3418986 -6233259 -2210619
3931 -2210619 1306494 -11909 -2698312 -4238158 -7026410 -11033446 -11449821 -7556884
3923 -7556884 -6212190 -11680523 -18366117 -18999818 -14987357 -12781786 -13370309 -11480918 -4403133
3914d403133P560736J035352o716294q012024j839936M042026J666564o449188
3906a3115897r598031l393365M012881M161092M75111J543193P016830Q833694
3898f4492M424397n0268j1088J620935P38109j750794k719430j618212j3021Q53873
3888A410009M70677p32069r25622R80906K652477Q06004l249461m028385Q51022
3879a764442O896394Q325808N074849J610647K00562j315550m662304p186741
3871G179223n371618q64673P48885k057125l787689L28333O711210P780216K248109
3862A2914871l670736m842675k355748R8481N21764j320008m083406m687132j814560
3853i239149Q35138n81263k999370n91531M777093N401691O54291j414824K168741
$$ plain form
3914 -4403133 3157603 4192955 -2523339 -10535363 -12375299 -8333273 -6666709 -13115897
3906 -13115897 -22713928 -26107293 -22094412 -17933320 -17458209 -15915016 -8898186 -64492
3898 -64492 4359905 4309637 4298549 5919484 6657593 4906799 2187369 569157 556136 1410009
3888 1410009 1880686 1148617 222995 1203901 3856378 4662382 1412921 -2615464 -1764442
3879 -1764442 5131952 13457760 18532609 20143256 20343818 19028268 14365964 7179223
3871 7179223 1807605 942932 1691817 -365308 -4152997 -3824664 2886546 10666762 12914871
3862 12914871 9244135 4401460 2045712 2144193 2665957 1345949 -2737457 -7424589 -9239149
3853 -9239149 -8404011 -8985274 -11984644 -12576175 -7799082 -2397391 -1743100 -3157924 -989183
3844i89183M160366K89226k757676N44426M115210Q92332m455918l802344M09741
3835a593820Q03891r17266J935980O952521N914140J51251r14378L568910M184240
3826B0085469j981831n986826k333107K396631J740947l78106J524060M077088
3818A9144325J134387n908655j0821941j0977251p538707j715959M023498N219747
3810g440556Q66308l912900m500602k160958M51182L904511P879275P927944J909086
3801D923290m722860n634507j846067J867582M543387P185361P523385L469406
3793A7308977j209395j467591J187410J934583J001778J516691J496305l336748
3785A8432010r742972r412102k344735J364773l706702r825478p265957K180110
$$ plain form
3844 -989183 3171183 3460409 702733 1247159 5362369 6254701 1798783 -2003561 -1593820
3835 -1593820 -789929 -1707195 228785 7181306 13095446 13246697 12332319 15901229 20085469
3826 20085469 18103638 12116812 9783705 12180336 13921283 13543177 15067237 19144325
3818 19144325 20278712 14370057 3548116 -7429135 -14967842 -16683801 -12660303 -7440556
3810 -7440556 -6574248 -10487148 -14987750 -17148708 -16697526 -12793015 -4913740 3014204 4923290
3801 4923290 200430 -5434077 -7280144 -5412562 -869175 6316186 13839571 17308977
3793 17308977 16099582 14631991 15819401 17753984 18755762 20272453 21768758 18432010
3785 18432010 8689038 -723064 -3067799 -1703026 -5409728 -15235206 -22501163 -20321053
3777b0321053Q570318O823962J060975j944111N38161N796686Q113355L856453
3769A2494746l907979p745288m554982M55732O56317l694530o839267n200255
3761a8335506n58225L239718L992552K253585P40351J839790M377126M530277
3753B079668J427095p17436J461044N050284M984915J531688p53892l75005l03076
3744A4385285k088862l460219k838815j811798j410536k4203K684649L613817
3736I049318J126724j015699J429642O290507P204382K129115m205534o748507
3728A5259948n739630m516596m081957k167746K639319P589373P832402J861048
3720A8676161o155309j0339616q560388k866110L792355Q524876P734605K96542
$$ plain form
3777 -20321053 -11750735 -4926773 -3865798 -5809909 -5271748 524938 8638293 12494746
3769 12494746 8586767 841479 -3713503 -3257771 -2601454 -6295984 -13135251 -18335506
3761 -18335506 -18893731 -15654013 -11661461 -9407876 -8667525 -6827735 -2450609 2079668
3753 2079668 3506763 2789327 4250371 9300655 14285570 15817258 15063366 14688361 14385285
3744 14385285 12296423 8836204 5997389 4185591 2775055 2750852 5435501 9049318
3736 9049318 10176042 9160343 10589985 16880492 24084874 26213989 22008455 15259948
3728 15259948 9520318 5003722 921765 -1245981 1393338 8982711 16815113 18676161
3720 18676161 12520852 2181236 -6379152 -9245262 -5452907 3071969 10806574 11103116
3712A1103116p987167q520450q82731N363814L274728k220851k777286N27934
3704b118893L74320l609342l908741K214806P591437N635258n28268l435627j315876
3695H99074J267411J80004l847202o068518k058862O647001J1642475O380192
3687A5041575m263651q527356k800275M045418L541375j844525n039296m883443
3679d730178m461678l768031r57895J816399N02063l916711o025126l255188J515384
3670b3280961M188796L137347l00408k410833J6712N029629O505322K409711j779947
3661f484632j310878R78880Q71829N51427L263691M998166N15169n469533l477781
3652e563662N285079R300521L660764l621570m934019k905551k524929k279980
$$ plain form
3712 11103116 3115949 -5404501 -6287232 -923418 2351310 130459 -2646827 -2118893
3704 -2118893 -1744573 -5353915 -9262656 -7047850 543587 6178845 5650577 2214950 899074
3695 899074 2166485 2346489 -1500713 -7569231 -9628093 -2981092 8661383 15041575
3687 15041575 10777924 2250568 -549707 3495711 7037086 5192561 153265 -4730178
3679 -4730178 -9191856 -12959887 -13917782 -12101383 -11599320 -15516031 -21541157 -24796345 -23280961
3670 -23280961 -19092165 -15954818 -16255226 -18666059 -18649347 -13619718 -7114396 -4704685 -6484632
3661 -6484632 -7795510 -6816630 -5944801 -5393374 -2129683 2868483 3383652 -2085881 -5563662
3652 -5563662 -278583 9021938 12682702 9061132 4127113 1221562 -1303367 -3583347
3644c583347P22580L721409L058036Q67330O86332N37468l270597q539892r628840
3635a5429521n716177j203825J007528J937162K887166L434443K974709J559898
3627h548617l40928j274207K90417K802725K162635k144850m770517j888218K506311
3618a1205249K454143p68305j575115m59694l587838j0858394j2340124j479921
3610c9820497J3473570J7941890Q969988j813889l687566Q71240K527618j137661
3602b675307l988234j702883K597495M253827L206878J541242o52323l302990
3594g22295l886522j251016R61165o54168l361428k545271M84961R94873n95853
3585a0575554M32558M282461O026694M348540L508813N061049M871378Q87386
$$ plain form
3644 -3583347 -2860767 860642 3918678 4786008 5472340 6009808 2739211 -5800681 -15429521
3635 -15429521 -21145698 -22349523 -21341995 -19404833 -16517667 -13083224 -10108515 -8548617
3627 -8548617 -8889545 -10163752 -9873335 -7070610 -4907975 -7052825 -11823342 -13711560 -11205249
3618 -11205249 -8751106 -9519411 -11094526 -11554220 -15142058 -26000452 -38340576 -39820497
3610 -39820497 -26346927 -8405037 564951 -1248938 -4936504 -4065264 -1537646 -2675307
3602 -2675307 -6663541 -8366424 -5768929 -1515102 1691776 3233018 2580695 -722295
3594 -722295 -4608817 -5859833 -4898668 -5552836 -8914264 -11459535 -10974574 -9979701 -10575554
3585 -10575554 -10142996 -5860535 166159 4514699 8023512 13084561 17955939 18843325
3577A8843325k916538l390627k737754l112633k917383j706610k376564m920549
3569e235333m644238m90690J963646K72205N0976M526629P459326L828747o21446
3560G109822M03834J821835l395769r622371o769363J515158K711858l375921
3552i600917l928482N080729J1680754P034665j701194m134879q68393K337622
3544E899905M622329O039130K194368p760819j4345568q663113M174212J1283201
3536C443645Q360245J659464l292605o128652o350875k570255K304967K629742
3528E5676j549759l679924k17460M300439M120515j31671l669398m244954l385880
3519h402416k529383j052717J554502L491035K249983j508271l441154p18932
$$ plain form
3577 18843325 15926787 12536160 9798406 6685773 3768390 2061780 -314784 -5235333
3569 -5235333 -9879571 -10370261 -8406615 -8134410 -8083434 -3556805 3902521 7731268 7109822
3560 7109822 7513656 9335491 5939722 -3682649 -10452012 -8936854 -6224996 -9600917
3552 -9600917 -13529399 -8448670 3232084 10266749 8565555 4430676 3562283 5899905
3544 5899905 10522234 16561364 18755732 10994913 -3350655 -12013768 -7839556 3443645
3536 3443645 11803890 13463354 10170749 4042097 -2308778 -4879033 -2574066 55676
3528 55676 -1494083 -5174007 -5391467 -1091028 3029487 2897816 -771582 -5016536 -8402416
3519 -8402416 -10931799 -11984516 -10430014 -6938979 -4688996 -6197267 -9638421 -10357353
3511a0357353L385487L170611j490303m816712l568462j088093p63012n81905
3503a6109742J945333M260541L501129K622162N071485O657617J161200p368864
3495A740861p599905K350152J0575052P870885L35854q51841M021146N023490
3487B3465694k104638j0546777j2327687p408181j466109J203347Q33794M37498
3479g913059J820876K731286n84209o797595q815300l083643L846020L583918
3471a5211706j716497k500547L355522P339697L877594j351696j336111J193955
3463f349789o36291o062739q066364m070507J664843N116894N799740L839395
3455h764818j63699k601683j65852L974769L106484l093076p296695m680254J126407
$$ plain form
3511 -10357353 -6971866 -3801255 -5291558 -10108270 -13676732 -14764825 -15527837 -16109742
3503 -16109742 -14164409 -9903868 -6402739 -3780577 1290908 7948525 9109725 1740861
3495 1740861 -5859044 -3508892 7066160 14937045 15272899 14421058 18442204 23465694
3487 23465694 21361056 10814279 -1513408 -8921589 -10387698 -9184351 -8350557 -7913059
3479 -7913059 -6092183 -3360897 -3945106 -10742701 -19558001 -22641644 -18795624 -15211706
3471 -15211706 -16928203 -19428750 -16073228 -8733531 -4855937 -6207633 -7543744 -6349789
3463 -6349789 -6986080 -13048819 -21115183 -25185690 -23520847 -18403953 -12604213 -8764818
3455 -8764818 -8928517 -11530200 -11696052 -7721283 -4614799 -7707875 -15004570 -19684824 -18558417
3446a8558417M260333L763901K130065J205077J869844L685136L132076k959176
3438a471161j0454636j0422157j643316N826433M203451j242252j271254L072409
3430a3402483L616190j033157l991564j704331J569254K020495J630415K818725
3422h476456L721422K041517n94976j295199j49304P49537P01481Q01265J830798
3413f69915K824633J632801k536360o789819o704219k149196J554244M80827k738783
3404a5095787l489105j611062N98089L221171O318953O138247M98866m637875
3396h058503k010271M946557N962663j15276l154076K020390P001923K616522
3388I209929p542255j2903003r608352k071911M745709Q310762P027678J956622
$$ plain form
3446 -18558417 -14298084 -10534183 -8404118 -7199041 -5329197 -1644061 1488015 -1471161
3438 -1471161 -11925797 -22347954 -23991270 -18164837 -13961386 -15203638 -16474892 -13402483
3430 -13402483 -9786293 -10819450 -14811014 -16515345 -14946091 -12925596 -11295181 -8476456
3422 -8476456 -4755034 -2713517 -3308493 -4603692 -4752996 -4003459 -3301978 -2500713 -669915
3413 -669915 2154718 3787519 1251159 -5538660 -12242879 -14392075 -12837831 -12357004 -15095787
3404 -15095787 -18584892 -20195954 -19597865 -16376694 -10057741 -3919494 -3420628 -8058503
3396 -8058503 -10068774 -5122217 840446 725170 -2428906 -408516 6593407 9209929
3388 9209929 1667674 -11235329 -20843681 -22915592 -18169883 -9859121 -2831443 -874821
3380h74821j801666m78811L057324L470352N76498j364327l28145J654098K186080
3371F096582L62304l802480q205564q222393j480532P385633J0509753N695781
3363H339084j303295l941720k000428m52944k383955m639500j846192N304948
3355b924002Q799580L198486n789982p788460j614089L789027K528607j576977
3347a377810l553306m517820o138638n241862N1572M838395M592210K493519K859485
3338e994255K805906j356119m553804L5470P767665P709120l3434l923576P53585
3329C210558M831839M27298p086894q433853l849565l8159O83742R60383J637286
3320g657365J188613K11637R40283K923447L351266J250650j722315l880397m289096
$$ plain form
3380 -874821 -2676487 -3155298 -97974 3372378 3948876 2584549 2256404 3910502 6096582
3371 6096582 6458886 2656406 -5549158 -13771551 -15252083 -7866450 2643303 8339084
3363 8339084 7035789 3094069 1093641 640697 -1743258 -6382758 -8228950 -2924002
3355 -2924002 5875578 9074064 3284082 -4504378 -6118467 -2329440 199167 -1377810
3347 -1377810 -4931116 -9448936 -15587574 -20829436 -20777864 -15939469 -11347259 -8853740 -5994255
3338 -5994255 -3188349 -4544468 -9098272 -9062802 -1295137 6413983 6380549 2456973 3210558
3329 3210558 8042397 8469695 1382801 -7051052 -10900617 -10938776 -10255034 -9294651 -7657365
3320 -7657365 -6468752 -6257115 -5316832 -2393385 957881 2208531 486216 -3394181 -7683277
3311g683277k235434J261927K704200O4022l422459k865098J268651L615695K021179
3302e270594R59767M241820P752384M332330n038218j0644426o600223J101871
3294i165289L310671K25469j280626J1780j049677m394906k766610N020627Q984974
3285a103587L029881l855607j034075O412421N768000k686901o931663l315573
3277c717104p81959l569736m330341P86348L818416o15041m297654J462086J0837834
3268d07151J2320542N761389j88343k394063l919210m214879j55462M952506M511035
3259A6266364K70421K3988L281349P61061r062508j4258968o263551O552975R885400
3250G456531K140246n858316o305748j891048J062309M27971j603763k007741
$$ plain form
3311 -7683277 -9918711 -8656784 -5952584 -5888562 -9311021 -12176119 -10907468 -7291773 -5270594
3302 -5270594 -4310827 -69007 7683377 12015707 6977489 -3666937 -10267160 -9165289
3294 -9165289 -5854618 -5629149 -6909775 -6897995 -7947672 -12342578 -15109188 -10088561 -1103587
3285 -1103587 1926294 -1929313 -2963388 3449033 9217033 6530132 -401531 -3717104
3277 -3717104 -4499063 -8068799 -12399140 -11612792 -7794376 -8409417 -12707071 -11244985 -407151
3268 -407151 11913391 17674780 17486437 15092374 11173164 6958285 6802823 11755329 16266364
3259 16266364 16536785 16560773 19842122 20603183 11540675 -2718293 -8981844 -2428869 7456531
3250 7456531 9596777 3738461 -2567287 -4458335 -3396026 -2968055 -4571818 -6579559
3242f579559O11134M620273O052050K503770l708324p719434o968895k649980
3234a3838965K569632O319108O740007L294165k143055o224606o670673l746643
3226a3701030J71958K126097P45026k236180l503598j911666M26791J436877J634775
3217a4810950K008236J441624j153355l493689k018813K728521N799119L700127
3209e799180j572851n032951l423970K783553R754849J2081443P007209j644153
3201A4153949o154452l345839J787143K771706m73244l233683l212448k221766
3193G1366j726063r13877N63774J586189K020579L063915M370790L806797Q81750
3184A3725220k396856m631867n807693m702688N6252N278150M906154r36099m137249
$$ plain form
3242 -6579559 -5968425 -1348152 4703898 7207668 3499344 -4220090 -11188985 -13838965
3234 -13838965 -11269333 -4950225 1789782 5083947 2940892 -3283714 -9954387 -13701030
3226 -13701030 -13529072 -11402975 -10657949 -12894129 -16397727 -18309393 -17882602 -16445725 -14810950
3217 -14810950 -12802714 -11361090 -12514445 -16008134 -18026947 -15298426 -9499307 -5799180
3209 -5799180 -7372031 -12404982 -15828952 -13045399 -3290550 8790893 15798102 14153949
3201 14153949 7999497 4653658 6440801 9212507 8739263 5505580 2293132 71366
3193 71366 -1654697 -2568574 -2004800 -418611 1601968 4665883 9036673 12843470 13725220
3184 13725220 11328364 6696497 888804 -3813884 -3757632 1520518 6426672 5490573 1353324
3175A353324n0083M697356K072448m232564m016105L266453P249641K568586l364251
3166I544805k505760J743771J146816l777606m697053J350550O922429M167914
3158A3895866m840837j0954276q979176k595002J645923K190145K212930L185640
3150d238787K668105n40579k924926j002651L043436M329265K269346N19694R05072
3141E027975J691014J453901L83991j901836n224905n921825o53147O551352P450042
3132H856562J298481l292706q58383L504119L318998M36694m17324p90830m469672
3123G585939q439283o455533L29181M548856L773251K555592L039694J626078
3115H563775k912372n443042k431633J878415J772393j617073k940047p13160
$$ plain form
3175 1353324 1303241 6000597 8073045 3840481 -175624 3090829 10340470 12909056 9544805
3166 9544805 7039045 8782816 9929632 6152026 1454973 2805523 9727952 13895866
3158 13895866 9055029 -1899247 -10878423 -13473425 -11827502 -9637357 -7424427 -4238787
3150 -4238787 -1570682 -2111261 -5036187 -6038838 -2995402 1333863 3603209 4122903 5027975
3141 5027975 6718989 8172890 8556881 6655045 1430140 -4491685 -5144832 1406520 8856562
3132 8856562 10155043 6862337 6003954 9508073 12827071 13263765 12846441 12055611 7585939
3123 7585939 -853344 -7308877 -6979696 -2430840 1342411 3898003 6937697 8563775
3115 8563775 5651403 208361 -2223272 -344857 1427536 -189537 -3129584 -3842744
3107c842744J831057K482776K539901L800273N944602P025473M922213j082480
3099B3621071q558039j2638650j0454478m396503P02898K928023L760068L896762
3091a138848J783969k670250n711057l591397K331892O832622O890645M254453
3083H982029J808219J7728j844713l333560l757333l840621m283501m041611k322428
3074a2615791p29638n22495O12794N035016R477924Q065800J300650l452291k068075
3065E103894J211408J510115O34294K019950K935198j730747r802969j2539757
3057a0658614n787381M322993Q613665M974683n46807j508455J639023K874697
3049C923804o26385l425357R00775Q704375Q779638k375818j4436408j6433036
$$ plain form
3107 -3842744 -2011687 471089 3010990 6811263 12755865 19781338 24703551 23621071
3099 23621071 15063032 2424382 -8030096 -12426599 -11723701 -8795678 -5035610 -1138848
3091 -1138848 645121 -2025129 -7736186 -11327583 -8995691 -2163069 4727576 8982029
3083 8982029 10790248 10807976 8963263 5629703 1872370 -1968251 -6251752 -10293363 -12615791
3074 -12615791 -13345429 -13867924 -13255130 -8220114 1257810 9323610 10624260 7171969 5103894
3065 5103894 6315302 7825417 8459711 10479661 13414859 11684112 1881143 -10658614
3057 -10658614 -16445995 -12123002 -3509337 1465346 918539 -589916 1049107 3923804
3049 3923804 3297419 -127938 772837 9477212 18256850 15881032 1444624 -14988412
3041a4988412r941728l404546Q50928N738311R657834P598300J038719k655767
3033f106361j492405q63514k822186k279269K820458O022548K412891k679108
3025d986946j564594M055626O178682K439194j847144k522084j329526j212408
3017g89200j721605r55449R04442K039972J651785O43198j0379n19911j442361
3008a99508k142547j364470M30689J036316j71383q86919L98406J602975O26893
2999f69548o44953M03994J952990M90822k750500l469687j553217o79473q72722
2990g792294J717422O527760P341332K111949k737419j879928J005006j53068
2982F140760m263543n771682l214966N45633L824489O256847N621887M19448n227190
$$ plain form
3041 -14988412 -24930140 -28334686 -27483758 -21745447 -12087613 -4489313 -3450594 -6106361
3033 -6106361 -7598766 -8462280 -11284466 -13563735 -10743277 -4720729 -2307838 -4986946
3025 -4986946 -6551540 -2495914 3682768 6121962 4274818 1752734 423208 -789200
3017 -789200 -2510805 -3466254 -2561812 -521840 1129945 1773143 1762764 1242853 -199508
3008 -199508 -2342055 -3706525 -3275836 -2239520 -2410903 -3297822 -2899416 -1296441 -669548
2999 -669548 -1314501 -910507 1042483 1533305 -1217195 -4686882 -6240099 -6919572 -7792294
2990 -7792294 -6074872 452888 7794220 9906169 7168750 5288822 6293828 6140760
2982 6140760 1877217 -3894465 -7109431 -6563798 -2739309 3517538 9139425 9558873 4331683
2973D331683m766481K202508Q843576R449565N433247J688159k46041k950558
2965B3985658p598485j0060155n121952N127392J0860307N898646l396498o092763
2957A3602150j568203R89654k441616n477308l421394q94731k078641k284142
2949c574231K954983P688107M015145m273987o714058j880231K035550J051055
2941A302333k39251J297134K187930l02215k956102j753525K780033P314331Q820769
2932A8451437N557770p12367m017552q92604L014115o27174j0132307j4728850
2924d087532q898680J431753Q324565R948449P327797J141716m574186l291680
2916G322202M176804P256448p69150j1966752j3506004m548901L832819L801006
$$ plain form
2973 4331683 -434798 1767710 10611286 20060851 25494098 27182257 26936216 23985658
2965 23985658 16387173 6327018 1205066 6332458 17192765 23091411 19694913 13602150
2957 13602150 12033947 13023601 10581985 5104677 1683283 788552 -1290089 -3574231
2949 -3574231 -619248 7068859 11084004 6810017 95959 -1784272 251278 1302333
2941 1302333 1063082 2360216 4548146 4245931 1289829 -463696 2316337 9630668 18451437
2932 18451437 24009207 23296840 19279288 18386684 21400799 20773625 10641318 -4087532
2924 -4087532 -12986212 -11554459 -3229894 6718555 14046352 15188068 10613882 7322202
2916 7322202 11499006 18755454 17986304 6019552 -7486452 -12035353 -8202534 -4401528
2908d401528j158193l457469q72954L145796M967941M050409J927094k61960k591629
2899A347507m866275n511066l225283J033091N209915Q205851Q994241N749094
2891A6937075r39410n960073n091166r37600J286463J776047L527565L798020
2883A4396921k713472j1967967j2356381j635511P862096O337030l05085j573858
2875a956227J531461J030746l187699l656315J747316O511297N185954m71223
2867F735310n318105n827879j726169L424626M563356J135286j934971j971398
2859i19944k294696m355525l013499L676339P188058O77157p667104n405107M210747
2850g903574O784911n73274o025344l382066l40642k137056j756692N852523J2297431
$$ plain form
2908 -4401528 -5559721 -9017190 -9890144 -6744348 -1776407 2274002 4201096 3939136 1347507
2899 1347507 -3518768 -9029834 -12255117 -11222026 -6012111 2193740 11187981 16937075
2891 16937075 15997665 10037592 4946426 4008826 5295289 7071336 10598901 14396921
2883 14396921 11683449 -284518 -12640899 -14276410 -6414314 -77284 -382369 -1956227
2875 -1956227 -424766 605980 -2581719 -6238034 -4490718 2020579 7206533 6735310
2867 6735310 1417205 -4410674 -6136843 -2712217 1851139 2986425 1051454 -919944
2859 -919944 -3214640 -7570165 -10583664 -6907325 280733 957890 -6709214 -12114321 -7903574
2850 -7903574 -1118663 -1691937 -7717281 -11099347 -11439989 -13577045 -15333737 -9481214 2816217
2841B816217Q429423p45838m154373r34354J160860j303378m998672o502483l905305
2832a0137903M016954J3059724J3250353J803113q649198n026130O884002R810396
2824B5011311k82779r822453q863499l439461k185255k564724J530264P044717
2816F428121O367288R4767l950972k613768l41931m69859q38956K37823j86279
2807D726234m338276q311276o528667J77683N403648N929022N252943O832731
2799I144042P946664M140726k664504n573706j924011L687850O300544N752613
2791B6810218L468459p11974n439604o386953k238914J648536M19039k814990
2783A4753817k238020Q47450K66368m409530o780742l494304J490558L810292
$$ plain form
2841 2816217 11245640 10499802 6345429 5411075 6571935 5268557 269885 -6232598 -10137903
2832 -10137903 -6120949 6938775 20189128 21992241 13343043 8316913 15200915 25011311
2824 25011311 24728532 14906079 6042580 2603119 417864 -2146860 -616596 6428121
2816 6428121 12795409 12890176 8939204 6325436 5983505 5513646 4674690 4912513 4726234
2807 4726234 387958 -7923318 -14451985 -14274302 -8870654 -2941632 2311311 9144042
2799 9144042 17090706 21231432 18566928 12993222 11069211 14757061 21057605 26810218
2791 26810218 30278677 29566703 24127099 17740146 15501232 17149768 17568807 14753817
2783 14753817 12515797 13363247 13629615 9220085 2439343 -1054961 435597 4245889
2775D245889L769656K629621l39942m279927n272478j933425J435065P47324j890906
2766h89123j442561L075955P784166Q674897N263721P31371q44999R88740J750838
2757B5093005k009584o670763o211631k020490j211581m535640m329835K361267
2749D64748P330038L715138k755696k992447J117801J173827k903395l029128
2741B120886L165959Q464491P044507J152876m582442q091913p527664j378490
2733C68210O491826Q577939L638701j033905l93172J422627q35216m303548k980166
2724A0953296J749581K372210l747721j0162418r277730j221871O670115P799539
2716E135001K685771k445067k909805j65135J596806J404137J357003J903372
$$ plain form
2775 4245889 8015545 10645166 10305224 6025297 752819 -1180606 254459 1001783 -889123
2766 -889123 -2331684 744271 8528437 17203334 22467055 23198426 22353427 23342167 25093005
2757 25093005 23083421 16412658 10201027 8180537 6968956 2433316 -1896519 464748
2749 464748 7794786 11509924 8754228 5761781 6879582 8053409 5150014 2120886
2741 2120886 5286845 13751336 20795843 21948719 17366277 9274364 1746700 368210
2733 368210 6860036 15437975 19076676 18042771 17649599 19072226 18237010 13933462 10953296
2724 10953296 12702877 15075087 11327366 1164948 -8112782 -9334653 -2664538 5135001
2716 5135001 7820772 5375705 2465900 2300765 3897571 5301708 6658711 8562083
2708H562083J112038j396777l420344l491440k101499L31458L269309M236952
2700G101780J407220k299848k507127m26040q42223l298219k673427N89552k46017
2691c194349n778602o948869M55924P045577L717780l697282l958709J603343
2683a0755187K745275j656254k547050K578914N103039N81776l147085Q42224
2675f254348O549274M184036m628223r215963m872332J994580L847949J371827
2667g023200N25845L366714N308613K028008l482467m164961R10794M290530P05904
2658B465780m718324l931918J853604M385404J259627j088675J973852O646118
2650H845468O902436J840916n259756j0406246r885271k963319M720820N761263
$$ plain form
2708 8562083 9674121 8277344 4857000 1365560 -735939 -404481 2864828 7101780
2700 7101780 8509000 6209152 3702025 3275985 2433762 -864457 -3537884 -2948332 -3194349
2691 -3194349 -8972951 -15921820 -15465896 -8420319 -4702539 -8399821 -12358530 -10755187
2683 -10755187 -8009912 -9666166 -12213216 -9634302 -4531263 -3949487 -7096572 -6254348
2675 -6254348 294926 4478962 -149261 -9365224 -14237556 -12242976 -8395027 -7023200
2667 -7023200 -6497355 -3130641 2177972 4205980 723513 -3441448 -2530654 1759876 2465780
2658 2465780 -2252544 -6184462 -4330858 54546 1314173 225498 2199350 8845468
2650 8845468 15747904 17588820 12329064 1922818 -7962453 -10925772 -6204952 -443689
2642d43689P14964k420094j54666J919309n61132l401362j880962P30635o14319
2633f111316l414533k074515K088200L043274m6873k479274k174890j207088J7783
2624a2359232L146806O365808N212545J6641l416212k175771O0200k42653j057674
2615d449542Q46758L948132M000953J13693m085013m673176j292337K756672L748795
2606I14935J436949o17650M00512K775879L025160J337864J182418L607791N201585
2597A9265443K782850k189531n188512l373054J764723N526540L929864k255738
2589B0262585p682768p782546l315610J388946L180730J533783k508993o154947
2581a078820n773455j475198J234194j346314m317448m44413P893452J0498053
$$ plain form
2642 -443689 271275 -2148819 -2303485 -384176 -945308 -4346670 -6227632 -5496997 -6111316
2633 -6111316 -9525849 -11600364 -9512164 -6468890 -6515763 -8995037 -11169927 -12377015 -12359232
2624 -12359232 -9212426 -2846618 2365927 2382568 -1033644 -3209415 -3149215 -3391868 -4449542
2615 -4449542 -3602784 345348 4346301 4459994 374981 -4298195 -5590532 -2833860 914935
2606 914935 2351884 1734234 2134746 4910625 7935785 9273649 10456067 14063858 19265443
2597 19265443 22048293 19858762 14670250 11297196 13061919 18588459 22518323 20262585
2589 20262585 12579817 4797271 1481661 2870607 6051337 7585120 5076127 -1078820
2581 -1078820 -6852275 -8327473 -7093279 -8439593 -12757041 -13201454 -5308002 5190051
2573E190051M240520j841799j80785L935699J249506o398118q566113k128186
2565d499225M038379K050119m319405n949601o97168N517932P619089O353551
2557A0113671M655975L470374K519175J903124Q80357k373017p245910r197489
2549D726260n265877N13285J667417j335136j798318K136998L648452j764512
2541B528569p401946m213146N015531Q525295K142482n112873m170812K213014
2533d73886M952125J137541m189846o189642m886763k113656J821401O959618
2525b983108J1462778J2327450Q138582P34081n821316q139923n839350j364798
2517H514396K092156K608064N53064j675114j728716J99515J800291J858249J343142
$$ plain form
2573 5190051 9430571 7588772 7407987 11343686 12593192 6195074 -2371039 -4499225
2565 -4499225 -460846 1589273 -2730132 -8679733 -9376901 -3858969 3760120 10113671
2557 10113671 14769646 18240020 20759195 22662319 23542676 21169659 13923749 4726260
2549 4726260 -539617 -26332 1641085 305949 -1492369 644629 4293081 2528569
2541 2528569 -4873377 -9086523 -4070992 4454303 6596785 1483912 -2686900 -473886
2533 -473886 4478239 5615780 1425934 -4763708 -9650471 -11764127 -9942726 -2983108
2525 -2983108 8479670 20807120 28945702 29679783 23858467 15718544 9879194 8514396
2517 8514396 10606552 13214616 13767680 12092566 10363850 10563365 12363656 14221905 15565047
2508A5565047P57343r01472l030085k568575R20966K612039j062280o100606o273337
2499h0960k468885n51679j400524l66774L356669M634618J382759j715021j282285
2490A507918j09698m79488M01094L708820M501550j36307m418967k381065J959645
2481D553502J003633l773875m626679p71536Q11345k343966m502948k063003R83555
2472a0729972J099171J182614M128942O668208M897577J272709N96492K441247
2464A1556988K975957J812865J482228J632303n16720m137937m671678q98646
2456I235360K453065J254315k436899l878342k081612L3913J03084j823812m600394
2447a741322o452286n161804p47182K799581J886842r30305J61953N034319O523535
$$ plain form
2508 15565047 16322390 15420918 12390833 9822258 10743224 13355263 12292983 6192377 -80960
2499 -80960 -2549845 -3101524 -4502048 -4868822 -1512153 3122465 4505224 2790203 1507918
2490 1507918 1398220 918732 1319826 5028646 9530196 9393889 4974922 2593857 4553502
2481 4553502 5557135 1783260 -2843419 -3614955 -2803610 -5147576 -9650524 -11713527 -10729972
2472 -10729972 -9630801 -8448187 -4319245 2348963 7246540 8519249 9115741 11556988
2464 11556988 14532945 16345810 17828038 19460341 18943621 14805684 10134006 9235360
2456 9235360 11688425 12942740 10505841 6627499 4545887 4579800 4682884 2859072 -1741322
2447 -1741322 -8193608 -13355412 -14102594 -11303013 -9416171 -10346476 -10184523 -5150204 1373331
2438A373331J135708m353759j997155N367099P862423K689369k719117k311968
2430G045931P73451Q09193j924361l510701l404805m012844n105568l320112K624673
2421a0025143R180431J1219136P004913p3704m553752m389732k941259l942521
2413A478369n701741l696040J664911M705227K802781j13596m81833l46505k445885
2404b134312m888737m874308l478344k193689J068494P006103R887925M538238
2396D931370l982880n404556J403398O525440K934978m041276m363014L689425
2388A692885J1611192J0459237O85483p989596p166689j202K414419l816036r203282
2379a313589m341789N606500P654714n45257q065849o575270j05494L276765K114088
$$ plain form
2438 1373331 2509039 -1844720 -3841875 1525224 9387647 12077016 9357899 7045931
2430 7045931 7819382 8628575 6704214 3193513 -211292 -4224136 -9329704 -12649816 -10025143
2421 -10025143 -844712 10374424 17379337 17305633 12751881 8362149 5420890 1478369
2413 1478369 -4223372 -7919412 -6254501 -1549274 1253507 1139911 658078 311573 -2134312
2404 -2134312 -7023049 -11897357 -15375701 -17569390 -16500896 -9494793 393132 4931370
2396 4931370 948490 -4456066 -3052668 3472772 6407750 2366474 -1996540 1692885
2388 1692885 13304077 23763314 24448797 16459201 9292512 9291310 11705729 7889693 -1313589
2379 -1313589 -5655378 -48878 7605836 7060579 -1005270 -7580540 -7686034 -4409269 -2295181
2370b295181L07199P22609L479196O525769N674081j622480j0542259j1771983
$$ plain form
2370 -2295181 -1987982 -1265373 2213823 8739592 14413673 12791193 2248934 -9523049
$$ [...]
##END NTUPLES=NMR SPECTRUM
##END=
