##TITLE=31Pdec_DE-79K2TFA3
 CDCl3, 64 sc
 2.12.2024
##JCAMPDX= 6.0         $$ Bruker NMR JCAMP-DX V2.0
##DATA TYPE= NMR SPECTRUM
##DATA CLASS= NTUPLES
##ORIGIN= UXNMR, Bruker Analytische Messtechnik GmbH
##OWNER= root
$$ XWIN-NMR		Version 3.5
$$ Mon Dec  2 15:40:53 2024 Russian Standard Time (UT+4h)  she@DPX200
##.OBSERVE FREQUENCY= 81.013821
##.OBSERVE NUCLEUS= ^31P
##.ACQUISITION MODE= SIMULTANEOUS
##.ACQUISITION SCHEME= undefined
##.AVERAGES= 64
##.DIGITISER RES= 17
##SPECTROMETER/DATA SYSTEM= spect
##.PULSE SEQUENCE= zgpg30
##.SOLVENT NAME= CDCl3
##.SHIFT REFERENCE= (INTERNAL, CDCl3, 0, 198.062)
##AUDIT TRAIL= $$ (NUMBER, WHEN, WHO, WHERE, WHAT)
$$ ##TITLE= Audit trail, XWIN-NMR		Version 3.5
$$ ##JCAMPDX= 5.01
$$ ##ORIGIN= Bruker BioSpin GmbH
$$ ##OWNER= she
$$ F:/spectra/data/she/nmr/P31/2/pdata/1/auditp.txt
$$ ##AUDIT TRAIL=  $$ (NUMBER, WHEN, WHO, WHERE, WHAT)
(   1,<2024-12-02 15:39:43.26 +0400>,<she>,<DPX200>,
      <created by zg, POWCHK disabled, PULCHK disabled
       configuration hash MD5:
       00 E9 B6 7A A2 85 ED C7 34 08 36 98 17 FE 4E 26
       data hash MD5: 32K
       12 A2 77 1C 15 01 6D 9B 08 7B 08 16 9C 09 4E 8D>)
(   2,<2024-12-02 15:39:45.57 +0400>,<she>,<DPX200>,
      <Start of raw data processing
       efp BC_mod = 2 LB = 1.5 FT_mod = 6 PKNL = 1 PHC0 = 2223.911 PHC1 = 260.2883 SI = 64K 
       data hash MD5: 64K
       10 4B 31 06 7A 88 2F 5F 0E 27 10 BC 02 61 55 D7>)
(   3,<2024-12-02 15:40:07.25 +0400>,<she>,<DPX200>,
      <pk PHC0 = -3.603918 PHC1 = 0 
       data hash MD5: 64K
       CB 23 C9 97 BB E2 4A 73 14 F8 34 19 DE 79 AD 4E>)
$$ ##END=
$$ 
$$ hash MD5
$$ 40 0D E1 83 31 C1 E7 E4 2D A5 EE 52 11 3D A5 4F
##$RELAX= 
##$RELAX= 
##$RELAX= 
##$RELAX= 
##$RELAX= 
##$RELAX= 
##$RELAX= 
##$RELAX= 
$$ Bruker specific parameters
$$ --------------------------
##$DU= <F:/spectra>
##$EXPNO= 2
##$NAME= <P31>
##$PROCNO= 1
##$TYPE= <nmr>
##$USER= <she>
##$AMP= (0..31)
100 100 100 100 100 100 100 100 100 100 100 100 100 100 100 100 100 100 
100 100 100 100 100 100 100 100 100 100 100 100 100 100 
##$AQSEQ= 0
##$AQ_mod= 1
##$AUNM= <au_zg>
##$AUTOPOS= <>
##$BF1= 81.014009
##$BF2= 200.13
##$BF3= 200.13
##$BF4= 200.13
##$BF5= 200.13
##$BF6= 200.13
##$BF7= 200.13
##$BF8= 200.13
##$BYTORDA= 1
##$CFDGTYP= 0
##$CFRGTYP= 5
##$CHEMSTR= <none>
##$CNST= (0..31)
1 1 145 1 1 1 1 1 1 1 1 1 1 1 1 1 1 1 1 1 1 1 1 1 1 1 1 1 1 1 1 1 
##$CPDPRG= <waltz16>
##$CPDPRG1= <>
##$CPDPRG2= <waltz16>
##$CPDPRG3= <>
##$CPDPRG4= <mlev>
##$CPDPRG5= <mlev>
##$CPDPRG6= <mlev>
##$CPDPRG7= <mlev>
##$CPDPRG8= <mlev>
##$CPDPRGB= <>
##$CPDPRGT= <>
##$D= (0..31)
0 1 0 0 0 0 0 0 0 0.06 0 0.03 2e-05 3e-06 0 0 0.0002 0 0 0 0 0 0 0 0 0 
0 0 0 0 0 0 
##$DATE= 1733139582
##$DBL= (0..7)
120 120 120 11 120 120 24 19 
##$DBP= (0..7)
150 150 150 150 150 150 150 150 
##$DBP07= 0
##$DBPNAM0= <>
##$DBPNAM1= <>
##$DBPNAM2= <>
##$DBPNAM3= <>
##$DBPNAM4= <>
##$DBPNAM5= <>
##$DBPNAM6= <>
##$DBPNAM7= <>
##$DBPOAL= (0..7)
0.5 0.5 0.5 0.5 0.5 0.5 0.5 0.5 
##$DBPOFFS= (0..7)
$$ [...]
##$SUBNAM3= <"">
##$SUBNAM4= <"">
##$SUBNAM5= <"">
##$SUBNAM6= <"">
##$SUBNAM7= <"">
##$SUBNAM8= <"">
##$SUBNAM9= <"">
##$SW= 400.765351723535
##$SWIBOX= (0..15)
0 1 3 0 0 0 0 0 0 0 0 0 0 0 0 0 
##$SW_h= 32467.5324675325
##$TD= 32768
##$TD0= 1
##$TE= 0
##$TE2= 300
##$TE3= 300
##$TEG= 300
##$TL= (0..7)
0 120 53 12 22 120 120 120 
##$TP= (0..7)
150 150 150 150 150 150 150 150 
##$TP07= 0
##$TPNAME0= <>
##$TPNAME1= <>
##$TPNAME2= <>
##$TPNAME3= <>
##$TPNAME4= <>
##$TPNAME5= <>
##$TPNAME6= <>
##$TPNAME7= <>
##$TPOAL= (0..7)
0.5 0.5 0.5 0.5 0.5 0.5 0.5 0.5 
##$TPOFFS= (0..7)
0 0 0 0 0 0 0 0 
##$TUNHIN= 0
##$TUNHOUT= 0
##$TUNXOUT= 0
##$USERA1= <user>
##$USERA2= <user>
##$USERA3= <user>
##$USERA4= <user>
##$USERA5= <user>
##$V9= 5
##$VALIST= <valist>
##$VCLIST= <CCCCCCCCCCCCCCC>
##$VD= 0
##$VDLIST= <DDDDDDDDDDDDDDD>
##$VPLIST= <PPPPPPPPPPPPPPP>
##$VTLIST= <TTTTTTTTTTTTTTT>
##$WBST= 1024
##$WBSW= 4
##$XGAIN= (0..3)
0 0 0 0 
##$XL= 0
##$YL= 0
##$YMAX_a= 17534
##$YMIN_a= -18909
##$ZGOPTNS= <>
##$ZL1= 120
##$ZL2= 120
##$ZL3= 120
##$ZL4= 120
##$ABSF1= 0
##$ABSF2= 0
##$ABSG= 0
##$ABSL= 0
##$ALPHA= 0
##$AQORDER= 0
##$ASSFAC= 0
##$ASSFACI= 0
##$ASSFACX= 0
##$ASSWID= 0
##$AUNMP= <proc_1d>
##$AZFE= 0.1
##$AZFW= 0.5
##$BCFW= 0
##$BC_mod= 2
##$BYTORDP= 0
##$COROFFS= 0
##$CY= -3
##$DATMOD= 1
##$DC= 0
##$DFILT= <>
##$DTYPP= 0
##$F1P= 0
##$F2P= 0
##$FCOR= 1
##$FTSIZE= 65536
##$FT_mod= 6
##$GAMMA= 0
##$GB= 0
##$INTBC= 1
##$INTSCL= 9.790993e-09
##$ISEN= 30
##$LB= 1.5
##$LEV0= 0
##$LPBIN= 0
##$MAXI= 10000
##$MC2= 0
##$MEAN= 0
##$ME_mod= 0
##$MI= 50
##$NCOEF= 0
##$NC_proc= -8
##$NLEV= 6
##$NOISF1= 182.463
##$NOISF2= 159.3651
##$NSP= 0
##$NTH_PI= 0
##$NZP= 0
##$OFFSET= 198.0616
##$PC= 4
##$PHC0= 2220.307
##$PHC1= 260.2883
##$PH_mod= 1
##$PKNL= yes
##$PPARMOD= 0
##$PSCAL= 0
##$PSIGN= 0
##$REVERSE= no
##$SF= 81.0140089999434
##$SI= 65536
##$SIGF1= 159.3651
##$SIGF2= -187.1042
##$SINO= 113.3802
##$SIOLD= 16384
##$SREGLST= <1H.CDCl3>
##$SSB= 0
##$STSI= 65536
##$STSR= 0
##$SW_p= 32467.5324675325
##$SYMM= 0
##$S_DEV= 0
##$TDeff= 32768
##$TDoff= 0
##$TI= <>
##$TILT= no
##$TM1= 0
##$TM2= 0
##$TOPLEV= 0
##$USERP1= <user>
##$USERP2= <user>
##$USERP3= <user>
##$USERP4= <user>
##$USERP5= <user>
##$WDW= 1
##$XDIM= 65536
##$YMAX_p= 328677090
##$YMIN_p= -101811226
$$ End of Bruker specific parameters
$$ ---------------------------------
##NTUPLES= NMR SPECTRUM
##VAR_NAME=  FREQUENCY,     SPECTRUM/REAL,   SPECTRUM/IMAG
##SYMBOL=    X,             R,               I
##VAR_TYPE=  INDEPENDENT,   DEPENDENT,       DEPENDENT
##VAR_FORM=  AFFN,          ASDF,            ASDF
##VAR_DIM=   65536,         65536,           65536
##UNITS=     HZ,            ARBITRARY UNITS, ARBITRARY UNITS
##FACTOR=    0.49542278885378, 1,            1
##FIRST=     16045.7642231865, 0,            0
##LAST=      -16421.768244346, 0,            0
##MIN=       -16421.768244346, -101811226,   0
##MAX=       16045.7642231865, 328677090,    0
$$ Real data points
##PAGE= N=1
##DATA TABLE= (X++(R..R)), XYDATA
$$ [...]
7496E311450J774002K912294l64574m612413n275581k264404R02072J986636J591310
$$ 5311450 7085452 9997746 9633172 5020759 -254822 -2519226 -1617154 369482 1960792
7487A960792Q79971L84838N56829J167262P81227r14479j451703P50858K463565
$$ 1960792 2840763 3225601 3782430 4949692 5730919 4816440 3364737 4115595 6579160
7478F579160l28126n199911n435671l2137M138611K256432j811403k172428N69955
$$ 6579160 6251034 1051123 -4384548 -4416685 -278074 1978358 166955 -2005473 -1435518
7469a435518J854076N64092r13677j551716k031656j989851r57133m40537j367550
$$ -1435518 418558 982650 68973 -1482743 -3514399 -5504250 -6461383 -6901920 -8269470
7460h269470j331709J705745M942413M343732J035458n81584L04692R52528R27494
$$ -8269470 -9601179 -7895434 -2953021 1390711 2426169 1844585 2149277 3101805 4029299
7451D029299K426607M875969M662528J066433k285579k901030k138164j629234
$$ 4029299 6455906 11331875 15994403 17060836 14775257 11874227 9736063 8106829
7443H106829j172325j033578k166105l241267j716921J235179J485946j155826
$$ 8106829 6934504 5900926 3734821 493554 -1223367 11812 1497758 341932
7435C41932j860927J373042L927477J759452k179188k775038m80456L06268j647356
$$ 341932 -1518995 -145953 3781524 5540976 3361788 586750 106294 412562 -1234794
7426a234794l310935k445618j42838J534506J942569J831905K310142L507116
$$ -1234794 -4545729 -6991347 -7134185 -5599679 -3657110 -1825205 484937 3992053
7418C992053L763723J396305k312712l888188k237862j88367k73583j319910q06217
$$ 3992053 7755776 9152081 6839369 2951181 713319 524952 251369 -1068541 -1874758
7409a874758J415926L428991L654690J743275j222870k587418l64243L520167
$$ -1874758 -458832 2970159 6624849 8368124 7145254 4557836 4193593 7713760
7401G713760M719310K086352j062880k234291k722749l713878l433284q71356
$$ 7713760 12433070 14519422 13456542 11222251 8499502 4785624 1352340 480984
7393D80984J301802R04222J65359J743310L645361K452407n43300j221696M97576
$$ 480984 1782786 2687008 2852367 4595677 8241038 10693445 10150145 8928449 9426025
7384I426025N65292k378858m550090k552649J953030M719096L884473J016740
$$ 9426025 9991317 7612459 3062369 509720 2462750 7181846 11066319 12083059
7376A2083059j393554k024887q64889J380909L328284K924398q83143n660080
$$ 12083059 10689505 8664618 7799729 9180638 12508922 15433320 14550177 8890097
7368H890097o636559k482485J875771J381860j922341k252663O51614J677219
$$ 8890097 2253538 -228947 1646824 3028684 1106343 -1146320 -494706 1182513
7360A182513l06051n26597K370322K792727j967834n547035k013394M331723N521538
$$ 1182513 876462 349865 2720187 5512914 3545080 -2001955 -4015349 316374 5837912
7351E837912J681887j117624j196505j644972k664404j357296J752680L031473
$$ 5837912 7519799 6402175 5205670 3560698 896294 -461002 1291678 4323151
7343D323151K171637K045472K696211J692021r2632N33883K588813J865267j659509
$$ 4323151 6494788 8540260 11236471 12928492 12835860 13369743 15958556 17823823 16164314
7334A6164314l834864l791824m561408n871010l660120J915867N246503M062920
$$ 16164314 12329450 8537626 3976218 -1894792 -5554912 -3639045 1607458 5670378
7326E670378K592512L558322L889710J413716q11026m96914l57809k395063l696568
$$ 5670378 8262890 11821212 15710922 17124638 16313612 15816698 15458889 13063826 9367258
7317I367258k165847r65258k620655l846022j342951J889929J553191o28880l37035
$$ 9367258 7201411 6236153 3615498 -230524 -1573475 316454 1869645 1240765 903730
7308I03730J796979J886154l29001j808282j702321j494481j081774O25800K376730
$$ 903730 2700709 4586863 4257862 2449580 747259 -747222 -1828996 -1203196 1173534
7299A173534K102525O55320J94300K44342p85450j738799n50127J417638J216623
$$ 1173534 3276059 3931379 4125679 4370021 3584571 1845772 1295645 2713283 3929906
7290C929906n28248o57356J043801J752942O78966N968O82241J168812P67109
$$ 3929906 3401658 2744302 3788103 5541045 6220011 6225979 6908220 8077032 8844141
7281H844141O87432J300604J453046J000411J151417J813784J256246j030925
$$ 8844141 9531573 10832177 12285223 13285634 14437051 16250835 17507081 16476156
7273A6476156l390009m288368l624886j742111Q56743K792601K669257P07802
$$ 16476156 13086147 8797779 5172893 3430782 4287525 7080126 9749383 10457185
7265A0457185j729337l609716m036929k082261J302435K831699P23323k522906
$$ 10457185 8727848 5118132 1081203 -1001058 301377 3133076 3856399 1333493
7257A333493l623146k894904k209965q64868K348451M771931K807785j407211
$$ 1333493 -2289653 -5184557 -7394522 -8259390 -5910939 -1139008 1668777 261566
7249B61566j833579K329569M825287J570688l254252l540216P0491J856103o08685
$$ 261566 -1572013 757556 5582843 7153531 3899279 359063 429554 2285657 1676972
7240A676972l737445l430747k68159J918823J157300o34130q15727L48513Q72506
$$ 1676972 -2060473 -5491220 -5759379 -3840556 -2683256 -3317386 -4133113 -3784600 -2912094
7231b912094Q98297K347188M427290L369149j379774m580139k246545K091265
$$ -2912094 -2013797 333391 4760681 8129830 6750056 2169917 -76628 2014637
7223B014637K623114m0298q60503Q26467Q09499k144786m284034l506189k169314
$$ 2014637 4637751 4597453 3736950 4563417 5372916 3228130 -1055904 -4562093 -6731407
7214f731407j850911p86361J526833K347134P22844k60839J092614K033650P29517
$$ -6731407 -8582318 -9368679 -7841846 -5494712 -4771868 -5032707 -3940093 -1906443 -1176926
7205a176926R3650K466581M566202K332330k203859l664636j001815K027259K830198
$$ -1176926 -1083276 1383305 5949507 8281837 6077978 2413342 1411527 3438786 6268984
7196F268984K275432J552820M48070r81571j672679r86693N30422J648672R67636
$$ 6268984 8544416 10097236 10545306 9563735 7891056 6904363 7434785 9083457 10051093
7187A0051093j940372n058156n283432k348252N54759J151808O35992M87101j70271
$$ 10051093 8110721 3052565 -2230867 -4579119 -4024360 -2872552 -2236560 -1749459 -1919730
7178a919730j827177k296190p7505K688714L735287M322488N758862N254707J51176
$$ -1919730 -3746907 -6043097 -6120602 -3431888 303399 4625887 10384749 15639456 15790632
7169A5790632n811712o200229j257493K036672j95034m005673m186980r97077
$$ 15790632 9978920 3778691 2521198 4557870 4362836 357163 -3829817 -4826894
7161d826894J941679K939279K787494K333316J881887J674964J379598J80955
$$ -4826894 -2885215 54064 2841558 5174874 7056761 8731725 10111323 10292278
7153A0292278j667470k592373j718829K6446J267644J434776N16293j046601k143448
$$ 10292278 8624808 6032435 4313606 4340052 5607696 7042472 7558765 6512164 4368716
7144D368716k089386j768588k137227k146356k84650K352318L206853K188451
$$ 4368716 2279330 510742 -1626485 -3772841 -4057491 -1705173 1501680 3690131
7136C690131J437839J292341J13815j504066o74581K205409K325211k339187o704273
$$ 3690131 5127970 6420311 6534126 5030060 4355479 6560888 8886099 6546912 -157361
7127a57361n259338M5767K962833J727166j06394j99750L52167J013446K773029
$$ -157361 -5416699 -5370932 -2408099 -680933 -787327 -987077 -634910 378536 3151565
7118C151565M307686K233953k845758n101855j287574L937031M229871K18793
$$ 3151565 7459251 9693204 6847446 1745591 458017 4395048 8624919 8843712
7110H843712k507248k133485k085378l967492m430940j012750L082014L197149
$$ 8843712 6336464 4202979 2117601 -1849891 -6280831 -7293581 -4211567 -1014418
7102a014418k49524k680867j483630J712094M163360M561170K519754j650131
$$ -1014418 -1263942 -3944809 -5428439 -3716345 447015 5008185 7527939 5877808
7094E877808n742961o365770k385801L241939O180325M833630J300048j164499
$$ 5877808 134847 -6230923 -8616724 -5374785 805540 5639170 6939218 5774719
7086E774719j075457M64871J339941P07950m62212j161085j713951k516030k347232
$$ 5774719 4699262 5164133 6504074 7212024 6749812 5588727 3874776 1358746 -988486
7077i88486K68901M174036N923732L620667r00351m254901m765301l126560j031669
$$ -988486 -719585 3454451 9378183 12998850 12098499 7843598 3078297 -48263 -1079932
7068a079932J92470L81965M21770Q35998P77358n74538k155796k209355r53133
$$ -1079932 -887462 -505497 -83727 752271 1529629 955091 -1200705 -3410060 -4363193
7059d363193k9848M06177J480927K535481J560134n83726o9613L953402O855622
$$ -4363193 -4393041 -3986864 -2505937 29544 1589678 1005952 936339 4889741 11745363
7050A1745363M736902J51571j808563p57287k72961j429103j624063J85865J244943
$$ 11745363 16482265 16633836 14825273 14067986 13795025 12365922 10741859 10927724 12172667
7041A2172667p79638m196274n448893l313249J02325J732550O03553j061261l03497
$$ 12172667 11393029 7196755 1747862 -1565387 -1463062 269488 873041 -188220 -491717
7032d91717K594148M070630K157204q02303k118282k846733m805075n808621k360216
$$ -491717 2102431 6173061 8330265 7527962 5409680 2562947 -2242128 -8050749 -10410965
7023a0410965L872684P047003M903638J229683k62239l83892j272793k406445
$$ -10410965 -6538281 508722 5412360 6642043 6379804 5995912 4723119 2316674
7015B316674k025196l5611K322565L787583L051694k59453l713301l859217r34656
$$ 2316674 291478 255867 2578432 6366015 9417709 9158256 5444955 1585738 651082
7006F51082J091099L38040m62657R32012K214500M89931k555172l021479n84823
$$ 651082 1742181 2080221 1617564 2549576 4764076 5254007 2698835 -322644 -907467
6997i07467J527576J367765Q448j030804j417032j183598l73163N10149J097211
$$ -907467 620109 1987874 1996322 965518 -451514 -1635112 -2008275 -1498126 -400915
6988d00915J751711K411052J880358j75102j721999q74680R51701O88827j901748
$$ -400915 1350796 3761848 5642206 5467104 3745105 2870425 3822126 4510953 2609205
6979B609205l575673j710722K531682N581005N012339J491959k188734l841352
$$ 2609205 -966468 -2677190 -145508 5435497 10447836 11939795 9751061 5909709
6971E909709l670082l098309k441296j130235J71475n640j090615p02005J403911
$$ 5909709 2239627 -858682 -3299978 -4430213 -4258738 -4264378 -5354993 -6056998 -4653087
6962d653087K504811J445681Q29875K468429L836657K208623m96894q85915J50316
$$ -4653087 -2148276 -702595 127280 2595709 6432366 8640989 8144095 7258180 7408496
6953G408496o98903l078039l604721j908489j061266j865540j633712M93523J797653
$$ 7408496 6709593 3631554 26833 -1881656 -2942922 -4808462 -6442174 -5948651 -4150998
6944d150998J089383R92130K826125L418331J87536l953946m453521j527980R44891
$$ -4150998 -3061615 -2069485 756640 4174971 4362507 408561 -4044960 -5572940 -4628049
6935d628049J319688J285595J900857K034186Q36448r72249k543179l434095k677774
$$ -4628049 -3308361 -2022766 -121909 1912277 2748725 1776476 -766703 -4200798 -6878572
6926f878572L29914L669543M029034R52361k048196j906526J85984J071384L43910
$$ -6878572 -6548658 -2879115 1149919 2102280 54084 -1852442 -1666458 -595074 -251164
6917b51164L88947K118992L345019K280271M47135K59018J153429N52528j878483
$$ -251164 137783 2256775 5601794 7882065 8329200 8588218 9741647 10294175 8415692
6908H415692l581223l000754j552266p93838j97932P06767M98604j426313k442379
$$ 8415692 4834469 1833715 281449 -512389 -710321 -3554 495050 -931263 -3373642
6899c373642j73931L038947K836374o03807k665310j220476O33058Q3971j040242
$$ -3373642 -3547573 -508626 2327748 1723941 -941369 -2161845 -1528787 -1444816 -2485058
6890b485058L8857K026984J575657j288335l046160j586396J356574K779743J589213
$$ -2485058 -2446201 -419217 1156440 -131895 -3178055 -4764451 -3407877 -628134 961079
6881I61079r70172k704132k174616o359J568518J182163q8137l91691L81383R55052
$$ 961079 -9093 -2713225 -4887841 -4894200 -3325682 -2143519 -2231656 -2623347 -2241964 -1286912
6871a286912R25275J108714J740086J828540P26441p20189j192768n53898j3707
$$ -1286912 -361637 747077 2487163 4315703 5042144 4321955 3129187 2575289 2561582
6862B561582p09520k181099k420068m849L647999N035129K298220k398827n105977
$$ 2561582 1852062 -329037 -2749105 -2753954 894045 5929174 8227394 5828567 722590
6853G22590m308572j989363p18154p77581n08135J162311L155104L373445J297268
$$ 722590 -3585982 -5575345 -6293499 -7071080 -7579215 -6416904 -3261800 111645 1408913
6844A408913j103851j703798j012605j288659k859534l268046j054529J531005
$$ 1408913 305062 -1398736 -2411341 -3700000 -6559534 -9827580 -10882109 -9351104
6836i351104J547869k03988l20240K039304L812469K454783n59874j884112m10770
$$ -9351104 -7803235 -8007223 -8327463 -6288159 -2475690 -20907 -580781 -2464893 -2875663
6827b875663K061786L230126K120412p02535l492319m228962k223550J132223
$$ -2875663 -813877 2416249 4536661 3834126 341807 -3887155 -6110705 -4978482
6819d978482L617935L959761K325017n5266j388627o26137R50704P03362j675404
$$ -4978482 -1360547 2599214 4924231 4868965 3480338 2854201 3804905 4508267 2832863
6810B832863k904641m13438L376786L771759K59969k886342k699747q12317M26848
$$ 2832863 -71778 -485216 2891570 6663329 6923298 4036956 1337209 524892 951740
6801I51740J543465L322863L752939R98332k680292l691613k375715j661355j610014
$$ 951740 2495205 5818068 9571007 10569339 7889047 4197434 1821719 160364 -1449650
6792a449650K00097L188457L649566R38258j051677k18052O52725n15347j114573
$$ -1449650 -1249553 1938904 5588470 6526728 5475051 5256999 5909724 5394377 4279804
6783D279804J030464K826559P32393k922478l589768k017522k444858m693897
$$ 4279804 5310268 8136827 8869220 5946742 2356974 339452 -2105406 -6799303
6775f799303m121953M44106M355385L983823J304252j7805O47908J761690K114001
$$ -6799303 -10921256 -10477150 -6121765 -2137942 -833690 -851495 -203587 1558103 3672104
6766C672104J032139j305642k921130k025542j95933l88364j854523j214443J149306
$$ 3672104 4704243 3398601 477471 -1548071 -1744004 -2132368 -3986891 -5201334 -4052028
6757d052028J017670j986932k469457K022417N867042L398142k389114m417001
$$ -4052028 -3034358 -5021290 -7490747 -5468330 398712 3796854 1407740 -3009261
6749c009261j562066J405188J694780P33698k35128j397475j540788J097436M801251
$$ -3009261 -4571327 -3166139 -1471359 -737661 -972789 -2370264 -3911052 -2813616 1987635
6740A987635N431266K176325j290809j978927o79915O09755J297742J527637J487946
$$ 1987635 7418901 9595226 8304417 6325490 5645575 6255330 7553072 9080709 10568655
6731A0568655J879581K838988K490178q53355n234561o700435m402791j158445
$$ 10568655 12448236 15287224 17777402 16924047 11689486 4989051 586260 -572185
6723e72185R37184K152282K398619P84962j334936p79759K487104M322769K230689
$$ -572185 364999 2517281 4915900 5700862 4365926 3586167 6073271 10396040 12626729
6714A2626729r74945j578666k13407l5639j793504l532434l942809l512865k935619
$$ 12626729 11651784 10073118 9859711 9824072 8030568 4498134 555325 -2957540 -5893159
6705e893159k153247p18795J694137M452723N459745L075750j077179l292486
$$ -5893159 -8046406 -8765201 -7071064 -2618341 2841404 5917154 4839975 1547489
6697A547489k436966j084893j055089o41781J900774M792438N243757L589579
$$ 1547489 -889477 -1974370 -3029459 -3671240 -1770466 3021972 8265729 11855308
6689A1855308K166036J488338L28790j335769k162584j821341j279708r95244
$$ 11855308 14021344 15509682 15838472 14502703 12340119 10518778 9239070 8243826
6681H243826p04802n88253q25147n01401J141017K783299K291138l36297l035129
$$ 8243826 7539024 6950771 6125624 5624223 6765240 9548539 11839677 11503380 8468251
6672H468251m386167m459575l329305q93490J743136K795908K200077J741161
$$ 8468251 4082084 -377491 -3706796 -4600286 -2857150 -61242 2138835 3879996
6664C879996K216707K113627L5827k782532l576508j293383J972602K912316M71538
$$ 3879996 6096703 8210330 8246157 5463625 1887117 593734 2566336 5478652 5950190
6655E950190k636668k646438O38641L156344J639738j935005k929048k12494K856955
$$ 5950190 3313522 667084 1305725 4462069 6101807 4166802 1237754 1025260 3882215
6646C882215L529315K756550K238557J275635j226954l621374l337803j119283
$$ 3882215 7411530 10168080 12406637 13682272 12455318 8833944 5496141 4376858
6638D376858m61391k438232l747098j285434L287015N576877L956870Q02575j339823
$$ 4376858 3915467 1477235 -2269863 -3555297 -268282 5308595 9265465 10068040 8728217
6629H728217k296458k515708j382519J056344K568310J207558j692971l202280
$$ 8728217 6431759 3916051 2533532 3589876 6158186 7365744 5672773 2470493
6621B470493k742860k020737j578842k95885J598206K131960J078251Q30862K377569
$$ 2470493 -272367 -2293104 -3871946 -4167831 -2569625 -437665 640586 1471448 3849017
6612C849017L291689J727296l57841o31548n13169k382418m575464l471803J78732
$$ 3849017 7140706 8868002 8510161 7878613 7365444 4983026 407562 -3064241 -2885509
6603b885509J613652p54671k903970j541571J103631J464152L37304P98005K539400
$$ -2885509 -1271857 -2026528 -4930498 -6472069 -5368438 -3904286 -3566982 -2768977 -229577
6594b29577K537677O91179M31105K816878L933847N65311m282137m835405l75694
$$ -229577 2308100 2999279 3430384 6247262 10181109 10746420 6464283 1628878 1253184
6585A253184L737202K965123j386387m900296n269220l261486n10155J550406
$$ 1253184 4990386 7955509 6569122 1668826 -3600394 -6861880 -7372035 -5821629
6577e821629J740288K43747q93786l6723J873772K902180K891764K792212K306656
$$ -5821629 -4081341 -3837594 -4731380 -4768103 -2894331 7849 2899613 5691825 7998481
6568G998481O94904q52076n61555N22377l37303k902239l742764j381818J571372
$$ 7998481 8693385 7841309 7279754 7802131 7464828 4562589 819825 -561993 1009379
6559A009379K466982J706458O27610n37680j211828k25509J393761P91290j789007
$$ 1009379 3476361 5182819 5810429 5272749 4060921 3835412 5229173 6020463 4231456
6550D231456k282925O75336K752173P23235j958898q07206K249564K391108o7533
$$ 4231456 1948531 2623867 5376040 6099275 4140377 3333171 5582735 7973843 7906310
6541G906310j096795l55085r33667k822773k867005q72124K74180N28664K553385
$$ 7906310 6809515 6454430 5520763 2697990 -169015 -1041139 -766959 -238295 2315090
6532B315090N260177M047328j157303m495021k947194m07990l34679m02133J883915
$$ 2315090 7575267 11622595 10465292 5970271 3023077 2615087 2280408 1878275 3762190
6523C762190L810482K203506r47041k169032j935553j967808r45624K172045M022334
$$ 3762190 7572672 9776178 8829137 6660105 4724552 2756744 1811120 3983165 8005499
6514H005499J521182k099627j712328J359612J504105j946085l972257k229348
$$ 8005499 9526681 7427054 5714726 7074338 8578443 6632358 2660101 430753
6506D30753j9877P7505K2469J809681L651612L082649O02223j876689l530623
$$ 430753 410876 488381 510850 2320531 5972143 9054792 9657015 7780326 4249703
6497D249703l846355j944456J410166L271989J931045o58312j404146K56816K411905
$$ 4249703 403348 -1541108 -130942 3141047 5072092 4413780 3009634 3266450 5678355
6488E678355L097352J574512j577363m489054n027876k785963M39093K491307
$$ 5678355 8775707 10350219 8772856 4283802 -744074 -3530037 -3090944 -599637
6480e99637K557448J140868n74487j386087j245243j549894k992300l718178j593126
$$ -599637 1957811 3098679 2524192 1138105 -107138 -1657032 -4649332 -8367510 -9960636
6471i960636K129269L943366K955989J791354K072923K120055N57122q03799m5043
$$ -9960636 -7831367 -3888001 -932012 859342 2932265 5052320 5609442 4805643 4760600
6462D760600J196792M742l254828n397117m711169k360908k7337J507405J748088
$$ 4760600 5957392 5962134 2707306 -2689811 -7400980 -9761888 -9789225 -8281820 -6533732
6453f533732Q09314K91124J525851K886074J432939k210256l520198j57521M163228
$$ -6533732 -5724418 -5433294 -3907443 -1021369 411570 -1798686 -5318884 -5476405 -1313177
6444a313177M352378P28993j883647r61938J185132J855769J490569J387458Q90554
$$ -1313177 3039201 3768194 1884547 922609 2107741 3963510 5454079 6841537 7732091
6435G732091o72594j346474J029074M677198N316684J757224k712152m942919
$$ 7732091 7059497 5713023 6742097 11419295 16735979 18493203 15781051 10838132
6427A0838132n199820m845294l477802m21190K667910L064879L79626k897667
$$ 10838132 5638312 793018 -2684784 -3105974 -438064 2626815 3006441 108774
6419A08774m069032k550782N731J205069J59654j223920j90924L096710N195999
$$ 108774 -3960258 -6511040 -6505309 -5300240 -5140586 -6364506 -6555430 -3458720 1737279
6410A737279L773618P66007m16759N32745J101854k89j326864j194310P5755Q02803
$$ 1737279 5510897 6276904 5860145 6392890 7494744 7494455 6167591 4973281 5049036 5851839
6400E851839j35373k148045l252904k081503M1325K14583k066623l691022k126558
$$ 5851839 5716466 3568421 315517 -1765986 -1724661 -1510078 -3576701 -7267723 -9394281
6391i394281Q72683J948916J167029J515930L897389N546720L948267J52611k608661
$$ -9394281 -8521598 -6572682 -5405653 -3889723 7666 5554386 9502653 9655264 7046603
6382G046603k368299j44206J010083r31827m110880m234996k22961L413590K233823
$$ 7046603 4678304 4534098 5544181 4612354 501474 -3733522 -3956483 -542893 1690930
6373A690930j760746k822762M37286L651031L419231J304899L3676n30276j635273
$$ 1690930 -69816 -2892578 -2455292 1195739 4614970 5919869 5953545 5423269 3787996
6364C787996k707115k425052r63040N73135J573176J627482K99177j759301k838075
$$ 3787996 1080881 -1344171 -2307211 -1734076 -160900 1466582 1765759 6458 -2831617
6355b831617k140798n03426J111559K281645K388739J346927R21571K638184M418820
$$ -2831617 -4972415 -5475841 -4364282 -2082637 306102 1653029 2574600 5212784 9631604
6346I631604K651732j966874m468382k528782O25742J710053J432651Q86569j331236
$$ 9631604 12283336 10316462 5848080 3319298 3945040 5655093 7087744 7974313 6643077
6337F643077m898186n198943J48302N721109M895024l92708k523538N53003L385072
$$ 6643077 1744891 -3454052 -3305750 2415359 7310383 6917675 4394137 4947140 8332212
6328H332212K266810o0992m82825m67233k063902l460495k161943L68854Q08601
$$ 8332212 10599022 10538030 10055205 9587972 7524070 4063575 1901632 2270486 3079087
6319C079087j039500k384324j525590O61072K589025L243767K136912j69638j737843
$$ 3079087 2039587 -344737 -1870327 -1209255 1379770 4623537 6760449 6590811 4852968
6310D852968r96969J204975K422336J424596p23549k238169k331132j374245k65740
$$ 4852968 3855999 5060974 7483310 8907906 8184357 5946188 3615056 2240811 1975071
6301A975071J27813m22313j107980p61968O81499J790280J256190k80348p60691
$$ 1975071 2102884 1680571 572591 -189377 492122 2282402 3538592 3258244 2497553
6292B497553Q02370L078659L980651K742094O2045k797296m292276l186384k06419
$$ 2497553 3299923 6378582 10359233 13101327 13163372 10366076 6073800 2887416 2680997
6283B680997J901714J563086N56926J080486J978256P76800j603539k012057n93503
$$ 2680997 4582711 6145797 6702723 7783209 9761465 10538265 8934726 6922669 6329166
6274F329166o46560k412151k032096J554929L849564J911687o53647J04154J783366
$$ 6329166 5682606 3270455 1238359 2793288 6642852 8554539 7900892 8005046 9788412
6265I788412K92480k573718k396248k59668p41162l220192k480825J960803M285749
$$ 9788412 10080892 7507174 5110926 4851258 4110096 889904 -1590921 369882 4655631
6256D655631J579954j857282j796336L3712L53406l28264l08287n40725k132162
$$ 4655631 6235585 4378303 2581967 2615679 2969085 2640821 2332534 1791809 -340353
6247c40353l144419j513079J261616K470663K050289J335107L18202r86163p87296
$$ -340353 -3484772 -4997851 -3736235 -1265572 784717 2119824 2438026 1451863 664567
6238F64567J723657L860572K875798J61628j134582r76180j453277k351855j549258
$$ 664567 2388224 6248796 9124594 9286222 8151640 7175460 5722183 3370328 1821070
6229A821070Q07929K197107J722572R59229O58750k81869k079712l125943k608393
$$ 1821070 2628999 4826106 6548678 7507907 8166657 7884788 5805076 2679133 70740
6220G0740j743199j555292j446012p57106J08226R48129K367500M124946M484089
$$ 70740 -1672459 -3227751 -4673763 -5430869 -5322643 -4374514 -2007014 2117932 6602021
6211F602021K522473n0796p88525L83973J243097L10709j336839j756912q69404
$$ 6602021 9124494 9073698 8285173 8669146 9912243 10222952 8886113 7129201 6259797
6202F259797m44051j327863k011281j026962L22269l20117k311844k390731K65968
$$ 6259797 5815746 4487883 2476602 1449640 1771909 1451792 -860052 -3250783 -2984815
6193b984815K310332J307318k02983J357256M547718M504076n3589n030343o452720
$$ -2984815 -674483 632835 429852 1787108 6334826 10838902 10785313 5754970 -697750
6184f97750m538695j579836J107164K749742K444779R20120Q36705L115348M665829
$$ -697750 -5236445 -6816281 -5709117 -2959375 -514596 405524 1242229 4357577 9023406
6175I023406K290183k364682m589616k820457p8325R82145J283905K264346K488831
$$ 9023406 11313589 8948907 4359291 1538834 1460509 2442654 3726559 5990905 8479736
6166H479736l4823l790503n057076k887508n8127J090411J084070R64695K92573
$$ 8479736 8444913 4654410 -402666 -3290174 -3348301 -2257890 -1173820 -209125 83448
6157H3448j060813j579907n42300L07372k17897j48784K259518M445012K793906
$$ 83448 -977365 -2557272 -3099572 -2792200 -3010097 -3158881 -899363 3545649 6339555
6148F339555j069149j893660J141913K883966J99489l156318k507256P50748J939737
$$ 6339555 5270406 3376746 4518659 7402625 7602114 4445796 1938540 2689288 4629025
6139D629025K58371j086251n66649J3836n55882r04854J85115J645682J835747
$$ 4629025 4887396 3801145 3234496 3248332 2692450 1787596 1972711 3618393 5454140
6130E454140P64253l33568o46542l50641m9283k2957q273R6768l87710j834309
$$ 5454140 6218393 5884825 5238283 4887642 4838359 4815402 4807129 4903897 4516187 2681878
6120B681878k799232j438837J175050J506311j423365l866866k328279J348720
$$ 2681878 -117354 -1556191 -381141 1125170 -298195 -4165061 -6493340 -5144620
6112e144620K708873J125923K00106K044120M378746M091124J331029j188832
$$ -5144620 -2435747 -1309824 -1109718 934402 5313148 9404272 10735301 9546469
6104I546469j664317q32080n70401j576859k740319k892117k444158k207340j344894
$$ 9546469 7882152 7050072 6479671 4902812 2162493 -729624 -3173782 -5381122 -6726016
6095f726016J311353M134415L874201N72413j925772j523460l65655j33624R19295
$$ -6726016 -5414663 -1280248 2593953 3166366 1240594 -282866 -648521 -782145 137150
6086A37150L439748L961660O53853j941424O80406N053164M442739q07406m367471
$$ 137150 3576898 7538558 8192411 6250987 6931393 11984557 16427296 15619890 11252419
6077A1252419l905241k803454k522857r69020R60205q02953n186945n311094O68953
$$ 11252419 7347178 4543724 2020867 1051847 2012052 1209099 -3977846 -9288940 -8619987
6068h619987N436170L574248j47409P91373L950257K746354k192102m225128j316388
$$ -8619987 -3183817 390431 243022 1034395 4984652 7731006 5538904 1313776 -2612
6059b612J738604J438557j91450l27662N33376O35046k09168j190894j828104
$$ -2612 1735992 3174549 2983099 2655437 3188813 3823859 3614691 2423797 595693
6050E95693k018452k071296k489929k708645j168337K072775M465822M318338
$$ 595693 -1422759 -3494055 -5983984 -8692629 -9860966 -7788191 -3322369 995969
6042I95969L027406K141726P55637j629699k492080j26273K317020R08971k688593
$$ 995969 4023375 6165101 6920738 5291039 2798959 2672686 4989706 5898677 3210084
6033C210084l546897j036324P94190M5985o75606P50843K936687L907448L461878
$$ 3210084 -336813 -1373137 -578947 -532962 -1208568 -457725 2478962 6386410 9848288
6024I848288J825453p24306k354928j260226P31697j94641l890574n865476l958307
$$ 9848288 11673741 10949435 8594507 7334281 8065978 7871337 3980763 -1884713 -5843020
6015e843020j297266q81684j238585M6842K028959K647737K437808K827134K995504
$$ -5843020 -7140286 -8021970 -9260555 -9213713 -7184754 -4537017 -2099209 727925 3723429
6006C723429J667668K85825J064598K990441K969379M63753j929753k479290k232231
$$ 3723429 5391097 5676922 6741520 9731961 12701340 13165093 11235340 8756050 6523819
5997F523819k430091k258787l99871K359292L403421J216290k566883m584463
$$ 6523819 4093728 1834941 1435070 3794362 7197783 8414073 5847190 1262727
5989A262727l343485o96346Q42313J208499J778225K232189R33647j672718k894378
$$ 1262727 -2080758 -2777104 -1934791 -726292 1051933 3284122 4217769 2545051 -349327
5980c49327j793305o56027j192588j890315r81535M03472N05330L50773J889546
$$ -349327 -2142632 -2798659 -3991247 -5881562 -6863097 -6459625 -5954295 -5603522 -3713976
5971c713976L949955L332044k57649l275034k875582j80649J733082J434007j15488
$$ -3713976 235979 3568023 3310374 35340 -2840242 -3020891 -1287809 146198 30710
5962C0710j247883j192216n12054l28045q84703j175055m97419K22523k94855
$$ 30710 -1217173 -2409389 -2921443 -3249488 -4134191 -5309246 -5806665 -5584142 -5878997
5953e878997j504991j530742P3817J443917R81163j78880N28412L440985N526202
$$ -5878997 -7383988 -8914730 -8840913 -7396996 -6415833 -6594713 -6066301 -2625316 2900886
5944B900886L817167n20481l094876j686549J017795J509042N02624J158868L287649
$$ 2900886 6718053 6197572 3102696 1416147 2433942 3942984 4445608 5604476 8892125
5935H892125L184348k62464l302612k993110j514357j971403k968568j219902
$$ 8892125 12076473 11814009 8511397 5518287 4003930 2032527 -936041 -2155943
5927b155943K475513M180395K823544J065889L70339o49477k400190k777256q60596
$$ -2155943 319570 4499965 7323509 8389398 8759737 8110260 5710070 2932814 2072218
5918B072218J086202R78668l47318j301256j926253k399130j510470J286369M145177
$$ 2072218 3158420 4137088 3789770 2488514 562261 -1836869 -3347339 -2060970 2084207
5909B084207N080252M331378K811136J88395l320519n201386l549241n08595J59172
$$ 2084207 7164459 11495837 14306973 14495368 11174849 5973463 2424222 1915627 2074799
5900B074799j649778k382024j5152L313177M213363J664333k441599m792068l004118
$$ 2074799 425021 -1957003 -1972155 1341022 5554385 7218718 4777119 -14949 -3019067
5891c019067J692509M594321K488571k040084l787485j831444L7396l83248j115006
$$ -3019067 -1326558 3267763 5756334 3716250 -71235 -1902679 -1865283 -2248531 -3363537
5882c363537o34421o39969j917284j607345J907618M789877K778887j933572l627600
$$ -3363537 -3997958 -4637927 -6555211 -8162556 -6254938 -1465061 1313826 -619746 -4247346
5873d247346j378037N98519L04721K91661K016104L064837J778082J38892k52107
$$ -4247346 -5625383 -5026864 -4722143 -4430482 -2414378 650459 2428541 2567433 2315326
5864B315326r96091k900474l034956N57942M372101L943301N86677r18743J97654
$$ 2315326 1319235 -1581239 -4616195 -4058253 313848 4257149 4843826 3925083 4122737
5855D122737N54872o31484q7452L152769M830067J505272l929806n852632k939113
$$ 4122737 4677609 4046125 3958673 7111442 11941509 13446781 9516975 3664343 725230
5846G25230J234509L297120L043183J742279l3341k226142m194746m656205k788222
$$ 725230 1959739 5256859 8300042 10042321 10008980 7782838 3588092 -1068113 -3856335
5837c856335N40602K908556K496550K25291j095215K8299K241355L175743J857595
$$ -3856335 -3315733 -407177 2089373 2314664 1219449 1247748 3489103 6664846 8522441
5828H522441q91742l340608l820292j982579M64955J319905M40386m71827o72215
$$ 8522441 7630699 4290091 469799 -1512780 -1047825 272080 712466 240639 -431576
5819d31576j045598j515701k52485L030799N233086L657678Q2635j636893r94910
$$ -431576 -1477174 -2992875 -3245360 -214561 5018525 8676203 8758838 7121945 6127035
5810F127035q17096k163051k645210p14967J387999R00145j280860k023286n48758
$$ 6127035 5309939 3146888 501678 -213289 1174710 2074855 793995 -1229291 -1778049
5801a778049P64827N6952j564571j877260n13512Q28010N44971j122510k232284
$$ -1778049 -1013222 -956270 -2520841 -4398101 -4911613 -4083603 -3538632 -4661142 -6893426
5792f893426q68544K703965N518178M560541M92426k434065j229786K173658L669072
$$ -6893426 -7761970 -5058005 460173 5020714 5513140 3079075 1849289 4022947 7692019
5783G692019K283343L65822q40013k424315m097927l076590J206594M529004L164568
$$ 7692019 9975362 10341184 9501171 7076856 2978929 -97661 1108933 5637937 8802505
5774H802505o64240k186353r99216m34547j365301j524947p35292j615717m077252
$$ 8802505 8138265 5951912 4952696 4518149 3152848 1627901 892609 -723108 -4800360
5765d800360m066650P1562M169359L841630J88414k661634k671161j43195L906015
$$ -4800360 -8867010 -8795448 -4626089 -784459 -596045 -3257679 -5928840 -6072035 -2166020
5756b166020O843764N182452m37742m134899k357373O03158p87172m204950k975161
$$ -2166020 4677744 9860196 9422454 5287555 2930182 3533340 2746168 -1458782 -4433943
5747d433943K911424O027277K304016l376070m330260k52624M047535M693829
$$ -4433943 -1522519 4504758 6808774 3432704 -897556 -1150180 2897355 7591184
5739G591184J462517k941190m750755k455585R00837J080317j452025k172859
$$ 7591184 9053701 6112511 1361756 -1093829 -192992 887325 -564700 -2737559
5731b737559N25833K997891K346717O41801P06668J346458N5173k210664k567856
$$ -2737559 -2211726 786165 3132882 3774683 4481351 5827809 5882982 3672318 1104462
5722A104462r43649l011j074785k702184k885730j030751J854632L797172L572434
$$ 1104462 160813 157802 -916983 -3619167 -6504897 -7535648 -5681016 -1883844 1688590
5713A688590K424873K512477L160932J289026l247727n940470l592349Q89958
$$ 1688590 4113463 6625940 9786872 11075898 7828171 1887701 -1704648 -814690
5705h14690K670026J412658M2050o38337j727340k061308P69156N229376O319944
$$ -814690 1855336 3267994 3310044 2671707 944367 -1116941 -347785 4881591 11201535
5696A1201535K412860k165754l015086r98832L11256K6245J46507J559722K384830
$$ 11201535 13614395 11448641 8433555 7434723 7745979 7772224 7918731 9478453 11863283
5687A1863283O92224k454329l731811j527637J576654J546002j954602m979757
$$ 11863283 12555507 10101178 6369367 4841730 6418384 7964386 6009784 1030027
5679A030027m472275j775098L37734J563112K660739K614265N88048j108100J8979
$$ 1030027 -3442248 -5217346 -4879612 -3316500 -655761 1958504 2546552 1438452 1457431
5670A457431J948722Q46744k192868k176423J600296L735885R11372k988480k893427
$$ 1457431 3406153 4252897 2060029 -116394 1483902 5219787 6131159 3142679 249252
5661B49252K46840J851788M72037j522745k191229j604307l25458R18216R48568
$$ 249252 496092 2347880 2819917 1297172 -894057 -2498364 -2823822 -1905606 -957038
5652i57038k54370p27524P09033K269821J928721P18586P36868J335500L39724
$$ -957038 -1211408 -1938932 -1229899 1039922 2968643 3687229 4424097 5759597 6099321
5643F099321j900676k851208j755208k73825O41652J560581K163850J022788j551248
$$ 6099321 4198645 1347437 -407771 -681596 -39944 1520637 3684487 4707275 3156027
5634C156027l053813k148670l50320N66126Q49927J404921J903921J613591R18990
$$ 3156027 102214 -2046456 -2396776 -1830650 -980723 424198 2328119 3941710 4860700
5625D860700P95539J406463J988349J659234O2423k155669l438730k689301n84550
$$ 4860700 5656239 7062702 9051051 10710285 10772708 8617039 5178309 2489008 1904458
5616A904458J210288J913802J846537J275901K88968o17286j208655k252311l944411
$$ 1904458 3114746 5028548 6875085 8150986 8439954 7822668 6614013 4361702 417291
5607D17291m285114j327982L203239N183022L297698M38894o91983o93663j139399
$$ 417291 -3867823 -5195805 -1992566 3190456 6488154 6927048 6235065 5541402 4402003
5598D402003j788760j790041j581894j825553k049428j844617j823897k069115
$$ 4402003 2613243 823202 -758692 -2584245 -4633673 -6478290 -8302187 -10371302
5590a0371302j422311K68935J217784O87519P50927K939212N233141M961869K826823
$$ -10371302 -11793613 -11524678 -10306894 -9619375 -8868448 -5929236 -696095 4265774 7092597
5581G092597J179624P2071j623777k688032j155814J385254J439373n53343n85854
$$ 7092597 8272221 8344292 6720515 4032483 2876669 4261923 5701296 5147953 4562099
5572D562099J960588K516330j423060n493625m232383J318587N450640N347617
$$ 4562099 6522687 9039017 7615957 2122332 -2110051 -791464 4659176 10006793
5564A0006793L091075J098359o34828k411731l100345j871634Q2358Q21683j73748
$$ 10006793 13097868 14196227 13561399 11149668 8049323 6177689 6260047 7081730 6907982
5555F907982j776571k495971j584018M72302K102531J815371k18770j947023j365485
$$ 6907982 5131411 2635440 1051422 1523724 3626255 5441626 5222856 3275833 1910348
5546A910348J134401K762166J251631k282024m226687k524683J108496L637151
$$ 1910348 3044749 5806915 7058546 4776522 549835 -1974848 -866352 2770799
5538B770799M125551L415949J747184r49623l050294k506594m09494k79033k824891
$$ 2770799 6896350 10312299 12059483 11109860 8059566 5552972 5143478 4864445 2039554
5529B039554m444934k609560K97126J073634Q46227K469860M751893L841451j18346
$$ 2039554 -2405380 -5014940 -4717814 -3644180 -2797953 -328093 4423800 8265251 8146905
5520H146905k459753j055620M12734j544628m479168l549546J255606N019867
$$ 8146905 5687152 4631532 5044266 3499638 -979530 -4529076 -3273470 1746397
5512A746397M433195J344665n47946j38161R05298Q08328n98439k115278k326937
$$ 1746397 6179592 7524257 6976311 6838150 7743448 8551776 7953337 5838059 3511122
5503C511122q39720J265450K451421K196667J068723l57567j742053k289791j220872
$$ 3511122 2671402 3936852 6388273 8584940 9653663 9296096 7554043 5264252 4043380
5494D043380O19838J092218k92529j173335K74310K007478P47228k513588k953984
$$ 4043380 4663218 5755436 5462907 4289572 4563882 6571360 7318588 4805000 1851016
5485A851016J107881M906488L345972j931283m962126l656077j580287j484174
$$ 1851016 2958897 7865385 11211357 9280074 4317948 661871 -918416 -2402590
5477b402590j281908J535225M748351M028648o11314m282637l388384J48923J937020
$$ -2402590 -3684498 -2149273 2599078 6627726 6016412 1733775 -1654609 -1505686 431334
5468D31334P81475m88073N03567K383500K433546R56644P40847K115955J693476
$$ 431334 1212809 724736 1228303 3611803 6045349 7001993 7742840 9858795 11552271
5459A1552271k133900n323487l291857J878288L776862P88615j955220o84257
$$ 11552271 9418371 4094884 803027 2681315 6458177 7246792 5291572 4607315
5451D607315J777928J290331j168232j740787M36508L015051M113765L264412
$$ 4607315 6385243 7675574 6507342 4766555 5203063 8218114 12331879 15596291
5443A5596291N43302k483760k977775q32228j43666l377755o603931m780963L92455
$$ 15596291 16139593 13655833 10678058 9845830 9702164 6324409 -279522 -5060485 -4668030
5434d668030K987195J742584P72677J912349K501697J550304J982221M628682
$$ -4668030 -1680835 61749 834426 2746775 5248472 6798776 8780997 13409679
5426A3409679N483140K070052j977127k312502k17078K97656j134337j789490
$$ 13409679 18892819 20962871 18985744 16673242 16456164 16753820 15619483 13829993
5418A3829993q49995O2909K60571M33528L03866j131967l177814l813439k618073
$$ 13829993 12979998 13042907 13303478 13737006 14040872 12908905 9731091 5917652 3299579
5409C299579j302964j117899j310595m81096J548438L400152L213000L55862l521910
$$ 3299579 1996615 878716 -431879 -912975 635463 4035615 7248615 7604477 4082567
5400D082567n610907m421813q22675K976981M580101K489870j914595m106905
$$ 4082567 -1528340 -5950153 -6772828 -3795847 784254 3274124 1359529 -2747376
5392b747376r34081M590632O180296K389256j784387k420958j573593k342230
$$ -2747376 -3681457 909175 7089471 9478727 7694340 5273382 3699789 1357559
5384A357559l217522j214423K236615L031082P02815j046339K01391K777871L637212
$$ 1357559 -1859963 -3074386 -837771 2193311 2896126 1849787 2051178 4829049 8466261
5375H466261J629424j808398l750880k349871N09269P12459k521145m916475l072391
$$ 8466261 10095685 8287287 4536407 2186536 2695805 3408264 887119 -4029356 -7101747
5366g101747N85033J791982P91517P44484J785119J253209j076089k452546j627607
$$ -7101747 -6516714 -4724732 -3933215 -3188731 -1403612 -150403 -1226492 -3679038 -5306645
5357e306645o424J404884K483390J928731j158229l970040k800053P82002J475972
$$ -5306645 -5313069 -3908185 -1424795 503936 -654293 -4624333 -7424386 -6642384 -5166412
5348e166412j390594k414787J215328M941227L880160J99077o90489J790025L569894
$$ -5166412 -6557006 -8971793 -7756465 -2815238 1064922 1263999 573510 2363535 5933429
5339E933429K485390M15754o79654j271946k261499k987780k306281m04586J327786
$$ 5933429 8418819 8834573 8154919 6882973 4621474 1633694 -672587 -1077173 250613
5330B50613J862639J510930J244701J255897Q19427k61277j163328j555849k078447
$$ 250613 2113252 3624182 4868883 6124780 6944207 6682930 5519602 3963753 1885306
5321A885306k313392m39582L149086M371152Q24482l548545l417956k2781J065289
$$ 1885306 -428086 -867668 2281418 6652570 7477052 3928507 510551 487770 1553059
5312A553059q15729p85906K432055L684133J97621l243439j987452J053734O97428
$$ 1553059 737330 -48576 2383479 6067612 6265233 3021794 1034342 2088076 2785504
5303B785504k056518k508723k40146J115783K93144p69728j395580k388331k437441
$$ 2785504 728986 -1779737 -2019883 -904100 -610956 -1380684 -2776264 -5164595 -7602036
5294g602036O35343M948640N712596K174389q91802o8369K111913J506141j693619
$$ -7602036 -6966693 -2018053 3694543 5868932 4977130 4908761 7020674 8526815 6833196
5285F833196l948599l535967k068791j261999l65128K145533N136080M951772
$$ 6833196 2884597 -651370 -2720161 -3982160 -4347288 -2201755 2934325 7886097
5277G886097K23824m832386m741716k35747K244674l45402l196465j131037L310005
$$ 7886097 8109921 3277535 -1464181 -1699928 544746 199344 -2997121 -4128158 -818153
5268h18153L771446n16142m490185n107948l992532k459336N19426M228701N088390
$$ -818153 2953293 2437151 -2053034 -7160982 -11153514 -13612850 -13093424 -8864723 -3776333
5259c776333J864198j725770j878069P63011L316023M476148M067719J569175
$$ -3776333 -1912135 -3637905 -5515974 -4752963 -1436940 3039208 7106927 8676102
5251H676102k407146n182957m847323k510518j42979J873695L396908L147037
$$ 8676102 6268956 1085999 -3761324 -6271842 -6414821 -4541126 -1144218 2002819
5243B002819J074470k295J981866M586001L791368k32647l329364k971329q39869
$$ 2002819 3077289 3074994 5056860 9642861 13434229 13201582 9872218 6900889 6061020
5234F061020L12175j74557j333697k113180j781599l55017R29630Q90139K48382
$$ 6061020 6373195 6198638 4864941 2751761 970162 615145 1544775 2434914 2683296
5225B683296O73633J941772J957811L4093j851431j962866j153754j061089j501762
$$ 2683296 3356929 5298701 7256512 7290605 5439174 3476308 2322554 1261465 -240297
5216b40297j232151k06087N36675N20764n2422j148856k382872k358403l15512
$$ -240297 -1472448 -1678535 -1141860 -621096 -673518 -1822374 -4205246 -6563649 -6879161
5207f879161J991459K061744K60520m29364J306015L110773K191738j065189l790961
$$ -6879161 -4887702 -2825958 -2565438 -2994802 -1688787 1421986 3613724 2548535 -1242426
5198a242426l711442o95259L430804N757741M460908J089800p90778j14271N50839
$$ -1242426 -4953868 -5649127 -2218323 3539418 8000326 9090126 8299348 8185077 8735916
5189H735916m57750j004695Q10699K497436P95895k432952k502124O69682K287618
$$ 8735916 8278166 7273471 8084170 10581606 11377501 8944549 6442425 7112107 9399725
5180I399725K14321k042410j307339P06501J080044J58117l99901q91813j897645
$$ 9399725 9614046 7571636 6264297 6970798 8050842 8208959 7809058 6917245 5019600
5171E019600j940029L5049J944634J471568j22694k59002N46973M5312j241167
$$ 5019600 3079571 3114620 5059254 6530822 6408128 6149126 6696099 6741411 5500244
5162E500244q06105R72185P51691k386716m987431m030026r73071P79138N17640
$$ 5500244 4694139 5666324 6418015 4031299 -956132 -4986158 -5959229 -5180091 -4662451
5153d662451K91022J295288K254510J636799J09670k64825J059530K272454J776285
$$ -4662451 -4371429 -3076141 -821631 815168 924838 660013 1719543 3991997 5768282
5144E768282L05880p28572j649282l106109l424414o10258L337368M027848J186707
$$ 5768282 6074162 5345590 3696308 590199 -2834215 -3444473 -107105 3920743 5107450
5135E107450o51184O68516J677993k56715k081320o99232Q70203j529791n233850
$$ 5107450 4456266 5124782 6802775 6546060 4464740 3765508 4635711 3105920 -2127930
5126b127930m240628R67848L899372K268874R95104L389229N445094K246863m221395
$$ -2127930 -6368558 -5400710 -1501338 767536 1762640 5151869 10596963 12843826 8622431
5117H622431p599355n211718l37198K470956J859895j78671j029500n9992J172094
$$ 8622431 1023076 -4188642 -4525840 -2054884 -194989 -373660 -1403160 -1463152 -291058
5108b91058J208706M55337P8222K91086Q67290K023004L288947L027442R21194
$$ -291058 917648 1372985 1451207 1742293 2609583 4632587 7921534 10948976 11870170
5099A1870170p82475o98327r14881l363920n761559m766917j272808J489427L228047
$$ 11870170 11087695 10389368 9474487 6110567 349008 -4417909 -5690717 -4201290 -973243
5090i73243N258459N709298J925266l205413l792171p7470J505574j469529l853733
$$ -973243 4285216 9994514 11919780 8714367 4922196 4844726 6350300 4880771 1027038
5081A027038j788251J364130J459488K52879J181716K869005J615053k525927
$$ 1027038 -761213 602917 2062405 2315284 3497000 6366005 7981058 5455131
5073E455131o253487p446697n937152k142578K213844M232912L204762J688803
$$ 5455131 -798356 -8245053 -14182205 -16324783 -14110939 -9878027 -6673265 -4984462
5065d984462J410311J004221k53701j31821K454336M581032L657388J331102l1918
$$ -4984462 -3574151 -2569930 -2823631 -2955452 -501116 4079916 7737304 9068406 9036488
5056I036488j235137l124763l259215J2603L343469K905744L86935l01584K89077
$$ 9036488 7801351 4676588 1417373 1429976 4773445 7679189 8066124 7764540 8053617
5047H053617r10920k900700j871295J786522L410464J133896j898938k845097
$$ 8053617 7142697 4241997 2370702 4157224 7567688 8701584 6802646 3957549
5039C957549k317960j615321p51899m6465k73545o24868M02207J845837J251466
$$ 3957549 1639589 24268 -727631 -774096 -1047641 -1672509 -1270302 575535 1827001
5030A827001j005189j866420n39501L23224o86689j459122l36126Q86514J40675
$$ 1827001 821812 -1044608 -1584109 -1260885 -1947574 -3406696 -3742822 -2856308 -2715633
5021b715633j187085k77436K750536M840793L904405R75682j526792k413799k147461
$$ -2715633 -3902718 -4180154 -1429618 3411175 7315580 8291262 6764470 4350671 2203210
5012B203210j388896j15219J501558K224440R90900j222240k232666j492091o09958
$$ 2203210 814314 699095 2200653 4425093 5415993 4193753 1961087 468996 -140962
5003a40962q38476j721910k521270k989914k312516L49115L441705L720047O59008
$$ -140962 -979438 -2701348 -5222618 -8212532 -10525048 -10175933 -6734228 -3014181 -2355173
4994b355173k229968j957146L49534J853752J638585L71408j219772j857143j12755
$$ -2355173 -4585141 -6542287 -6192753 -4339001 -2700416 -2329008 -3548780 -5405923 -5518678
4985e518678L038785M494742L304123J902449J715359R68905j307271k879502
$$ -5518678 -2479893 2014849 5318972 7221421 8936780 9905685 8598414 5718912
4977E718912k259899j283781j253983o06553Q30671l1004l581719m703568n66577
$$ 5718912 3459013 2175232 921249 314696 1145367 1114363 -2467356 -7170924 -7737501
4968g737501L622867K300380j473532j267528K220246L268849J088996l8913Q54667
$$ -7737501 -4114634 -1814254 -3287786 -4555314 -2335068 933781 2022777 1983864 2838531
4959B838531M34885j948450l144298k180064j223980n57008J482418L523870K163380
$$ 2838531 3273416 1324966 -1819332 -3999396 -5223376 -5780384 -4297966 -774096 1389284
4950A389284j622123k773107L98437M182448N430572M651124K855437K27783j744711
$$ 1389284 -232839 -3005946 -2607509 1574939 7005511 11656635 14512072 14739855 12995144
4941A2995144j529367r90346k861576n125237l221962K143852M992219K515407
$$ 12995144 11465777 10475431 7613855 2488618 -733344 1410508 6402727 8918134
4933H918134j613825l272471k562853j495594j031501j295497j725921j095890
$$ 8918134 7304309 4031838 1468985 -26609 -1058110 -2353607 -4079528 -5175418
4925e175418K73953O0895j702726j213733K429543L700308q16480n329726l366393
$$ -5175418 -4901465 -4840570 -6543296 -7757029 -5327486 -1627178 -2443658 -7773384 -11139777
4916a1139777J415383J492016j730355j230756K844117M280134K307979J288068
$$ -11139777 -9724394 -8232378 -9962733 -11193489 -8349372 -4069238 -1761259 -473191
4908d73191Q44694k651681o394977m334518J261970K878699P68398R65420K475861
$$ -473191 371503 -2280178 -8675155 -13009673 -11747703 -8869004 -8100606 -7135186 -4659325
4899d659325l21326m648492l152482J335174M40996k829727O37845O523619L158487
$$ -4659325 -4980651 -9629143 -12781625 -11446451 -11005455 -13835182 -13197337 -6673718 -3515231
4890c515231m802957k260529P287086N326716p241815r284378K005549M813363
$$ -3515231 -8318188 -10578717 -3291631 2035085 -5206730 -14491108 -12485559 -7672196
4882g672196o261238r035678L005095N717057q231139r991919J0270695J6521886
$$ -7672196 -13933434 -22969112 -19964017 -14246960 -22478099 -32470018 -22199323 -5677437
4874e677437m409063K829727P6855909J47603969J11473985j5604670j05762192
$$ -5677437 -10086500 -7256773 69599136 217203105 328677090 313072420 207310228
4867B07310228q7811669k6567725q499705k6266498k5025774j806663N372270
$$ 207310228 119498559 92930834 84431129 58164631 33138857 31332194 36704464
4860C6704464q039626j2134926k27363N174619k108086m407944L100088N350211
$$ 36704464 28664838 16529912 16302549 21477168 19369082 14961138 18061226 23411437
4852B3411437j638075m392404R08581K447124l233964n663250j817309q38246
$$ 23411437 21773362 17380958 18289539 20736663 17502699 11839449 10022140 9183894
4844I183894m435279l318301L550741N614556K20094k780926L38594J428814k562156
$$ 9183894 4748615 1430314 4981055 10595611 10815705 8034779 8373373 9802187 7240031
4835G240031l788907M45035J950417k415686m242715P21356M527138J609162j671762
$$ 7240031 3451124 3896159 5846576 3430890 -811825 -90469 4436669 6045831 4374069
4826D374069N22842L488463K150183L32745J826119K122213k478484o203527k924836
$$ 4374069 4896911 8385374 10535557 10868302 12694421 14816634 12338150 6134623 3209787
4817C209787L249517M779535K037107J65201k2842o48825r01254N46864J207850
$$ 3209787 6459304 11238839 13275946 13441147 13418305 12769480 11868226 12415090 13622940
4808A3622940r73695k885053j496381J79434j660991m276348k763352J395120
$$ 13622940 12649245 9764192 8267811 8447245 6786254 2509906 -253446 1141674
4800A141674K882620J355336Q84135J879578M38499l995758o471848l702504J199778
$$ 1141674 4024294 5379630 6263765 8143343 8581842 4586084 -1885764 -5588268 -4388490
4791d388490L329166K114665N92147O61142J434945J560857J152379Q81679L15944
$$ -4388490 -1059324 1055341 1647488 2308630 3743575 5304432 6456811 7338490 7654434
4782G654434j466209l659877l801159j019088K221736L134675K085761J222567
$$ 7654434 6188225 2528348 -1272811 -2291899 -70163 3064512 5150273 6372840
4774F372840R58350K30107p64009q30186j97695p7587l82927l96795q04129k217311
$$ 6372840 7331190 7561297 6797288 5967102 5769407 5691820 5308893 4912098 4107969 1890658
4764A890658k806240q29517J549580J055877q86761O4593L668738M707166J182339
$$ 1890658 -915582 -1745099 -195519 860358 -26403 38190 3706928 8414094 9596433
4755I596433k295317j542103J256158J593208q00927k648224k110331k87422R49695
$$ 9596433 7301116 5759013 7015171 8608379 7807452 5159228 3048897 2761475 3711170
4746C711170P20109l78255p56698R6341L62330j208591j966075J518765P154830
$$ 3711170 4431279 4053024 3296326 3392667 3754997 2546406 580331 2099096 9253926
4737I253926Q612528L991719j203209j762594O21053J203883q32401k689639k874857
$$ 9253926 17866454 21858173 20654964 18892370 19513423 20717306 19884905 17195266 14320409
4728A4320409k350220j966320j542266j011677o76787o99586j226070k266561
$$ 14320409 11970189 10003869 8461603 7449926 6773139 6073553 4847483 2580922
4720B580922l086853k860902j937225r67082P59371L878971O405571N595904K177640
$$ 2580922 -505931 -3366833 -5304058 -6271140 -5511769 -1632798 4772773 10368677 12546317
4711A2546317n30907j535257k423244k870107o73539K977376L477181j56131l208921
$$ 12546317 12015410 10480153 8056909 5186802 4513263 7490639 10967820 10811689 7602768
4702G602768k560639j026622j466922j687684P19873L045242J875995q18255j203129
$$ 7602768 5042129 4015507 2548585 860901 1580774 4626016 6502011 5683756 4480627
4693D480627j48105p87400j937698L2881M019280M875479J275448k484098l204178
$$ 4480627 4332522 3545122 1607424 1640305 5659585 10535064 11810512 9326414 6122236
4684F122236k501699k565677k486939q83769R70478J005216m76332j385827o96821
$$ 6122236 3620537 1054860 -1432079 -2315848 -1345370 -340154 -816486 -2202313 -2899134
4675b899134N26113N91704q27704k159770j703259J01569J267362J231597J333431
$$ -2899134 -2373021 -1781317 -2609021 -4768791 -6472050 -6370481 -5103119 -3871522 -2538091
4666b538091J756423O58042k109375l286576q15418K338010K250201n6978n26546
$$ -2538091 -781668 -123626 -2233001 -5519577 -6334995 -3996985 -1746784 -1803762 -2330308
4657b330308J540466L101431K703408K037207K068015J476297l77346k232021
$$ -2330308 -789842 2311589 5014997 7052204 9120219 10596516 10219170 7987149
4649G987149l386281m367859m548337k291669J533094L334823J590148q51059
$$ 7987149 4600868 233009 -4315328 -6606997 -5073903 -1739080 -148932 -999991
4641i99991r08002O76416J264060K60612r00516j214925o56413O02408J863238
$$ -999991 -1907993 -1231577 32483 293095 -607421 -1822346 -2478759 -1876351 -13113
4632a3113J759513n3444j878426j914403l19256J795094M091844O029338N497451
$$ -13113 1746400 1692956 -185470 -2099873 -2419129 -624035 3467809 9497147 14994598
4623A4994598J119950m390574o060849k659125J514763K202655L87624k17459
$$ 14994598 16114548 11723974 5663125 3004000 4518763 6721418 7109042 6891583
4615F891583R01469R23716j013018k195459j126922l62447k004130l244918k75462
$$ 6891583 7793052 8716768 7703750 5508291 4381369 4018922 2014792 -1230126 -1505588
4606a505588M873734N947569J157297l945812l790101M04385L282504K233808
$$ -1505588 3368146 9315715 10473012 6527200 2737099 3141484 6423988 8657796
4598H657796r02928l280607l612494k095923J75989J916856K784741L282700L135265
$$ 8657796 7754868 4474261 861767 -1234156 -1058167 858689 3643430 6926130 10061395
4589A0061395J229104k064738m314632m004593k382520j039556M06967K485875
$$ 10061395 11290499 9225761 4911129 906536 -1475984 -2515540 -2108573 377302
4581C77302L689326K448105q6027j533085j503837j221873j004677l22122M93455
$$ 377302 4066628 6514733 6428706 4895621 3391784 2169911 1165234 843112 1336567
4572A336567O56786K64718m95355k203276m342949m287778q40455K706395K322470
$$ 1336567 1993353 2258071 1762716 -440560 -4783509 -9071287 -9911742 -7205347 -4882877
4563d882877r05022k162586L35269L621869M997539M989339M575488L048384J60172
$$ -4882877 -5787899 -7950485 -7615216 -3993347 1004192 5993531 10569019 13617403 13777575
4554A3777575k414047l411719l604033l683387k621261K77757L374015M373588
$$ 13777575 11363528 7951809 4347776 664389 -1956872 -1679115 1694900 6068488
4546F068488K919152L95131j740610k526391j615096J57268J234676J114902Q05931
$$ 6068488 8987640 9382771 7642161 5115770 3500674 3657942 4892618 6007520 6813451
4537F813451J102002J539961J527687J248574Q39417j15142j561483k505099k236831
$$ 6813451 7915453 9455414 10983101 12231675 13071092 12955950 11394467 8889368 6652537
4528F652537j174253o4056P08832P49473k18989j440038j550505m73154K27588
$$ 6652537 5478284 5414228 6123060 6872533 6653544 5213506 3663001 3189847 3417435
4519C417435n42182j946834k411925j344552P60193K927692L924655K808517j39320
$$ 3417435 2875253 928419 -1483506 -2828058 -2067865 859827 4784482 7592999 7453679
4510G453679l508832n813424n870526k837036K503378O780795O566489K417800
$$ 7453679 3944847 -1868577 -7739103 -10576139 -8072761 -1291966 5274523 7692323
4502G692323j479186k363040j604076j451951j443533o4227J728894J401260j132360
$$ 7692323 6213137 3850097 2246021 794070 -649463 -713690 1015204 2416464 1284104
4493A284104k828894j433842J587999K984083J681856j78705k8013K044442L415601
$$ 1284104 -1544790 -2978632 -1390633 1593450 3275306 3096601 3068588 5113030 8528631
4484H528631K043686j062329k960854k192504m25684l96935k548817m212985k454246
$$ 8528631 10572317 9509988 6549134 4356630 3930946 3534011 985194 -3227791 -5682037
4475e682037K273557N888140M848536L11607l056343k541741j26691Q66270M9357
$$ -5682037 -3408480 2479660 7328196 7639803 4583460 2041719 1915028 2781298 2830655
4466B830655o65049n08999m25104q02586q54175k51580L99286Q11096J252167
$$ 2830655 2165606 1656607 1231503 428917 -425258 -676838 -277552 533544 1785711
4457A785711J577269J441319J255803J430502J110494m59890j780133p08890J835183
$$ 1785711 3362980 4804299 6060102 7490604 8601098 8141208 6361075 5652185 7487368
4448G487368K512448L81487j726348j666729r74867j613696k232035k90976L518119
$$ 7487368 9999816 10381303 8654955 6988226 6013359 4399663 2167628 1876652 5394771
4439E394771N666501M160901M92298k561971l406123k080584J07121J234381L34068
$$ 5394771 11061272 15222173 15714471 13152500 9746377 7665793 7772914 9007295 9341363
4430I341363j402808j912948q31797J95123r7856j025724j306933r72221q75020
$$ 9341363 7938555 6025607 5193810 5388933 5291077 4265353 2958420 1986199 1111179
4421A111179q37995L02968K562374M027185L129353P74711j033541j975490l116448
$$ 1111179 273184 576152 3138526 7165711 10295064 11069775 10036234 8060744 4944296
4412D944296m200533l497756q23151J504659J781041J015617O38850K01918q05683
$$ 4944296 743763 -2753993 -3577144 -2072485 -291444 724173 1363023 1564941 759258
4403G59258q58687J313024L711035L182183j16364k931258l134934j327651J269315
$$ 759258 -99429 1213595 4924630 8106813 7990449 5059191 1924257 596606 1865921
4394A865921L836467M979746L403276j056k716020l377761k320641j7367K618804
$$ 1865921 5702388 10682134 14085410 14084354 11368334 7990573 5669932 5652565 8271369
4385H271369L080194l25173m833633n369752j096545L225308L415946M72997k237220
$$ 8271369 11351563 11026390 6192757 823005 -273540 2951768 6367714 6840711 4603491
4376D603491l386759l374574k106735M43427K811715L272378J945069N06263L02003
$$ 4603491 1216732 -2157842 -4264577 -3821150 -1009435 2262943 4208012 4714275 5016278
4367E016278J237733J858422N97209k035356l130036r79929J841272J631091q32935
$$ 5016278 6254011 8112433 8709642 6674286 3544250 2564321 4405593 6036684 5203749
4358E203749j315179J197747K881259J195797j424184j972955j253055j165750
$$ 5203749 3888570 5086317 7967576 9163373 7739189 5766234 4513179 3347429
4350C347429q30825J219930L247341K304866j098337l406042k577504J03151K330786
$$ 3347429 2516604 3736534 6983875 9288741 8190404 4784362 2206858 2310009 4640795
4341D640795K917175J945714L75036o72549j106089j774605k618022k081008O96654
$$ 4640795 7557970 9503684 9878720 9206171 8100082 6325477 3707455 1626447 2323101
4332B323101M126464N540921L695454l03143l621266l559356l88971K078258Q37460
$$ 2323101 6449565 11990486 15685940 15382797 11761531 8202175 7813204 9891462 10728922
4323A0728922k026452k285468j63927J05428k437026l500497n13166L109913L420882
$$ 10728922 8702470 6417002 6253075 6358503 3921477 420980 -92186 3017727 6438609
4314F438609J620279R45762J274300N62251q98672j353185q64145n58493k47276
$$ 6438609 8058888 9004650 10278950 10841201 9942529 8589344 7725199 7166706 6919430
4305F919430N01821P21885n9482l59195M58976M44018j244954j818825O36826
$$ 6919430 7421251 8143136 8083654 7724459 8183435 8627453 7382499 5563674 6200500
4296F200500K972185J309930k716992m385379k833075j230603j227430j557508
$$ 6200500 9172685 10482615 7765623 3380244 547169 -683434 -1910864 -3468372
4288c468372j498630j635737j437694K41749K279557K172587q2735j774058j217723
$$ -3468372 -4967002 -6602739 -8040433 -7798684 -5519127 -3346540 -3429275 -5203333 -6421056
4279f421056N34335J598118J093948m01170r25591J104610M047343M073997N44403
$$ -6421056 -5886721 -4288603 -3194655 -3595825 -4521416 -3416806 630537 4704534 5248937
4270E248937k437483j836036J98843O01528J18633L72770l1258k166001l023645
$$ 5248937 2811454 975418 1174261 1775789 1894422 2267192 2235934 69933 -2953712
4261b953712q1583L337197K591067r06717k285132r24640k221m17621q31158j688155
$$ -2953712 -3035295 301902 2892969 1986252 -298880 -1223520 -1225741 -1643362 -2474520 -4162675
4251d162675l377843k683922K474858P058028M961881q02395k036099J772234
$$ -4162675 -7540518 -10224440 -7749582 -691554 4270327 3467932 1431833 3204067
4243C204067L281122j83490l120008j985101M3152M13581Q41189J179001j901226
$$ 3204067 6485189 6301699 3181691 1196590 1239742 1653323 2494512 3673513 1772287
4234A772287p006373p202678j106272L254768N11957l708671k313172K231192
$$ 1772287 -5234086 -12436764 -13543036 -10288268 -9776311 -13484982 -15798154 -13566962
4226a3566962L178725M33182r62814L84264J528506R39812m40631j993231l008087
$$ -13566962 -10388237 -9955055 -10917869 -10533605 -9005099 -8065287 -8505918 -10499149 -13507236
4217a3507236j645961K001547M295386K878437L25345k32647J87211m09796p15510
$$ -13507236 -15153197 -13151650 -8856264 -5977827 -5652482 -5885129 -5697918 -6107714 -6823224
4208f823224Q59704K173486Q35662j116421n71371J115350O34300j211346p82280
$$ -6823224 -5963520 -3790034 -2954372 -4070793 -4642164 -3526814 -2892514 -4103860 -4886140
4199d886140K168977L999280K612589j63758j699220j432783m70617M2423M4411
$$ -4886140 -2717163 1282117 3894706 3730948 2031728 598945 128328 170751 215162
4190B15162M09605J114157L90707k323273l961143j880003R50241j76001l396518
$$ 215162 624767 1738924 2129631 -193642 -4154785 -6034788 -5084547 -5260548 -8657066
4181h657066k293127L360164O160683K370221k634817l333568j554484j112927
$$ -8657066 -10950193 -7590029 -1429346 940875 -1693942 -5027510 -6581994 -7694921
4173g694921j436551r35076q61889j497353j50224K990991L058532j291942m324518
$$ -7694921 -9131472 -10066548 -10928437 -12425790 -12576014 -9585023 -6526491 -7818433 -12142951
4164a2142951k331072M86304P3227o95280J290330L136861K184262J205350J720551
$$ -12142951 -14474023 -13987719 -13914492 -14609772 -13319442 -10182581 -7998319 -6792969 -5072418
4155e072418J01036l923392m097432O71839K075585k878766n360620j781557k476040
$$ -5072418 -4971382 -8894774 -12992206 -12320367 -10244782 -13123548 -18484168 -20265725 -22741765
4146b2741765j1392024j4467717n303840l122527j9561254k5222099J3951496
$$ -22741765 -34133789 -48601506 -53905346 -57027873 -76589127 -101811226 -87859730
4139h7859730P4564540R2233073M5996870j2890022l0879331j5056714m239440
$$ -87859730 -13295190 78937883 124934753 112044731 81165400 66108686 61869246
4132F1869246q814245j0992305m912112k192811n306465m514915O08544K86467
$$ 61869246 53055001 42062696 37150584 34957773 29651308 25136393 25744937 26031404
4124B6031404n099788m484386K971356N260546j484019o304413k030665M104829
$$ 26031404 20931616 16447230 19418586 24679132 23195113 16890700 14860035 18964864
4116A8964864M017292P08735L34700J846336R58344k141752m281250m094814k155824
$$ 18964864 22982156 23690891 24025591 25871927 26830271 24688519 20407269 16312455 14156631
4107A4156631J66992P37156r86636j961151P6002J920532k03071l284847j806055
$$ 14156631 14323623 15060779 14074143 12112992 12188994 14109526 13906455 10621608 8815553
4098H815553K434106K688355j302651k777369N42516K889954L61812l308734l748992
$$ 8815553 11249659 13938014 12635363 9857994 10400510 13290464 13652276 10343542 6594550
4089F594550k122527j121257k88772J507913L311390M230140M655936M008802
$$ 6594550 4472023 3350766 3061994 4569907 7881297 12111437 16767373 20776175
4081B0776175J236076j820171k166606j142380k802860o327531o282317j746474
$$ 20776175 22012251 20192080 18025474 16883094 14080234 7752703 1470386 -276088
4073b76088J533723M75873n57591K154370N023520L264350j262544l398703k241025
$$ -276088 1257635 1733508 1175917 3330287 8353807 11618157 10355613 6956910 4715885
4064D715885n38471O39233K041568K997694K119741J26200j027683q02238J44482
$$ 4715885 4177414 4816647 6858215 9855909 11975650 12101850 11074167 10271929 10416411
4055A0416411J243364J478494k96648k938284l441176j404960j19612j345594
$$ 10416411 11659775 13138269 12841621 9903337 6462161 5057201 4937589 3591995
4047C591995k413524r69229R69987R11595M42246J897026L329072J474574k141727
$$ 3591995 1178471 209242 1179229 2090824 2533070 4430096 7759168 9233742 7092015
4038G092015k942283k66907K049437J941994J500315K350784K676061N72138k524157
$$ 7092015 4149732 3882825 5932262 7874256 9374571 11725355 14401416 14973554 12449397
4029A2449397l837361k960100j751384j498218j683032j260410q8136J106766
$$ 12449397 8612036 5651936 3900552 2402334 719302 -541108 -629244 477522
4021D77522J717451J811367J635689J024947j66984j407414k090631k484346k953422
$$ 477522 2194973 4006340 5642029 6666976 6499992 5092578 3001947 517601 -2435821
4012b435821k585190k43117K981483M316207K864377Q09379L17687J006760J386176
$$ -2435821 -5021011 -5264128 -2282645 2033562 4897939 5707318 6025005 7031765 8417941
4003H417941R86856j04470k028704l985078l869241q29001K946525M555438L519203
$$ 8417941 9404797 9300327 7271623 3286545 -582696 -1411697 1534828 6090266 9609469
3994I609469J302291r67481k621682k566743m79409J688955J476617q97311k759983
$$ 9609469 10911760 9944279 7322597 4755854 4276445 5965400 7442017 6544706 3784723
3985C784723k428022r92943m81094j358432k202626j303685J436372L999303M187180
$$ 3784723 1356701 363758 -117336 -1475768 -3678394 -4982079 -3545707 453596 4640776
3976D640776K327672J003842J479011J838150M8057k498885k718775n27989P79317
$$ 4640776 6968448 7972290 9451301 11289451 11337508 8838623 6119848 5591859 6371176
3967F371176o93947k639335j915466Q85309K260636O37092j686865j883511j50774
$$ 6371176 5677229 3037894 1122428 2007737 4268373 4905465 3218600 1335089 1184315
3958A184315J292895J555933J568292J709345J181735J67747L43737K009435K747263
$$ 1184315 2477210 4033143 5601435 7310780 8492515 8660262 9003999 11013434 13760697
3949A3760697Q59157j526405j243676J172607K373870J229690r2821r8271J45006
$$ 13760697 14619854 13093449 11849773 13022380 15396250 16625940 16533119 16434848 16579854
3940A6579854k19002j50407Q92768J434466M81587n71162k95109K80228o08043
$$ 16579854 16360852 16210445 17103213 18537679 19019266 18448104 18152995 18433223 17825180
3931A7825180k601987l918994l921366l361992k790968k107563j189149j258J325959
$$ 17825180 15223193 11304199 7382833 4020841 1229873 -877690 -2066839 -2068097 -742138
3922g42138J952032Q93073j186771k004347m18619J939443K689413J323946q56716
$$ -742138 1209894 2102967 916196 -1088151 -1506770 432673 3122086 4446032 3589316
3913C589316k193526j475291J123041L180672J950116j860273m201333k858084
$$ 3589316 1395790 -79501 1043540 4224212 6174328 4314055 112722 -2745362
3905b745362l66482k5718j188426r92881Q85361K111349J482523J55176o19912
$$ -2745362 -3111844 -3137562 -4325988 -5318869 -4433508 -2322159 -839636 -684460 -1304372
3896a304372p27707k68642O83384J454508J450539J257594J713917K342841K128386
$$ -1304372 -2032079 -2300721 -1617337 -162829 1287710 2545304 4259221 6602062 8730448
3887H730448J323963J005934J303119J464370J152705L94512r72952k435679k426575
$$ 8730448 10054411 11060345 12363464 13827834 14980539 15375051 14402099 11966420 9539845
3878I539845n00980J192472O37020q46074n00706J447998J965678k92122l185502
$$ 9539845 9038865 10231337 10868357 10022283 9521577 10969575 12935253 12643131 9457629
3869I457629m161017l015646j134181K65954O70737M42136O57761J642945K014154
$$ 9457629 5296612 2280966 1146785 1412739 2083476 2525612 3183373 4826318 6840472
3860F840472O07581j254727j325873K17634J170422P90068N26469J178732J705868
$$ 6840472 7448053 6193326 4867453 5085087 6255509 7045577 7572046 8750778 10456646
3851A0456646J325090O59016J83357o38435k097275l601172m492422m118081j556113
$$ 10456646 11781736 12440752 12624109 11985674 9888399 6287227 1794805 -2323276 -3879389
3842c879389K722410N544134M156995M22471j276732l67582n72321l324375m946165
$$ -3879389 -1156979 4387155 8544150 8966621 7689889 7322307 6749986 3425611 -1520554
3833a520554k473122J509697K867386J770082J083283J126780j05861k621643
$$ -1520554 -3993676 -2483979 383407 2153489 3236772 4363552 4257691 1636048
3825A636048l987079l041852j137801M18405J715837K797375K959644J976525
$$ 1636048 -2351031 -5392883 -6530684 -6112279 -4396442 -1599067 1360577 3337102
3817C337102N94060m42633q51695n36767J27847K16351m82109q48706k78678j03837
$$ 3337102 3931162 3488529 2636834 2100067 2227914 2444265 1962156 1113450 834772 730935
3807G30935j516528l058274k296640N69258K962189L443283K756145J595700j29063
$$ 730935 -785593 -3843867 -6140507 -5571249 -2609060 834223 3590368 5186068 5057005
3798E057005j527556q08502J890877L804940K869207K55248j420092j080216M98622
$$ 5057005 3529449 2720947 4611824 8416764 11285971 11541219 10121127 9040911 9539533
3789I539533K013776K287647P70739j599546k972912k765476k259173k444841
$$ 9539533 11553309 13840956 14611695 13012149 10039237 7273761 5014588 2569747
3781B569747k603658j845416o05626M62232J599450K607697J980993p01845k770423
$$ 2569747 -33911 -1879327 -2484953 -2022721 -423271 2184426 4165419 3463574 693151
3772F93151j283814K645359M735164K794346j004397l382147l466829k407953
$$ 693151 -590663 2054696 6789860 9584206 8579809 5197662 1730833 -677120
3764f77120j224693n7485J394492L233190M479145L201149r41369m700767m245893
$$ -677120 -1901813 -1959298 -564806 2668384 7147529 10348678 9407309 4706542 460649
3755D60649m37031J772528J85979j622538j87790K217195J343443j978892l035588
$$ 460649 23618 1796146 1982125 359587 171797 2388992 3732435 1753543 -1282045
3746a282045n82023J637243J092289j47785L83524J692735J721316O69191k68874
$$ -1282045 -1864068 -226825 865464 717679 1101203 2793938 4515254 5184445 4915571
3737D915571j111869j951486j819474p83209q90577k665607l039446K25099M142718
$$ 4915571 3803702 1852216 32742 -750467 -1641044 -4306651 -7346097 -7120998 -2978280
3728b978280M167995P88247j480823q10325M52245P93596J512277K845701K439970
$$ -2978280 1189715 1977962 497139 -313186 139059 932655 2444932 5290633 7730603
3719G730603m35439k685676j716431Q42158K063030J879228J785489J556379J29976
$$ 7730603 7295164 4609488 2893057 3735215 5798245 7677473 9462962 11019341 11149317
3710A1149317j742426k507440k373096k301237j531954J045718L790746L688006
$$ 11149317 9406891 6899451 4526355 2225118 693164 1738882 5529628 9217634
3702I217634Q11336j465489j127502K50914O29317K74426J53849k08000j448828
$$ 9217634 10028970 8563481 7435979 7686893 8316210 8590636 8744485 8536485 7087657
3693G087657k438539j604861N26678J819329J285487j3548p55191p99250n98989
$$ 7087657 4649118 3044257 3570935 5390264 6675751 6662203 5907012 5107762 4508773
3684D508773j76094P05201J782172K272545J615721L3147j649756k635103k638473
$$ 4508773 4332679 5037880 6820052 9092597 10708318 10741465 9091709 6456606 3818133
3675C818133j938874j106272o07743m71200l00761K33199R35344J271596R19111
$$ 3818133 1879259 772987 165244 -305956 -606717 -373518 561826 1833422 2752533
3666B752533p2192j409388k427403k190634n23589J276296J811274J571595K155077
$$ 2752533 2680341 1270953 -1156450 -3347084 -3870673 -2594377 -783103 788492 2943569
3657B943569L390075L164691R03768r67362o96254k52700k063612m283144k971827
$$ 2943569 6333644 9498335 10402103 9434741 8738487 8485787 6422175 2139031 -832796
3648h32796J393676L660973J314272j700056p55281K781061L835128Q91420k429979
$$ -832796 560880 4221853 5536125 3836069 3080788 5861849 9696977 10588397 8158418
3639H158418k578537J23980L120583M577072L990626J739833r76367k810997l450332
$$ 8158418 5579881 5703861 8824444 13401516 17392142 19131975 18155608 15344611 11894279
3630A1894279l399029k715115j193993L21385N06060k97111k50113J084901J851133
$$ 11894279 8495250 5780135 4586142 4907527 5413587 5116476 4866363 5951264 7802397
3621G802397Q83712j84801O69375K701890L435650K001205l11426k250044l530991
$$ 7802397 8686109 8501308 9170683 11872573 15308223 17309428 16998002 14747958 11216967
3612A1216967l817905k604081l97470J365386J942774J791036J348559M75828
$$ 11216967 7399062 4794981 4397511 5762897 7705671 9496707 10845266 11321094
3604A1321094o99928j534835j794859j874309j895117j580780j108593q96159
$$ 11321094 10621166 9086331 7291472 5417163 3522046 1941266 832673 -63486
3596f3486m67650R24523K238102J159079k258675m320321j917360L073294N675813
$$ -63486 -531136 393387 2631489 3790568 1531893 -2788428 -4705788 -1632494 4043319
3587D043319L721305K4980j371939M70365L175852L888801J770229j523152l418921
$$ 4043319 7764624 7789604 6417665 6888030 10063882 13952683 15722912 14199760 10780839
3578A0780839k962546j770577j817163k550075j483457K074601N272613M724362
$$ 10780839 7818293 6047716 4230553 1680478 197021 2271622 7544235 12268597
3570A2268597N70171l553107m405213k097169Q78181K589463K943006K504209
$$ 12268597 12838768 9285661 4880448 2783279 3661460 6250923 9193929 11698138
3562A1698138J242584r22408l010232l589062k599471j523323j292128j058026
$$ 11698138 12940722 12018314 9008082 5419020 2819549 1296226 4098 -1053928
3554a053928J35774J465218J517782Q28262J407848L494579M504977K244153j967008
$$ -1053928 -918154 547064 2064846 2893108 4300956 7795535 12300512 14544665 12577657
3545A2577657m666905m237129k270287j064799r54819n76355R95176L092309M265058
$$ 12577657 7910752 3673623 1403336 338537 -616282 -1192637 -197461 2894848 7159906
3536G159906L803754K418036J487820J529819J501854J28669k013861k688682
$$ 7159906 10963660 13381696 14869516 16399335 17901189 18029858 16015997 13327315
3528A3327315j035013N41424q09312l969308m549075q27339L219828K734674j720548
$$ 13327315 12292302 12833726 12024414 8055106 3506031 2678692 5898520 8633194 6912646
3519F912646n126705m415472j189497J697335L246818L385064J858755m17514
$$ 6912646 1785941 -2629531 -3819028 -2121693 1125125 4510189 6368944 5951430
3511E951430j177360K28056J427115M15868j237986p20725J640418K680096P11420
$$ 5951430 4774070 5002126 6429241 6845109 5607123 4886398 6526816 9206912 9918332
3502I918332k452431l867837k481215K70325J963654J425918k8657j39346J311536
$$ 9918332 7465901 3598064 1116849 1387174 3350828 4776746 4748089 4608743 5920279
3493E920279K325820J872169J205810J005183k54021k995892m112141j057945
$$ 5920279 8246099 10118268 11324078 12329261 12075240 9079348 4967207 3909262
3485C909262L284689L648394l13108l514086k450978P18459J964089L15104k300023
$$ 3909262 7193951 10842345 10529237 7015151 4564173 5282632 7246721 7561825 5261802
3476E261802l964691m159437l552057l216169l228597k192706O73087L663107
$$ 5261802 1297111 -2862326 -6414383 -9630552 -12859149 -15051855 -14378768 -10715661
3468a0715661M543919L574024K429232J152605r57228k338825p94991K031726
$$ -10715661 -6171742 -2597718 -168486 984119 26891 -2311934 -3106925 -1075199
3460a075199J927350j398035l097384l2596M651160N819128K521633j961007m016334
$$ -1075199 852151 -545884 -3643268 -3675864 975296 6794424 9316057 7355050 3338716
3451C338716k254482J650161L677808J359413k511402k969049N6120J738033J54523
$$ 3338716 1084234 2734395 6412203 7771616 5260214 2291165 2347285 4085318 4239841
3442D239841r15544J001129K557669N44607k392041k431018r47437j118658j517321
$$ 4239841 3324297 4325426 6883095 7427702 5035661 2604643 1657206 538548 -978773
3433i78773J076602M703692M251357l83779l907443l468098j694291j221806r40604
$$ -978773 97829 4801521 9052878 8669099 4761656 1293558 -400733 -1622539 -2563143
3424b563143P92027K926071L540830K452977P34035n98512q24099m3975M18254
$$ -2563143 -1771116 1154955 4695785 7148762 7882797 7284285 6460186 6416211 6834465
3415F834465m49937j871561k747659l465136m398260m156683j811788O42111R07198
$$ 6834465 6384528 4512967 1765308 -1699828 -6098088 -10254771 -12066559 -11424448 -10517250
3406a0517250j042J64322Q36968L26811n3141K055179N037540N028601K183746
$$ -10517250 -10518292 -10353970 -9517002 -9190191 -9243332 -7188153 -2150613 2877988 5061734
3397E061734L51925N61213m9382k314846l362197k125269j480939k936318l772682
$$ 5061734 5413659 5974872 5925490 3610644 248447 -1876822 -3357761 -6294079 -10066761
3388a0066761j836028Q74921J885353J898872K344310K633104K267351K448116
$$ -10066761 -11902789 -11027868 -9142515 -7243643 -4899333 -2266229 1122 2449238
3380B449238L164514J928509j922328m790516l697688q49138j30920j385737j534544
$$ 2449238 5613752 7542261 5619933 829417 -2868271 -3717409 -3848329 -5234066 -6768610
3371f768610L31010K233690K598697J534273l36539k107273k448227j028571P35270
$$ -6768610 -6437600 -4203910 -1605213 -70940 -407479 -2514752 -4962979 -5991550 -5256280
3362e256280J597282J910460K116626J595469L06651l35441L19552R55862P02707
$$ -5256280 -3658998 -1748538 368088 1963557 2270208 1934767 2254319 3210181 3912888
3353C912888O80735J652206K310688J536611J62889j090856k981013n260250n547954
$$ 3912888 4593623 6245829 8556517 10093128 10256017 9165161 6184148 923898 -4624056
3344d624056k935299j56629L36921L8314J429026L673323M205432K666561M35297
$$ -4624056 -7559355 -7715984 -7379063 -7340749 -5911723 -2238400 1967032 4633593 5068890
3335E068890j882656l741301l453555o67331J870991J995232J504065K687060
$$ 5068890 3186234 -555067 -4008622 -4675953 -2804962 -809730 694335 3381395
3327C381395L782397J886050j469746k214059k46633N08928j608725l887638l863495
$$ 3381395 7163792 9049842 7580096 5366037 5119404 5628332 4019607 131969 -3731526
3318c731526k345899r26453N22280K627983M709942N119220K657832j949816n417569
$$ -3731526 -6077425 -7003878 -6481598 -3853615 856327 5975547 8633379 6683563 1265994
3309A265994m399312J25948L229718K519214J247237K316816K854228q02577n732658
$$ 1265994 -3133318 -3007370 222348 2741562 3988799 6305615 9159843 8357266 2624608
3300B624608n834478j051292K760346K682316J579730J760966J544700m41443
$$ 2624608 -3209870 -4261162 -1500816 1181500 2761230 4522196 6066896 5625453
3292E625453k425374k750747k073465r42229J134102L107349K616528o7671j870361
$$ 5625453 3200079 449332 -1624133 -2566362 -1432260 1675089 4291617 4223946 2353585
3283B353585j549681q40866m22315R25147K297917P75887k765075l034834J772043
$$ 2353585 803904 -36962 -459277 465870 2763787 3539674 774599 -2260235 -488192
3274d88192O067282M310391j404813m895813l993252j322623P19617J963889K591959
$$ -488192 5579090 9889481 8484668 3588855 -404397 -1727020 -1007403 956486 3548445
3265C548445K288667R42339j238037l491702m035201j805743J042601J176102
$$ 3548445 5837112 6779451 5541414 2049712 -1985489 -3791232 -2748631 -1572529
3257a572529r59566j645868N3199R89138j22422l23427J859569L303685J896418
$$ -1572529 -2532095 -4177963 -4124764 -3135626 -3258048 -3581475 -1721906 1581779 3478197
3248C478197L46317P49639L05482k989750n151639k362516J785500J691458q49596
$$ 3478197 3824514 4574153 4879635 1889885 -3261754 -5624270 -3838770 -2147312 -2996908
3239b996908J50471M339491N327673R58770l955740n567668m919146l040729J129151
$$ -2996908 -2846437 1493054 6820727 7779497 3823757 -1743911 -6663057 -9703786 -8574635
3230h574635N955657O485627J640145l011721k793195J34855J457562J076588
$$ -8574635 -2618978 3866649 5506794 2495073 -298122 -163267 1294295 2370883
3222B370883J058073Q63948r42400k670661j637861J022871J763872J85089o09884
$$ 2370883 3428956 4292904 3350504 679843 -958018 64853 1828725 2013814 1403930
3213A403930P19317J668322J03730k200016j995097J008219L876278L979108J397271
$$ 1403930 2123247 3791569 3895299 1695283 -299814 708405 4584683 8563791 9961062
3204I961062j913923l951707l453798m29710K977868L386876j88221m175491m188166
$$ 9961062 8047139 4095432 641634 211924 3189792 6576668 6388447 2212956 -1975210
3195a975210q10461J130609m35253j975491k21049K622869K641013L98228n83474
$$ -1975210 -2785671 -1655062 -2090315 -4065806 -4286855 -1663986 977027 1375255 791781
3186G91781L64845J092195J245548K196315K872176O21483l393191m626354k106009
$$ 791781 1156626 2248821 3494369 5690684 8562860 9184343 5791152 1164798 -941211
3177i41211q1529r03623j223690J741644M747856L555988m1260j158778M19210
$$ -941211 -1022740 -1926363 -3150053 -1408409 3339447 6895435 6854175 5695397 6114607
3168F114607O67394j376096k043448N25045L011010J982018j056060k252899q90134
$$ 6114607 6782001 5405905 3362457 3887502 6898512 8880530 7824470 5571571 4681437
3159D681437M98023L90391r1765J32291J52652j127830k712367k553308l28195
$$ 4681437 5179460 5569851 5478086 5610377 5763029 4635199 1922832 -630476 -958671
3150i58671K195577L376307K930731J077065j717871l680019k551537J176567
$$ -958671 1236906 4613213 7543944 8621009 6903138 3223119 671582 1848149
3142A848149L712495K526976j00151l54143J707834K857705J828862M40942j23006
$$ 1848149 5560644 8087620 7987469 7633326 9341160 12198865 14027727 14468669 14345663
3133A4345663p35293j666020j797130j258175j727496l095855k891246l10207
$$ 14345663 13610370 11944350 10147220 8889045 7161549 4065694 1174448 864241
3125H64241K123176K348169J304237K23190j395943l255721l161708r64152j72734
$$ 864241 2987417 5335586 6639823 6863013 5467070 2211349 -950359 -1914511 -2087245
3116b087245k465323l912914p39380M002645M446930P47673j443130M30887L110484
$$ -2087245 -4552568 -8465482 -9204862 -5202217 -755287 -7614 -1450744 -1019857 2090627
3107B090627L607971K843573K013799L9437l243852n093381l540426l81315J625431
$$ 2090627 5698598 8542171 10555970 10595407 7351555 2258174 -1282252 -1663567 -38136
3098c8136K263969K714990L107174L108403L042775K688541Q60512k120432l586547
$$ -38136 2225833 4940823 8047997 11156400 14199175 16887716 17748228 15627796 12041249
3089A2041249k148582k34920p11039k659801l137979j794745q18534j028000j039472
$$ 12041249 9892667 9657747 8946708 6286907 3148928 1354183 535649 -492351 -1531823
3080a531823l11971k17945j395269k207664q69087K230811N029899N701251L882663
$$ -1531823 -1843794 -2061739 -3457008 -5664672 -6533759 -4302948 726951 6428202 10310865
3071A0310865J055588l60354M16039J048912j048032m408066m568700l68593L376722
$$ 10310865 11366453 11006099 11422138 12471050 11423018 7014952 2446252 2077659 5454381
3062E454381J648289m047184p433327n194421j70156L144232L436819K086254
$$ 5454381 7102670 3055486 -4377841 -9572262 -9742418 -6598186 -3161367 -1075113
3054a075113N03123k72250O89162K645472K776885j53097k765404q06833M311677
$$ -1075113 -571990 -844240 -155078 2490394 5267279 5114182 2348778 1541945 5853622
3045E853622O289136K230483l283179m518724j947170j05189m01613l19671J014445
$$ 5853622 12142758 14373241 11090062 6571338 4624168 4518979 4117366 3797695 4812140
3036D812140J097037j203761l137230k316032m53152l69210j506163j231572P87165
$$ 4812140 5909177 4705416 1568186 -747846 -1200998 -1570208 -3076371 -4307943 -3520778
3027c520778K320822K024803P10700m30913o99960N56559K869155L475048J22850
$$ -3520778 -1199956 824847 1535547 1104634 404674 961233 3830388 7305436 7428286
3018G428286m638907n168298r5835M898397L972542j392839m712723k925326Q91433
$$ 7428286 2789379 -2378919 -2474754 2423643 6396185 5003346 290623 -2634703 -1743270
3009a743270K869148K726479J779441l9181k703417l858445j307281K982709M468472
$$ -1743270 1125878 3852357 5631798 5592617 2889200 -969245 -2276526 706183 5174655
3000E174655J944985q60853n76672J448347J819173P8049j559049k298616l569302
$$ 5174655 7119640 6258787 5682115 7130462 8949635 9027684 7468635 5170019 1600717
2991A600717n639366o229685l680142L32386K631124K084917L01998m69215N61883
$$ 1600717 -4038649 -10268334 -13948476 -13616090 -10984966 -8900049 -8598051 -9067266 -8505383
2982h505383K056285J718530q64551k665878m19493M272116N730010J624297l075444
$$ -8505383 -6449098 -4730568 -5595119 -8260997 -8680490 -4408374 1321636 2945933 -129511
2973a29511k292270K989390O190464L774353j222017m145540l625417r13644K304815
$$ -129511 -2421781 567609 6758073 10532426 9310409 5164869 1539452 625808 2930623
2964B930623M102169L023297J88970j360636o14651K09143n61254j623470j551415
$$ 2930623 7032792 10056089 10245059 8884423 8269772 8478915 7917661 6294191 4742776
2955D742776j399344k233056k383675L8832L481975M658090K981064P97490p7138
$$ 4742776 3343432 1110376 -1273299 -1234467 2247508 6905598 9886662 10684152 10607014
2946A0607014K07717Q63530J071450p7913k267115l358248k055908j52130k3211
$$ 10607014 10814731 11678261 12749711 12671798 10404683 7046435 4990527 4838397 4815186
2937D815186j088049j141932P9921J379344K707258M080402L348798r27217n375607
$$ 4815186 3727137 2585205 2665126 4044470 6751728 10832130 14180928 13253711 7878104
2928G878104n217878j431012M31929j271788k427477p54314O96296j29116l19673
$$ 7878104 2660226 1229214 1661143 389355 -2038122 -2792436 -2096140 -2225256 -2544929
2919b544929K116103L721704J510087j131568J76343L143450K519459j085897
$$ -2544929 -428826 3292878 4802965 3671397 3847740 6991190 9510649 8424752
2911H424752k459541m94435P73649l79027j083497P0616M59875j192448j830420
$$ 8424752 5965211 5470776 6244425 5865398 4781901 4852517 5312392 4119944 2289524
2902B289524Q32105M062721L937227O79426k537320m005342m130636l230043j209021
$$ 2289524 3121629 7184350 11121577 11801003 9263683 5258341 1127705 -2102338 -3311359
2893c311359J170392K471789J913985j20275k294716k808507q44791K028232L050193
$$ -3311359 -2140967 330822 2244807 2124532 -170184 -2978691 -3823482 -1795250 1254943
2884A254943J307035j372153k613564j496599J336394L973455L906647M16402
$$ 1254943 2561978 1189825 -1423739 -2920338 -1583944 2389511 6296158 6712560
2876F712560l655864m521671j975081O74069J153768L53561j86128j84399M14284
$$ 6712560 3056696 -1464975 -3440056 -2765987 -1612219 -1258658 -1444786 -1629185 -1214901
2867a214901J562353J612760j148606m527637l572888K409549P381204N811838
$$ -1214901 347452 1960212 811606 -3716031 -7288919 -4879370 2501834 8313672
2859H313672l35677m815125m918106k729598m72450J441085K414454J468362n96732
$$ 8313672 7977995 3162870 -1755236 -4484834 -4957284 -3516199 -1101745 366617 -230115
2850b30115j583254q85844M4950L97461R40992J862505J837729K33236j389824
$$ -230115 -1813369 -2699213 -2654263 -2256802 -1315810 546695 2384424 2617660 1227836
2841A227836j215731L11424J127962L97474m03557K84930J509806P52414k228819
$$ 1227836 12105 323529 1451491 1848965 1445408 1730338 3240144 3992558 1763739
2832A763739m156942k381513J073119K150315P23015M74777K499828L054344l35887
$$ 1763739 -2393203 -4774716 -3701597 -1551282 -828267 -353490 2146338 5200682 4864795
2823D864795m109267l323211J233595M259562L097357J54204j476812j566086
$$ 4864795 755528 -2567683 -1334088 2925474 6022831 6177035 4700223 3134137
2815C134137j419707j477844j204810q2252J758764L197354K733829K86021k246262
$$ 3134137 1714430 236586 -968224 -1050476 708288 3905642 6639471 6925492 4679230
2806D679230l124450k604617j701348m90551R20994J218933k82789j728607q71262
$$ 4679230 1554780 -1049837 -2751185 -3241736 -2320742 -1101809 -1384598 -3113205 -3984467
2797c984467J597774L026619K521703J498928Q97634N4096j579325l338367m111117
$$ -3984467 -2386693 639926 3161629 4660557 5558191 5612287 4032962 694595 -3416522
2788c416522l094558k45614K924269L919026K020350m95509j301485q82130q47106
$$ -3416522 -6511080 -6756694 -3832425 86601 2106951 1611442 309957 -572173 -1419279
2779a419279j042639n21373J84705K87694P79348K508235L703220K500273N00799
$$ -1419279 -2461918 -2983291 -2798586 -2510892 -1731544 776691 4479911 6980184 7480983
2770G480983K90604P26465j189482m581182n407208k813799k57318J55557K4316
$$ 7480983 7771587 8498052 7308570 2727388 -2679820 -5493619 -5750937 -5595380 -5571064
2761e571064N55731N58772j26147N41752K717585L325963R57825j388084p99457
$$ -5571064 -5015333 -4456561 -4582708 -4040956 -1323371 2002592 2960417 1572333 772876
2752G72876J389264K282069J530385M95530j94360j55341J240914K917155K240427
$$ 772876 2162140 4444209 5974594 6470124 6275764 6120423 7361337 10278492 12518919
2743A2518919q47443k584357o05594K300926K358807K08968r44330m87464k59749
$$ 12518919 11671476 9087119 8481525 10782451 13141258 13350226 12405896 11918432 11658683
2734A1658683o68075m38661K72972l78587k809900m818574m120331j011743J850097
$$ 11658683 10990608 10551947 10824919 10446332 7636432 2817858 -1302473 -2314216 -464119
2725d64119K163893O32935K34990J890063K364891r45264m682199l375435J809266
$$ -464119 1699774 2332709 2567699 4457762 6822653 5877389 1195190 -2180245 -370979
2716c70979L775729J09494l104547r60349K720046K145207j170497j857675J32566
$$ -370979 3404750 3514244 409697 -550652 2169394 4314601 3144104 1286429 1418995
2707A418995M10073j668533k182328L26150K658253K402969J049757P32023J319929
$$ 1418995 1829068 160535 -2021793 -1695643 962610 3365579 4415336 5147359 6467288
2698F467288J608000R61511m72829j482336n12960J684049J962001o02686k626386
$$ 6467288 8075288 9036799 8563970 7081634 6568674 8252723 10214724 9612038 6985652
2689F985652j679281l20207j130000j491727J427931M048538J483690l378596
$$ 6985652 5306371 4986164 3856164 2364437 3792368 7840906 9324596 5946000
2681E946000l725212j89126L09480l135173l687056R83558M136900J310186k361504
$$ 5946000 2220788 2031662 2341142 -794031 -4481087 -3497529 639371 1949557 -411947
2672d11947j333743J320377M40427j769876j49176L789664M159135L45612k470637
$$ -411947 -1745690 -425313 15114 -1754762 -1903938 1885726 6044861 6390473 3919836
2663C919836j531441N21377P59436n32584j667742j540026J3550J434869K29959
$$ 3919836 2388395 2909772 3669208 3136624 1468882 -71144 -57594 1377275 1607234
2654A607234l105189m080026k45434M181053L786863m1211j517613M46347J148404
$$ 1607234 -1497955 -5577981 -5823415 -1642362 2144501 2103290 585677 1032024 2180428
2645B180428j730981m301193k555525J896643M594697L924142J764197K71719
$$ 2180428 449447 -3851746 -6407271 -4510628 84069 4008211 5772408 6044127
2637F044127O6497P05403J403068J361671N6526k394839m644006m241877p8326
$$ 6044127 6110624 6816027 8219095 9580766 9637292 7242453 2598447 -1643430 -1721756
2628a721756M871992N600217J242429l226414l423187r48304M30533R45280K819875
$$ -1721756 3150236 8750453 9992882 6766468 3343281 2394977 2825510 3770790 6590665
2619F590665M399451K034632k722647l841206J04331L101862M67421m204375m458895
$$ 6590665 10990116 13024748 10302101 6460895 6565226 9667088 10134509 5930134 1471239
2610A471239q6149L314425K268894q92716k128065n81277J367397J418538k42067
$$ 1471239 1385090 4699515 6968409 6075693 3947628 3366351 4733748 6152286 5910219
2601E910219j644143j614326q97696m34526J31860R67348O03402j682703l289331
$$ 5910219 4266076 2651750 1754054 1319528 1451388 2418736 3022138 1339435 -1949896
2592a949896j354403K211808K680222l26370k025437j3553K073790R00311j032187
$$ -1949896 -3304299 -1092491 1587731 1261361 -764076 -777629 1296161 2196472 1164285
2583A164285M6728K696130L043384J510865J547783K993816K161968j480435l867700
$$ 1164285 1211013 3907143 6950527 8461392 10009175 13002991 15164959 13684524 9816824
2574I816824k606916j54151R21427J678981L413083M165304J917454j270592j937294
$$ 9816824 7209908 7055757 7977184 9656165 13069248 17234552 19152006 17881414 15944120
2565A5944120n76089o93598k980865l918089r58894L520128M942095J858949k726521
$$ 15944120 15368031 14674433 11693568 7775479 6816585 10336713 15278808 17137757 14411236
2556A4411236m799606l203248j74210J471655J258249P62266P69173J53991j720967
$$ 14411236 9611630 6408382 6234172 7705827 8964076 9726342 10495515 10649506 8928539
2547H928539l101157k103865J35018Q87831P328o611J554819K038814k86764k968033
$$ 8928539 5827382 3723517 3858535 4746366 4753694 4747083 6301902 8340716 8053952 5085919
2537E085919k705644j66373J290157O63970J12279Q84341J451564N15815n49242
$$ 5085919 2380275 2213902 3504059 4168029 4280308 5164649 6616213 7132028 6582786
2528F582786K12884K259082L106405J416867j502749l137014k322873n00279j52222
$$ 6582786 6795670 9054752 12161157 13578024 12075275 8938261 6615388 6115109 5962887
2519E962887j593748k204647j13682K356826J270128l164361o259270m957906
$$ 5962887 4369139 2164492 2050810 4407636 5677764 2513403 -3745867 -8703773
2511h703773j477865N22929P56751J140740J978309K038745J242084O92466O72747
$$ -8703773 -10181638 -9658709 -8901958 -7761218 -5782909 -3744164 -2502080 -1809614 -1136867
2502a136867P39525J183606K356704L164336K293739M20582p78093j141653j435367
$$ -1136867 -397342 786264 3142968 6307304 8601043 9021625 8243532 7101879 5666512
2493E666512j096633P31565K429175J271581k272677m626100l978872k117100
$$ 5666512 4569879 5301444 7730619 9002200 6729523 2103423 -1875449 -3992549
2485c992549o74565J177405L828692N122073L443860O24959o66583o32665r90763
$$ -3992549 -4667114 -3489709 338983 5461056 8904916 9529875 8863292 8230627 7239864
2476G239864j434587k55181K224648L483994K105438o78795k842141l486908k871861
$$ 7239864 5805277 5550096 7774744 11258738 13364176 12685381 9843240 6356332 3484471
2467C484471j717805n85363O25075K093956K734277R28879k429077l657268j073786
$$ 3484471 1766666 1181303 1806378 3900334 6634611 7563490 5134413 1477145 403359
2458D03359J783508O74237k942808l819279q46226J313425m20067k842439j664514
$$ 403359 2186867 2861104 -81704 -3900983 -4747209 -3433784 -3853851 -6696290 -8360804
2449h360804K017409L983269L322188K529476K297951N99539k713786m459129
$$ -8360804 -6343395 -2360126 962062 3491538 5789489 6389028 3675242 -783887
2441g83887k819928k42754N26015N95521K238438M086079K855543p13460j794102
$$ -783887 -3603815 -3846569 -3320554 -2725033 -486595 3599484 6455027 5741567 3947465
2432C947465J505019M591875K435255l120780n446593j873466K934080L156743
$$ 3947465 5452484 10044359 12479614 9358834 3912241 2038775 4972855 8129598
2424H129598j093845m548249l337032J053656M127103L235150l15924l173773
$$ 8129598 7035753 2487504 -849528 204128 4331231 7566381 7250457 4076684
2416D076684l184636q18132J901529L155831K185043m48606k714721k210077J172906
$$ 4076684 892048 73916 1975445 5131276 7316319 6867713 4152992 1942915 3115821
2407C115821M095619L014578j294584m261745l165710l24257O16337l09177l27117
$$ 3115821 7211440 10226018 8931434 4669689 1503979 1179722 1796059 1486882 1159765
2398A159765J276834K201345J064968m51102n14388n7260j025774l033272l726745
$$ 1159765 2436599 4637944 5702912 5251810 4737422 4680162 3654388 621116 -3105629
2389c105629j992375Q86969L097331L767480K576924l70047l592791m563892k223250
$$ -3105629 -5098004 -4211035 -1113704 2653776 5230700 4860653 1267862 -3296030 -5519280
2380e519280J444608L380040K725428J329979J179189K131959K324981L43782
$$ -5519280 -4074672 -694632 2030796 3360775 4539964 6671923 8996904 9340686
2372I340686l108228n520525m777307j337824K076072L229795K314176Q49014
$$ 9340686 6232458 711933 -4065374 -5403198 -3327126 -97331 2216845 3065859
2364C065859l56471j177015j003648P39205L052088L868964K344630m98041l325082
$$ 3065859 2709388 1532373 528725 1267930 4320018 8188982 10533612 10035571 6710489
2355F710489n270366n273713k662671J029169K750065J431941p87009j694738
$$ 6710489 1440123 -3833590 -6496261 -5467092 -2717027 -1285086 -2072095 -3766833
2347c766833j456267p85580J011305M002180N512843K970362j933941m636161
$$ -3766833 -5223100 -6008680 -4997375 -995195 4517648 7488010 5554069 917908
2339I17908l039333P48386L649480M227770K303579j331461m325088m214467j294454
$$ 917908 -2121425 -1373039 2276441 6504211 8807790 7476329 3151241 -1063226 -2357680
2330b357680J626027K706621K548984K063283J167346K01350K51374J005148M89667
$$ -2357680 -731653 1974968 4523952 6587235 7754581 7955931 8207305 9212453 9702120
2321I702120j733018l207360k089364j30557r2769j612671j983308k58574J751725
$$ 9702120 7969102 4761742 2672378 2541821 2449052 836381 -1146927 -1405501 346224
2312C46224K373383J822193Q09698o44573k084689j787382J271160M959224N292321
$$ 346224 2719607 4541800 5351498 4706925 2622236 834854 2106014 7065238 12357559
2303A2357559J151752l463602l712380j06086J938315o36153m459369m806486
$$ 12357559 13509311 10045709 6333329 6227243 8165558 7529405 3070036 -1736450
2295a736450k086566q7773K52269J049379K305193J386583j765801l507940k043660
$$ -1736450 -3823016 -3910789 -3658520 -2609141 -303948 1082635 -683166 -4191106 -6234766
2286f234766N4653P43184J749832M300099N571353K977096j148628k994525k816907
$$ -6234766 -6180113 -5436929 -3687097 613002 6184355 9161451 8012823 5018298 2201391
2277B201391l014822k967775n02324K826376K864999q03427l955272l648816j354710
$$ 2201391 -813431 -3781206 -4283530 -1457154 1407845 604418 -3350854 -6999670 -8354380
2268h354380N38583J909215L329730M026038K975811N11940k050768l374971k758786
$$ -8354380 -7815797 -5906582 -2576852 1449186 4424997 4936937 2886169 -488802 -3247588
2259c247588j127908q35117k794147m543614l211179L74165K908168L171289K600140
$$ -3247588 -4375496 -5210613 -8004760 -12548374 -15759553 -15385388 -12477220 -9305931 -6705791
2250f705791J961624P47199k11700R90335L809251N098279L453970J082637L72798
$$ -6705791 -4744167 -3996968 -4208668 -3218333 590918 5689197 9143167 10225804 10598602
2241A0598602R80522J254650M60113j174566k771986k874494j154625J27781j172778
$$ 10598602 11579124 12833774 13293887 12119321 9347335 6472841 5318216 5445997 4273219
2232D273219l311917k706814M40777K303818J441859M60591Q40662O56296q77292
$$ 4273219 961302 -1745512 -1304735 999083 2440942 2901533 3742195 4398491 3521199
$$ [...]
##END NTUPLES=NMR SPECTRUM
##END=
