##TITLE=31Pdec_DE-79K2TFA
 CDCl3, 64 sc
 29.11.2024
##JCAMPDX= 6.0         $$ Bruker NMR JCAMP-DX V2.0
##DATA TYPE= NMR SPECTRUM
##DATA CLASS= NTUPLES
##ORIGIN= UXNMR, Bruker Analytische Messtechnik GmbH
##OWNER= root
$$ XWIN-NMR		Version 3.5
$$ Fri Nov 29 14:40:53 2024 Russian Standard Time (UT+4h)  she@DPX200
##.OBSERVE FREQUENCY= 81.013821
##.OBSERVE NUCLEUS= ^31P
##.ACQUISITION MODE= SIMULTANEOUS
##.ACQUISITION SCHEME= undefined
##.AVERAGES= 64
##.DIGITISER RES= 17
##SPECTROMETER/DATA SYSTEM= spect
##.PULSE SEQUENCE= zgpg30
##.SOLVENT NAME= CDCl3
##.SHIFT REFERENCE= (INTERNAL, CDCl3, 0, 198.062)
##AUDIT TRAIL= $$ (NUMBER, WHEN, WHO, WHERE, WHAT)
$$ ##TITLE= Audit trail, XWIN-NMR		Version 3.5
$$ ##JCAMPDX= 5.01
$$ ##ORIGIN= Bruker BioSpin GmbH
$$ ##OWNER= she
$$ F:/spectra/data/she/nmr/P31/2/pdata/1/auditp.txt
$$ ##AUDIT TRAIL=  $$ (NUMBER, WHEN, WHO, WHERE, WHAT)
(   1,<2024-11-29 14:38:48.65 +0400>,<she>,<DPX200>,
      <created by zg, POWCHK disabled, PULCHK disabled
       configuration hash MD5:
       00 E9 B6 7A A2 85 ED C7 34 08 36 98 17 FE 4E 26
       data hash MD5: 32K
       08 A3 49 51 40 1B 9A F9 C1 DA 46 4B 9D 47 05 83>)
(   2,<2024-11-29 14:39:01.15 +0400>,<she>,<DPX200>,
      <Start of raw data processing
       efp BC_mod = 2 LB = 1.5 FT_mod = 6 PKNL = 1 PHC0 = 2213.767 PHC1 = 222.4883 SI = 64K 
       data hash MD5: 64K
       D6 B3 0F 3C 4E C1 03 FE 2E 81 A9 0D 00 BC 86 F5>)
(   3,<2024-11-29 14:39:17.03 +0400>,<she>,<DPX200>,
      <pk PHC0 = 25.98312 PHC1 = 0 
       data hash MD5: 64K
       55 3D 9B 45 19 7B 42 A8 7B 05 26 AA 05 AC 59 7D>)
(   4,<2024-11-29 14:39:29.59 +0400>,<she>,<DPX200>,
      <pk PHC0 = 159.0731 PHC1 = 0 
       data hash MD5: 64K
       EA 7F 0A 2B 4F E8 E1 A5 6C B5 79 87 9E 13 7F B0>)
(   5,<2024-11-29 14:40:12.96 +0400>,<she>,<DPX200>,
      <pk PHC0 = -174.9125 PHC1 = 37.8 
       data hash MD5: 64K
       3F 55 CC B5 29 D2 63 A4 A7 DB 30 6A 3E 8F A9 59>)
(   6,<2024-11-29 14:40:17.84 +0400>,<she>,<DPX200>,
      <abs ABSG = 5 
       data hash MD5: 64K
       80 75 7C 5E 9E 3A 9A 91 44 54 08 3B 5B 1C 45 0E>)
$$ ##END=
$$ 
$$ hash MD5
$$ A1 6B AF A9 5F 6B B7 27 3F A3 3C A0 1F F8 4D 83
##$RELAX= 
##$RELAX= 
##$RELAX= 
##$RELAX= 
##$RELAX= 
##$RELAX= 
##$RELAX= 
##$RELAX= 
$$ Bruker specific parameters
$$ --------------------------
##$DU= <F:/spectra>
##$EXPNO= 2
##$NAME= <P31>
##$PROCNO= 1
##$TYPE= <nmr>
##$USER= <she>
##$AMP= (0..31)
100 100 100 100 100 100 100 100 100 100 100 100 100 100 100 100 100 100 
100 100 100 100 100 100 100 100 100 100 100 100 100 100 
##$AQSEQ= 0
##$AQ_mod= 1
##$AUNM= <au_zg>
##$AUTOPOS= <>
##$BF1= 81.014009
##$BF2= 200.13
##$BF3= 200.13
##$BF4= 200.13
##$BF5= 200.13
##$BF6= 200.13
##$BF7= 200.13
##$BF8= 200.13
##$BYTORDA= 1
##$CFDGTYP= 0
##$CFRGTYP= 5
##$CHEMSTR= <none>
##$CNST= (0..31)
1 1 145 1 1 1 1 1 1 1 1 1 1 1 1 1 1 1 1 1 1 1 1 1 1 1 1 1 1 1 1 1 
##$CPDPRG= <waltz16>
##$CPDPRG1= <>
##$CPDPRG2= <waltz16>
##$CPDPRG3= <>
##$CPDPRG4= <mlev>
##$CPDPRG5= <mlev>
$$ [...]
##$SUBNAM3= <"">
##$SUBNAM4= <"">
##$SUBNAM5= <"">
##$SUBNAM6= <"">
##$SUBNAM7= <"">
##$SUBNAM8= <"">
##$SUBNAM9= <"">
##$SW= 400.765351723535
##$SWIBOX= (0..15)
0 1 3 0 0 0 0 0 0 0 0 0 0 0 0 0 
##$SW_h= 32467.5324675325
##$TD= 32768
##$TD0= 1
##$TE= 0
##$TE2= 300
##$TE3= 300
##$TEG= 300
##$TL= (0..7)
0 120 53 12 22 120 120 120 
##$TP= (0..7)
150 150 150 150 150 150 150 150 
##$TP07= 0
##$TPNAME0= <>
##$TPNAME1= <>
##$TPNAME2= <>
##$TPNAME3= <>
##$TPNAME4= <>
##$TPNAME5= <>
##$TPNAME6= <>
##$TPNAME7= <>
##$TPOAL= (0..7)
0.5 0.5 0.5 0.5 0.5 0.5 0.5 0.5 
##$TPOFFS= (0..7)
0 0 0 0 0 0 0 0 
##$TUNHIN= 0
##$TUNHOUT= 0
##$TUNXOUT= 0
##$USERA1= <user>
##$USERA2= <user>
##$USERA3= <user>
##$USERA4= <user>
##$USERA5= <user>
##$V9= 5
##$VALIST= <valist>
##$VCLIST= <CCCCCCCCCCCCCCC>
##$VD= 0
##$VDLIST= <DDDDDDDDDDDDDDD>
##$VPLIST= <PPPPPPPPPPPPPPP>
##$VTLIST= <TTTTTTTTTTTTTTT>
##$WBST= 1024
##$WBSW= 4
##$XGAIN= (0..3)
0 0 0 0 
##$XL= 0
##$YL= 0
##$YMAX_a= 14354
##$YMIN_a= -16250
##$ZGOPTNS= <>
##$ZL1= 120
##$ZL2= 120
##$ZL3= 120
##$ZL4= 120
##$ABSF1= 198.0616
##$ABSF2= -202.7028
##$ABSG= 5
##$ABSL= 3
##$ALPHA= 0
##$AQORDER= 0
##$ASSFAC= 0
##$ASSFACI= 0
##$ASSFACX= 0
##$ASSWID= 0
##$AUNMP= <proc_1d>
##$AZFE= 0.1
##$AZFW= 0.5
##$BCFW= 0
##$BC_mod= 2
##$BYTORDP= 0
##$COROFFS= 0
##$CY= -3
##$DATMOD= 1
##$DC= 0
##$DFILT= <>
##$DTYPP= 0
##$F1P= 0
##$F2P= 0
##$FCOR= 1
##$FTSIZE= 65536
##$FT_mod= 6
##$GAMMA= 0
##$GB= 0
##$INTBC= 1
##$INTSCL= 9.790993e-09
##$ISEN= 30
##$LB= 1.5
##$LEV0= 0
##$LPBIN= 0
##$MAXI= 10000
##$MC2= 0
##$MEAN= 0
##$ME_mod= 0
##$MI= 50
##$NCOEF= 0
##$NC_proc= -8
##$NLEV= 6
##$NOISF1= 182.463
##$NOISF2= 159.3651
##$NSP= 0
##$NTH_PI= 0
##$NZP= 0
##$OFFSET= 198.0616
##$PC= 4
##$PHC0= 2223.91
##$PHC1= 260.2883
##$PH_mod= 1
##$PKNL= yes
##$PPARMOD= 0
##$PSCAL= 0
##$PSIGN= 0
##$REVERSE= no
##$SF= 81.0140089999434
##$SI= 65536
##$SIGF1= 159.3651
##$SIGF2= -187.1042
##$SINO= 113.3802
##$SIOLD= 16384
##$SREGLST= <1H.CDCl3>
##$SSB= 0
##$STSI= 65536
##$STSR= 0
##$SW_p= 32467.5324675325
##$SYMM= 0
##$S_DEV= 0
##$TDeff= 32768
##$TDoff= 0
##$TI= <>
##$TILT= no
##$TM1= 0
##$TM2= 0
##$TOPLEV= 0
##$USERP1= <user>
##$USERP2= <user>
##$USERP3= <user>
##$USERP4= <user>
##$USERP5= <user>
##$WDW= 1
##$XDIM= 65536
##$YMAX_p= 325811699
##$YMIN_p= -368445057
$$ End of Bruker specific parameters
$$ ---------------------------------
##NTUPLES= NMR SPECTRUM
##VAR_NAME=  FREQUENCY,     SPECTRUM/REAL,   SPECTRUM/IMAG
##SYMBOL=    X,             R,               I
##VAR_TYPE=  INDEPENDENT,   DEPENDENT,       DEPENDENT
##VAR_FORM=  AFFN,          ASDF,            ASDF
##VAR_DIM=   65536,         65536,           65536
##UNITS=     HZ,            ARBITRARY UNITS, ARBITRARY UNITS
##FACTOR=    0.49542278885378, 1,            1
##FIRST=     16045.7642231865, 0,            0
##LAST=      -16421.768244346, 0,            0
##MIN=       -16421.768244346, -368445057,   0
##MAX=       16045.7642231865, 325811699,    0
$$ Real data points
##PAGE= N=1
##DATA TABLE= (X++(R..R)), XYDATA
$$ [...]
##PAGE= N=2
##DATA TABLE= (X++(I..I)), XYDATA
$$ plain form
7485 5950847 4767586 3394841 976756 -2066790 -4530111 -5080781 -2555490 2994403
7477 2994403 9446641 13834124 14569741 12094593 7992273 4105137 1552799 -367796
7469 -367796 -3390492 -7442316 -9852855 -8713451 -5702454 -3888114 -3984193 -4745114 -5769219
7460 -5769219 -7342199 -8381597 -7505448 -5968133 -6635926 -9664629 -11753277 -10281706 -5898940
7451 -5898940 -463455 5080430 9716612 11566863 9786797 5946108 2265345 -521166
7443 -521166 -2764160 -4580932 -5803218 -6220438 -5221658 -2246962 1857380 5020820 5949701
7434 5949701 4908670 2451193 -969462 -3766282 -3634658 -346193 3345065 4696479
7426 4696479 3673789 1839147 61688 -1481916 -2370605 -2442980 -2396069 -2757403 -3022325
$$ packed form
7485E950847j183261j372745k418085l043546k463321n50670K525291N549893
7477B994403O452238M387483P35617k475148m102320l887136k552338j920595
7469c67796l022696m051824k410539J139404L010997J814340r6079p60921j024105
7460e769219j572980j039398Q76149J537315o67793l028703k088648J471571M382766
7451e898940N435485N543885M636182J850251j780066l840689l680763k786511
7443e21166k242994j816772j222286m17220R98780K974696M104342L163440R28881
7434E949701j041031k457477l420655k796820J31624L288465L691258J351414
7426D696479j022690j834642j777459j543604q88689p2375M6911l61334k64922
$$ plain form
7417 -3022325 -2661082 -2033809 -1468704 -522759 873771 1622736 906337 -449774 -989388
7408 -989388 -100789 2249890 6008919 10241594 13025112 13239306 11490477 8573107 4584066
7399 4584066 492511 -1501733 -894595 -218354 -1260768 -1798610 988254 5238327 6174258
7390 6174258 2849955 -502152 -556701 935192 563098 -1775529 -3499823 -3409823 -2866718
7381 -2866718 -3289569 -4142154 -3750329 -1392311 1798372 3985518 4563704 4538880 4841530
7372 4841530 5127231 4970778 5178832 6368666 6951563 4718412 552629 -1704006 -47256
7363 -47256 2868675 3136344 477209 -2031539 -2329948 -1437456 -1005970 -663298 1048047
7354 1048047 3959414 5933658 5372002 3033181 753319 -928599 -2877124 -5383636
$$ packed form
7417c022325L61243O27273N65105R45945J396530P48965p16399j356111n39614
7408i89388Q88599K350679L759029M232675K783518K14194j748829k917370l989041
7399D584066m091555j994244O07138O76241j042414n37842K786864M250073R35931
7390F174258l324303l352107n4549J491893l72094k338627j724294R0000N43105
7381b866718m22851q52585L91825K358018L190683K187146N78186k4824L02650
7372D841530K85701j56453K08054J189834N82897k233151m165783k256635J656750
7363d7256K915931K67669k659135k508748k98409Q92492M31486L42672J711345
7354A048047K911367J974244n61656k338821k279862j681918j948525k506512
$$ plain form
7346 -5383636 -7321339 -7620441 -6613065 -5316708 -4073741 -2509531 -367434 2011087
7338 2011087 3569025 2880237 -355124 -3958880 -4861558 -2700622 -323486 201694 247011
7329 247011 1757527 3610288 3302698 1039355 -733663 -1283917 -2030632 -2990474 -1933644
7320 -1933644 2016094 6628604 9705556 11697217 13706087 14949163 14116970 11779762
7312 11779762 9531447 7845464 6615769 6809568 9364734 12791339 14005693 11860990
7304 11860990 8258718 5409755 3548165 2062009 1422249 2526817 4710813 5959752
7296 5959752 5373032 4283290 4311015 5230110 5772785 5853694 6452736 7428566 7296769 5738632
7286 5738632 4469842 4424023 3788998 636626 -3853920 -6969484 -8181272 -8696796 -8048989
$$ packed form
7346e383636j937703k99102J007376J296357J242967J564210K142097K378521
7338B011087J557938o88788l235361l603756r02678K160936K377136N25180M5317
7329B47011J510516J852761l07590k263343j773018n50254p46715r59842J056830
7320a933644L949738M612510L076952J991661K008870J243076q32193k337208
7312A1779762k248315j685983j229695J93799K555166L426605J214354k144703
7304A1860990l602272k848963j861590j486156o39760J104568K183996J248939
7296E959752n86720j089742K7725R19095N42675Q0909N99042R75830j31797j558137
7286E738632j268790m5819o35025l152372m490546l115564j211788n15524O47807
$$ plain form
7277 -8048989 -4428497 1290141 5146408 4943710 2760838 1175958 -211982 -2311454
7269 -2311454 -3196100 -545336 3928344 5992243 4595510 2867596 2977998 3088005 930362
7260 930362 -1956721 -1946854 1700004 5748688 6804408 4569310 1044739 -1979987 -3769424
7251 -3769424 -4019677 -2712320 -452738 1888867 3834421 5109065 5353628 4967518 5495209
7242 5495209 7437739 8141618 4511946 -1663880 -4183720 -32028 6236162 8426186
7234 8426186 6671978 5880160 7951485 10117180 10539266 10595228 10603474 7953567 1774465
7225 1774465 -4208991 -6199772 -4887582 -2917005 -595347 2689026 4994890 3544058
7217 3544058 -1006469 -5117560 -6650137 -6040774 -3967300 -659682 2732422 4669698
$$ packed form
7277h048989L620492N718638L856267k02698k182872j584880j387940k099472
7269b311454q84646K650764M473680K063899j396733j727914J10402J10007k157643
7260I30362k887083R867L646858M048684J055720k235098l524571l024726j789437
7251c769424k50253J307357K259582K341605J945554J274644K44563l86110N27691
7242E495209J942530P03879l629672o175826k519840M151692O268190K190024
7234H426186j754208p91818K071325K165695M22086N5962Q246k649907o179102
7225A774465n983456j990781J312190J970577K321658L284373K305864j450832
7217C544058m550527m111091j532577O09363K073474L307618L392104J937276
$$ plain form
7209 4669698 5213213 5526755 5709333 5191948 4856484 6344542 9291464 11485971 11797359
7200 11797359 10793192 8654798 5195512 2251237 3030051 7740513 12183596 12310332
7192 12310332 8471579 3696259 -443557 -4158946 -6842882 -6794403 -3841551 -398966
7184 -398966 1031814 511214 -98958 -13538 -390660 -2085679 -3839492 -3843613 -2210257 -140186
7174 -140186 2814814 8028397 13864479 15533464 10928168 4370202 1877166 4101004
7166 4101004 6619795 6047673 2792594 -1552216 -6066757 -9411135 -9949792 -7986567 -5730739
7157 -5730739 -4356431 -3029615 -1159262 678641 2494119 4978891 7004620 5685521
7149 5685521 423450 -5309682 -7926477 -7708570 -7240631 -7544644 -7659374 -6867113 -5438130
$$ packed form
7209D669698N43515L13542J82578n17385l35464J488058K946922K194507L11388
7200A1797359j004167k138394l459286k944275P78814M710462M443083J26736
7192A2310332l838753m775320m139816l715389k683936M8479K952852L442585
7184c98966J430780n20600o10172Q5420l77122j695019j753813m121J633356K070071
7174a40186K955000N213583N836082J668985m605296o557966k493036K223838
7166D101004K518791n72122l255079m344810m514541l344378n38657J963225K255828
7157e730739J374308J326816J870353J837903J815478K484772K025729j319099
7149E685521n262071n733132k616795K17907M67939l04013j14730P92261J428983
$$ plain form
7140 -5438130 -3762006 -2173721 -1241698 -1282376 -2038287 -3284255 -4853553 -5728667 -4518370
7131 -4518370 -1529732 1078414 2026347 2283592 2788123 2536306 400556 -2542290 -4131713
7122 -4131713 -3687234 -2218978 -1021014 -1098312 -2824251 -5011598 -5497296 -3784404 -1853626
7113 -1853626 -1321214 -1441927 -1255815 -1747688 -3846101 -5943448 -5796888 -3682387 -1378809
7104 -1378809 684101 2671639 3031760 240945 -3632521 -4495162 -1625147 1489322 2224288
7095 2224288 1860180 2662553 4594798 6254289 6889078 6102092 3516960 277841 -898083
7086 -898083 933439 2796246 1037276 -3884873 -7762834 -7728399 -5284271 -3755679 -4066521
7077 -4066521 -4260043 -2745718 -461050 956921 1970417 4329667 7723653 9522149
$$ packed form
7140e438130J676124J588285R32023m0678p55911j245968j569298q75114J210297
7131d518370K988638K608146R47933K57245N04531k51817k135750k942846j589423
7122d131713M44479J468256J197964p7298j725939k187347m85698J712892J930778
7113a853626N32412j20713J86112m91873k098413k097347J46560K114501K303578
7104a378809K062910J987538L60121k790815l873466q62641K870015L114469P34966
7095B224288l64108Q02373J932245J659491O34789p86986k585132l239119j175924
7086h98083J831522J862807j758970m922149l877961L4435K444128J528592l10842
7077d066521j93522J514325K284668J417971J013496K359250L393986J798496
$$ plain form
7069 9522149 8714331 7899147 9538316 11953509 11502234 7678409 3341290 362554 -2069907
7060 -2069907 -4616762 -6033993 -5171421 -2664539 258069 2979669 4876826 5249526 4615112
7051 4615112 4494938 5236424 5504662 4377861 2346675 -43466 -2578323 -4029053 -2752722
7042 -2752722 553357 2973028 3199115 2931894 3498019 3816640 3196258 3194389 4454021
7033 4454021 4392696 869954 -4024979 -6831712 -7428058 -7703316 -7394008 -5056944 -1941483
7024 -1941483 -737981 -949415 390546 3380450 4820140 3781147 3469286 5989157 8856134
7015 8856134 8843730 6436972 4168406 2816905 1651781 770332 834799 1420874 1437227
7006 1437227 626340 -354502 -509919 1330592 5439665 9699860 11094054 9566913 8362504
$$ packed form
7069I522149q07818q15184J639169K415193m51275l823825m337119k978736k432461
7060b069907k546855j417231Q62572K506882K922608K721600J897157L72700o34414
7051D615112j20174P41486K68238j126801k031186k390141k534857j450730J276331
7042b752722L306079K419671K26087k67221N66125L18621o20382j869J259632
7033D454021o1325l522742m894933k806733n96346k75258L09308K337064L115461
7024a941483J203502k11434J339961K989904J439690j038993l11861K519871K866977
7015H856134j2404k406758k268566j351501j165124q81449O4467N86075J6353
7006A437227q10887r80842j55417J840511M109073M260195J394194j527141j204409
$$ plain form
6997 8362504 9549800 11606623 12666383 13200079 13416412 11125208 5375604 -313439 -2165512
6988 -2165512 -1707058 -2987582 -5718697 -5987213 -3259196 -1476414 -2457131 -3139654 -1108288
6979 -1108288 1540697 2235901 1979995 2461512 2421345 303507 -2069859 -2172576 -1219880
6970 -1219880 -2111785 -4270127 -4629036 -3244059 -3638648 -6952795 -9676067 -8891264 -6676039
6961 -6676039 -6853631 -9284064 -10029689 -6564513 -711722 3700575 4683291 3234917 1663791
6952 1663791 1502567 2784617 4557658 5539419 4569370 1463597 -2046429 -3077323 -397313
6943 -397313 3715848 5340083 2730542 -2229803 -6150921 -6965238 -4880685 -1634975 759062
6934 759062 1154044 -220145 -2235755 -3782566 -4303475 -3954953 -3537194 -3810178 -4548180
$$ packed form
6997H362504J187296K056823J059760N33696K16333k291204n749604n689043j852073
6988b165512M58454j280524k731115k68516K728017J782782r80717o82523K031366
6979a108288K648985O95204k55906M81517m0167k117838k373366j02717R52696
6970a219880q91905k158342l58909J384977l94589l314147k723272P84803K215225
6961f676039j77592k430433p45625L465176N852791M412297R82716j448374j571126
6952A663791j61224J282050J773041R81761r70049l105773l510026j030894K680010
6943c97313M113161J624235k609541m960345l921118q14317K084553L245710K394037
6934G59062L94982j374189k015610j546811n20909L48522M17759k72984p38002
$$ plain form
6925 -4548180 -4724403 -3826850 -2289935 -465337 1683560 3415021 3252027 1237619 -297185
6916 -297185 328694 1742148 1770847 816642 751051 1408040 822990 -1360060 -3282845 -3698396
6906 -3698396 -3047902 -1672954 611730 2984056 4160387 4755774 6454151 8460210 7820505
6897 7820505 4104495 505399 -1139644 -3074909 -7164360 -10808149 -10438017 -6936961
6889 -6936961 -4229430 -3762061 -3592079 -2336091 -1075084 -1229993 -2624873 -3788159 -2922028
6880 -2922028 821940 5698617 7970440 5787215 1582283 -898472 -721320 766872
6872 766872 2915280 5689347 7874718 8215689 7584610 7302702 6179433 2438265 -1923678
6863 -1923678 -2423973 1752879 6200107 6874526 4418473 1805681 348412 -400142 -853876
$$ packed form
6925d548180j76223Q97553J536915J824598K148897J731461j62994k014408j534804
6916b97185O25879J413454K8699r54205o5591O56989n85050k183050j922785m15551
6906c698396O50494J374948K284684K372326J176331N95387J698377K006059o39705
6897G820505l716010l599096j645043j935265m089451l643789L70132L501056
6889f936961K707531M67369J69982J255988J261007j54909j394880j163286Q66131
6880b922028L743968M876677K271823k183225m204932k480755J77152J488192
6872G66872K148408K774067K185371L40971o31079k81908j123269l741168m361943
6863a923678n00295M176852M447228O74419k456053k612792j457269p48554m53734
$$ plain form
6854 -853876 -1216244 -1844371 -2632724 -2968508 -2803836 -2678993 -2593698 -2253432 -2229091 -2980823
6844 -2980823 -2988772 -326900 3863539 6305682 6355812 6645472 8101841 7919612 4378107
6835 4378107 364943 -626176 590773 1057344 753260 2101159 5460408 8377332 9092121
6826 9092121 8171157 6661846 4860621 3133808 2228652 2493017 3798857 5794091 7108038
6817 7108038 5341153 -157974 -6054033 -7872983 -5284554 -2541697 -3120747 -5734724
6809 -5734724 -6702192 -4912031 -2845054 -2926161 -4299013 -4100774 -1435600 1331662 1882560
6800 1882560 1145615 1383353 1913362 -377688 -5655927 -9232469 -7057206 -1148595 2903378
6791 2903378 2658251 495025 -808508 -1305647 -2087553 -2511502 -853774 2903360 6187612
$$ packed form
6854h53876l62368o28127p88353l35784J64672J24843Q5295L40266K4341p51732
6844b980823p949K661872M190439K442143N0130K89660J456369j82229l541505
6835D378107m013164r91119J216949M66571l04084J347899L359249K916924P14789
6826I092121r20964j509311j801225j726813r05156K64365J305840J995234J313947
6817G108038j766885n499127n896059j818950K588429K742857n79050k613977
6809e734724r67468J790161K066977q1107j372852J98239K665174K767262N50898
6800A882560p36945K37738N30009k291050n278239l576542K175263N908611M051973
6791B903378k45127k163226j303533m97139p81906m23949J657728L757134L284252
$$ plain form
6782 6187612 6175165 2790284 -1136402 -2965429 -2840171 -2440148 -2082635 -805775 1117610
6773 1117610 2084774 1851603 1956268 2822220 2890806 1616411 782134 1509069 2533969
6764 2533969 3027667 4313452 6727046 7744940 6030130 4531518 6075415 8314395
6756 8314395 7197353 3651385 2180393 3712068 4515872 2214275 -1424143 -4114148
6748 -4114148 -5529436 -5484916 -3423911 -819967 -760216 -3800539 -6934503 -7740695 -7080809
6739 -7080809 -6910021 -7912744 -9949338 -12307035 -13011817 -10575219 -6847796 -5302613 -6203276
6730 -6203276 -6669169 -5723766 -5296572 -5455611 -3221582 1898365 5367206 3347437 -2287073
6721 -2287073 -7160969 -9405319 -8908301 -5066674 1216367 5961909 6215553 3938454 2807158
$$ packed form
6782F187612j2447l384881l926686j829027J25258M00023L57513J276860J923385
6773A117610R67164k33171J04665Q65952O8586j274395q34277P26935J024900
6764B533969M93698J285785K413594J017894j714810j498612J543897K238980
6756H314395j117042l545968j470992J531675Q03804k301597l638418k690005
6748d114148j415288M4520K061005K603944N9751l040323l133964q06192O59886
6739g080809J70788j002723k036594k357697p04782K436598L727423J545183r00663
6730f203276m65893R45403M27194j59039K234029N119947L468841k019769n634510
6721b287073m873896k244350M97018L841627O283041M745542K53644k277099j131296
$$ plain form
6712 2807158 3072798 2626926 1198395 129355 -484555 -1122841 -508884 2936191 8158342
6703 8158342 12496587 14519755 13716991 9327811 2316832 -3340325 -4488156 -2340925
6695 -2340925 573333 4617612 10523896 15159983 14636861 10060353 5312971 685613
6687 685613 -5562184 -10431717 -8054917 772945 7655580 7439070 4061370 2754380 2255494
6678 2255494 -964513 -5521400 -7497169 -6990354 -7052899 -7795947 -6450842 -2684605 458008
6669 458008 1179615 1098671 2162217 3979880 5022865 4665286 3358406 1960492 1249424
6660 1249424 1290467 1260720 482673 -655844 -1245123 -706313 1213344 4192641 6544650
6651 6544650 6118653 2998806 -58885 -1077147 -1394269 -3365747 -6889972 -9944265 -11417854
$$ packed form
6712B807158K65640m45872j428531j069040o13910o38286O13957L445075N222151
6703H158342M338245K023168q02764m389180p010979n657157j147831K147231
6695b340925K914258M044279N906284M636087n23122m576508m747382m627358
6687F85613o247797m869533K376800Q827862O882635k16510l377700j306990m98886
6678B255494l220007m556887j975769N06815o2545p43048J345105L766237L142613
6669D58008P21607q0944J063546J817663J042985l57579j306880j397914p11068
6660A249424M1043k9747p78047j138517n89279N38810J919657K979297K352009
6651F544650m25997l119847l057691j018262l17122j971478l524225l054293j473589
$$ plain form
6642 -11417854 -11424154 -9651442 -5624934 -365256 4136287 7094750 9030766 9896586 8894090
6633 8894090 6343505 4083726 3470726 4144499 5171658 6263775 7311960 7711936 6989138
6624 6989138 5598012 4327045 3061389 934578 -1869721 -3102157 -531014 4592621
6616 4592621 7642164 5644168 1189338 -695975 1056847 2887824 2200584 425616
6608 425616 -311528 -228782 123998 1681323 4122582 4265563 546859 -3301893 -2995448
6599 -2995448 -239493 20576 -2314057 -2516985 715673 2646680 -52091 -4147836 -5118592
6590 -5118592 -3623080 -2977473 -3127671 -1570587 1175041 1530507 -1514118 -4341105 -3435018
6581 -3435018 240070 2954587 2778564 1089635 307944 1313593 3049525 3980520 3572121
$$ packed form
6642a1417854o300J772712M026508N259678M501543K958463J936016Q65820j002496
6633H894090k550585k259779o13000O73773J027159J092117J048185L99976p22798
6624F989138j391126j270967j265656k126811k804299j232436K571143N123635
6616D592621L049543j997996m454830j885313J752822J830977o87240j774968
6608D25616p37144Q2746L52780J557325K441259J42981l718704l848752L06445
6599b995448K755955K60069k334633k02928L232658J931007k698771m095745r70756
6590e118592J495512O45607j50198J557084K745628L55466l044625k826987R06087
6581c435018L675088K714517j76023j688929p81691J005649J735932R30995m08399
$$ plain form
6572 3572121 2370604 1005357 -368686 -1616703 -2157428 -1236468 1475408 5372926 8678757
6563 8678757 9291590 6812707 3358898 1263565 431408 -591861 -1603814 -1163345 160107
6554 160107 57696 -1215698 -229803 3962430 6788031 3942466 -2203373 -5828076 -5703628
6545 -5703628 -5632556 -7420046 -8190772 -5669416 -1897772 303457 1238475 2304490 2750100
6536 2750100 1278321 -905483 -1399926 124055 2218731 4045392 5061360 3533870
6528 3533870 -1457028 -6805065 -7493971 -2817292 2164170 2757763 119072 -1160216 666957
6519 666957 2952541 2879293 1027124 117541 1545380 4122835 5732160 5321930 3260486
6510 3260486 534317 -1736181 -2317852 -511839 2653617 4657501 3959009 1988072 1579701
$$ packed form
6572C572121j201517j365247j374043j248017n40725R20960K711876L897518L305831
6563H678757O12833k478883l453809k095333q32157j023269j011953M40469J323452
6554A60107j02411j273394R85895M192233K825601k845565o145839l624703J24448
6545e703628P1072j787490p70726K521356L771644K201229R35018J066015M45610
6536B750100j471779k183804m94443J523981K094676J826661J015968j527490
6528C533870m990898n348037o88906M676679M981462N93593k638691j279288J827173
6519F66957K285584p3248j852169r09583J427839K577455J609325m10230k061444
6510C260486k726169k270498n81671J806013L165456K003884o98492j970937m08371
$$ plain form
6501 1579701 3356816 4819795 3527702 200918 -2221320 -2088084 -677979 -393387 -1938478
6492 -1938478 -3475379 -2479554 1497537 6050809 8360320 8255382 7925220 8512116 8502835
6483 8502835 6430072 3666515 2648976 3141386 2624082 430239 -971401 253625 2384701
6474 2384701 2585454 713755 -1207864 -2245595 -3043504 -3463604 -2067866 1548042 5583656
6465 5583656 7827963 7431220 4667969 539618 -2870269 -3505897 -1989511 -1574788 -3900216
6456 -3900216 -6177628 -4651467 134068 4018815 4792332 4211488 3939942 2517393 -1656674
6447 -1656674 -6482960 -8186810 -6501301 -5093615 -6442585 -8561993 -7994966 -4519552
6439 -4519552 -1192220 -241462 -538707 391736 2761412 3863371 1249888 -3826549 -6884914
$$ packed form
6501A579701J777115J462979j292093l326784k422238J33236J410105K84592j545091
6492a938478j536901R95825L977091M553272K309511j04938l30162N86896r281
6483H502835k072763k763557j017539M92410n17304k193843j401640J225026K131076
6474B384701K00753j871699j921619j037731p97909m20100J395738L615908M035614
6465E583656K244307l96743k763251m128351l409887o35628J516386M14723k325428
6456c900216k277412J526161M785535L884747P73517n80844k71546j422549m174067
6447a656674m826286j703850J685509J407686j348970k119408N67027L475414
6439d519552L327332R50758k97245R30443K369676J101959k613483n076437l058365
$$ plain form
6430 -6884914 -4689095 1021471 5085801 4296565 331861 -2968251 -3924305 -3414995 -2098993
6421 -2098993 378283 3158906 3575994 371664 -3949991 -5841974 -4826250 -2868813
6413 -2868813 -524363 3333105 7712922 8775601 4694184 -1221913 -4634302 -5535796
6405 -5535796 -6716463 -8343180 -7671643 -3897275 269817 2480589 3012948 2335960 -105616
6396 -105616 -3038677 -2850967 1284877 4750057 3475705 179972 235277 2909381 2104530
6387 2104530 -4059630 -9855268 -9960470 -6172228 -3174940 -1534930 947084 3415677
6379 3415677 2335603 -2789464 -8128613 -10503599 -10523482 -9899833 -8390506 -4937694 -75487
6370 -75487 4298301 6635347 6448753 4388887 2262674 1728327 2141213 991686 -2393312
$$ packed form
6430f884914K195819N710566M064330p89236l964704l300112r56054N09310J316002
6421b098993K477276K780623M17088l204330m321655j891983J015724J957437
6413b868813K344450L857468M379817J062679m081417n916097l412389r01494
6405e535796j180667j626717O71537L774368M167092K210772N32359o76988k441576
6396a05616k933061J87710M135844L465180j274352l295733N5305K674104q04851
6387B104530o164160n795638j05202L788242K997288J640010K482014K468593
6379C415677j080074n125067n339149k374986j9883O23649J509327L452812M862207
6370g5487M373788K337046j86594k059866k126213n34347M12886j149527l384998
$$ plain form
6361 -2393312 -4865190 -2885522 2719713 7324783 7819174 5610078 3853640 3400340 2774855
6352 2774855 1089109 -881787 -2486655 -4291038 -6429705 -6949699 -3339054 4192566
6344 4192566 11958668 15778308 14369279 9832775 5586186 4157892 6118823 10046246
6336 10046246 13414604 14218378 12313131 9371722 7484655 7480909 8267030 7974874 6156120
6327 6156120 4520338 4725846 5733917 4738122 1036597 -2577393 -3295895 -1797202 -659673
6318 -659673 -251870 1526594 5346164 8519364 8097497 4555547 1067270 -167288 463007
6309 463007 1723393 3340401 5431739 7182158 7396281 6296117 5545527 5985395 6479229
6300 6479229 6053279 6128045 8745377 12970957 15391490 14620084 12921338 12293663 11442237
$$ packed form
6361b393312k471878J979668N605235M605070M94391k209096j756438m53300o25485
6352B774855j685746j970896j604868j804383k138667n19994L610645P531620
6344D192566P766102L819640j409029m536504m246589j428294J960931L927423
6336A0046246L368358Q03774j905247k941409j887067l746P86121k92156j818754
6327F156120j635782K05508J008071r95795l701525l613990p18502J498693J137529
6318f59673M07803J778464L819570L173200m21867l541950l488277j234558O30295
6309D63007J260386J617008K091338J750419K14123j100164p50590M39868M93834
6300F479229m25950P4766K617332M225580K420533p71406j698746o27675q51426
$$ plain form
6291 11442237 8639361 5385101 4296359 4697432 3616395 701900 -1152926 -302630
6283 -302630 1680877 3259855 5145117 7886859 9761931 8833557 5413941 1122445 -2853832
6274 -2853832 -5431694 -5561331 -3989234 -3247747 -4304074 -5126614 -4345097 -4130308 -6851682
6265 -6851682 -10672628 -11672500 -9411311 -7218497 -7305654 -8542537 -9016739 -7933539 -4787468
6256 -4787468 461413 5749942 8082329 7198382 5739394 5031646 3351651 -421729 -4100530
6247 -4100530 -4948762 -2975114 357902 4440956 8222232 8889165 5196057 764568 320496
6238 320496 3019860 3354571 -779608 -4783246 -3797357 894654 4558584 5587881 5997472
6229 5997472 6755079 6470444 4841672 3990237 5193002 6829278 7069023 6595081 6950599
$$ packed form
6291A1442237k802876l254260j088742M01073j081037k914495j854826Q50296
6283c02630J983507J578978J885262K741742J875072r28374l419616m291496l976277
6274b853832k577862j29637J572097P41487j056327q22540P81517K14789k721374
6265f851682l820946r99872K261189K192814q7157j236883m74202J083200L146071
6256d787468N248881N288529K332387q83947j458988p07748j679995l773380l678801
6247d100530q48232J973648L333016M083054L781276O66933l693108m431489m44072
6238C20496K699364L34711m134179m003638R85889M692011L663930J029297M09591
6229E997472P57607k84635j628772q51435J202765J636276K39745m73942L55518
$$ plain form
6220 6950599 7792566 7725475 6733237 5824185 5057181 3823196 2420486 1394682 -55078
6211 -55078 -2803463 -5415672 -5545205 -3494053 -1610456 -209744 2453629 5544320 5092403
6202 5092403 133568 -4387397 -4028376 -1088711 -584441 -2488145 -2720234 -496215 545972
6193 545972 -1370056 -3626046 -4011390 -3772611 -4306467 -4684054 -4434136 -5201025 -7202122
6184 -7202122 -7322537 -3731261 335684 748628 -1708827 -3236475 -3004155 -3303624 -4633893
6175 -4633893 -4746953 -2774898 -738158 -200279 -378836 -449217 -1055098 -2477310 -3687308
6166 -3687308 -4368198 -5651720 -7550230 -7783298 -4793083 -207795 3304931 5034071 5442650
6157 5442650 4221660 1517314 -182926 1714757 6052370 8867856 8405637 6875627
$$ packed form
6220F950599Q41967o7091r92238r09052p67004j233985j402710j025804j449760
6211e5078k748385k612209j29533K051152J883597J400712K663373L090691m51917
6202E092403m958835m520965L59021K939665N04270j903704k32089K224019J042187
6193E45972j916028k255990l85344K38779n33856l77587K49918p66889k001097
6184g202122j20415L591276M066945M12944k457455j527648K32320k99469j330269
6175d633893j13060J972055K036740N37879j78557p0381o05881j422212j209998
6166c687308o80890j283522j898510k33068K990215M585288L512726J729140M08579
6157E442650j220990k704346j700240J897683M337613K815486m62219j530010
$$ plain form
6149 6875627 6782480 7895650 8939829 10102321 12005863 13616397 13364079 11843725 11415083
6140 11415083 12971936 14655727 14234923 11645824 8656315 6844373 6454019 6717345 6892737
6131 6892737 7244660 8901815 12165419 15308428 16321689 15846589 16581601 19049708 19962475
6122 19962475 16604220 11379566 9442305 12307600 16468693 18478201 18546496 18089568 16565886
6113 16565886 13088753 9391786 8315711 9813640 10883908 9561291 6934991 4885954
6105 4885954 3780847 3199642 3320445 4398154 5867084 7036283 8047352 9359059 10932300
6096 10932300 12648987 14799724 17267487 18868148 18492007 16398430 13408872 9423477
6088 9423477 4057935 -1604166 -5429710 -6465273 -5379292 -2696829 1585404 6134784
$$ packed form
6149F875627r3147J113170J044179J162492J903542J610534k52318j520354m28642
6140A1415083J556853J683791m20804k589099k989509j811942l90354K63326J75392
6131F892737L51923J657155L263604L143009J013261m75100P35012K468107R12767
6122A9962475l358255n224654j937261K865295M161093K009508O8295m56928j523682
6113A6565886l477133l696967j076075J497929J070268j322617k626300k049037
6105D885954j105107n81205J20803J077709J468930J169199J011069J311707J573241
6096A0932300J716687K150737K467763J600661l76141k093577k989558l985395
6088I423477n365542n662101l825544j035563J085981K682463M282233M549380
$$ plain form
6080 6134784 8149981 6618600 4244643 4272743 6377277 7754690 7588151 7805670 9200926
6071 9200926 9531455 6863125 2833719 624761 714998 610634 -1521870 -4686857 -6709941
6062 -6709941 -6693297 -5295216 -3479992 -1716894 -101826 1275471 2219468 2617610 2620232
6053 2620232 2454848 2149935 1784295 1884508 2904743 4196459 4274537 2485679 -197776
6044 -197776 -2269738 -2780717 -1238184 2152123 5432231 5671078 2313138 -1317215 -1532912
6035 -1532912 1479319 4649446 6387447 7664006 9125444 9870526 9664850 9892412 11081427
6026 11081427 11438110 9352927 5880591 3094116 1119633 -1297718 -3801445 -3962525
6018 -3962525 -294112 5347057 9061551 8451531 4741949 1435812 864591 2239517 3215415
$$ packed form
6080F134784K015197j531381k373957K8100K104534J377413j66539K17519J395256
6071I200926L30529k668330m029406k208958R0237j04364k132504l164987k023084
6062f709941J6644J398081J815224J763098J615068J377297R43997L98142K622
6053B620232j65384l04913l65640J00213J020235J291716P8078j788858k683455
6044a97776k071962n10979J542533L390307L280108K38847l357940l630353k15697
6035a532912L012231L170127J738001J276559J461438P45082k05676K27562J189015
6026A1081427L56683k085183l472336k786475j974483k417351k503727j61080
6018c962525L668413N641169L714494o10020l709582l306137n71221J374926R75898
$$ plain form
6009 3215415 2659129 994842 -1472791 -4727046 -7328688 -6561850 -1599243 4618068 8026889
6000 8026889 7426890 4899240 2973697 2540754 3065233 3450755 2532748 -226630 -3972117
5991 -3972117 -6797542 -7341374 -6089737 -4854168 -4697080 -4541228 -2510312 1213982 3949242
5982 3949242 3682968 1591599 157138 -97775 -127523 367433 2443029 4888287 4789998
5973 4789998 1865336 -574946 -168850 1636890 2747948 3706564 5596834 7018780 6022229
5964 6022229 3586458 2320441 2580774 2578644 1868501 2117437 4276931 7085220 8851134
5955 8851134 9419811 10087280 12228603 15727260 18434760 18274763 16347588 16087572 18280400
5946 18280400 19229586 15756800 9684323 4729676 1184161 -2787855 -6192505 -5854995
$$ packed form
6009C215415n56286j664287k467633l254255k601642P66838M962607O217311L408821
6000H026889n99999k527650j925543m32943N24479L85522r18007k759378l745487
5991c972117k825425n43832J251637J235569J57088J55852K030916L724294K735260
5982C949242k66274k091369j434461k54913k9748M94956K075596K445258r8289
5973D789998k924662k440282M06096J805740J111058R58616J890270J421946r96551
5964F022229k435771j266017K60333k130p10143K48936K159494K808289J765914
5955H851134N68677O67469K141323L498657K707500j59997j927175k60016K192828
5946A8280400R49186l472786o072477m954647l545515l972016l404650L37510
$$ plain form
5938 -5854995 -1705773 2505043 4152502 4131137 4013768 4068932 4643136 6407932 8469247
5929 8469247 8996485 8290658 8381019 9111009 7867736 4091302 798383 330461 1559472
5920 1559472 2589783 3165527 2936436 566320 -3471301 -6194802 -6336993 -6331662 -7725170
5911 -7725170 -7731798 -3625147 1967466 4024279 1918196 -438863 -408731 954346 2114713
5902 2114713 3387407 5354281 7270888 8011294 7409771 6243232 5500834 5387925 4568668
5893 4568668 1379122 -3385138 -6184862 -4495927 283453 4876837 7713270 9092750
5885 9092750 9384691 9024927 9138615 10215124 11044101 10526947 9311736 8042737 5725104
5876 5725104 2074518 -149807 2026063 7680286 13336441 17274114 19650610 19594201 15922061
$$ packed form
5938e854995M149222M210816J647459k1365j17369N5164N74204J764796K061315
5929H469247N27238p05827R0361P29990j243273l776434l292919m67922J229011
5920A559472J030311N75744k29091k370116m037621k723501j42191N331j393508
5911g725170o628M106651N592613K056813k106083k357059L0132J363077J160367
5902B114713J272694J966874J916607P40406o01523j166539p42398j12909q19257
5893D568668l189546m764260k799724J688935M779380M593384K836433J379480
5885I092750K91941l59764J13688J076509Q28977n17154j215211j268999k317633
5876E725104l650586k224325K175870N654223N656155L937673K376496n6409l672140
$$ plain form
5867 15922061 10471079 7064503 6757210 7220791 7169899 8052884 10475573 12133962 10854000
5858 10854000 7387209 3870619 1431994 302603 359019 579305 -293278 -1848915 -2543743
5849 -2543743 -2433713 -3042711 -4025134 -2784941 1450740 5933831 8301542 9526175 11046501
5840 11046501 11564141 9393304 6145509 5095741 6770664 8690638 8988117 8128736 7360697
5831 7360697 7332267 8156730 9473746 10599683 11393848 12121505 11654878 7515055 -473949
5822 -473949 -8070133 -10694990 -8854551 -6902849 -6883141 -6562917 -3868198 -227965 1868741
5813 1868741 2407359 3116171 4500771 5345590 4674484 3019477 1918255 2678734 5191339
5804 5191339 7649070 8191802 7157510 6672382 7503296 7693522 5441366 2021523 12779
$$ packed form
5867A5922061n450982l406576l07293M63581n0892Q82985K422689J658389j279962
5858A0854000l466791l516590k438625j129391N6416K20286q72583j555637o94828
5849b543743J10030o08998r82423J240193M235681M483091K367711J224633J520326
5840A1046501N17640k170837l247795j049768J674923J919974K97479q59381p68039
5831G360697k8430Q24463J317016J125937P94165P27657m66627m139823p989004
5822d73949p596184k624857J840439J951702J9708L20224K694719L640233K096706
5813A868741N38618P08812J384600Q44819o71106j655007j101222P60479K512605
5804E191339K457731N42732j034292m85128Q30914J90226k252156l419843k008744
$$ plain form
5795 12779 -627824 -2432720 -6227524 -9305133 -8845070 -5583205 -2730755 -2231159 -3321368
5786 -3321368 -3954185 -2371932 1845362 6639999 8053156 4046954 -2327135 -5742767
5778 -5742767 -4899432 -3685467 -5204340 -7249104 -5799600 -1099336 2669360 3120702 2208372
5769 2208372 2637305 4106616 4355251 2562987 309625 -458118 528696 1967333 2733627
5760 2733627 3129663 4130385 5747927 7014036 7546166 7845979 7694991 5931615 2848814
5751 2848814 1082294 2357332 4718430 5147477 3925140 3926584 6157490 8598700 9349469
5742 9349469 8366790 6022564 2602435 -413833 -1399572 -1708753 -4889343 -11351294 -16427755
5733 -16427755 -15769318 -10717714 -6175986 -4610215 -4400155 -3265942 -1192743 -848
$$ packed form
5795A2779o40603j804896l794804l077609M60063L261865K852450M99596j090209
5786c321368o32817J582253M217294M794637J413157m006202o374089l415632
5778e742767Q43335J213965j518873k044764J449504M700264L768696M51342r12330
5769B208372M28933J469311K48635j792264k253362p67743R86814J438637P66294
5760B733627L96036J000722J617542J266109N32130K99813j50988j763376l082801
5751B848814j766520J275038K361098M29047j222337J444K230906K441210P50769
5742I349469r82679k344226l420129l016268r85739l09181l180590o461951n076461
5733a6427755O58437N051604M541728J565771K10060J134213K073199J191895
$$ plain form
5725 -848 -1193329 -4134995 -6087018 -5012596 -2551561 -2388670 -4940485 -6055615 -2741803
5716 -2741803 2086101 3290109 405715 -2366300 -2464484 -1905732 -3417214 -6482080 -8525285
5707 -8525285 -8095481 -5477456 -1495863 2820613 6097538 7462381 7443922 7269061 7350861
5698 7350861 7103503 6255200 5598850 5884730 6355717 5333720 2466830 -604102 -2423074
5689 -2423074 -3431980 -4387959 -4356213 -2328484 39077 121540 -1347394 -824523 2521273
5680 2521273 5284342 5352355 5407209 8223221 11645050 12031765 10401262 10586767 12391629
5671 12391629 11498604 6516956 1596022 643962 2722192 5051433 7235088 9899861
5663 9899861 11691282 10758291 7970214 5932216 5430567 5160166 4547450 4480176 5061116
$$ packed form
5725h48j192481k941666j952023J074422K461035J62891k551815j115130L313812
5716b741803M827904J204008k884394k772015r8184N58752j511482l064866k043205
5707h525285M29804K618025L981593M316476L276925J364843j8459j74861Q1800
5698G350861k47358q48303o56350K85880M70987j021997k866890l070932j818972
5689b423074j008906r55979L1746K027729K367561Q2463j468934N22871L345796
5680B521273K763069O8013N4854K816012L421829L86715j630503J85505J804862
5671A2391629q93025m981648m920934r52060K078230K329241K183655K664773
5663I899861J791421r32991k788077k037998n01649k70401o12716o7274N80940
$$ plain form
5654 5061116 4761722 2598890 -354561 -2565370 -3990816 -5300855 -5983780 -4769274 -1896253
5645 -1896253 494820 853021 47375 -173273 341199 526151 469665 1723060 5019126
5636 5019126 9062250 12020289 13062661 12148013 9745904 7311525 6490892 7061745 7183777
5627 7183777 6463470 6762171 8627193 9238975 6335263 2416521 1967309 5440272 9236750
5618 9236750 11232267 12655921 13902173 12287128 6246176 -664003 -2795223 1297943
5610 1297943 7611582 11451149 11769290 10611539 9749762 9045203 7922711 7201816 8293611
5601 8293611 10783693 12238919 10980369 7798666 4125194 -19379 -4828767 -8777751
5593 -8777751 -9865989 -8102637 -4969182 -1181545 3009966 6120743 6619727 5510982
$$ packed form
5654E061116k99394k162832k953451k210809j425446j310039o82925J214506K873021
5645a896253K391073L58201q05646k20648N14472J84952n6486J253395L296066
5636E019126M043124K958039J042372r14648k402109k434379q20633N70853J22032
5627G183777p20307K98701J865022O11782k903712l918742m49212L472963L796478
5618I236750J995517J423654J246252j615045o040952o910179k131220M093166
5610A297943O313639L839567L18141j157751q61777p04559j122492p20895J091795
5601H293611K490082J455226j258550l181703l673472m144573m809388l948984
5593h777751j088238J763352L133455L787637M191511L110777M98984j108745
$$ plain form
5585 5510982 5023983 4709262 1835832 -3636974 -7518868 -6454117 -2292603 457866 -13225
5576 -13225 -1751808 -2142139 -341685 2723832 5270821 5655368 3411667 -439549 -4069894
5567 -4069894 -5657549 -4191457 -521677 2783112 3864776 3482690 3167042 2267136 -931495
5558 -931495 -5447342 -7637434 -5572112 -1243619 2091697 2737583 492713 -3693405 -7316888
5549 -7316888 -8026938 -6523443 -5395020 -4695219 -1942449 2524965 4189826 776637 -3371719
5540 -3371719 -2609456 2734294 7696953 9366726 8733944 7187170 4796155 1835935 -800950
5531 -800950 -2796955 -4205449 -4581521 -3893519 -3207828 -2740228 -813435 2971304 5308066
5522 5308066 3096742 -1388061 -2767740 370211 3989671 4234536 1405196 -2067317
$$ packed form
5585E510982m86999l14721k873430n472806l881894J064751M161514K750469m71091
5576a3225j738583l90331J800454L065517K546989L84547k243701l851216l630345
5567d069894j587655J466092L669780L304789J081664l82086l15648q99906l198631
5558i31495m515847k190092K065322M328493L335316O45886k244870m186118l623483
5549g316888p10050J503495J128423O99801K752770M467414J664861l413189m148356
5540c371719P62263N343750M962659J669773o32782j546774k391015k960220k636885
5531h00950j996005j408494l76072O88002O85691M67600J926793L784739K336762
5522E308066k211324m484803j379679L137951L619460K44865k829340l472513
$$ plain form
5514 -2067317 -4604443 -5490530 -4369623 -2073694 -523817 -904601 -2668976 -4272102 -3980537
5505 -3980537 -668116 4708960 9079230 10190200 8744190 6295746 2828856 -1318254
5497 -1318254 -3266650 -965633 2600129 2677000 -480578 -2355989 -1227280 400742 1603943
5488 1603943 4702994 9511193 11322091 7624079 2421962 393065 416833 -1270255 -4581904
5479 -4581904 -6546895 -6676650 -7080480 -8294939 -8736705 -7765348 -6162057 -3970146 -563826
5470 -563826 3508950 7042235 9923472 12279999 12903036 10969999 8402873 7872227 9119211
5461 9119211 9701696 8537961 6178381 2778146 -976233 -2006953 2011301 7822718
5453 7822718 9124677 4566011 -737626 -2552674 -2118285 -1810635 -885333 1254762 1483929
$$ packed form
5514b067317k537126q86087J120907K295929J549877l80784j764375j603126K91565
5505c980537L312421N377076M370270J110970j446010k448444l466890m147110
5497a318254j948396K301017L565762P6871l157578j875411J128709J628022J203201
5488A603943L099051M808199J810898l698012n202117k028897K3768j687088l311649
5479d581904j964991j29755m03830j214459m41766R71357J603291K191911L406320
5470e63826M072776L533285K881237K356527O23037j933037k567126n30646J246984
5461I119211N82485j163735k359580l400235l754379j030720M018254N811417
5453G822718J301959m558666n303637j815048M34389L07650R25302K140095K29167
$$ plain form
5444 1483929 -2733602 -7645991 -6708023 761706 8667343 12128059 12431689 12884593 13395005
5435 13395005 11736416 7941472 4321018 1697367 -1619856 -6407450 -10044805 -9146201
5427 -9146201 -4184299 117501 -370924 -4823833 -8775965 -9184785 -7002731 -5010085 -4715189
5418 -4715189 -5828646 -7194779 -7157336 -4301812 598352 4119459 3327140 -867411 -4837835
5409 -4837835 -6351949 -5979670 -4739219 -2524587 555302 3167003 4185511 3931017 3195453
5400 3195453 2306995 1850485 2641948 3863891 3102408 65606 -1494520 1746868 7381032
5391 7381032 9624580 6773556 2943528 1774664 1947739 819694 -599163 512536
5383 512536 3625677 5019186 2958120 -65417 -815251 1011509 3313756 4167263 2946185
$$ packed form
5444A483929m217531m912389R37968P469729P905637L460716L03630M52904N10412
5435A3395005j658589l794944l620454k623651l317223m787594l637355Q98604
5427i146201M961902M301800m88425m452909l952132m08820K182054J992646K94896
5418d715189j113457j366133L7443K855524M900164L521107p92319m194551l970424
5409d837835j514114L72279J240451K214632L079889K611701J018508k54494p35564
5400C195453q88458m56510P91463J221943p61483l036802j560126L241388N634164
5391G381032K243548k851024l830028j168864J73075j128045j418857J111699
5383E12536L113141J393509k061066l023537p49834J826760K302247Q53507j221078
$$ plain form
5374 2946185 25388 -3534729 -6384038 -7573357 -6815774 -4273616 -730209 2207923
5366 2207923 3168389 2613041 2491802 3764199 4940467 3754213 -63712 -4287857 -6440911
5357 -6440911 -6188712 -5368063 -5676412 -6587980 -6050760 -3280669 18995 1868278 2629934
5348 2629934 4242311 7223417 9811190 10153393 8100291 4607388 699207 -2421566
5340 -2421566 -3561309 -2925226 -2532031 -4095928 -6861622 -8553918 -8320909 -7723026 -8525777
5331 -8525777 -10218762 -10378538 -7541690 -3360961 -1379631 -3316593 -6863228 -7792237 -4247432
5322 -4247432 1658527 6465664 8632149 8855052 8273523 7498203 6969701 6981376 7081019
5313 7081019 6304035 4407228 2284554 771326 -397644 -1907252 -3667852 -5096569
$$ packed form
5374B946185k920797l560117k849309j189319P57583K542158L543407K938132
5366B207923R60466n55348j21239J272397J176268j186254l817925m224145k153054
5357f440911K52199Q20649l08349r11568N37220K770091L299664J849283P61656
5348B629934J612377K981106K587773L42203k053102l492903l908181l120773
5340b421566j139743O36083L93195j563897k765694j692296K33009N97883q02751
5331h525777j692985j59776K836848M180729J981330j936962l546635r29009L544805
5322d247432N905959M807137K166485K22903n81529p75320n28502J1675R9643
5313G081019p76984j896807k122674j513228j168970j509608j760600j428717
$$ plain form
5305 -5096569 -6245089 -7562076 -8513657 -7722023 -5045755 -2369423 -1364700 -1388235 -745119
5296 -745119 817636 2285464 3228589 3712423 3091102 1197229 283279 2805603 7007799
5287 7007799 8071070 4822003 1854858 2942585 5737125 6103107 4687870 4939326 6601125
5278 6601125 6144099 3057722 790085 920201 950438 -763296 -1963526 -389039 2645979
5269 2645979 4878843 6528416 8634082 10213267 9631234 7207883 4295203 1293769
5261 1293769 -1367064 -1967650 283236 2981165 3034991 737147 -930462 -417937 1221911
5252 1221911 2757107 3882854 3902092 1742893 -1975356 -4696641 -4739491 -3278722 -2757362
5243 -2757362 -4062720 -5863631 -6170599 -3951331 498540 6042250 11051246 13466553
$$ packed form
5305e096569j148520j316987r51581P91634K676268K676332J004723k3535O43116
5296g45119J562755J467828R43125M83834o21321j893873r13950K522324M202196
5287G007799J063271l249067k967145J087727K794540L65982j415237K51456J661799
5278F601125m57026l086377k267637J30116L0237j713734j200230J574487L035018
5269B645979K232864J649573K105666J579185n82033k423351k912680l001434
5261A293769k660833o00586K250886K697929N3826k297844j667609N12525J639848
5252A221911J535196J125747J9238k159199l718249k721285m2850J460769N21360
5243b757362j305358j800911l06968K219268M449871N543710N008996K415307
$$ plain form
5235 13466553 11646364 6261741 847653 -1095579 288280 1871637 1866165 1589853 2421062
5226 2421062 3331114 2967105 2252810 2815590 4156587 4669474 4595721 5505566 7144915
5217 7144915 7289401 5167860 2959403 2998092 5021277 7290418 9352296 12241150 16124395
5208 16124395 19028495 18694264 15361660 11793577 10205219 9980450 9129537 7093511 4749456
5199 4749456 2361960 -389693 -2374748 -1376995 2638008 6591786 7833532 6995828 6007765
5190 6007765 4740536 1347456 -4737481 -11388804 -15050680 -13122625 -6229448 1423108
5182 1423108 5342959 5041442 3774376 3880503 4476904 4262252 3894861 4220284 4613143
5173 4613143 4784104 5934674 8237284 9369293 7555888 3988361 403779 -3169669
$$ packed form
5235A3466553j820189n384623n414088j943232J383859J583357n472k76312Q31209
5226B421062R10052l64009p14295N62780J340997N12887p3753R09845J639349
5217G144915J44486k121541k208457L8689K023185K269141K061878K888854L883245
5208A6124395K904100l34231l332604l568083j588358k24769q50913k036026k344055
5199D749456k387496k751653j985055R97753M015003L953778J241746q37704r88063
5190F007765j267229l393080o084937o651323l661876J928055O893177P652556
5182A423108L919851l01517j267066J06127N96401k14652l67391L25423L92859
5173D613143J70961J150570K302610J132009j813405l567527l584582l573448
$$ plain form
5165 -3169669 -6094043 -5638646 -1044713 3562044 4069888 2039230 1507769 2180499 540093
5156 540093 -3402146 -5492745 -3645113 -347961 1550671 1978332 2111783 2875554 5191597
5147 5191597 8820759 11121308 9968382 7440704 7254037 9099594 9338537 6883937 4127427
5138 4127427 2092641 -696778 -3965682 -4971145 -3259840 -1959757 -2991382 -4885660
5130 -4885660 -6506727 -8735387 -10971634 -10315553 -6331954 -2677074 -1666568 -844546 2650343
5121 2650343 7661277 11340172 12796454 12264527 9829411 7147390 7098389 9361768 9648930
5112 9648930 5770259 1005689 -1213682 -2248383 -4558300 -6652834 -5872988 -3508019
5104 -3508019 -2823288 -3841997 -4104471 -3242861 -3035965 -3772588 -3820495 -2347717 -106186
$$ packed form
5165c169669k924374M55397M593933M606757N07844k030658n31461O72730j640406
5156E40093l942239k090599J847632L297152J898632M27661J33451P63771K316043
5147E191597L629162K300549j152926k527678j86667J845557K38943k454600k756510
5138D127427k034786k789419l268904j005463J711305J300083j031625j894278
5130d885660j621067k228660k236247O56081L983599L654880J010506Q22022L494889
5121B650343N010934L678895J456282n31927k435116k682021m9001K263379K87162
5112I648930l878671m764570k219371j034701k309917k094534P79846K364969
5104c508019O84731j018709k62474Q61610K06896p36623m7907J472778K241531
$$ plain form
5095 -106186 1794202 2242708 654004 -1412921 -1192154 1268990 2700008 1890215 1966781
5086 1966781 5025170 8306313 9002070 9029740 10841484 12016635 9050045 3745630 531428
5077 531428 -367370 -1649459 -2837991 -1448744 947503 31246 -4074872 -6611520 -5353617
5068 -5353617 -2610325 160682 4123298 8589915 10256409 8460704 6361566 5295308
5060 5295308 2746247 -2124861 -5672029 -5188515 -3129467 -2921386 -3885094 -3493977 -2067802
5051 -2067802 -1938149 -3521700 -5006952 -5146656 -4460557 -4168312 -4865169 -5564709 -3993025
5042 -3993025 668731 5441698 6212309 3091527 697597 2393023 6577689 9565352
5034 9565352 9808913 8128532 5853040 4167464 3903185 4922634 6601819 8952681 11835865
$$ packed form
5095a06186J900388M48506j588704k066925K20767K461144J431018q09793P6566
5086A966781L058389L281143O95757K7670J811744J175151k966590n304415l214202
5077E31428q98798j282089j188532J389247K396247r16257m106118k536648J257903
5068e353617K743292K771007L962616M466617J666494j795705k099138j066258
5060E295308k549061m871108l547168M83514K059048K08081r63708L91117J426175
5051b067802J29653j583551j485252j39704O86099K92245o96857o99540J571684
5042c993025M661756M772967P70611l120782k393930J695426M184666K987663
5034I565352K43561j680381k275492j685576k64279J019449J679185K350862K883184
$$ plain form
5025 11835865 13460840 11985829 8728048 7378243 9529251 13028165 14978902 14191788
5017 14191788 10583697 4758494 -1255723 -5112195 -6485061 -6459884 -4941118 -1264499
5009 -1264499 2941656 4775179 4215240 4093559 5537915 6702091 6490513 5997424 5409385
5000 5409385 3125377 -706886 -3127630 -2340753 197067 2810047 5518414 7764625
4992 7764625 7847217 6334086 6530807 9458294 11605889 9942470 6132394 3400906 2104817
4983 2104817 986181 174169 164335 -21854 -1019443 -1282537 584523 3312840 4862821
4974 4862821 5259281 5739916 6633518 7565227 8138548 7374579 4575918 1640355 1794625
4965 1794625 4818489 6543798 4651642 1799798 1122568 1957861 2431824 3024809 4545307
$$ packed form
5025A1835865J624975j475011l257781j349805K151008L498914J950737p87114
5017A4191788l608091n825203o014217l856472j372866K5177J518766L676619
5009a264499M206155J833523n59939j21681J444356J164176k11578m93089n88039
5000E409385k284008l832263k420744P86877K537820K612980K708367K246211
4992G764625Q2592j513131J96721K927487K147595j663419l810076k731488j296089
4983B104817j118636q12012r834j86189r97589k63094J867060K728317J549981
4974D862821L96460M80635Q93602R31709N73321p63969k798661k935563J54270
4965A794625L023864J725309j892156k851844o77230Q35293M73963N92985J520498
$$ plain form
4956 4545307 5245854 3248618 17009 -1410600 -227034 2181886 4391645 5268451 4084925
4947 4084925 1991643 1392321 2577194 3407194 3381426 4777341 8266432 10977687 10885742
4938 10885742 9590745 8726944 7471805 5926828 6715584 10136584 11736234 8306749
4930 8306749 2940947 743054 2671961 6614856 11007049 14280156 14477618 12691923
4922 12691923 13104326 16536972 18307899 15763326 12891329 13351617 14154196 11320897 7097459
4913 7097459 6105598 8445193 11677694 15396551 18975377 19598315 17589105 18350728 23649400
4904 23649400 27071520 24200372 20412778 21227879 22230235 17682614 12322511 14020786
4896 14020786 20255744 22735397 20658216 18746951 17164264 14403377 14809354 21583579
$$ packed form
4956D545307P00547j997236l231609j427609J183566K408920K209759Q76806j183526
4947D084925k093282n99322J184873Q30000k5768J395915L489091K711255r1945
4938A0885742j294997q63801j255139j544977P88756L421000J599650l429485
4930H306749n365802k197893J928907L942895M392193L273107J97462j785695
4922A2691923M12403L432646J770927k544573k871997M60288Q02579k833299m223438
4913G097459r91861K339595L232501L718857L578826O22938k009210P61623N298672
4904B3649400L422120k871148l787594Q15101J002356m547621n360103J698275
4896A4020786O234958K479653k077181j911265j582687k760887M05977O774225
$$ plain form
4888 21583579 28099193 28370048 29155849 37914547 47089419 46934260 44904850 52365188 61622153
4879 61622153 60777668 61849883 82945149 110499170 119976884 131824455 192826990 284918969
4871 284918969 309134147 202359517 31043336 -81087850 -93734758 -67464931 -59033723
4864 -59033723 -61100022 -49549018 -32359795 -26505983 -25069794 -15351746 -5106920 -6715485
4856 -6715485 -13360490 -12225700 -7412328 -10466407 -18934035 -21960284 -19225147 -18677161
4848 -18677161 -21406474 -22403822 -21662398 -22644400 -23604272 -20780917 -16721811 -16336996 -18038012
4839 -18038012 -16938459 -13464051 -11292800 -10218587 -8170578 -6852005 -8512614 -10446609
4831 -10446609 -9202451 -6925386 -7311457 -8843782 -8351666 -7561404 -9355205 -10964095 -8091993
$$ packed form
4888B1583579O515614K70855P85801Q758698R174872j55159k029410P460338R256965
4879F1622153q44485J072215K1095266K7554021R477714J1847571O1002535R2091979
4871B84918969K4215178j06774630j71316181j12131186j2646908K6269827Q431208
4864e9033723k066299J1551004J7189223N853812J436189R718048J0244826j608565
4856f715485o645005J134790M813372l054079q467628l026249K735137N47986
4848a8677161k729313r97348P41424r82002r59872K823355M059106L84815j701016
4839a8038012J099553L474408K171251J074213K048009J318573j660609j933995
4831a0446609J244158K277065l86071j532325M92116P90262j793801j608890K872102
$$ plain form
4822 -8091993 -3117502 -1996060 -5004206 -7448704 -7890933 -8763893 -9910004 -8340313 -4243728
4813 -4243728 -1123347 276661 2722696 6740368 9036389 7490514 3810381 638423
4805 638423 -803929 -192242 1788600 3063302 2471088 1591045 1794017 1169405 -2416964
4796 -2416964 -6971219 -8882613 -8366775 -8318082 -8778066 -6958880 -2610530 685188 152333
4787 152333 -3205732 -6569704 -7866859 -6500832 -3702471 -1896221 -2079547 -2715188 -2594851
4778 -2594851 -2905855 -4527578 -5641013 -4628755 -2970350 -2270070 -907733 2801123 6431101
4769 6431101 6385372 3057219 -803780 -4652664 -8695097 -10155582 -6359111 -243949 2505647
4760 2505647 1036371 -977759 -2157359 -4223300 -6480047 -5712312 -2228848 -218704
$$ packed form
4822h091993M974491J121442l008146k444498m42229q72960j146111J569691M096585
4813d243728L120381J400008K446035M017672K296021j545875l680133l171958
4805F38423j442352O11687J980842J274702n92214q80043K02972o24612l586369
4796b416964m554255j911394N15838M8693m59984J819186M348350L295718n32855
4787A52333l358065l363972j297155J366027K798361J806250j83326o35641J20337
4778b594851l11004j621723j113435J012258J658405P00280J362337L708856L629978
4769F431101m5729l328153l860999l848884m042433j460485L796471O115162K749596
4760B505647j469276k014130j179600k065941k256747P67735L483464K010144
$$ plain form
4752 -218704 -997693 -1451252 -521171 -1447979 -5344782 -8045681 -6461861 -3402369 -2651593
4743 -2651593 -3349214 -3023617 -2655673 -4365049 -6483990 -5437009 -1485029 1287343 605292
4734 605292 -1444243 -2002597 -1339582 -1988347 -4835685 -7271128 -5927621 -1033217 3392060
4725 3392060 4433181 3617713 3644332 3664917 861317 -4266906 -7666572 -6770853 -2812531
4716 -2812531 1831530 5576746 6970344 5454638 3220048 3211857 4904032 5075938 2871347
4707 2871347 545631 -1075451 -3828071 -8011492 -10967419 -11207410 -10283163 -9299444 -7459478
4698 -7459478 -5450718 -5915461 -8459222 -8487944 -3718625 2114608 4986656 6026593 7709083
4689 7709083 8416562 5304825 -121777 -3897148 -5215650 -5898332 -5759170 -2925687 1892766
$$ packed form
4752b18704p78989m53559R30081r26808l896803k700899J583820L059492P50776
4743b651593o97621L25597L67944j709376k118941J046981L951980K772372o82051
4734F05292k049535n58354O63015o48765k847338k435443J343507M894404M425277
4725C392060J041121q15468K6619K0585k803600n128223l399666Q95719L958322
4716b812531M644061L745216J393598j515706k234590q191J692175J71906k204591
4707B871347k325716j621082k752620m183421k955927k39991R24247R83719J839966
4698g459478K008760m64743k543761k8722M769319N833233K872048J039937J682490
4689G709083P07479l111737n426602l775371j318502o82682J39162K833483M818453
$$ plain form
4680 1892766 5503370 6595917 6776592 7247185 7356630 6642509 5821460 5343533 4747240
4671 4747240 3681689 2377901 1254702 750604 758386 -228982 -3796481 -8719266 -11511054
4662 -11511054 -10829925 -8777116 -6659086 -2944053 2365478 5205188 2997908 -421729
4654 -421729 88359 3305731 4023543 1523850 250554 2318255 4543206 3847937 1386640
4645 1386640 -117148 24558 758538 808976 -758614 -3428503 -4741142 -3236581 -1409777
4636 -1409777 -2770564 -6328098 -7533346 -4906296 -2028394 -2127793 -4247736 -6131546 -7575417
4627 -7575417 -8950239 -9103175 -7113009 -4456238 -3327262 -3720549 -3662971 -1795468 1099907
4618 1099907 2706960 1198394 -2632108 -5601984 -5585079 -4090020 -3877548 -4831751 -4429112
$$ packed form
4680A892766L610604J092547J80675M70593J09445p14121q21049m77927n96293
4671D747240j065551j303788j123199n04098P782r87368l567499m922785k791788
4662a1511054O81129K052809K118030L715033N309531K839710k207280l419637
4654d21729N10088L217372P17812k499693j273296K067701K224951o95269k461297
4645A386640j503788J41706P33980N0438j567590k669889j312639J504561J826804
4636a409777j360787l557534j205248K627050K877902r9399k119943j883810j443871
4627g575417j374822j52936J990166K656771J128976l93287N7578J867503K895375
4618A099907J607053j508566l830502k969876J6905J495059K12472r54203M02639
$$ plain form
4609 -4429112 -1876691 783875 1855456 1911160 2106464 2566845 2915847 2812687 1823286
4600 1823286 140333 -975469 -1014426 -1588666 -4048772 -6962493 -8448865 -9547604 -11981052
4591 -11981052 -13928620 -12163479 -7617865 -4291291 -2961919 -942327 1769062 1658497
4583 1658497 -1821713 -4503144 -4280375 -4362509 -7111886 -9779198 -9808197 -9619593 -11852015
4574 -11852015 -13800800 -11341944 -5521644 -774114 1043798 679572 -1993225 -6853331
4566 -6853331 -10750706 -10593548 -8217354 -7878077 -9665574 -9684100 -6519857 -3377803 -3218193
4557 -3218193 -5085662 -6143062 -4983476 -2211886 691272 2731793 4294556 6011830
4549 6011830 6538088 3688278 -1290714 -3743056 -1848831 587090 264664 -611153 688112
$$ packed form
4609d429112K552421K660566J071581N5704J95304M60381L49002j03160r89401
4600A823286j682953j115802l8957n74240k460106k913721j486372j098739k433448
4591a1981052j947568J765141M545614L326574J329372K019592K711389j10565
4583A658497l480210k681431K22769q2134k749377k667312k8999J88604k232422
4574a1852015j948785K458856N820300M747530J817912l64226k672797m860106
4566f853331l897375J57158K376194L39277j787497j8526L164243L142054J59610
4557c218193j867469j057400J159586K771590K903158K040521J562763J717274
4549F011830N26258k849810m978992k452342J894225K435921l22426q75817J299265
$$ plain form
4540 688112 1566145 -1158351 -3938239 -900113 6091227 9117305 5746442 1685269 1044281
4531 1044281 1074772 -1243909 -3940784 -4716555 -5528607 -8732245 -12662857 -14418178 -13647567
4522 -13647567 -10894177 -5876320 -215707 2014950 -235255 -2546589 -1414725 606967
4514 606967 7994 -1225798 715531 4212039 4304743 454356 -3350161 -5488062 -8159790
4505 -8159790 -11694171 -12708689 -9413724 -4523032 -1123449 830017 2080015 1457833
4497 1457833 -1770867 -5328212 -6399463 -5358948 -4733051 -5277499 -5187973 -3010349 329777
4488 329777 2705949 3065175 2169065 1390662 974339 -259735 -3105717 -6220264 -7211088
4479 -7211088 -5661668 -3977205 -4576669 -7112261 -9340618 -10032161 -9782024 -9229017 -7998420
$$ packed form
4540F88112Q78033k724496k779888L038126O991340L026078l370863m061173o40988
4531A044281L0491k318681k696875p75771q12052l203638l930612j755321P70611
4522a3647567K753390N017857N660613K230657k250205k311334J131864K021692
4514F06967n98973j233792J941329L496508R2704l850387l804517k137901k671728
4505h159790l534381j014518L294965M890692L399583J953466J249998o22182
4497A457833l228700l557345j071251J040515O25897n44448Q9526K177624L340126
4488C29777K376172L59226q96110p78403m16323j234074k845982l114547r90824
4479g211088J549420J684463n99464k535592k228357o91543K50137N53007J230597
$$ plain form
4470 -7998420 -5939407 -4190159 -3930592 -4741647 -5394353 -5831736 -6859577 -7941180 -7221598
4461 -7221598 -4463522 -2084408 -1861048 -2222557 -831123 1375612 1327608 -1427420 -3808767
4452 -3808767 -3314403 -669146 2103427 3847408 3723057 1006247 -3078725 -5404291 -4624160
4443 -4624160 -3206106 -3913472 -5629040 -4870478 -722965 3886354 5799813 4924243 3660660
4434 3660660 3988494 5411745 5700107 3982987 2695094 4950429 9881979 12794836 11000009
4425 11000009 7294456 5870279 6737655 6607516 3813038 -450612 -4849935 -8836178
4417 -8836178 -11127101 -10325281 -7560035 -5959345 -6691706 -7658974 -6916644 -5315696 -4672868
4408 -4672868 -5187449 -6046223 -7097672 -8398522 -9187580 -8890760 -8490555 -9396581 -11186196
$$ packed form
4470g998420K059013J749248K59567q11055o52706m37383j027841j081603P19582
4461g221598K758076K379114K23360l61509J391434K206735m8004k755028k381347
4452c808767M94364K645257K772573J743981j24351k716810m084972k325566P80131
4443d624160J418054p07366j715568P58562M147513M609319J913459q75570j263583
4434C660660L27834J423251K88362j717120j287893K255335M931550K912857j794827
4425A1000009l705553j424177Q67376j30139k794478m263650m399323l986243
4417h836178k290923Q01820K765246J600690p32361r67268P42330J600948O42828
4408d672868n14581q58774j051449j300850p89058K96820M00205r06026j789615
$$ plain form
4399 -11186196 -11701943 -9430795 -4926722 92677 4225273 6896405 8273353 9139173
4391 9139173 10358509 11909727 12588959 11128464 7617710 3427981 -282644 -3400088
4383 -3400088 -5966869 -7335550 -7157109 -6711039 -7834588 -10275708 -11338601 -8886466 -3983199
4374 -3983199 103573 1100913 -414316 -1804219 -680708 3013579 6900738 8508173
4366 8508173 7636913 5859294 4266701 3107354 3200997 5454740 8543869 9408139 7176702
4357 7176702 4565428 4028175 4517486 3722109 1548741 -700930 -2843843 -5096575 -6389147
4348 -6389147 -6096181 -6147137 -8369999 -10685560 -9337867 -4537463 -418193 703626 480076
4339 480076 465848 -210719 -1607909 -1081754 2656865 6159113 5039063 -190652 -4886242
$$ packed form
4399a1186196n15747K271148M504073N019399M132596K671132J376948Q65820
4391I139173J219336J551218O79232j460495l510754m189729l710625l117444
4383c400088k566781j368681J78441M46070j123549k441120j062893K452135M903267
4374c983199M086772R97340j515229j389903J123511L694287L887159J607435
4366H508173q71260j777619j592593j159347R3643K253743L089129Q64270k231437
4357G176702k611274n37253M89311p95377k173368k249671k142913k252732j292572
4348f389147K92966n0956k222862k315561J347693M800404M119270J121819k23550
4339D80076j4228o76567j397190N26155L738619L502248j120050n229715m695590
$$ plain form
4330 -4886242 -6135942 -5225223 -4384573 -3602353 -1598161 1539299 3990503 4298592 3235930
4321 3235930 3266036 5904238 9720346 11601991 10276791 7882854 7348259 8617879 8498652
4312 8498652 4641589 -926405 -3206194 429487 6926374 10537062 8938257 5133346
4304 5133346 3066290 2989589 2290206 -422404 -3780582 -5646902 -5125848 -2916426 -1007519
4295 -1007519 -1713132 -5586441 -10317555 -12814866 -12244216 -10096341 -7865310 -6101991 -5341052
4286 -5341052 -6146728 -7909566 -8848292 -7661221 -4676665 -1578912 -429258 -2150092 -5229369
4277 -5229369 -6964335 -6830807 -7098015 -8936109 -10099354 -8655316 -6812528 -7844625 -10919687
4268 -10919687 -12829471 -13618952 -15908571 -18993197 -18754275 -14444260 -10735534 -11019460 -12823398
$$ packed form
4330d886242j249700R10719Q40650P82220K004192L137460K451204L08089j062662
4321C235930L0106K638202L816108J881645j325200k393937n34595J269620j19227
4312H498652l857063n567994k279789L635681O496887L610688j598805l804911
4304E133346k067056p6701o99383k712610l358178j866320N21054K209422J908907
4295a007519p05613l873309m731114k497311N70650K147875K231031J763319P60939
4286e341052q05676j762838r38726J187071K984556L097753J149654j720834l079277
4277e229369j734966J33528k67208j838094j163245J444038J842788j032097l075062
4268a0919687j909784p89481k289619l084626K38922M310015L708726k83926j803938
$$ plain form
4259 -12823398 -12378809 -10065488 -8307250 -7104838 -5108591 -3042456 -2682414 -3642635 -3989222
4250 -3989222 -3168939 -2025615 -832096 495486 1003192 -387302 -3023569 -5223122 -6389922
4241 -6389922 -7198865 -8311572 -9897179 -11508364 -11598761 -8617303 -3818981 -1401008 -4049350
4232 -4049350 -9442114 -12860241 -12258255 -9059038 -5090488 -1165317 1549820 1253140 -2286650
4223 -2286650 -6443569 -8021238 -6884735 -6363020 -9147129 -13247779 -13760783 -9160990 -3796530
4214 -3796530 -2677471 -5790024 -9678105 -12487389 -14261706 -14020608 -10702838 -6337771
4206 -6337771 -4251939 -4374114 -4045304 -2898772 -2830157 -3976084 -5575016 -9767776 -18223282
4197 -18223282 -25309831 -22403906 -10654147 -1730606 -2835672 -8274035 -9707958 -7303175
$$ packed form
4259a2823398M44589K313321J758238J202412J996247K066135L60042r60221l46587
4250c989222Q20283J143324J193519J327582N07706j390494k636267k199553j166800
4241f389922q08943j112707j585607j611185r0397K981458M798322K417973k648342
4232d049350n392764l418127O01986L199217L968550L925171K715137k96680l539790
4223b286650m156919j577669J136503N21715k784109m100650n13004M599793N364460
4214c796530J119059l112553l888081k809284j774317K41098L317770M365067
4206f337771K085832j22175L28810J146532O8615j145927j598932m192760q455506
4197a8223282p086549K905925J1749759Q923541j105066n438363j433923K404783
$$ plain form
4189 -7303175 -5333119 -3507459 455207 4487059 5099593 3053610 410349 -4313800
4181 -4313800 -12356352 -19776577 -22147673 -20835841 -19147081 -16063603 -9853382 -4124685
4173 -4124685 -3482306 -6002642 -6512327 -4785777 -4319786 -5592670 -6650105 -7839386 -10191733
4164 -10191733 -11918629 -11933480 -13282514 -17583400 -20480300 -18538868 -15452153 -15020628 -14337179
4155 -14337179 -11403365 -11948787 -19248555 -25103022 -22353678 -18453333 -23254098 -31087090
4147 -31087090 -30556084 -24993324 -25430248 -29495011 -27263111 -23015324 -29008895 -41219423
4139 -41219423 -45408141 -44687867 -54064310 -69027672 -70874968 -64432863 -74305609 -99121727
4131 -99121727 -113643408 -128695689 -193513775 -303325178 -356748756 -265717458 -79986851
$$ packed form
4189g303175J970056J825660L962666M031852O12534k045983k643261m724149
4181d313800q042552p420225k371096J311832J688760L083478O210221N728697
4173d124685O42379k520336n09685J726550M65991j272884j057435j189281k352347
4164a0191733j726896j4851j349034m300886k896900J941432L086715M31525O83449
4155a4337179K933814n45422p299768n854467K749344L900345m800765p832992
4147c1087090N31006N562760m36924m064763K231900M247787n993571j2210528
4139d1219423m188718P20274r376443j4963362j847296O442105r872746k4816118
4131i9121727j4521681j5052281o4818086j09811403n3423578R1031298J85730607
$$ plain form
4124 -79986851 61629051 92793156 70347716 66272147 78872419 73972568 54575438
4117 54575438 46554557 49727745 45267114 33542479 29979117 34356691 33290456 26308858
4109 26308858 24804211 29511951 30270025 25366070 22759180 23899812 22411273 17661050
4101 17661050 15500443 16360161 15094209 11842356 11820866 15140796 16904744 16265742 16121188
4092 16121188 15573139 11921092 8236234 9611239 13549926 13356929 9618416 8970897 12479880
4083 12479880 14596803 13335986 12470099 13366051 13132483 11485935 11531514 13010357 12290473
4074 12290473 9743982 9698586 12198019 12246706 8620883 6305430 8302159 11583909 13332410
4065 13332410 15178506 18837870 22722595 25106869 26188364 25464133 21524597 15700267
$$ packed form
4124g9986851J41615902L1164105k2445440m075569J2600272m899851j9397130
4117E4575438q020881L173188m460631j1724635l563362M377574j066235o981598
4109B6308858j504647M707740P58074m903955k606890J140632j488539m750223
4101A7661050k160607Q59718j265952l251853k1490L319930J763948o39002j44554
4092A6121188n48049l652047l684858J375005L938687j92997l738513o47519L508983
4083A2479880K116923j260817q65887Q95952k33568j646548M5579J478843p19884
4074A2290473k546491m5396K499433M8687l625823k315453J996729L281750J748501
4065A3332410J846096L659364L884725K384274J081495p24231l939536n824330
$$ plain form
4057 15700267 11438512 9070764 5788999 1487028 -587031 8671 -293068 -2436140
4049 -2436140 -2470455 1695642 6402093 7964679 7774119 8645556 10130077 10656843 10817918
4040 10817918 11244830 10165874 6344683 2240302 1353631 3980971 7579431 9625535
4032 9625535 8574880 4059850 -2154645 -7077211 -9478535 -10253875 -9508750 -6162533 -1265633
4023 -1265633 1664388 1324974 700834 2534277 5399111 6370343 5208044 3677417 2716647
4014 2716647 2412919 3079714 4340056 4546817 2902809 1034102 1102582 3417114 6762314
4005 6762314 9731075 11082191 10428306 9201882 9203158 9800292 8686488 5777044 3780905
3996 3780905 4253938 5841079 7264602 9014589 10859452 10888754 8824775 7316391 7845603
$$ packed form
4057A5700267m261755k367748l281765m301971k074059N95702l01739k143072
4049b436140l4315M166097M706451J562586j90560Q71437J484521N26766J61075
4040A0817918M26912j078956l821191m104381q86671K627340L598460K046104
4032I625535j050655m515030o214495m922566k401324p75340P45125L346217M896900
4023a265633K930021l39414o24140J833443K864834R71232j162299j530627r60770
4014B716647l03728O66795J260342K06761j644008j868707O8480K314532L345200
4005F762314K968761J351116o53885j226424J276N97134j113804k909444j996139
3996C780905M73033J587141J423523J749987J844863K9302k063979j508384N29212
$$ plain form
3987 7845603 8091855 5705585 2227969 727184 1630259 3399466 5482342 8073684 10480653
3978 10480653 12053974 13460992 15135545 15917365 14916626 12979774 10684360 7149409
3970 7149409 2915797 1511457 5270919 11487713 15616810 16644430 16435202 15585260 13406792
3961 13406792 10783125 9368157 8450217 5885499 1897895 -1008607 -1725411 -1384944 -847106
3952 -847106 -156454 -225897 -2001920 -3826106 -2628613 1738635 6066013 8265501 9601914
3943 9601914 11520032 12759267 11163704 6787578 1944194 -846927 -416091 2353106
3935 2353106 4964204 5648635 5451433 6624153 8951302 9593011 7110684 3741251 2563180
3926 2563180 3778836 5059507 4760484 3632471 3496845 4764820 5422300 2949051 -2246299
$$ packed form
3987G845603K46252k386270l477616j500785R03075J769207K082876K591342K406969
3978A0480653J573321J407018J674553P81820j000739j936852k295414l534951
3970G149409m233612j404340L759462O216794M129097J027620k09228q49942k178468
3961A3406792k623667j414968r17940k564718l987604k906502p16804L40467N37838
3952h47106O90652o9443j776023j824186J197493M367248M327378K199488J336413
3943I601914J918118J239235j595563m376126m843384k791121M30836K769197
3935B353106K611098O84431j97202J172720K327149O41709k482327l369433j178071
3926B563180J215656J280671k99023j128013j35626J267975O57480k473249n195350
$$ plain form
3917 -2246299 -6080648 -4774458 772299 5990085 7826408 7335811 7106406 8035507 9414987
3908 9414987 10682102 11840038 12776280 13077022 12443645 11124621 10080167 10302791 11354886
3899 11354886 11130726 8131489 3648287 598187 536402 2912733 6566397 10182684 11723239
3890 11723239 9777373 5944355 3857049 5058507 7506587 8875612 9537994 11134320
3882 11134320 13704809 15675278 15788356 13956704 11041008 8716840 8601340 10362635
3874 10362635 11395315 9492605 5397407 1821691 403012 486874 540271 -81019 -702635
3865 -702635 -235450 1425007 3062273 3852719 5111558 8862057 14354961 17727359 16178647
3856 16178647 11180703 6400987 3709059 2580642 2093514 1546328 -16636 -2654084
$$ packed form
3917b246299l834349J306190N546757N217786J836323m90597k29405R29101J379480
3908I414987J267115J157936R36242L00742o33377j319024j044454K22624J052095
3899A1354886k24160k999237m483202l050100o1785K376331L653664L616287J540555
3890A1723239j945866l833018k087306J201458K448080J369025O62382J596326
3882A1134320K570489J970469J13078j831652k915696k324168j15500J761295
3874A0362635J032680j902710m095198l575716j418679Q3862N3397o21290o21616
3865g02635M67185J660457J637266P90446J258839L750499N492904L372398j548712
3856A6178647m997944m779716k691928j128417m87128n47186j562964k637448
$$ plain form
3848 -2654084 -4246628 -2613617 1048102 3135686 2524805 2113628 4328896 7275129 7359161
3839 7359161 4301279 1076564 -579022 -1963181 -4171611 -5404769 -3251044 1391966
3831 1391966 4598839 3784025 558725 -1309737 -76924 2477841 3376195 1570315 -1314321
3822 -1314321 -2840893 -2030448 2625 1300719 959773 137281 1280647 5891842 12561465
3813 12561465 17464667 17608661 13881669 10309029 9880199 11636693 12395052 10658515 7760949
3804 7760949 5447120 3665238 1076997 -3259910 -9055654 -14589240 -16983004 -14111159
3796 -14111159 -7314620 -1125484 1058152 225192 -651435 -1146158 -3149086 -6451465 -7579338
3787 -7579338 -4294534 932656 3770669 2908319 234569 -2587269 -5248678 -6975184
$$ packed form
3848b654084j592544J633011L661719K087584o10881m11177K215268K946233Q4032
3839G359161l057882l224715j655586j384159k208430j233158K153725M643010
3831A391966L206873q14814l225300j868462J232813K554765Q98354j805880k884636
3822a314321j526572Q10445K033073J298094l40946q22492J143366M611195O669623
3813A2561465M903202J43994l726992l572640m28830J756494P58359j736537k897566
3804G760949k313829j781882k588241m336907n795744n533586k393764K871845
3796a4111159O796539O189136K183636q32960q76627m94723k002928l302379j127873
3787g579338L284804N227190K838013q62350k673750k821838k661409j726506
$$ plain form
3779 -6975184 -6296925 -3280995 28224 2169836 3438456 3750231 1728720 -2274562 -4429211
3770 -4429211 -1695086 3219182 4563116 1194208 -1948805 -936482 2105191 3190728
3762 3190728 2647900 3623501 6179796 6950694 4537745 1556325 389817 -47353 -1751396
3753 -1751396 -4208597 -5532502 -5487375 -5308867 -5246087 -4089880 -1087074 2781285 5459495
3744 5459495 5280474 2198747 -1850645 -4114209 -2909817 1693750 8427655 14877395
3736 14877395 17599257 14596586 8389719 4440058 5239484 7820539 8436089 7404724
3728 7404724 7105677 7340559 6061187 3652749 2774181 3810096 3926383 1633103 -690619
3719 -690619 -468115 1207958 1474727 -34178 -1037068 -56104 1990752 3666486 4837427
$$ packed form
3779f975184O78259L015930L309219K141612J268620L11775k021511m003282k154649
3770d429211K734125M914268J343934l368908l143013J012323L041673J085537
3762C190728n42828R75601K556295P70898k412949k981420j166508m37170j704043
3753a751396k457201j323905M5127J78508O2780J156207L002806L868359K678210
3744E459495j79021l081727m049392k263564J204392M603567O733905O449740
3736A4877395K721862l002671o206867l949661P99426K581055O15550j031365
3728G404724k99047K34882j279372k408438q78568J035915J16287k293280k323722
3719f90619K22504J676073K66769j508905j002890R80964K046856J675734J170941
$$ plain form
3710 4837427 5978925 6641494 5646482 2859654 90882 -469032 1245182 2859214 2079351
3701 2079351 -1047629 -4769046 -7634885 -8980244 -8259182 -5486788 -2253690 -779627
3693 -779627 -1465220 -2362105 -1508736 977594 3484009 4851683 5307818 5905225 7345506
3684 7345506 9145084 9988267 9113997 7020912 4502460 1748125 -809543 -1674908 115685
3675 115685 2903585 3670124 1686887 -572531 -670387 985032 2282336 2155889 1133247
3666 1133247 -61510 -1136694 -1525500 -155048 3345739 7407800 9322083 7981479
3658 7981479 5483877 4888467 6281310 6535256 3684257 -79355 -1277908 220116 1440532
3649 1440532 527703 -1375302 -2313454 -1588999 512457 3166687 4657556 3165529 -1263286
$$ packed form
3710D837427J141498O62569r95012k786828k768772n59914J714214J614032p79863
3701B079351l126980l721417k865839j345359P21062K772394L233098J474063
3693g79627o85593q96885Q53369K486330K506415J367674M56135N97407J440281
3684G345506J799578Q43183q74270k093085k518452k754335k557668q65365J790593
3675A15685K787900P66539j983237k259418r7856J655419J297304j26447j022642
3666A133247j194757j075184l88806J370452L500787M062061J914283j340604
3658G981479k497602n95410J392843K53946k850999l763612j198553J498024J220416
3649A440532r12829j903005r38152P24455K101456K654230J490869j492027m428815
$$ plain form
3640 -1263286 -6364289 -9588847 -9773802 -7264303 -3598397 -903240 -350072 -1204678 -2173587
3631 -2173587 -2951267 -3384517 -2545233 -670524 -602790 -4294211 -8691937 -8619440 -3656371
3622 -3656371 1464769 3603098 4392195 5742238 6375985 4921783 2831103 1630382 334604
3613 334604 -1668367 -2060179 844090 4343854 4683254 2394026 795019 509579 -763407
3604 -763407 -3572885 -5415839 -4431314 -1662464 803974 1908027 1665563 918902 1012267
3595 1012267 2195630 2725651 1093284 -1514421 -2710607 -2061738 -763662 921229 3397930
3586 3397930 5481835 5281329 3480261 3041212 4953496 6570807 5228478 1823526 -331002
3577 -331002 760333 3894165 5884560 4432154 311591 -3455372 -4956423 -4993076 -4627320
$$ packed form
3640a263286n101003l224558j84955K509499L665906K695157N53168q54606r68909
3631b173587p77680m33250Q39284J874709O7734l691421m397726P2497M963069
3622c656371N121140K138329P89097J350043O33747j454202k090680j200721j295778
3613C34604k002971l91812K904269L499764L39400k289228j599007k85440j272986
3604g63407k809478j842954R84525K768850K466438J104053k42464p46661R3365
3595A012267J183363N30021j632367k607705j196186O48869J298076J684891K476701
3586C397930K083905k00506j801068m39049J912284J617311j342329l404952k154528
3577c31002J091335L133832J990395j452406m120563l766963j501051l6653L65756
$$ plain form
3568 -4627320 -2821247 1515990 6369894 8158858 6108984 2739110 166079 -1628600
3560 -1628600 -2772610 -2400064 -418391 1667175 2666508 2933608 3025027 2690177 2021449
3551 2021449 2260462 4400559 7621711 9694207 8620228 4036417 -2290775 -7557317
3543 -7557317 -10215494 -10866991 -10505419 -9122334 -7092930 -6273206 -7643717 -9042569 -7665425
3534 -7665425 -4041307 -1036893 401911 1726695 3445907 4403685 4523923 5278621 6892195
3525 6892195 7772112 7288345 6504107 5564397 3117051 -762850 -3699710 -4224204 -3569465
3516 -3569465 -3187468 -2670729 -1270512 550675 2189278 3731037 4878564 4810602 3653562
3507 3653562 2246091 335752 -2585291 -4639753 -2933859 1855664 5588259 6253343
$$ packed form
3568d627320J806073M337237M853904J788964k049874l369874k573031j794679
3560a628600j144010L72546J981673K085566R99333K67100R1419l34850o68728
3551B021449K39013K140097L221152K072496j073979m583811o327192n266542
3543g557317k658177o51497L61572J383085K029404Q19724j370511j398852J377144
3534g665425L624118L004414J438804J324784J719212R57778J20238P54698J613574
3525F892195Q79917m83767p84238r39710k447346l879901k936860n24494O54739
3516c569465L81997N16739J400217J821187J638603J541759J147527o7962j157040
3507C653562j407471j910339k921043k054462J705894M789523L732595O65084
$$ plain form
3499 6253343 5996163 6481546 6207756 4316947 3143192 4346395 5944299 5910348 5330832
3490 5330832 5055507 2864798 -2270736 -6457036 -5852582 -2656332 -1366984 -1438654 907696
3481 907696 5167178 6911757 5402904 4847933 7021351 8128754 5240621 1318008 778576
3472 778576 3258668 5048918 4750296 4309849 5155146 6005531 5092999 3167187 3218386
3463 3218386 7052990 12718534 16370309 16752672 16264217 16914046 17296375 15283075 11782104
3454 11782104 9230216 7678371 5400375 2758259 2310399 4908169 8362529 10428979
3446 10428979 10896029 10354133 9006053 7230215 5643014 4233541 2690442 1313436
3438 1313436 179208 -1848737 -5336814 -8268938 -8082974 -5034811 -1148957 3184086
$$ packed form
3499F253343k57180M85383k73790j890809j173755J203203J597904l3951n79516
3490E330832k75325k190709n135534m186300O04454L196250J289348p1670K346350
3481I07696M259482J744579j508853n54971K173418J107403k888133l922613n39432
3472G78576K480092J790250k98622m40447Q45297Q50385r12532j925812N1199
3463C218386L834604N665544L651775L82363m88455O49829L82329k013300l500971
3454A1782104k551888j551845k277996k642116m47860K597770L454360K066450
3446A0428979M67050n41896j348080j775838j587201j409473j543099j377006
3438A313436j134228k027945l488077k932124J85964L048163L885854M333043
$$ plain form
3430 3184086 8405590 12298261 11244796 5439981 -609805 -3513520 -3809797 -2941409 -1130707
3421 -1130707 641101 259001 -2132822 -3535822 -2703940 -2260269 -4225961 -6560123 -6654928
3412 -6654928 -5446873 -5116365 -5078745 -3592659 -1705592 -2142979 -4955191 -7194772 -6775351
3403 -6775351 -4464409 -2198830 -1202971 -1608101 -2473925 -2289742 -374985 2566331 5656268
3394 5656268 8487571 10120269 9262952 6569089 4901392 5685407 6522888 4175213 -1324060
3385 -1324060 -7124834 -10833356 -11694353 -9800024 -5986877 -1746827 2033222 5281459
3377 5281459 7033606 5599452 1752024 -735643 103991 1358956 -455462 -4133816
3369 -4133816 -5812509 -4374710 -1520166 1782692 5028523 5754590 1938827 -3604741
$$ packed form
3430C184086N221504L892671j053465n804815o049786k903715k96277Q68388J810702
3421a130707J771808l82100k391823j403000Q31882M43671j965692k334162r4805
3412f654928J208055L30508L7620J486086J887067m37387k812212k239581M19421
3403f775351K310942K265579R95859m05130q65824J84183J914757K941316L089937
3394E656268K831303J632698q57317k693863j667697P84015Q37481k347675n499273
3385a324060n800774l708522q60997J894329L813147M240050L780049L248237
3377E281459J752147j434154l847428k487667Q39634J254965j814418l678354
3369d133816j678693J437799K854544L302858L245831P26067l815763n543568
$$ plain form
3361 -3604741 -5785981 -4490621 -4806947 -9074010 -13129019 -12374801 -7774400 -3313676 -568252
3352 -568252 1368400 2824233 3414294 3683174 4335807 4549199 3057305 417195 -1403723
3343 -1403723 -1329389 95525 1772231 2828955 2820788 1992967 976954 -122682 -1582047
3334 -1582047 -2843907 -2842025 -2158287 -3270805 -7327809 -11741643 -12531989 -8723384 -3359589
3325 -3359589 -324936 -803137 -2646474 -2810642 -543954 1918318 2192974 650373 -592157
3316 -592157 -802390 -792084 -327466 1906126 5230540 6701287 5216522 3285720 2945467
3307 2945467 2536305 51638 -2649441 -2368985 109825 917539 -1192164 -3663092 -4882206
3298 -4882206 -6525154 -9994114 -13489150 -14395898 -12499591 -9167772 -5155232 -1063162
$$ packed form
3361c604741k181240J295360l16326m267063m055009P54218M600401M460724K745424
3352e68252J936652J455833N90061K68880O52633K13392j491894k640110j820918
3343a403723P4334J424914J676706J056724q167q27821j016013j099636j459365
3334a582047j261860J882O83738j112518m057004m413834p90346L808605N363795
3325c359589L034653m78201j843337j64168K266688K462272K74656j542601j242530
3316e92157k10233J0306M64618K233592L324414J470747j484765j930802l40253
3307B945467m09162k484667k701079K80456K478810Q07714k109703k470928j219114
3298d882206j642948l468960l495036r06748J896307L331819M012540M092070
$$ plain form
3290 -1063162 1486840 1293374 -463970 -1448286 -905924 326327 2015198 4810546 8217041
3281 8217041 10137896 9339871 7244158 6211941 6608975 6602968 4838921 2472996 2024992
3272 2024992 4357347 7262822 7486607 4244857 341311 -666150 1722889 4512761
3264 4512761 4619058 2015980 -916930 -2478349 -3117511 -4059659 -5639636 -7390446 -8805402
3255 -8805402 -9238371 -7755061 -4150836 132251 3087853 4097704 3956774 3157810 1439532
3246 1439532 -759179 -1923404 -1483026 -1072225 -2466963 -4942346 -6117064 -5174369 -3828338
3237 -3828338 -3989283 -5755744 -7999768 -9625844 -9643948 -7277648 -3103829 781782 2971277
3228 2971277 4467545 6744544 8564488 6844960 1249046 -4100860 -5030366 -2196067
$$ packed form
3290a063162K550002j93466j757344r84316N42362J232251J688871K795348L406495
3281H217041J920855p98025k095713j032217L97034o007j764047k365925m48004
3272B024992K332355K905475K23785l241750l903546j007461K389039K789872
3264D512761J06297k603078k932910j561419o39162r42148j579977j750810j414956
3255h805402m32969J483310L604225M283087K955602J009851j40930p98964j718278
3246A439532k198711j164225M40378M10801j394738k475383j174718R42695J346031
3237c828338j60945j766461k244024j626076j8104K366300M173819L885611K189495
3228B971277J496268K276999J819944j719528n595914n349906r29506K834299
$$ plain form
3220 -2196067 250772 116179 -921216 -790024 -3699 -178160 -1464566 -2919152 -4062848
3211 -4062848 -4465355 -2921430 976480 5062217 6407067 4667398 1743056 -1568552
3203 -1568552 -6096646 -11141513 -13508905 -11145878 -5893078 -1173312 1510659 2478837
3195 2478837 2188567 1663291 3060845 7241240 11458640 11832528 7795295 2085047 -3038951
3186 -3038951 -7065694 -9155691 -7989653 -4392991 -1376802 -458471 -250429 317699 62693
3177 62693 -1582875 -2464135 -875869 1306379 1465567 503258 1056397 2633179 2167960
3168 2167960 -856462 -3464875 -3833869 -3500751 -3930851 -4062024 -2861919 -1543732 -1246411
3159 -1246411 -891648 426006 1062886 -557735 -2732298 -2833720 -1571136 -1648039 -2959522
$$ packed form
3220b196067K446839j34593j037395J31192P86325j74461j286406j454586j143696
3211d062848m02507J543925L897910M085737J344850j739669k924342l311608
3203a568552m528094n044867k367392K363027N252800M719766K683971R68178
3195B478837k90270n25276J397554M180395M217400L73888m037233n710248n123998
3186c038951m026743k089997J166038L596662L016189R18331K08042N68128k55006
3177F2693j645568q81260J588266K182248J59188r62309N53139J576782m65219
3168B167960l024422k608413l68994L33118m30100j31173J200105J318187K97321
3159a246411L54763J317654O36880j620621k174563j01422J262584p6903j311483
$$ plain form
3150 -2959522 -2731060 -509977 602052 -1283459 -3968510 -4648382 -3711502 -3170159 -3340262
3141 -3340262 -3192920 -2558001 -1961729 -1365517 -870078 -1563003 -3731344 -5261442 -4029620
3132 -4029620 -1155763 496119 596086 1461512 3812290 5236700 3841016 1055766 -596088
3123 -596088 -655082 -111151 712585 1750163 1852489 45661 -2360259 -2995966 -1768487
3114 -1768487 -1075013 -2296056 -3839527 -3586511 -1894687 -824310 -1144892 -1602383 -1054687
3105 -1054687 52674 876746 1854189 4153457 7682904 10651232 11499067 10618480 9499631
3096 9499631 8568019 6879544 4125344 1822938 1526499 2390755 1906720 -624920 -2570027
3087 -2570027 -905155 3945670 8457820 10097400 9753838 9633531 10015581 9375322 7181344
$$ packed form
3150b959522K28462K221083J112029j885511k685051o79872R36880N41343j70103
3141c340262J47342O34919N96272N96212M95439o92925k168341j530098J231822
3132d029620K873857J651882R9967Q65426K350778J424410j395684k785250j651854
3123e96088n8994N43931Q23736J037578J02326j806828k405920o35707J227479
3114a768487O93474j221043j543471K53016J691824J070377l20582m57491N47696
3105a054687J107361Q24072R77443K299268L529447K968328Q47835q80587j118849
3096I499631r31612j688475k754200k302406k96439Q64256m84035k531640j945107
3087b570027J664872M850825M512150J639580l43562j20307L82050o40259k193978
$$ plain form
3078 7181344 5038138 4654071 5613798 5800269 3698907 9149 -2776881 -2464094 558389
3069 558389 3051773 1800365 -2771467 -6498456 -5623754 -700863 4124225 5361961 3215277
3060 3215277 710029 407515 1968385 2703169 590016 -3283107 -5669671 -4588503 -1287577
3051 -1287577 1240139 1048482 -1414674 -3751383 -3277040 455310 4297159 4056481 -740517
3042 -740517 -5892983 -7220312 -4792045 -1427057 1137480 2676351 2802899 1626572 1208170
3033 1208170 3483014 6946129 7997807 5487693 1370187 -2895906 -7364820 -10677716
3025 -10677716 -9810162 -4411682 1469852 3974169 3512258 2554206 1804740 910712 884865
3016 884865 2938803 5988976 7782842 7756165 6783011 5105345 2752878 1234409 2446218
$$ packed form
3078G181344k143206l84067R59727J86471k101362l689758k786030L12787L022483
3069E58389K493384j251408m571832l726989Q74702M922891M825088J237736k146684
3060C215277k505248l02514J560870P34784k113153l873123k386564J081168L300926
3051a287577K527716j91657k463156k336709M74343L732350L841849k40678m796998
3042g40517n152466j327329K428267L364988K564537J538871J26548j176327m18402
3033A208170K274844L463115J051678k510114m117506m266093m468914l312896
3025a0677716Q67554N398480N881534K504317m61911r58052p49466q94028k5847
3016H84865K053938L050173J793866k6677r73154j677666k352467j518469J211809
$$ plain form
3007 2446218 6137864 10237801 13177794 14232975 12570262 8337824 4152605 2974377
2999 2974377 4511977 5892648 5769627 5462529 6001835 6570323 6444818 6214840 6184802
2990 6184802 5434811 3428532 1054473 -768870 -2237986 -3746349 -5017901 -5719283 -5867961
2981 -5867961 -5282216 -3669755 -1334719 1376834 5064224 10018415 14228515 14929229 12460282
2972 12460282 10226267 10089274 10153019 8255661 5416899 4176537 5186069 7058597 8321718
2963 8321718 8222850 6869759 5662078 6135161 7370181 6369231 2264462 -1929368 -3486046
2954 -3486046 -3710254 -5129296 -6914692 -6284586 -3357684 -1170242 -1011780 -953507 358377
2945 358377 1176097 -772324 -4905562 -8327926 -8979662 -7499454 -6311105 -7034683 -8628943
$$ packed form
3007B446218L691646M099937K939993J055181j662713m232438m185219j178228
2999B974377J537600J380671j23021l07098N39306N68488j25505k29978l0038
2990F184802p49991k006279k374059j823343j469116j508363j271552p01382j48678
2981e867961N85745J612461K335036K711553L687390M954191M210100P00714k468947
2972A2460282k234015j36993O3745j897358k838762j240362J009532J872528J263121
2963H321718r8868j353091j207681M73083J235020j000950m104769m193830j556678
2954c486046k24208j419042j785396O30106K926902K187442J58462N8273J311884
2945C58377Q17720j948421m133238l422364o51736J480208J188349p23578j594260
$$ plain form
2936 -8628943 -8583948 -6247338 -3835002 -3329744 -3805015 -3217863 -1402257 580800 2598173
2927 2598173 4495804 4298286 539237 -4185024 -5401861 -2661824 -74973 -548328 -2702564
2918 -2702564 -4237446 -4970579 -5192809 -4241543 -2602148 -2589861 -4776710 -6233526 -4620016
2909 -4620016 -1738274 -608685 -1267686 -2237973 -4016611 -7660771 -11369806 -12155205 -10225066
2900 -10225066 -8280276 -6895785 -4167819 12567 3028225 3680565 3904684 5001428
2892 5001428 5186481 2894474 225711 713398 4828262 9546093 11618745 10012965 6117267
2883 6117267 2942792 3254798 6881271 10171872 9425616 4865140 391163 -533320 1875902
2874 1875902 4488861 4720959 3081849 2290058 3882732 6302287 6971993 5526843 3637519
$$ packed form
2936h628943M4995K336610K412336N05258m75271N87152J815606J983057K017373
2927B598173J897631j97518l759049m724261j216837K740037K586851m73355k154236
2918b702564j534882p33133k22230R51266J639395J2287k186849j456816J613510
2909d620016K881742J129589o59001r70287j778638l644160l709035p85399J930139
2900a0225066J944790J384491K727966M180386L015658O52340K24119J096744
2892E001428J85053k292007k668763M87687M114864M717831K072652j605780l895698
2883F117267l174475L12006L626473L290601p46256m560476m473977r24483K409222
2874A875902K612959K32098j639110p91791J592674K419555O69706j445150j889324
$$ plain form
2865 3637519 2139259 345542 -1641246 -2237542 -999183 18226 -1061939 -3433269
2857 -3433269 -5209110 -5986465 -6094738 -4822092 -1745204 1133734 1213100 -990445 -2414864
2848 -2414864 -1870938 -1448642 -2893319 -4902937 -5306439 -4140060 -2934344 -2130866 -997705
2839 -997705 380387 736033 -492625 -2049459 -2278869 -1207810 -567899 -1548904 -2824781
2830 -2824781 -1446225 3848813 10524045 14204951 13028943 9621235 8302978 10371951
2822 10371951 12564250 10665841 4642771 -664466 -739092 3424651 6782498 6514962 4630914
2813 4630914 3852587 3643887 2230784 325839 -70968 675305 575990 -91847 1051829
2804 1051829 4236960 6727536 7098255 7177884 8240475 8198447 4950251 485142 -965784
$$ packed form
2865C637519j498260j793717j986788n96296J238359J017409j080165k371330
2857c433269j775841p77355j08273J272646L076888K878938P9366k203545j424419
2848b414864N43926M22296j444677k009618m03502J166379J205716Q03478J133161
2839i97705J378092L55646j228658j556834k29410J071059O39911r81005j275877
2830b824781J378556N295038O675232L680906j176008l407708j318257K068973
2822A0371951K192299j898409o023070n307237p4626M163743L357847k67536j884048
2813D630914p78327k08700j413103j904945l96807P46273r9315o67837J143676
2804A051829L185131K490576L70719P9629J062591m2028l248196m465109j450926
$$ plain form
2795 -965784 2121657 7429943 11691061 12978131 11131041 7880002 5986109 6568978 7750114
2786 7750114 7295513 5701086 4907998 4870061 3796175 1617257 694784 2330291 4522193
2777 4522193 4536896 2668581 1969202 4228636 7250044 7051622 2836990 -1392777 -1414107
2768 -1414107 1807191 3417957 1388942 -847815 300225 3267707 3621904 -28038
2760 -28038 -4836053 -7333282 -6144163 -2269851 1205597 992421 -2461373 -4303681 -1250375
2751 -1250375 3345010 3816140 207402 -2300723 -1321253 252858 27687 -691775 -882651
2742 -882651 -2086623 -4323195 -4158616 -86088 3859809 3594777 1168100 1476624 5019288
2733 5019288 8076756 8643610 8015737 7135352 5268602 2454841 160313 -756889 -329302
$$ packed form
2795i65784L087441N308286M261118J287070j847090l251039j893893N82869J181136
2786G750114m54601j594427p93088l7937j073886k178918r22473J635507K191902
2777D522193J4703j868315o99379K259434L021408j98422m214632m229767k1330
2768a414107L221298J610766k029015k236757J148040K967482L54197l649942
2760b8038m808015k497229J189119L874312L475448k13176l453794j842308L053306
2751a250375M595385M71130l608738k508125R79470J574111k25171p19462j90876
2742h82651j203972k236572J64579M072528L945897k65032k426677L08524L542664
2733E019288L057468N66854o27873q80385j866750k813761k294528r17202M27587
$$ plain form
2724 -329302 1925596 6003323 9360411 8981406 5774989 4044225 6048150 9738899 12450722
2715 12450722 13971317 14879275 14638098 13193805 12379538 13569583 15150783 14269921 10464092
2706 10464092 6028171 3198523 2249799 2068366 1327739 -1007590 -5266938 -10475848 -14450888
2697 -14450888 -15163246 -12501359 -8616789 -6007798 -5124647 -4376502 -2494140 144711 2877889
2688 2877889 6010357 9552255 11778274 10572312 5776065 -821719 -7060615 -10940342
2680 -10940342 -10961679 -7901841 -5297723 -5825291 -7668851 -6833883 -2711916 1322519 2862492
2671 2862492 3046593 3536034 3889939 3394307 3005033 3530158 3646154 1651594 -2015245
2662 -2015245 -5576432 -8046407 -9086201 -8039219 -5027163 -2226353 -2148625 -4832743 -8024506
$$ packed form
2724c29302K254898M077727L357088l79005l206417j730764K003925L690749K711823
2715A2450722J520595R07958k41177j444293q14267J190045J581200q80862l805829
2706A0464092m435921k829648r48724j81433p40627k335329m259348n208910l975040
2697a4450888p12358K661887L884570K608991Q83151P48145J882362K638851K733178
2688B877889L132468L541898K226019j205962m796247o597784o238896l879727
2680a0940342k1337L059838K604118n27568j843560Q34968M121967M034435J539973
2671B862492J84101M89441L53905m95632l89274N25125J15996j994560l666839
2662b015245l561187k469975j039794J046982L012056K800810P7728k684118l191763
$$ plain form
2653 -8024506 -9732786 -9347270 -6818910 -2569255 1568213 2938427 682207 -2713484
2645 -2713484 -3420337 -206911 3951170 4911946 2153476 -546791 -470 2174975 2119499
2636 2119499 -425451 -1743732 132747 2403593 1624529 -1668679 -4452122 -5362078 -5032271
2627 -5032271 -3710638 -1103952 2033934 4405455 6032704 7835859 9625273 10190305
2619 10190305 9207807 7573625 6035278 4803170 4100482 3712806 2582017 500396 -430542
2610 -430542 1809714 5506375 6339758 2709855 -2085667 -3849835 -2035653 656732 1871566
2601 1871566 1641244 1661228 3465270 6881232 9827379 10144992 7870751 5098745 3611904
2592 3611904 3615063 4841193 7449876 11034541 13794091 13837805 11096626 7422250 5013282
$$ packed form
2653h024506j708280L85516K528360M249655M137468J370214k256220l395691
2645b713484p06853L213426M158081R60776k758470k700267N46321K175445n5476
2636B119499k544950j318281J876479K270846p79064l293208k783443r09956L29807
2627e032271J321633K606686L137886K371521J627249J803155J789414N65032
2619A0190305r82498j634182j538347j232108p02688l87676j130789k081621r30938
2610d30542K240256L696661Q33383l629903m795522j764168J814182K692385J214834
2601A871566k30322J9984J804042L415962K946147L17613k274241k772006j486841
2592C611904L159J226130K608683L584665K759550M3714k741179l674376k408968
$$ plain form
2583 5013282 4828122 5903363 5974270 3450239 -838271 -4375366 -5619266 -5252008 -4666347
2574 -4666347 -4249264 -3646371 -2638591 -876605 2330910 6732906 10228219 10762090 9152916
2565 9152916 8586208 10760753 13751450 14628912 13169634 11398629 9895174 6777574 1306323
2556 1306323 -3390341 -3421802 534031 3285860 1046625 -4495134 -8935754 -10392102 -10457663
2547 -10457663 -10901822 -11295022 -10074985 -6823087 -2966353 -427442 380441 1002671 2775281
2538 2775281 4469975 3528754 -8273 -2567079 -1186111 2805318 5657337 5561444 3653056
2529 3653056 1847021 1465241 3043362 5548228 6492739 4642449 1788754 38663 -1304416
2520 -1304416 -3618020 -5179676 -3225969 779048 2233575 301091 -662856 1789932
$$ packed form
2583E013282j85160J075241P0907k524031m288510l537095j243900L67258N85661
2574d666347M17083O02893J007780J761986L207515M401996L495313N33871j609174
2565I152916n66708K174545K990697Q77462j459278j771005j503455l117600n471251
2556A306323m696664l1461L955833K751829k239235n541759m440620j456348o5561
2547a0457663m44159l93200J220037L251898L856734K538911Q07883O22230J772610
2538B775281J694694r41221l537027k558806J380968L991429K852019r5893j908388
2529C653056j806035l81780J578121K504866R44511j850290k853695j750091j343079
2520a304416k313604j561656J953707M005017J454527j932484r63947K452788
$$ plain form
2512 1789932 3901819 1439258 -3554642 -5487500 -2847553 563817 1287005 -109358
2504 -109358 -1085477 -474934 744162 691831 -1576791 -4820315 -6736986 -6895301 -7294498
2495 -7294498 -9036670 -10082210 -8059973 -3975206 -942907 13223 745805 2853830 5607763
2486 5607763 7032809 5858050 2617681 -347057 -683800 1435620 3778377 5678619
2478 5678619 8898328 13342900 14930866 10980734 5377736 4120460 7111342 9073193
2470 9073193 7905348 6724051 7140176 6327623 2918703 510412 1825612 3686530 2075653
2461 2075653 -1075789 -993354 2167564 3767042 2100889 465454 1369167 2900319 2196747
2452 2196747 -598165 -3294575 -4211431 -2600671 1278875 5212398 6078523 3326947 13904
$$ packed form
2512A789932K111887k462561m993900j932858K639947L411370P23188j396363
2504a09358r76119O10543J219096n2331k268622l243524j916671j58315l99197
2495g294498j742172j045540K022237M084767L032299R56130P32582K108025K753933
2486E607763J425046j174759l240369k964738l36743K119420K342757J900242
2478E678619L219709M444572J587966l950132n602998j257276K990882J961851
2470I073193j167845j181297M16125q12553l408920k408291J315200J860918j610877
2461B075653l151442Q2435L160918J599478j666153j635435R03713J531152p03572
2452B196747k794912k696410r16856J610760L879546L933523Q66125k751576l313043
$$ plain form
2443 13904 -846628 362024 1329445 1294819 1554694 3383110 6862325 11216209 15070772
2434 15070772 16793081 15718934 12959687 10353374 8911963 8649532 9040460 8821151 6288477
2425 6288477 1178051 -4114124 -6391015 -4627967 -330994 4444514 8222079 9883379
2417 9883379 9164131 7530032 7007742 7763835 8133014 7263749 6171745 5703641 5199839
2408 5199839 4125006 3430327 4029717 5306975 6543499 8403403 11115331 12389115 9654893
2399 9654893 4034616 -276595 -731406 1479005 4111868 6300810 7665638 7283571 4922903
2390 4922903 1877021 -536997 -2175360 -3118202 -3048840 -2390864 -2398872 -3115013 -2999909 -1756465
2380 -1756465 -1446749 -3076629 -4173006 -2197392 1316137 2866200 1973252 1017740 1068788
$$ packed form
2443A3904q60532J208652R67421l4626K59875J828416L479215M353884L854563
2434A5070772J722309j074147k759247k606313j441411k62431L90928k19309k532674
2425F288477n110426n292175k276891J763048M296973M775508L777565J661300
2417I883379p19248j634099n22290P56093L69179q69265j092004m68104n03802
2408E199839j074833o94679N99390J277258J236524J859904K711928J273784k734222
2399I654893n620277m311211m54811K210411K632863K188942J364828l82067k360668
2390D922903l045882k414018j638363r42842O9362O57976q008p16141J15104J243444
2380a756465L09716j629880j096377J975614L513529J550063q92948r55512N1048
$$ plain form
2371 1068788 1303295 2016296 4271331 6330430 4653058 -295145 -3343652 -2007255 -865377
2362 -865377 -5129116 -12484255 -15501943 -11085617 -3645077 1052935 1756236 779619 165049
2353 165049 380516 1053782 1268867 -187221 -3609835 -7423203 -9020181 -6810319 -1686590
2344 -1686590 3312119 5121249 2970297 -1275062 -4905765 -6069009 -4144140 41588
2336 41588 3970342 5114363 3982827 4057822 7350678 11522965 13241472 12919838 13553238
2327 13553238 15708535 16639838 14382872 10074786 5965803 3643861 4377079 8102624
2319 8102624 11214503 8689171 367514 -7542499 -9505339 -6910893 -4795766 -4627494
2311 -4627494 -3846503 -1180581 1641610 3381723 4714712 5392201 3416695 -1317842 -5272989
$$ packed form
2371A068788K34507P13001K255035K059099j677372m948203l048507J336397J141878
2362h65377m263739p355139l017688M416326P440540M698012P03301r76617o14570
2353A65049K15467O73266K15085j456088l422614l813368j596978K209862N123729
2344a686590M998709J809130k150952m245359l630703j163244J924869M185728
2336D1588L928754J144021j131536P4995L292856M172287J718507l21634O33400
2327A3553238K155297R31303k256966m308086m108983k321942P33218L725545
2319H102624L111879k525332q321657p910013j962840K594446K115127J68272
2311d627494P80991K665922K822191J740113J332989O77489j975506m734537l955147
$$ plain form
2302 -5272989 -5272514 -2384868 282622 2076009 4572606 7760351 9218181 7368097 3413750
2293 3413750 -561885 -3631855 -5277367 -4314203 -279834 4819835 7876521 7915940 6775028
2284 6775028 6325740 6210460 4978991 2502340 187688 -784119 -418621 710541 2029722
2275 2029722 2908806 3064364 3212990 4300652 5778923 5815212 3792077 1325094 -156331
2266 -156331 -1482275 -3818548 -5838288 -5242960 -2860634 -2469535 -5539047 -8401895 -6528838
2257 -6528838 -344565 5250086 6718810 5398581 4955504 6819296 8983740 8742972 5840603
$$ packed form
2302e272989M75K887646K667490J793387K496597L187745J457830j850084l954347
2293C413750l975635l069970j645512R63164M034369N099669L056686L9419j140912
2284F775028m49288j15280j231469k476651k314652r71807L65498J129162J319181
2275B029722Q79084J55558J48626J087662J478271L6289k023135k466983j481425
2266a56331j325944k336273k019740N95328K382326L91099l069512k862848J873057
2257f528838O184273N594651J468724j320229m43077J863792K164444k40768k902369
$$ [...]
##END NTUPLES=NMR SPECTRUM
##END=
