##TITLE=31Pdec_DE-79H_F2
 D2O, 64 sc
 29.1.2025
##JCAMPDX= 6.0         $$ Bruker NMR JCAMP-DX V2.0
##DATA TYPE= NMR SPECTRUM
##DATA CLASS= NTUPLES
##ORIGIN= UXNMR, Bruker Analytische Messtechnik GmbH
##OWNER= root
$$ XWIN-NMR		Version 3.5
$$ Thu Jan 30 16:56:50 2025 Russian Standard Time (UT+4h)  she@DPX200
##.OBSERVE FREQUENCY= 81.013821
##.OBSERVE NUCLEUS= ^31P
##.ACQUISITION MODE= SIMULTANEOUS
##.ACQUISITION SCHEME= undefined
##.AVERAGES= 64
##.DIGITISER RES= 17
##SPECTROMETER/DATA SYSTEM= spect
##.PULSE SEQUENCE= zgpg30
##.SOLVENT NAME= CDCl3
##.SHIFT REFERENCE= (INTERNAL, CDCl3, 0, 198.062)
##AUDIT TRAIL= $$ (NUMBER, WHEN, WHO, WHERE, WHAT)
$$ ##TITLE= Audit trail, XWIN-NMR		Version 3.5
$$ ##JCAMPDX= 5.01
$$ ##ORIGIN= Bruker BioSpin GmbH
$$ ##OWNER= she
$$ F:/spectra/data/she/nmr/P31/2/pdata/1/auditp.txt
$$ ##AUDIT TRAIL=  $$ (NUMBER, WHEN, WHO, WHERE, WHAT)
(   1,<2025-01-30 16:55:51.07 +0400>,<she>,<DPX200>,
      <created by zg, POWCHK disabled, PULCHK disabled
       configuration hash MD5:
       00 E9 B6 7A A2 85 ED C7 34 08 36 98 17 FE 4E 26
       data hash MD5: 32K
       93 D4 C8 88 D7 B6 91 FB 85 81 DB 6B E9 E8 0C 5C>)
(   2,<2025-01-30 16:55:53.40 +0400>,<she>,<DPX200>,
      <Start of raw data processing
       efp BC_mod = 2 LB = 1.5 FT_mod = 6 PKNL = 1 PHC0 = 1591.381 PHC1 = 460.2905 SI = 64K 
       data hash MD5: 64K
       FE 37 F4 27 3A 75 EA B1 D4 E8 1B 0D 6D 57 20 2A>)
(   3,<2025-01-30 16:56:10.56 +0400>,<she>,<DPX200>,
      <pk PHC0 = -3.57576 PHC1 = 0 
       data hash MD5: 64K
       87 53 2A 1E 17 72 F3 E0 9E 12 1C 0E B6 C2 C7 0F>)
(   4,<2025-01-30 16:56:17.65 +0400>,<she>,<DPX200>,
      <abs ABSG = 5 
       data hash MD5: 64K
       6B BA 53 55 E0 67 15 66 80 C2 07 05 77 A7 9C 05>)
$$ ##END=
$$ 
$$ hash MD5
$$ 37 DB 63 9E B6 40 43 8F E8 CD EB AF 6E 0D F6 6C
##$RELAX= 
##$RELAX= 
##$RELAX= 
##$RELAX= 
##$RELAX= 
##$RELAX= 
##$RELAX= 
##$RELAX= 
$$ Bruker specific parameters
$$ --------------------------
##$DU= <F:/spectra>
##$EXPNO= 2
##$NAME= <P31>
##$PROCNO= 1
##$TYPE= <nmr>
##$USER= <she>
##$AMP= (0..31)
100 100 100 100 100 100 100 100 100 100 100 100 100 100 100 100 100 100 
100 100 100 100 100 100 100 100 100 100 100 100 100 100 
##$AQSEQ= 0
##$AQ_mod= 1
##$AUNM= <au_zg>
##$AUTOPOS= <>
##$BF1= 81.014009
##$BF2= 200.13
##$BF3= 200.13
##$BF4= 200.13
##$BF5= 200.13
##$BF6= 200.13
##$BF7= 200.13
##$BF8= 200.13
##$BYTORDA= 1
##$CFDGTYP= 0
##$CFRGTYP= 5
##$CHEMSTR= <none>
##$CNST= (0..31)
1 1 145 1 1 1 1 1 1 1 1 1 1 1 1 1 1 1 1 1 1 1 1 1 1 1 1 1 1 1 1 1 
##$CPDPRG= <waltz16>
##$CPDPRG1= <>
##$CPDPRG2= <waltz16>
##$CPDPRG3= <>
##$CPDPRG4= <mlev>
##$CPDPRG5= <mlev>
##$CPDPRG6= <mlev>
##$CPDPRG7= <mlev>
##$CPDPRG8= <mlev>
##$CPDPRGB= <>
##$CPDPRGT= <>
##$D= (0..31)
0 1 0 0 0 0 0 0 0 0.06 0 0.03 2e-05 3e-06 0 0 0.0002 0 0 0 0 0 0 0 0 0 
0 0 0 0 0 0 
##$DATE= 1738241750
##$DBL= (0..7)
120 120 120 11 120 120 24 19 
##$DBP= (0..7)
150 150 150 150 150 150 150 150 
##$DBP07= 0
##$DBPNAM0= <>
##$DBPNAM1= <>
##$DBPNAM2= <>
$$ [...]
##$SUBNAM3= <"">
##$SUBNAM4= <"">
##$SUBNAM5= <"">
##$SUBNAM6= <"">
##$SUBNAM7= <"">
##$SUBNAM8= <"">
##$SUBNAM9= <"">
##$SW= 400.765351723535
##$SWIBOX= (0..15)
0 1 3 0 0 0 0 0 0 0 0 0 0 0 0 0 
##$SW_h= 32467.5324675325
##$TD= 32768
##$TD0= 1
##$TE= 0
##$TE2= 300
##$TE3= 300
##$TEG= 300
##$TL= (0..7)
0 120 53 12 22 120 120 120 
##$TP= (0..7)
150 150 150 150 150 150 150 150 
##$TP07= 0
##$TPNAME0= <>
##$TPNAME1= <>
##$TPNAME2= <>
##$TPNAME3= <>
##$TPNAME4= <>
##$TPNAME5= <>
##$TPNAME6= <>
##$TPNAME7= <>
##$TPOAL= (0..7)
0.5 0.5 0.5 0.5 0.5 0.5 0.5 0.5 
##$TPOFFS= (0..7)
0 0 0 0 0 0 0 0 
##$TUNHIN= 0
##$TUNHOUT= 0
##$TUNXOUT= 0
##$USERA1= <user>
##$USERA2= <user>
##$USERA3= <user>
##$USERA4= <user>
##$USERA5= <user>
##$V9= 5
##$VALIST= <valist>
##$VCLIST= <CCCCCCCCCCCCCCC>
##$VD= 0
##$VDLIST= <DDDDDDDDDDDDDDD>
##$VPLIST= <PPPPPPPPPPPPPPP>
##$VTLIST= <TTTTTTTTTTTTTTT>
##$WBST= 1024
##$WBSW= 4
##$XGAIN= (0..3)
0 0 0 0 
##$XL= 0
##$YL= 0
##$YMAX_a= 5816
##$YMIN_a= -13300
##$ZGOPTNS= <>
##$ZL1= 120
##$ZL2= 120
##$ZL3= 120
##$ZL4= 120
##$ABSF1= 198.0616
##$ABSF2= -202.7028
##$ABSG= 5
##$ABSL= 3
##$ALPHA= 0
##$AQORDER= 0
##$ASSFAC= 0
##$ASSFACI= 0
##$ASSFACX= 0
##$ASSWID= 0
##$AUNMP= <proc_1d>
##$AZFE= 0.1
##$AZFW= 0.5
##$BCFW= 0
##$BC_mod= 2
##$BYTORDP= 0
##$COROFFS= 0
##$CY= -3
##$DATMOD= 1
##$DC= 0
##$DFILT= <>
##$DTYPP= 0
##$F1P= 0
##$F2P= 0
##$FCOR= 1
##$FTSIZE= 65536
##$FT_mod= 6
##$GAMMA= 0
##$GB= 0
##$INTBC= 1
##$INTSCL= 9.790993e-09
##$ISEN= 30
##$LB= 1.5
##$LEV0= 0
##$LPBIN= 0
##$MAXI= 10000
##$MC2= 0
##$MEAN= 0
##$ME_mod= 0
##$MI= 50
##$NCOEF= 0
##$NC_proc= -8
##$NLEV= 6
##$NOISF1= 182.463
##$NOISF2= 159.3651
##$NSP= 0
##$NTH_PI= 0
##$NZP= 0
##$OFFSET= 198.0616
##$PC= 4
##$PHC0= 1587.805
##$PHC1= 460.2905
##$PH_mod= 1
##$PKNL= yes
##$PPARMOD= 0
##$PSCAL= 0
##$PSIGN= 0
##$REVERSE= no
##$SF= 81.0140089999434
##$SI= 65536
##$SIGF1= 159.3651
##$SIGF2= -187.1042
##$SINO= 113.3802
##$SIOLD= 16384
##$SREGLST= <1H.CDCl3>
##$SSB= 0
##$STSI= 65536
##$STSR= 0
##$SW_p= 32467.5324675325
##$SYMM= 0
##$S_DEV= 0
##$TDeff= 32768
##$TDoff= 0
##$TI= <>
##$TILT= no
##$TM1= 0
##$TM2= 0
##$TOPLEV= 0
##$USERP1= <user>
##$USERP2= <user>
##$USERP3= <user>
##$USERP4= <user>
##$USERP5= <user>
##$WDW= 1
##$XDIM= 65536
##$YMAX_p= 109476852
##$YMIN_p= -215400575
$$ End of Bruker specific parameters
$$ ---------------------------------
##NTUPLES= NMR SPECTRUM
##VAR_NAME=  FREQUENCY,     SPECTRUM/REAL,   SPECTRUM/IMAG
##SYMBOL=    X,             R,               I
##VAR_TYPE=  INDEPENDENT,   DEPENDENT,       DEPENDENT
##VAR_FORM=  AFFN,          ASDF,            ASDF
##VAR_DIM=   65536,         65536,           65536
##UNITS=     HZ,            ARBITRARY UNITS, ARBITRARY UNITS
##FACTOR=    0.49542278885378, 1,            1
##FIRST=     16045.7642231865, 0,            0
##LAST=      -16421.768244346, 0,            0
##MIN=       -16421.768244346, -215400575,   0
##MAX=       16045.7642231865, 109476852,    0
$$ Real data points
##PAGE= N=1
##DATA TABLE= (X++(R..R)), XYDATA
$$ [...]
##PAGE= N=2
##DATA TABLE= (X++(I..I)), XYDATA
9544 188397 -3465086 -4519235 -3965600 -4435135 -5747824 -6053838 -5292231 -4747316 -4352935
9535 -4352935 -2989921 -803929 1059883 2674255 5198917 8610437 11326304 12118456
9527 12118456 10975905 8264725 4569891 1282497 -190255 32077 636902 823415 626857
9518 626857 108788 -346433 469012 3006692 5349749 5216333 3245296 1961582 1653146
9509 1653146 154505 -2839865 -4503724 -3375304 -2124238 -3472334 -5702012 -5197852
9501 -5197852 -1988541 451381 336445 -631399 -757136 -652033 -993936 -452409 2293724
9492 2293724 5799666 6985072 4648479 573216 -2703122 -4168109 -4375372 -4172989 -3819899
9483 -3819899 -2953856 -1151208 1301427 3186519 3282311 1639352 -426599 -1759497 -2332097
9474 -2332097 -2600664 -2646402 -2627393 -3304777 -4804785 -5259299 -2559686 2109645 4426788
9465 4426788 1880838 -2929283 -5564413 -5074200 -3999043 -3944071 -3821525 -2565490 -968919
9456 -968919 90990 1137368 2528368 3104900 1968069 459693 762864 3118707 5719242
9447 5719242 6943031 6641960 5641849 5018942 5605164 7298258 9008526 9896634 10262753
9438 10262753 10537884 9986517 7525400 3705717 850569 894348 3493753 6321765 6951330
9429 6951330 4666124 920806 -1930273 -2616756 -1810607 -1224035 -2095479 -4194487 -5636872
9420 -5636872 -4019104 1053076 6440801 7837209 4323022 -463099 -2379034 -1027385
9412 -1027385 770421 680098 -1082925 -2785640 -3228411 -2890936 -3373720 -5322239 -7104681
9403 -7104681 -6713531 -4838204 -4092018 -4796510 -4118130 -831307 1665582 -324085 -5275656
9394 -5275656 -8346193 -7868232 -6819278 -7995969 -10595575 -12010921 -10777127 -7326094
9386 -7326094 -3666840 -2432897 -4367580 -6777824 -6462447 -3964276 -2535856 -3050108 -2959774
9377 -2959774 -806291 1515947 2388806 3355632 6150364 9035414 8720355 4860076 464369
9368 464369 -1726841 -1784524 -1830315 -3647250 -6642734 -7865224 -4942790 840723 5693819
9359 5693819 7563587 7447662 6539404 4812343 3109639 3405003 5248862 4908918 368247
9350 368247 -5435379 -8882629 -10420665 -11826744 -11506464 -7104226 -1254350 404318 -3004993
9341 -3004993 -6323224 -5546707 -2218908 537641 2531508 5024558 7655566 9110310
9333 9110310 9056627 7786881 5478250 2932865 1389163 700592 -438931 -1726578 -1095829
9324 -1095829 1533185 2984999 1192382 -1396276 -973710 2779395 7058225 9437242
9316 9437242 8838245 4828781 -1175859 -5163140 -4002170 670879 4421635 5270380 4468138
9307 4468138 2830359 -233239 -3701955 -4369182 -719563 5017745 9982438 13518585
9299 13518585 15376242 13654718 7378782 -194635 -3966302 -2732641 -141032 411223
9291 411223 -542758 -964697 -1138716 -2821717 -5620260 -6821339 -5062853 -1987491 528444
9282 528444 2665986 4703415 4866087 1897042 -1343595 -387265 4429533 7560080 5714702
9273 5714702 2534475 3235196 7093361 8812887 6126644 2225509 636395 1209492 2093782
9264 2093782 2649095 2746096 1459036 -1495208 -4364764 -5265093 -4714192 -4810473 -6486693
9255 -6486693 -8876560 -10903648 -12153340 -12293349 -10785747 -7511362 -3273563 394058
9247 394058 1982472 1191280 -367717 -398446 1590262 3585292 3334741 720900 -2505613
9238 -2505613 -4492800 -4193799 -1540349 2207218 4939217 5601019 5151616 4757775 3865350
9229 3865350 1446297 -1500451 -2591137 -1224213 708042 1714874 2537934 4095873
9221 4095873 5146766 3729854 337081 -2064867 -1360488 1597617 4582426 6583705
9213 6583705 7956408 8777251 8479173 7247146 6456931 6853925 7130195 5523981 2424342
9204 2424342 -55116 -1089352 -2037439 -3730458 -4651491 -3312277 -1170404 -1104845 -3431095
9195 -3431095 -5558684 -5817782 -5552681 -6435236 -7303132 -5306693 263730 6521624 9448063
9186 9448063 7333726 1945500 -3264976 -6099006 -6867595 -6761396 -5649357 -2567657 1796972
9177 1796972 4742970 4447556 2080497 174384 1940 1580706 4886185 9171493 11903341
9168 11903341 10737455 6658864 3102283 1563949 146069 -2784554 -5654539 -5885789
9160 -5885789 -3341787 189521 3508078 5866155 5538610 1375370 -4431098 -7866288
9152 -7866288 -7785715 -6638283 -5990093 -4170477 227773 5159741 7663397 7629123 6640009
9143 6640009 4770957 1452857 -1667780 -2056076 -99949 1540297 2223510 3549416 5050842
9134 5050842 3656040 -1078459 -4889903 -4372725 -1635944 -624288 -1399774 -1446255 -677966
9125 -677966 -1263732 -3397421 -4943715 -5037551 -4734533 -4164926 -2327497 47189 682391
9116 682391 -586201 -1408509 -972651 -1379709 -3816257 -6304070 -6712669 -5261147 -2567410
9107 -2567410 1678909 5984943 6190285 597880 -6205780 -8136424 -4849299 -950356
9099 -950356 772091 1582529 2713277 2995282 1478403 -535771 -1379345 -986702 -63185
9090 -63185 1032333 1793165 1425391 -65015 -1730431 -2903913 -3432034 -2816252 -760473
9081 -760473 1328352 1173671 -1628353 -5191607 -7774860 -8882508 -7925439 -4178833 1178220
9072 1178220 5188335 6381915 6120618 5889202 5470319 4915193 5697892 7881649 8418695
9063 8418695 4955246 -262094 -3129474 -3214584 -3523219 -5377309 -6810982 -6314814 -5128327
9054 -5128327 -4823593 -5050891 -4935115 -4709064 -4535327 -3366932 -664050 1872147 1996299
9045 1996299 -184273 -2396470 -2947713 -2114300 -1126680 -1061919 -2678579 -5979039 -9475962
9036 -9475962 -10974747 -9912545 -8329333 -8650910 -10778295 -12260875 -11335180 -8778665 -6313937
9027 -6313937 -4168194 -1332850 2133996 4396940 3845753 1039984 -1793032 -2769251 -1673236
9018 -1673236 213349 1439906 1965148 3244615 6025777 8486682 8061804 5092427 2666012
9009 2666012 2227218 1647719 -919580 -3623166 -3811576 -2499939 -2642152 -3947894 -3294663
9000 -3294663 -422282 845380 -1512238 -4221564 -3585894 -1066290 -853430 -3645726 -6283077
8991 -6283077 -6817569 -6510882 -6501113 -5537731 -2309291 1989424 4886907 5363943 4338891
8982 4338891 3218533 2674747 2128807 -48772 -4921321 -10963620 -14627908 -13834317 -10208866
8973 -10208866 -6997497 -5477348 -4496242 -2892340 -828277 1177734 2932556 3798532
8965 3798532 2705934 -416 -1739885 -186527 3708083 6483241 5978093 3184387
8957 3184387 223267 -1975514 -3273384 -3168301 -1571454 190530 946553 1795411 4598648
8948 4598648 8233252 8584724 3383480 -4532600 -10106323 -11081215 -8937382 -6105095 -4055885
8939 -4055885 -3420591 -3940734 -4239679 -3184887 -1574610 -1138416 -1951751 -2455631 -2161277
8930 -2161277 -2473493 -4159362 -5681249 -5142088 -2703050 -40323 1640738 2225752 2440684
8921 2440684 3850687 7735760 12679827 14691401 11659070 6734793 4988159 7067414
8913 7067414 8647459 6441619 2240290 -190094 -159302 -70770 -1448547 -3064666 -3154631
8904 -3154631 -2006361 -1556699 -2943359 -5187510 -6447415 -6146668 -5263988 -4527255 -3239645
8895 -3239645 -548323 2888090 5549519 6856094 7120935 6229338 4073674 2163930 2681919
8886 2681919 5279079 6741937 5003336 1945451 887744 2601950 5273167 7208060
8878 7208060 7812398 6732710 3999791 801776 -1452667 -2710320 -3697825 -4282841 -3955096
8869 -3955096 -3511570 -4371925 -6165321 -6795866 -5296392 -3101714 -2025527 -2288657 -2969259
8860 -2969259 -3121299 -1959432 867833 4600426 7859704 10141647 11943192 13398274
8852 13398274 13997500 13676484 12705503 10409251 5845112 239128 -3241838 -3176195 -1684680
8843 -1684680 -1428354 -2389613 -2926105 -2506163 -1785321 -1129341 -714275 -1200775 -2708566
8834 -2708566 -3820990 -3120921 -1172883 345657 910448 1321233 2293675 4140022 7071610
8825 7071610 10375738 11988914 10468191 6943433 3748722 1691159 37035 -1594739
8817 -1594739 -3010701 -4395973 -5630717 -5320362 -2664162 137884 -218617 -3739807 -6901419
8808 -6901419 -7152864 -5468661 -3868324 -2618117 -1013441 738382 1724236 1531606 531592
8799 531592 -339406 12195 1605250 2719780 1916764 522848 1173594 3818482 5451054
8790 5451054 4375890 2455554 2125245 3286255 4426679 4924742 4786066 3734871 2069140
8781 2069140 993623 687415 -513817 -3495462 -6373269 -6934001 -5938107 -6064558 -8220749
8772 -8220749 -10535628 -10505431 -6823113 129776 7961329 12873413 12289277 7244250 1546431
8763 1546431 -1390841 -878121 913661 823480 -2112674 -5033113 -4339118 -648294 1674139
8754 1674139 723641 -175917 2189036 5743341 6314488 3859116 1999989 2683199 4786051
8745 4786051 7128075 9258970 9679413 6934419 2700452 586312 1531892 3269686 4339430
8736 4339430 5314905 5846182 4302551 1361169 295092 2138970 3886759 3272185 2063405
8727 2063405 2345054 2631311 644932 -2423474 -3679992 -2992360 -2657234 -3652370 -4961454
8718 -4961454 -5885905 -6573402 -6845609 -6649557 -6939480 -8013452 -7948794 -5145703 -1512275
8709 -1512275 -184551 -576702 969414 5338799 8818939 8278663 5274000 3245898 2960878
8700 2960878 2908923 2525153 2451336 2338462 879710 -1746018 -3332889 -2280104 310610
8691 310610 1839996 880204 -1842269 -4590602 -6190090 -6767805 -7453769 -9239631 -11760172
8682 -11760172 -13393238 -13067302 -11787195 -11565264 -12764837 -13577913 -12716543 -11457634 -11704463
8673 -11704463 -12799234 -12141056 -8945358 -5425556 -3595149 -2723100 -1248897 190989
8665 190989 -540345 -3907479 -7810572 -9810392 -9180149 -6964266 -5087444 -5213528 -7300471
8656 -7300471 -9251489 -9025598 -7046505 -5353031 -4388296 -2244736 2235272 7046162 8959501
8647 8959501 7090408 3327561 -201511 -2726620 -4260534 -5149550 -6466727 -9107500
8639 -9107500 -11619697 -10654376 -5292247 362373 1384327 -1648721 -3482815 -1778181
8631 -1778181 -415162 -3127271 -6926587 -5817713 227758 4513691 2514182 -2317347
8623 -2317347 -3551140 231819 4994134 6981679 6084567 4119692 2363253 1244119
8615 1244119 851661 965533 1190673 1364505 1524019 1540734 1137145 232657 -808272 -1142021
8605 -1142021 -20504 1903749 2265225 -648197 -5136885 -7249215 -5214327 -1287707
8597 -1287707 1384920 2050430 1537495 -11615 -2843844 -6099721 -8336817 -9073469 -8725194
8588 -8725194 -7742255 -6754937 -6504610 -6511439 -5061806 -1898101 443351 -220690 -2399390
8579 -2399390 -2775315 -434254 2833004 5493736 7053001 6559208 3279425 -1000961 -3119511
8570 -3119511 -2715605 -2986211 -6259060 -10620684 -12119657 -9167359 -3893730 47940 578854
8561 578854 -1122993 -1844389 112329 2883683 3373932 969529 -2239553 -4050956 -3387559
8552 -3387559 -58203 4436093 6706595 4839597 1517430 911013 2916992 4004399
8544 4004399 3657500 5433914 10289732 13395345 10480632 3976490 -454092 -998231 17763
8535 17763 873435 1825508 2822587 3191050 3153573 3034508 1646199 -1852015 -5211830 -5288724
8525 -5288724 -2798792 -1808735 -4104939 -6949626 -7291501 -5585727 -4018165 -3006670 -1349286
8516 -1349286 1225547 3372591 3784163 2540218 761569 -712350 -2277569 -5037868
8508 -5037868 -9029663 -12405766 -13184411 -11648304 -10165030 -10604646 -12610465 -14369668 -14408326
8499 -14408326 -12648150 -10283023 -8586669 -7521925 -5965311 -3720615 -2405948 -3297074
8491 -3297074 -5039310 -4981974 -2508407 394676 1781887 1511457 335302 -1167472 -2283797
8482 -2283797 -2199702 -1093181 -204568 -229416 -628884 -1077980 -2292043 -4259795 -4702069
8473 -4702069 -1105862 5677294 11280433 11814989 7260248 614338 -5265128 -9184082
8465 -9184082 -10965537 -10921224 -10054209 -9412008 -8725305 -6841620 -4134176 -3099663 -5307660
8456 -5307660 -8899401 -10803614 -10602320 -10209971 -10345723 -9848880 -8476871 -7583743 -7266483
8447 -7266483 -5534320 -1718451 1656626 2231737 1080645 595248 803139 106699 -1596410
8438 -1596410 -3022793 -3964912 -5268987 -6762915 -7397206 -7289409 -7626262 -8454481 -8225616
8429 -8225616 -5682666 -1049474 4321271 8324021 8928910 6323762 3590542 3373593 4382502
8420 4382502 3224397 -681631 -4287875 -5032053 -3603431 -2264049 -2281302 -3470601 -4749636
8411 -4749636 -4824513 -3588033 -2738395 -3614486 -4817779 -3781527 -381185 2989497 4600689
8402 4600689 4399762 2187948 -2370111 -7554676 -10176206 -9245122 -6840644 -4708070 -2410726
8393 -2410726 382051 2377393 2610430 1579910 -689759 -5176585 -10938204 -14195344
8385 -14195344 -12471884 -7805679 -3886061 -1771505 -506509 -199990 -1773789 -4488538
8377 -4488538 -6165021 -5709038 -3788733 -1389487 800080 1915372 1274311 -769444 -3096996
8368 -3096996 -4669191 -4681374 -2696867 637097 3664026 5127313 5055389 4258631 3854753
8359 3854753 4950095 7187890 7902298 4964361 473776 -1172993 648060 1891323
8351 1891323 89918 -2117213 -1779449 -452577 -1128638 -3156510 -3914826 -3641847 -4719262
8342 -4719262 -7045300 -7596270 -4453750 1151958 6338005 8171229 4961795 -1675476
8334 -1675476 -7067720 -8001995 -5895442 -3689261 -1771559 383881 1126961 -866599 -2878782
8325 -2878782 -1362239 2343754 4006817 3226116 3289109 4911187 5507533 4872746 5913290
8316 5913290 8589494 8736378 5046991 2078884 3361587 5877812 4756948 -66561
8308 -66561 -5143522 -8325295 -9051477 -6774509 -2695927 -725828 -2992781 -5992343 -4604911
8299 -4604911 1158457 6288391 6613961 2075511 -4484949 -9199031 -9077340 -4780601 -748670
8290 -748670 -415509 -2293027 -2701649 -772801 1632449 3213358 3462969 1120582 -4135064
8281 -4135064 -9247606 -10393558 -7642317 -4049654 -824366 3117467 7191479 8759997
8273 8759997 7278844 5151318 3420782 125989 -5432537 -9935755 -9841576 -5810996 -1337135
8264 -1337135 1260726 1633299 -12505 -2847911 -5009816 -5292004 -4616888 -4311703 -3865487
8255 -3865487 -2176929 -164163 109158 -1297338 -1998344 -682332 1277480 2345190 3049323
8246 3049323 4297168 4994846 3487738 764039 -200719 1267023 2136375 -84863 -3350906
8237 -3350906 -3256506 1632626 8520706 13862485 16005013 14699333 10613946 5973289 3398811
8228 3398811 3017807 2481450 704474 -461166 574361 2486735 3284407 3204085 3326464
8219 3326464 3105793 1638280 -122121 -938847 -1718519 -3602344 -4902545 -3247076 -63894
8210 -63894 667227 -1844707 -4159089 -3758548 -1881977 -273400 1645962 4712283 7670231
8201 7670231 8685045 7400728 4217464 -582749 -5727819 -8873358 -9009246 -7388664
8193 -7388664 -5223961 -2608847 -692622 -1988326 -6362894 -9258855 -6831116 -1208881
8185 -1208881 2240818 1621239 -489714 -1740585 -2302803 -2543533 -1704573 103958 941122
8176 941122 -636906 -3593909 -5579179 -5209945 -2985353 -942350 -1397792 -4821057 -8886378
8167 -8886378 -10728581 -9936671 -8038558 -5586914 -1956930 1857004 2886316 -22407
8159 -22407 -3950887 -5215575 -3805359 -2752363 -3695901 -4900265 -3852039 -484101 2802988
8150 2802988 3713146 2129245 -159611 -1374510 -1203187 -506237 -86066 -126965 -483287
8141 -483287 -854856 -800129 -270699 -87828 -1103630 -2812703 -3639670 -2837625 -1303774
8132 -1303774 -249907 71697 -20670 -296294 -295481 637333 2147276 2617137 1248248 -382364
8122 -382364 -315327 650274 -437626 -4613442 -8959760 -9386056 -4630176 2931186 9500466
8113 9500466 12305684 10880619 7035733 3230824 289936 -2883194 -6893823 -10159620
8105 -10159620 -10777228 -9302379 -7950339 -7206592 -5185597 -928625 3468582 5284372
8097 5284372 4499386 3226550 2624152 2008020 691143 -955666 -2422828 -3638272 -4334397
8088 -4334397 -4168130 -3907459 -5068397 -7493124 -8576966 -6272772 -2059506 602313 348542
8079 348542 -1179174 -2376430 -3648192 -5594049 -7002965 -6297291 -4088069 -2540895 -2495185
8070 -2495185 -2920104 -3261670 -4419588 -6748501 -8984268 -10445876 -12544069 -16035811 -18132225
8061 -18132225 -15332243 -8956437 -4688264 -5638502 -8662856 -9238819 -7421202 -6315716
8053 -6315716 -6496486 -5441981 -2138607 1059246 1930451 1285626 1219983 2213289 3154958
8044 3154958 3103592 2102414 1080621 1399146 3473592 5558628 5238657 2571825 268061
8035 268061 125934 928782 767655 -339364 -1540704 -3151321 -5530635 -7117736 -5947199
8026 -5947199 -2740147 -299512 242723 548547 1960488 3147608 2082329 -702899 -2318611
8017 -2318611 -1028010 1320614 1000821 -3434246 -9233630 -12240162 -11233639 -8510164
8009 -8510164 -6372329 -4763870 -2985118 -1838230 -2405526 -3900743 -4645254 -4527060 -4684870
8000 -4684870 -5247317 -5277019 -4657459 -4070679 -3279289 -1648597 -505148 -2405735 -7092620
7991 -7092620 -10456148 -9128830 -4523268 -654859 781574 1335193 2655892 4451974
7983 4451974 5555453 5445606 4267578 2210920 -687559 -4332904 -8110536 -10660915
7975 -10660915 -10846952 -9323591 -8218935 -8493368 -8567936 -6729324 -3998895 -2855826 -3469376
7966 -3469376 -3326966 -1137930 866265 -58107 -3101321 -4708424 -3200286 -892760 -1101192
7957 -1101192 -4208972 -7541485 -8425665 -6441054 -3083983 -349693 379840 -706892 -1522814
7948 -1522814 146561 3671428 5418613 2928995 -1538632 -3588362 -2567850 -2341122
7940 -2341122 -5335251 -8449212 -7238874 -2485425 648688 -298790 -2261722 -1916023 -663341
7931 -663341 -1963486 -5732314 -8508520 -8494925 -7393841 -7047250 -7134093 -7140009 -7937604 -9642678
7921 -9642678 -10021346 -7386183 -3707616 -2290796 -3144441 -3357257 -1870942 -1079359 -3123688
7912 -3123688 -7052038 -10640825 -12950974 -13901673 -13166108 -10906972 -8168220 -5295904 -1404914
7903 -1404914 3420354 7119279 8387109 8695570 9681823 10184269 8302355 5088806 3342201
7894 3342201 3441536 3303591 2243474 1926417 3152989 4417489 4469722 4127167 4648596
7885 4648596 5933972 6865456 6072997 2597770 -2275497 -4420667 -1043737 4592894 6099448
7876 6099448 2194859 -1820705 -2026618 -871842 -1653655 -2526143 -504874 1782271 -926402
7867 -926402 -7962429 -12748019 -11784416 -8622275 -7396663 -6894885 -3866300 959418 3747666
7858 3747666 3040430 1097192 -63457 -1200512 -3494562 -5537247 -4588271 -649170 2412940
7849 2412940 936478 -4080159 -8089573 -8424930 -6833132 -6120360 -6340127 -5774072 -4040466
7840 -4040466 -2161726 -524851 1081314 1904797 738089 -2178542 -5396558 -8013594
7832 -8013594 -9558101 -8907841 -5676695 -2322839 -2165379 -4932571 -6703977 -4885357 -1017062
7823 -1017062 2004499 3179147 2950965 1780173 455825 -112124 -721606 -3619195 -8979774
7814 -8979774 -13529637 -14507548 -13463374 -14094068 -17379190 -20811223 -21696894 -19423463 -14991334
7805 -14991334 -9983599 -5828172 -2962084 -1016963 -331511 -2000514 -5335350 -6860514
7797 -6860514 -3817165 2225174 7096392 8543031 7193663 4150043 320753 -2230108
7789 -2230108 -1290542 2381982 5182955 4830364 2698942 1283645 1181112 1660486 2541468
7780 2541468 3907124 4908340 4417615 2581297 621035 -810048 -2231973 -4179623
7772 -4179623 -6009971 -6368827 -5024256 -3834391 -4960119 -7916768 -9655241 -8341900
7764 -8341900 -5565282 -3352370 -805729 3463719 6747189 4260248 -3551590 -9745871
7756 -9745871 -9070649 -4285400 -1566112 -2241120 -2701975 -919889 1070995 1054619 -590069
7747 -590069 -2665016 -4843822 -6654031 -7138526 -6574077 -6560183 -7466585 -7692172 -6418403
7738 -6418403 -5157407 -5395060 -6565484 -7682274 -9039202 -10580613 -10438701 -7346330 -3159912
7729 -3159912 -597850 496934 2093985 3970149 3735697 890477 -1902493 -2187360 -157894
7720 -157894 2725629 5322812 6479952 5516654 3918100 4174487 5892976 5635871 2065657
7711 2065657 -1591230 -2451453 -2528535 -5060122 -8478263 -8409232 -4885196 -2928005 -5229592
7702 -5229592 -8327010 -7809910 -4124885 -922645 23781 -239167 -462691 -331608 331488
7693 331488 1656508 3363269 5356049 7809275 9661994 8528812 3961860 -390481
7685 -390481 -356717 3334284 5516625 2674273 -3482067 -8925099 -11657799 -12098166 -11011194
7676 -11011194 -9024474 -7547442 -8275285 -11245083 -14198251 -14443052 -11304972 -6751923
7668 -6751923 -3765000 -3970798 -6499166 -8947724 -9535544 -8466923 -7257732 -6789502 -6314895
7659 -6314895 -4787487 -2993448 -3293481 -6460442 -9591571 -8659405 -3083667 3664950 8154303
7650 8154303 9966132 10033156 8192207 4291565 393480 -625066 1376234 3503376 3306119
7641 3306119 1089251 -1436080 -3286383 -4412179 -4919040 -4802434 -3901092 -1896432 1052228
7632 1052228 3792983 5158473 5219292 4446622 2074785 -2782953 -8249949 -10266101 -7250570
7623 -7250570 -2395441 172991 21510 -475526 -198430 -123275 -836789 -1700120 -2456360
7614 -2456360 -3401547 -3701860 -1868204 1375061 3028277 1937124 793063 2019994 3545770
7605 3545770 1628504 -2952081 -4942760 -1414146 4407268 7417262 6317371 3247079
7597 3247079 -25212 -2807160 -3695526 -1399890 2458278 4022697 1512803 -2919176
7589 -2919176 -6136640 -6994319 -5907191 -3688523 -1955769 -2672360 -5654109 -7983685 -7386703
7580 -7386703 -4789957 -2144703 409859 3061238 3729901 39733 -6663728 -12019820
7572 -12019820 -13306002 -11161998 -7179874 -2612678 599581 745606 -922240 -1178396
7564 -1178396 504213 1104920 -889810 -2690678 -1634430 308779 -533452 -3858232 -5895832
7555 -5895832 -4783349 -2351726 -636395 605481 2248555 3756993 3812309 1940917 -979940
7546 -979940 -3156354 -2965622 -622269 1449275 1109046 -773427 -1431687 -16253 1292091
7537 1292091 478017 -1387864 -1379299 1881883 6880788 10866128 12209658 11346070 9985071
7528 9985071 9587393 10397130 11578833 11945293 10663816 7822333 4500065 1851564 30338
7519 30338 -1484441 -2672151 -3138108 -3541807 -5315310 -8245927 -9832191 -8277058 -4993585
7510 -4993585 -2812019 -2679746 -3552370 -4626300 -6004601 -7698243 -9455757 -11116459 -11963509
7501 -11963509 -10678433 -7417265 -4752610 -4581252 -5214980 -3897075 -1090661 701781
7493 701781 1489627 3383566 5736270 5018367 769519 -2381886 -974016 2221486 2196653
7484 2196653 -1602301 -5494618 -6780078 -5892474 -4419135 -3469950 -3339161 -2924430 -471144
7475 -471144 3372529 4714258 937913 -5157785 -8295929 -6895799 -3771566 -1583285
7467 -1583285 -594380 -568767 -1701199 -3206544 -3594383 -2969802 -2972157 -4119172 -5280053
7458 -5280053 -5812226 -5782415 -4035443 856044 6924445 9241323 5672490 -235323 -3711242
7449 -3711242 -3763169 -2105032 171065 2207720 1831405 -2213046 -7335466 -9442155 -8034674
7440 -8034674 -6480419 -7209831 -8992695 -9361171 -7702283 -5214896 -3245829 -2374893 -2196442
7431 -2196442 -1589909 69973 1885801 2350353 1198366 -376016 -1077363 -360021 1483914
7422 1483914 3102659 2715971 295366 -1679773 -1256365 147149 137700 -334977 1683871
7413 1683871 5494744 6246612 1544742 -4821289 -8066869 -8449052 -9034925 -9694952 -7382800
7404 -7382800 -1744464 3450987 5149177 4378452 3857473 4614901 6101095 7656798 8513157
7395 8513157 7796890 5807657 4136106 3403343 2035394 -1430239 -5746606 -8097175 -7341596
7386 -7341596 -4878044 -2586379 -1089927 27010 1337883 3114238 5060807 6336186
7378 6336186 6293665 5291170 4435856 4461140 4978005 4743922 2721578 -698907 -3484468
7369 -3484468 -3643087 -1441231 730936 1141887 632138 1095136 2744532 3879124 3128411
7360 3128411 1132855 -7870 1369344 4813887 7728125 7689129 5195315 3164390 3126686
7351 3126686 3259923 1406997 -1345669 -2107849 -378090 1545326 2161634 2456228 3723374
7342 3723374 5871312 8414296 11043202 12483736 10967257 7010776 3780461 3261820
7334 3261820 3738106 2536055 -336800 -2867894 -3738755 -2624675 477716 4071007 4968156
7325 4968156 1973047 -1577883 -2010720 -949666 -3012138 -8255281 -11240187 -8540595
7317 -8540595 -3105753 708865 2724559 4755626 5934672 4036909 -69021 -2954170
7309 -2954170 -3163332 -2255222 -1525567 -491951 1107770 2292537 2496843 2445655 2839199
7300 2839199 3577757 4363824 4472490 2143545 -3496037 -9658233 -11756020 -9188811 -6812599
7291 -6812599 -8846974 -13342332 -14997794 -11984428 -7214972 -3546728 -825742 1709384
7283 1709384 2763944 645303 -3469737 -5805576 -3881111 674968 3794428 3342010
7275 3342010 1217712 672220 2143781 3025603 1588514 -604799 -1273218 -995923 -2366814
7266 -2366814 -6089321 -9791116 -10920787 -9346572 -6645497 -4042753 -1793958 84356
7258 84356 1224710 1115654 -63538 -939794 -154886 1482304 1381405 -1045747 -2435778
7249 -2435778 376452 5123498 6095915 1561163 -3920069 -5554600 -3647511 -1209109
7241 -1209109 774948 2918275 4428997 3882817 2030764 791335 -51406 -2182605 -4905306
7232 -4905306 -5011005 -1199574 3890834 7090410 8081069 8248803 7967987 6580460 4129568
7223 4129568 1853458 1204237 2606194 4503806 3876132 -759798 -6640242 -8897000 -6228692
7214 -6228692 -2708461 -2693828 -5482781 -6817727 -4730021 -1756808 -1296470 -3465359 -5357081
7205 -5357081 -4615685 -1885497 268967 251826 -1353947 -3270015 -5096087 -6819810 -7950604
7196 -7950604 -8464117 -9689884 -12465615 -15031462 -14939883 -12767139 -11386226 -11445646 -10517927
7187 -10517927 -7536468 -4971945 -4949543 -6011551 -5966303 -5516790 -6362203 -7656995 -7397787
7178 -7397787 -5996804 -5462530 -5989417 -6324022 -6698273 -8165249 -9410427 -7691314 -3372473
7169 -3372473 -411064 -1364556 -4382562 -6117113 -5465704 -3485650 -1592025 -943836 -2028034
7160 -2028034 -3804989 -4336867 -2759115 332307 4173585 7894673 9737579 8550282
7152 8550282 5985926 4616699 3795529 501650 -5223533 -9369275 -9880590 -9722692 -11612006
7143 -11612006 -13157019 -10740026 -5714251 -2688230 -2974962 -3648006 -2588146 -852359
7135 -852359 88996 278007 -120539 -1487816 -3333069 -4369728 -4551170 -4997728 -5478693
7126 -5478693 -4283107 -1494395 -155153 -2551289 -6746306 -8487079 -5916500 -1124160
7118 -1124160 2671098 4447522 5722382 7988722 10268553 9949794 6429431 2853545
7110 2853545 2842617 6012680 8467296 7681515 5067661 3341542 3234783 3702578 3701439
7101 3701439 2442826 -759400 -5178752 -7990353 -6758984 -2588439 702919 826221
7093 826221 -778797 -1378431 -250623 1498045 3429304 6196116 9237283 9921414 6540924
7084 6540924 1349736 -1209006 650982 4515124 7189923 7790632 6792272 4253895 771805
7075 771805 -1472612 -1061159 58317 -1256391 -4882031 -7544696 -7393372 -5909867 -4753375
7066 -4753375 -3339021 -857910 1485549 2045967 1015598 -655206 -3364991 -7856145
7058 -7856145 -12781684 -15304920 -14171758 -10824579 -7501785 -5388019 -4494876 -4115735 -3303274
7049 -3303274 -1891288 -1032749 -1768078 -3235630 -3561772 -2556293 -2048603 -3062191 -4069602
7040 -4069602 -3044861 -258928 2159196 2928619 2789850 3227216 4963651 7552946 9548403
7031 9548403 9206415 6070693 1949575 -708155 -1589750 -2531227 -4441072 -5703192 -4642225
7022 -4642225 -2252873 -899399 -1139859 -1645395 -1809890 -2387666 -3430125 -3584937 -2064000
7013 -2064000 280925 2419064 4120239 4954957 4162227 2387695 1668297 2511970 2887680
7004 2887680 1556934 376224 1319854 3144770 3501994 2679519 2295784 1679195 -890042
6995 -890042 -4086370 -4594015 -2290923 -503568 -551509 -128076 1553761 1254856 -2958556
6986 -2958556 -7318140 -6899482 -2481469 720650 14085 -2413040 -3506225 -2485378 173899
6977 173899 3981904 7699682 9417125 8599939 6929335 6185999 6070826 4946431 2320444
6968 2320444 -261767 -1085872 -638931 -1305697 -4267821 -7514255 -8074525 -5757595 -3184079
6959 -3184079 -2344367 -2975797 -4430743 -6896988 -9958303 -11958544 -11925374 -10546829 -8488942
6950 -8488942 -5666206 -2936675 -2097106 -2992881 -3198734 -2010315 -1810968 -3579282 -4515083
6941 -4515083 -3092051 -2964143 -7601934 -13827886 -15716666 -12994145 -10139877 -8519242
6933 -8519242 -5562938 -1438518 140289 -1044898 -242436 4320093 7763213 6040660
6925 6040660 2005094 201817 166561 -625248 -1046914 1200734 4122894 3837463 843555
6916 843555 -1184177 -1827397 -4070406 -8243531 -10713396 -9350015 -6175496 -3525649 -1263107
6907 -1263107 756950 666763 -2924717 -8331414 -12165662 -12134834 -8122966 -2267386 1742589
6898 1742589 1517338 -1327998 -3124830 -2911461 -2934365 -4259939 -4938878 -3597403 -1930369
6889 -1930369 -1883913 -2764601 -3064134 -3055242 -3522031 -3778382 -3140231 -2701414 -3276143 -3045418
6879 -3045418 44070 4478870 6512591 4919764 2078397 675987 1587621 4539656
6871 4539656 8239226 9973862 7931925 4309179 3328677 5467394 6537033 3740227
6863 3740227 -281852 -1471769 123433 1563302 1818987 2069912 2169241 355934 -3256589
6854 -3256589 -5919316 -5893134 -4527483 -3668417 -3073715 -1720888 100929 1603233 3004659
6845 3004659 4487233 4721805 2389597 -1370231 -3915514 -4340376 -4055906 -4163629 -4086074
6836 -4086074 -3280349 -2638924 -3210749 -4647789 -5906726 -6676890 -7150576 -7044315 -5998860
6827 -5998860 -4755220 -4890109 -7036022 -9771346 -10622279 -8401609 -4802356 -3387635 -6214961
6818 -6214961 -11386339 -14859961 -14941055 -13772741 -13710288 -13737855 -11219658 -6362953 -2629603
6809 -2629603 -2466164 -4690524 -6995918 -9169812 -12102602 -14756341 -14472166 -10550384 -5746431
6800 -5746431 -3215019 -2877266 -1850394 1874464 7078058 10626311 10476438 7270632 3576727
6791 3576727 1936570 3169886 5789856 6935245 4570074 -483494 -4693545 -4649340 -233505
6782 -233505 5145687 7684354 6327698 2750903 -907818 -3309030 -3525480 -1301897 1667578
6773 1667578 2399594 -4881 -2767046 -2949910 -1704198 -2674805 -6426021 -9293416 -8638710
6764 -8638710 -6542165 -6420232 -8078439 -8600467 -6814774 -4166776 -1834808 206440 1316165
6755 1316165 255567 -2111256 -2626815 309845 4390623 6184046 4965612 2590215
6747 2590215 738291 -350197 -1135258 -1992132 -2881922 -3226634 -2607240 -1794145 -2058030
6738 -2058030 -3112126 -3113898 -1387217 373219 633680 185173 317967 289255 -1407090
6729 -1407090 -4201529 -6048974 -6440293 -6735206 -7540010 -7688553 -6150295 -3403868 -588909
6720 -588909 1399731 1860878 850255 91074 1703829 5312890 7764747 6640365 3020860
6711 3020860 -172544 -1706722 -2739607 -4428319 -6077919 -6045066 -3924897 -1261825 76451
6702 76451 -81832 -377136 -77864 -137702 -1537093 -3496425 -4426287 -4055964 -3340794 -2650881
6692 -2650881 -1581955 -548285 -901857 -2880146 -4708688 -4552093 -2524961 -88255 1835211
6683 1835211 3407286 4965984 6180101 5986296 3253407 -2037829 -8045796 -11954870
6675 -11954870 -12073931 -9161574 -5804598 -4497068 -5787207 -7868073 -8403447 -7119602
6667 -7119602 -5939195 -6175366 -6795234 -6388253 -5392241 -4682316 -3354977 -488140 1742878
6658 1742878 7308 -4853208 -7684530 -5383882 -625049 2366251 3183278 4101238 5516385
6649 5516385 5433361 3015105 404471 660563 4717656 10165122 12794313 10465447 5893288
6640 5893288 4017365 5914482 7419386 5074955 1035950 -198547 2121256 5048529
6632 5048529 6556811 6801509 5647555 2513926 -1269666 -3143339 -2818373 -2371680 -2514018
6623 -2514018 -1666917 658628 2623424 3241675 3800991 4677339 3765765 196382 -3070918
6614 -3070918 -3015643 -821899 430778 537333 1457011 3200343 4021608 4084084 5139730
6605 5139730 6373050 4395346 -1432469 -7029244 -8782832 -7931984 -7584403 -7852293 -6832450
6596 -6832450 -4661322 -3221018 -2542326 -872664 1491872 1555900 -2153942 -7080587 -9635922
6587 -9635922 -8937232 -6425074 -3564692 -1447902 -1207492 -2980092 -5199301 -6317755 -6510050
6578 -6510050 -6535190 -6046725 -4600229 -3274175 -3327068 -3970888 -3567413 -2497189 -2474630 -3149065
6568 -3149065 -1957380 2033372 6243209 7383990 4626512 -449557 -5377311 -7883965
6560 -7883965 -7309696 -5522473 -4767430 -4478960 -2477547 533087 888331 -2455122 -5583703
6551 -5583703 -5000850 -2400211 -1369451 -1942331 -1799547 -915754 -1191350 -2566547 -3299762
6542 -3299762 -3669409 -5783093 -9628466 -12594802 -13232388 -12461056 -10743786 -7288970 -2807548
6533 -2807548 123868 732605 1277370 3105938 4096736 1978637 -1884850 -4174773 -3614512
6524 -3614512 -1309537 1689555 4973645 7414370 7251533 4087830 3230 -1809592
6516 -1809592 191131 4088061 5862673 3546993 -242880 -1179753 1614088 4924068
6508 4924068 5903471 5109144 4542334 4672039 4513534 3238012 679051 -2675861 -5472665
6499 -5472665 -6268618 -4939385 -2353258 1097252 4939586 6989107 5034604 686415
6491 686415 -1343698 890674 3894591 3377330 -732206 -5411832 -8274948 -8359124 -5520656
6482 -5520656 -1202998 2092432 3980699 6731315 10830790 12797223 10085933 5448979
6474 5448979 3018314 2473860 1133627 -206618 1551302 5655041 7528026 5251022
6466 5251022 1687166 -455155 -1544647 -2058532 -780784 2261515 4346129 3468294 695091
6457 695091 -2302105 -5425284 -8376110 -9422981 -7882296 -5661403 -4555228 -4027796 -3280045
6448 -3280045 -3214906 -4272188 -4407350 -1766137 2030780 3685287 2337473 -214358 -2495792
6439 -2495792 -4396219 -5790430 -6199138 -5796341 -5299008 -4907348 -4355635 -3688984 -3155387
6430 -3155387 -2866648 -3250089 -4893752 -7036383 -7312157 -4237965 875877 5473258 8027081
6421 8027081 7688662 3527048 -3500027 -8888170 -7926357 -1180830 5369658 6363505 1937361
6412 1937361 -3668098 -6846477 -7218671 -6576912 -6362182 -6298481 -5382379 -3944322 -3790538
6403 -3790538 -5666453 -7558378 -6951870 -4497697 -3900277 -7669789 -13870270 -17710943 -16168909
6394 -16168909 -10825544 -6082136 -4464381 -4062829 -1428007 3309592 5932455 3387614
6386 3387614 -2203953 -6171146 -6499543 -4643263 -2392266 -413878 504635 -544820 -2665764
6377 -2665764 -3220383 -901256 2461900 4058819 3212914 1614776 1078240 1703567 1955579
6368 1955579 205177 -3642410 -7949003 -10757025 -11101113 -9066652 -5691089 -3274945
6360 -3274945 -4201832 -7957729 -10505582 -8584661 -3867553 -667407 -91558 807723 3982856
6351 3982856 7504658 8818046 8307587 7900461 8074350 8232151 8593163 9499097 9669752
6342 9669752 7401831 3389068 419040 -85202 359777 -83417 -571762 1510621 6862692
6333 6862692 12690925 15491814 14744438 12674950 10549340 7046418 1259683 -4525061
6325 -4525061 -7209486 -7045409 -6842918 -7382386 -6582834 -3717512 -1355005 -1589355 -2948871
6316 -2948871 -3163437 -2929993 -4358655 -7013346 -8190534 -6611628 -3609348 -993994 222113
6307 222113 -730935 -4015586 -7956960 -9842699 -8412293 -4615200 -145734 3573871 5427193
6298 5427193 5278708 4497888 4315114 3907312 1819171 -967549 -1548717 968216 4040311
6289 4040311 4909770 3621527 2109337 1709602 2286362 2614414 1212271 -1880773 -3981251
6280 -3981251 -2225866 2397096 5520883 4681256 2014624 689024 1037920 1835437 2975842
6271 2975842 4467479 4688617 2531057 4100 -275240 697828 -203371 -2918622 -3781735
6262 -3781735 -892411 3212545 5331649 5423171 5334518 5964123 7233769 9048619 10672393
6253 10672393 10609407 8605765 6493516 5739051 5585194 5043252 5013313 6297437 6859363
6244 6859363 3822906 -2125837 -6827028 -7419563 -5069046 -2616728 -1436704 -1355167 -2051560
6235 -2051560 -3342285 -4837151 -6136751 -7008751 -7150915 -6354905 -4947113 -3332974 -1203753
6226 -1203753 1752549 4348798 4480948 1709879 -1892701 -4135757 -4998294 -5876904 -7453583
6217 -7453583 -9119260 -9867218 -9016762 -6528140 -3198498 -186573 1987457 3577517 4820804
6208 4820804 5868354 7358611 9591143 10937992 9072524 4745084 2275754 4450480
6200 4450480 8485358 9378533 6315049 3230726 3386394 5883037 7700015 6866833 3174939
6191 3174939 -1983020 -5613575 -5051740 -1263578 1262926 -672558 -5288854 -8045072
6183 -8045072 -6559877 -2237678 1938780 3809220 2922312 588389 -948648 -360607 1665126
6174 1665126 3552441 4613647 5200187 5703636 6113887 6085929 4914864 2207284 -727902
6165 -727902 -1157695 2178373 7096186 10202459 10640406 10191288 9949567 8674525 4977537
6156 4977537 -129209 -3805887 -4140415 -1902859 294512 503376 -848186 -1999595 -2494859
6147 -2494859 -3726233 -6367192 -8708859 -9007389 -8405093 -9445495 -12135278 -13788410 -12949475
6138 -12949475 -11151158 -10057038 -9116270 -7432576 -6079242 -6622325 -8504291 -9912074
6130 -9912074 -10636190 -12070362 -14469493 -16103703 -15590622 -13521896 -10990265 -7794695 -3408088
6121 -3408088 943812 2817591 1545380 -500445 -576814 1142723 2125490 1046294 -718945
6112 -718945 -1497845 -1600507 -2191268 -3291238 -4339594 -5511734 -6650448 -6035231 -2723035
6103 -2723035 555669 -101419 -4233772 -7151493 -6394052 -4836948 -5859900 -8574255 -10166470
6094 -10166470 -10231001 -9845127 -8569918 -5778298 -3404151 -3764641 -5581666 -5707468 -4137925
6085 -4137925 -3568671 -4291671 -3680877 -1210877 209236 -827274 -1860388 -909246 549618
6076 549618 1294726 3436027 8492538 13320417 13949136 11608657 10784496 12298140 12587369
6067 12587369 9812842 6542814 5313956 4956146 3122963 59263 -2102997 -2302581
6059 -2302581 -1163800 316501 1359940 1438870 797279 379542 511116 368740 -501477
6050 -501477 -956856 407318 3116614 4985750 4388283 1801053 -791863 -1592885 -272362
6041 -272362 1906343 3104042 2235841 -477232 -3836570 -6157573 -5919415 -3038770 267255
6032 267255 994835 -1393347 -3818833 -2711262 1881719 6280053 7343857 5563968 3438096
6023 3438096 1970212 374230 -1129628 -423133 3591456 8844583 12531910 14462634
6015 14462634 15831528 15677183 11813547 5510336 1649250 2516777 4443595 3083474
6007 3083474 -511844 -2281984 -1644487 -1590083 -3110984 -3746012 -2104127 -103908 434404
5998 434404 336706 882398 1762455 2586001 3844018 4918078 3783227 508602 -1539409
5989 -1539409 -223750 2015465 1886954 27461 -1079528 -1988641 -5153771 -9835341 -12255505
5980 -12255505 -11023968 -8806139 -7907801 -7474735 -6160571 -4534243 -3242070 -1388622
5972 -1388622 1259450 2532199 596557 -2920060 -4741544 -4075304 -3026742 -3476091 -5363981
5963 -5363981 -7746851 -9764339 -10522302 -9612520 -8109699 -7832623 -9220133 -10927134 -11819517
5954 -11819517 -12258013 -12823486 -12810402 -11037278 -7693387 -4346301 -2083040 -350796 2143266
5945 2143266 5700235 8824023 9006728 4808472 -2129570 -7512754 -8071775 -5061325 -2901729
5936 -2901729 -3872113 -5649549 -5263108 -3903586 -5442598 -10685916 -15786232 -17028302 -14973721
5927 -14973721 -12612724 -11184578 -9622107 -7182818 -4778779 -3683728 -3938331 -4158552
5919 -4158552 -2703600 493161 3161524 2728399 -631198 -4200519 -6235335 -7470806
5911 -7470806 -8445045 -7706056 -4484987 -1125323 -343374 -1413161 -1679763 -821568 -785224
5902 -785224 -2183919 -3775387 -5204480 -7102857 -8367516 -6661475 -2341877 1235968
5894 1235968 2406650 3160760 4983466 5762163 3089142 -1697928 -5264664 -6389010 -6044942
5885 -6044942 -4949248 -3520000 -3076187 -4401544 -5733763 -4672409 -1755674 301231
5877 301231 904146 2562362 6820967 11281384 12037685 7996068 1626043 -3928942 -7400446
5868 -7400446 -9265490 -10164786 -10160092 -9376964 -8550121 -8255199 -7863969 -6019949 -2181216
5859 -2181216 2840474 7609709 10551696 10230659 6703862 2658072 1468585 3464944
5851 3464944 5486193 4807085 2196925 389282 824507 2647682 3680754 1815513 -3019215
5842 -3019215 -7632752 -8171149 -4874640 -2217814 -3118007 -5332490 -5384417 -3622721 -2720072
5833 -2720072 -3055583 -2773037 -1346503 -42073 510938 439986 -939097 -3815364 -5573615
5824 -5573615 -3156722 2178883 5660820 4974254 2427053 616987 -835761 -3051669
5816 -3051669 -5362920 -6800487 -7883240 -9159394 -9689049 -8562467 -6528492 -4828353
5808 -4828353 -3734907 -3264331 -3812655 -4995996 -5406139 -4675126 -4258401 -4997181 -5526158
5799 -5526158 -4484607 -2751833 -1911675 -1888671 -1775479 -1720615 -2156376 -2221289 -926791 816987
5789 816987 1224179 214896 -731309 -920035 -1013688 -1555145 -2477844 -3847185 -5542488
5780 -5542488 -6388625 -5262456 -3118295 -2250620 -3171739 -3748701 -2122599 784138 2635549
5771 2635549 2747114 2741728 4370365 7395678 9699059 9215302 5876047 1897382 9884
5762 9884 1028736 3063364 3351125 994632 -2369448 -4772112 -6168877 -7682538 -9085935
5753 -9085935 -8729655 -6394898 -4287147 -3799993 -3042721 98811 3616307 3126480 -2210062
5744 -2210062 -8609745 -12997999 -16183576 -19337979 -20524822 -17509089 -12096100 -8595421
5736 -8595421 -8580913 -9594856 -8865283 -6358670 -4096361 -3908350 -5924643 -8300769 -8692381
5727 -8692381 -6801223 -4784451 -4246251 -3970576 -2166682 102055 -64231 -3229662 -6516761
5718 -6516761 -6887500 -3973402 424721 4033840 5119289 3498114 1133641 410751 1274282
5709 1274282 1256409 -1168059 -4538501 -6488257 -6752478 -7024359 -8464705 -10466886 -11749372
5700 -11749372 -11797981 -11004377 -9851415 -8354761 -6341025 -4048082 -2089794 -699814 632367
5691 632367 2390928 4055797 4340180 2566858 -339937 -2443923 -2571746 -1504106 -1105455
5682 -1105455 -2251177 -4232492 -6372086 -9036502 -12127705 -13833958 -12634708 -9771622
5674 -9771622 -7697254 -6669215 -5349176 -4347949 -5857016 -9222481 -10408060 -7400499
5666 -7400499 -3028988 -504461 724015 2185342 2626017 599369 -1538562 -388393
5658 -388393 2958499 4151212 1842460 -926661 -1437383 36554 2359983 5057033 7250437
5649 7250437 7958507 7973092 8966477 10518817 10574906 8925888 7478181 6939614 6193396
5640 6193396 5204585 5329364 6154711 5333219 2504311 162971 -489122 -1233263 -2915004
5631 -2915004 -3241830 -607011 2902657 4785856 5804417 7679625 9336131 8504451 5668893
5622 5668893 3541199 3313207 3711332 3246597 1584761 -819884 -3029415 -4110364 -4267612
5613 -4267612 -4567926 -4810107 -3130760 1299845 6743156 10984982 13172367 12751624 9131466
5604 9131466 3944725 966182 1564552 2663974 1685470 897106 3542737 7854002 8985054
5595 8985054 5697790 1089413 -2629315 -5856480 -8105447 -7180727 -3169821 180893
5587 180893 -77947 -2636765 -4507538 -5043948 -5637508 -6800163 -7365461 -6234664 -3901061
5578 -3901061 -2196826 -2572711 -4372547 -5277875 -4108815 -2456228 -2490851 -3988459 -5012408
5569 -5012408 -4838562 -4373171 -4044603 -3210671 -1688473 -252421 437591 128113 -1360613
5560 -1360613 -3214520 -3110992 148465 3850195 3794962 -222616 -3825433 -3605877 -988863
5551 -988863 448146 -521247 -2348667 -3353141 -3292907 -2930237 -2978217 -3234553 -2626458 -664556
5541 -664556 1384052 1713110 124004 -2057360 -3740010 -4489766 -3887190 -2225682 -1312990
5532 -1312990 -2524153 -4411900 -4466420 -2911086 -2155144 -2622259 -2183261 -118020 1624089
5523 1624089 2069418 2806783 4338962 4041975 155039 -4679124 -6470584 -4633876 -1341705
5514 -1341705 1939336 4499111 4586120 922967 -4430087 -7568426 -7143042 -5111637 -3348745
5505 -3348745 -1913927 -830646 -1083476 -2836557 -4382583 -4076446 -2345242 -795683 43602
5496 43602 1137396 3263101 5715826 7103739 7110520 6726869 6534040 5733564 3754025
5487 3754025 1842856 1438959 1623195 468493 -1143519 145722 5100974 9852527 10702986
5478 10702986 8795656 7771336 8469516 8562287 6483956 3113692 -169665 -2852846 -4577155
5469 -4577155 -4846489 -3826054 -2363987 -1152082 -542170 -710880 -1213588 -1065895 -48706
5460 -48706 1033789 2093673 4089920 6403316 6072405 1948848 -2335610 -2705006 -565943
5451 -565943 -666930 -3750497 -5698648 -4472060 -3386822 -5483684 -8346045 -7593417 -3268030
5442 -3268030 399920 524143 -1738517 -3531436 -3278349 -1502106 -203360 -1281453 -4449131
5433 -4449131 -7021444 -6684177 -3881982 -511103 2781988 6376944 9416105 10001528 8127665
5424 8127665 6581638 7656024 9927197 9787076 6084787 1914200 1110290 3841194 6913737
5415 6913737 8168183 8795654 10481182 11937215 10296326 5304733 -109315 -3577972
5407 -3577972 -5471986 -6783275 -7101826 -6118393 -5301968 -6007734 -6883508 -5246073 -771043
5398 -771043 3883125 6079113 5423045 3088988 423897 -1557518 -2556728 -3233692 -4210433
5389 -4210433 -4912426 -4530433 -3922562 -4864532 -7144183 -8269247 -6867528 -4621815 -3677614
5380 -3677614 -3881388 -4231760 -5336155 -7884304 -9742984 -7786456 -2803047 459384 -742208
5371 -742208 -3625367 -3909651 -1324372 896008 516327 -1918610 -4872194 -7132419 -7721999
5362 -7721999 -6515561 -4926465 -4414050 -4497168 -3704556 -1977320 -323204 1319024 3519884
5353 3519884 4990495 3638261 337600 -1329376 -86945 1088706 -614220 -4256390
5345 -4256390 -7701430 -10843203 -13750281 -14215782 -10560554 -5199016 -1960539 -1079271 -370351
5336 -370351 -209023 -2847400 -6792565 -6763754 -1047185 4975268 5243060 229273 -4936773
5327 -4936773 -7360901 -8241700 -9029202 -9106192 -7689383 -5700297 -4663336 -4761823 -4762242 -3545103
5317 -3545103 -1385167 291802 491734 -188475 -432024 33105 457722 717956 1487500
5308 1487500 2313469 1095216 -3271393 -8679644 -11623084 -10859698 -8216974 -6014933 -4713798
5299 -4713798 -3187210 -604058 2310120 3902696 3585766 2844510 3424561 4607494 3638007
5290 3638007 -533813 -5150986 -6347254 -3198955 1899867 6239436 9011069 10817371
5282 10817371 12032086 11891279 9093198 3696938 -1687956 -3908878 -3025439 -2564549 -4887994
5273 -4887994 -7794180 -7461982 -3487916 1312587 5211673 8746623 11703449 12198484 9878072
5264 9878072 7268566 6199772 5193930 2657669 729834 2837507 8152122 11675845
5256 11675845 10318257 6312445 3569485 2775300 1743562 -731115 -3348830 -4361316
5248 -4361316 -3675019 -2590924 -2222243 -2553899 -2870222 -2924455 -3423307 -4999404 -6944675
5239 -6944675 -7682763 -6420272 -3472851 829712 6043625 10194335 10492246 6686572 2072066
5230 2072066 -334663 -1015618 -1573431 -1152676 1680557 4809813 4388101 885301 -715647
5221 -715647 2105266 5986244 7146973 6789744 8189325 11084354 12420921 11122945 8861587
5212 8861587 6968072 5459761 4506433 4273455 3869751 2787762 2509244 4061083 4994481
5203 4994481 2096815 -3402959 -6971711 -7235362 -7592948 -10581231 -14226101 -15540461 -14591065
5194 -14591065 -13195578 -12084462 -11348146 -11657504 -13068000 -14179081 -14073364 -13553705 -13131952
5185 -13131952 -11622037 -8247434 -4296410 -1048704 2012293 5070825 6152207 3913947
5177 3913947 629384 -386818 762536 1390849 661247 273641 1028196 1547528 759833
5168 759833 -621411 -1507799 -1437669 23036 2876586 5314375 4760354 1100936 -2653175
5159 -2653175 -3650950 -1881332 817881 2784620 2795546 24841 -4701040 -8474701 -8697396
5150 -8697396 -5828512 -2818052 -1837334 -2303472 -2192696 -622820 1303834 1988040 1121210
5141 1121210 -294234 -1348879 -1944612 -2072338 -1325202 183595 1106935 169437 -1932262
5132 -1932262 -2963544 -1748587 444059 1497057 731968 -1025296 -3072764 -5338257
5124 -5338257 -7131518 -6752538 -3544709 311087 1659397 92646 -1765646 -2021496 -1571223
5115 -1571223 -1382752 13388 4008856 8416130 9450052 6746287 3632542 2441621
5107 2441621 2268924 1670845 844764 350922 54732 169462 1167891 2024213 956959
5098 956959 -1357102 -1956399 51014 2041247 1930297 777216 -48348 -1147037 -2684653
5089 -2684653 -2917582 -1441233 -747906 -1866054 -1774827 1416438 3954433 1539967 -3499768
5080 -3499768 -5090461 -1977620 1571533 2798108 3073854 3510164 3006305 1730943 2183886
5071 2183886 5060570 7393494 6559694 3646036 1464172 1279691 2490870 3747354 3794636
5062 3794636 2805963 2815482 4972525 6958610 5719837 2256166 511881 1546335 2226217
5053 2226217 241851 -2841824 -4457157 -4113706 -2713720 -1313725 -1182777 -2630828 -3572901
5044 -3572901 -2064555 -188045 -1808624 -6163033 -7919896 -4799399 -847415 -148793
5036 -148793 -1330051 -1047100 541124 1087928 297022 -493499 -1321785 -3251768 -5967000
5027 -5967000 -7905295 -8100727 -6633998 -4389175 -3190972 -4477129 -7008148 -7894790 -6597442
5018 -6597442 -5404302 -5191919 -3941309 -881485 1401657 1218863 831660 2408604 3816058
5009 3816058 1797953 -2757954 -6033457 -6220805 -4343672 -1654625 816026 1324278 -984392
5000 -984392 -4108954 -5157230 -3780357 -1999844 -1552845 -2857018 -5258125 -6768693 -5080917
4991 -5080917 -421016 4111679 6257161 6626171 6004405 3707332 482956 -463375 1641943
4982 1641943 2372019 -2041376 -8626674 -11569590 -10220593 -8814829 -9470456 -9995246 -8415132
4973 -8415132 -5732515 -3782851 -3261229 -4065147 -5305827 -5242211 -3255472 -1256259 -1255485
4964 -1255485 -2656673 -3841187 -4691404 -5180925 -3562448 891076 5129933 5795170 3984293
4955 3984293 2995632 2725732 334415 -4345847 -8185455 -9451897 -9564346 -9994008 -10380287
4946 -10380287 -9854565 -7886752 -4170158 270826 2850074 2475715 1410114 1759687 2080812
4937 2080812 326581 -2029260 -2287039 -983250 -462476 -930642 -1564076 -3288074 -6383035
4928 -6383035 -7716289 -4974404 -1420371 -1523797 -4070254 -4903259 -4276098 -5553383 -8472408
4919 -8472408 -9983652 -10349732 -12065287 -14028655 -13267970 -11143572 -11129207 -11968778 -10411824
4910 -10411824 -9143747 -13408463 -20436093 -21427779 -14620575 -7588725 -5669321 -6807270
4902 -6807270 -8815888 -12494635 -15854174 -14439529 -9608527 -7804539 -9849438 -10069030
4894 -10069030 -7528776 -7961852 -12506286 -15329538 -14998602 -16905319 -21527263 -22366859 -18853277
4885 -18853277 -18364968 -21931770 -22309355 -20089681 -24923182 -35617929 -38699928 -34143658
4877 -34143658 -39486817 -57640283 -69037639 -74714965 -114009467 -203024351 -280162335
4870 -280162335 -262938063 -153926878 -42974619 1266903 -2530043 -2868883 10252189
4863 10252189 14949625 7525630 4190991 7807001 6405970 -469750 -403133 8652623
4855 8652623 15116568 13648797 10718794 10105674 8215345 4657333 3992852 5721066 4227797
4846 4227797 -222357 -1038235 3218905 6746260 6863024 7187576 9248341 9630144 7111278
4837 7111278 4851583 3903546 1736631 -1333404 -1190510 2904056 6524823 7178097 7294578
4828 7294578 8474181 8462819 5967381 3449699 2806205 2334402 64949 -3075090 -4860289
4819 -4860289 -4029775 -620844 3454759 4765653 2225584 -556683 -129686 1460375 475136
4810 475136 -1532500 -241602 3378107 4111300 1299036 -121704 2008371 4251744 4461743
4801 4461743 5083709 7497983 8996055 7966547 6755913 6734416 5693170 3050905 2547197
4792 2547197 6192881 9990913 9472717 5716685 2272405 -224145 -2567411 -3594573
4784 -3594573 -2541948 -2060329 -4638607 -8129650 -8836072 -7248092 -6776282 -8195405 -9169157
4775 -9169157 -8286848 -6024128 -2531030 2054575 5623727 5780559 3380971 1486481 986311
4766 986311 186658 -1293020 -1398889 840092 3402320 4172668 3773616 4062052 5122680
4757 5122680 5275646 3586616 1182462 -100535 187753 817303 679638 280883 778162
4748 778162 1978813 2496120 1821522 769825 -389047 -2456963 -5103337 -5900689 -3177509
4739 -3177509 1255967 3960252 3883752 2892442 2456601 1475345 -1858961 -6833667 -9968679
4730 -9968679 -8546642 -4051520 -958265 -1594310 -3511179 -3186711 -855301 620792 510455
4721 510455 473180 286844 -2655319 -8417339 -12927114 -13464037 -12353963 -12418732 -11929692
4712 -11929692 -7896494 -2040160 1011625 436484 -171121 1490692 4324676 7556366
4704 7556366 12074849 16788965 17766740 13403015 7467789 4480806 4405227 4535334 4493361
4695 4493361 5932064 8244746 8111317 3822205 -2372049 -6943701 -8345584 -7050072
4687 -7050072 -4204232 -1344725 -43726 -377778 -403543 1628942 4943423 7209136 7510183
4678 7510183 7044448 6817276 6072862 3763835 570492 -1662153 -2124742 -1702531 -1509540
4669 -1509540 -1601362 -1305203 -231444 1252215 2163905 1426949 -1365785 -5527917 -9709370
4660 -9709370 -12580819 -13003187 -10282795 -5236953 -724785 199018 -2769529 -6705079 -8309300
4651 -8309300 -6792335 -3756909 -940801 1408070 4293391 8546394 13505127 17065245
4643 17065245 17429474 14902476 11569887 9203283 7987332 7254933 6636086 6078193 5288965
4634 5288965 3680865 784343 -3303885 -7614151 -10570559 -11043105 -9153222 -5830788
4626 -5830788 -2050036 986113 1753727 -155416 -2829911 -3747779 -2703850 -1637400 -1561765
4617 -1561765 -1416034 -343840 795785 1181705 1740139 3848900 7399363 11164282 14007391
4608 14007391 14747497 12158845 6668044 1256416 -886233 626680 3591595 5807339
4600 5807339 6531953 6184571 5823293 6349529 7167904 6321060 3035983 -758003 -2822230
4591 -2822230 -3594767 -5005132 -7013752 -7562333 -5921593 -3878007 -3052524 -2944621 -2545159
4582 -2545159 -2320882 -3328834 -5311237 -6925742 -7479016 -7495940 -7709247 -8166684 -8385075
4573 -8385075 -7974948 -6930677 -5400290 -3425135 -1250372 185344 -200793 -2181717 -3986323
4564 -3986323 -4216872 -3452965 -3076202 -2990779 -1741872 1132010 4085070 5339948 4856560
4555 4856560 3968848 3531297 3042909 1639710 -406402 -1654911 -1248118 -248755 -384832
4546 -384832 -1632785 -2300791 -1743583 -1446637 -2607696 -4197675 -4747315 -4657371 -4990188
4537 -4990188 -5172179 -4091946 -2645617 -2605132 -3215029 -1695001 2395653 5892572 6201898
4528 6201898 4631479 4238879 6084786 9069406 12030477 14271513 14842006 12939474 8937035
4519 8937035 4260845 584920 -602710 1258621 4697553 6793506 5778110 2409727
4511 2409727 -1653936 -5577082 -8710806 -9901734 -8994026 -7857919 -8210215 -9246643 -9068472
4502 -9068472 -7539479 -5794443 -3764869 -647718 2525555 3545605 2583860 2410790 4212424
4493 4212424 5849675 5784049 6172161 9480338 13596291 13396864 7099229 -1266410 -6149154
4484 -6149154 -5746180 -2826626 -1691106 -4466415 -9113249 -10942920 -7330964 -976766
4476 -976766 2828801 2074667 -527151 -1898969 -1924267 -1565490 -273866 2655521 5849451
4467 5849451 7296778 7033047 6303340 4968902 2090290 -1447584 -3347273 -2881171 -1304300
4458 -1304300 607576 3105710 5502323 6257174 5603192 5649710 7083775 8150146 7821402
4449 7821402 7400800 7607831 6659057 3243518 -706332 -2422584 -1861270 -891691 -596217
4440 -596217 -1380517 -3955958 -7840681 -10534571 -10692962 -10442343 -11805782 -12786179 -10633350
4431 -10633350 -7406754 -7768313 -11798473 -14701254 -13959211 -12126876 -11483020 -10544858 -7891937
4422 -7891937 -5340639 -4699707 -4808330 -4562285 -5638741 -8920318 -11026402 -8341957 -2681591
4413 -2681591 946613 1034833 251198 237469 -215926 -1658989 -2410159 -1478388 -99974
4404 -99974 764747 1926693 3722756 4614970 3653706 2485330 3050151 4540460 4497367
4395 4497367 2182310 -835715 -2995389 -3967803 -3664533 -1770760 1067860 2820367 1889841
4386 1889841 -1159602 -4519703 -7270158 -9472431 -10461141 -8851815 -5058858 -2275761
4378 -2275761 -3282889 -6979896 -9819734 -10342325 -10328919 -11331018 -12227756 -11198622 -8407858
4369 -8407858 -5401551 -3061121 -1521079 -1158603 -2132493 -3338164 -3036414 -430454 3918044
4360 3918044 8604648 11672748 11372959 7844308 3549771 1043254 724528 1512194 2831074
4351 2831074 4685348 6406762 6838606 5763366 4213972 3479255 4365966 6819989 9453556
4342 9453556 10190865 8426769 5829902 3935315 1960784 -1357848 -4624339 -4721996 -895998
4333 -895998 4075622 7189526 8121605 8433296 9380030 11110599 12823986 13103227 11073534
4324 11073534 7717341 5143033 4210833 3894545 3333128 3222128 4329263 5711584 5739987
4315 5739987 4552294 4223763 6151384 9071068 10445843 9634167 8700902 9527317 11005659
4306 11005659 10469258 7594196 5067258 4959364 6273240 7027766 6929276 6461626 5009750
4297 5009750 2014384 -1127202 -2590183 -2867953 -3785072 -5299473 -5623959 -4296364 -2767393
4288 -2767393 -1879234 -1038748 -145977 -138495 -1172844 -2286529 -3327148 -5252292 -8002020
4279 -8002020 -9948649 -9965711 -8334405 -5463852 -1800809 887656 728388 -1267673 -2109923
4270 -2109923 -1359967 -1733665 -4142830 -5550699 -3702312 -808806 73760 -391460 177885
4261 177885 1686945 2647380 3499571 5281813 6495582 5151564 2968487 3444552 6039597
4252 6039597 6466064 3283586 152246 181086 1711442 1911052 1626107 3739441 8283355
4243 8283355 11940666 11938072 8505575 3740103 -331937 -2471548 -2321273 -433853 2057811
4234 2057811 4038596 4905612 4880651 4827039 5282873 5689756 5119708 3671719 2407877
4225 2407877 1920434 1845742 1963331 2855769 5044070 8133426 11227563 13689868 15240853
4216 15240853 15891141 16131579 16697356 17734191 18464261 17928921 15912423 13155596 10948846
4207 10948846 10379525 11444602 12813659 12876055 11156949 8538824 6280225 5150391 5216758
4198 5216758 5820697 5772668 4204640 1549898 -501036 -218370 2764608 6909698 9677836
4189 9677836 9541352 7301108 5026749 3805409 3228443 2807343 2550714 2063364 750653
4180 750653 -581681 -150941 1938320 3214955 2437546 1541009 2289960 3290034 2836315
4171 2836315 2591292 4957862 8148808 7899593 3894304 713038 1816739 5735047 8872561
4162 8872561 9204596 6560152 2180062 -1071446 -667016 2532841 5440138 7103032 9000731
4153 9000731 10956019 10644147 8020261 6208072 6656954 7479013 7986900 10113770 13308099
4144 13308099 13550707 10720018 11061602 17544917 23582171 22676138 18382368 15557682 6491733
4135 6491733 -21129154 -61805905 -90627386 -89792187 -68008887 -47364299 -38305987 -35192643
4127 -35192643 -30825650 -25381916 -21778241 -20218933 -19331576 -18328371 -16695462 -14461651
4119 -14461651 -13026615 -13404304 -14126630 -13266636 -11541404 -10543146 -8988171 -4352037 2134558
4110 2134558 5906409 4985213 2259446 1097044 1570205 2040215 1982693 2022368 2962294
4101 2962294 5488647 9118308 11219082 9316170 4801432 1905266 2254950 2922742 835852
4092 835852 -3399055 -7343833 -9897387 -10947702 -10144818 -8035753 -6532804 -6182964 -4683332
4083 -4683332 -307916 4787440 7172881 6764697 6106095 5932800 4523223 1407199 -1225755
4074 -1225755 -1730682 -1576381 -3494187 -8014463 -12609981 -14012810 -11474071 -7938545 -7123890
4065 -7123890 -8933337 -9350452 -6122155 -2503843 -2911793 -6580501 -9009098 -8739160 -8413078
4056 -8413078 -8835458 -6645728 32082 7293914 9772273 6968733 2612451 -417115
4048 -417115 -1760932 -1634045 -252489 1234031 1616291 1286618 1361384 1712533 1563559
4039 1563559 1323145 1959929 3188934 4115403 4866603 5468880 4038302 -1085072 -7752780
4030 -7752780 -11649648 -11843658 -11677889 -13324767 -14554478 -12637860 -8894106 -6928818 -7811979
4021 -7811979 -9273894 -8955008 -6634929 -3668193 -1655871 -1397870 -2081255 -1804703 309388
4012 309388 2981501 4352676 4001956 2819302 1821424 1814970 3134639 4791889 5030334
4003 5030334 3768407 3160341 4386778 5403394 3857075 925090 -347107 246879 57915
3994 57915 -1736741 -2602828 -731381 2142807 3574669 3791810 4301293 4912274 4472653
3985 4472653 3497975 3733074 5552699 7802371 9820207 11449184 11213948 7135389 174134
3976 174134 -5526501 -7427822 -7812243 -10180308 -13804732 -14611417 -11145028 -6699845 -4665372
3967 -4665372 -4363855 -3322678 -1687735 -1728562 -3842757 -5893990 -6657443 -7322111 -8713069
3958 -8713069 -9262499 -7170087 -2942223 1675756 5783696 8676030 8692663 5221618 1048439
3949 1048439 -57376 1854591 3051349 1487946 -488420 160044 3096191 5921212
3941 5921212 7695246 8969250 9418969 7816748 4170854 8160 -3592150 -6701827
3933 -6701827 -9063730 -9388672 -6820727 -2309835 1898980 3609897 1585663 -3788624
3925 -3788624 -10252822 -14806501 -15711576 -13295857 -9068343 -4833899 -2464153 -3049562 -5496268
3916 -5496268 -6927327 -5489619 -2353112 -249230 -508382 -2220191 -3737630 -4050452 -3044438
3907 -3044438 -1507030 -834199 -1756370 -3315743 -4055815 -4235756 -5592179 -8458968 -10481220
3898 -10481220 -9336029 -5930775 -3581159 -4339882 -7380684 -10845419 -13746575 -15543514
3890 -15543514 -15249912 -12250549 -7512856 -2890864 637374 3115882 4094151 2251153
3882 2251153 -2687515 -8384690 -11448477 -10774790 -8589387 -7670478 -8038961 -7240185 -3875725
3873 -3875725 179353 1832350 477721 -1465954 -1739746 -792902 -552750 -1622096 -2832168
3864 -2832168 -3173444 -2920768 -2744915 -2824911 -3254312 -4375882 -6061278 -7382854 -7726555
3855 -7726555 -7595089 -7453885 -6403292 -3232058 1460484 5569861 8062310 9923131 12141061
3846 12141061 14125132 14894689 14524595 13285804 10624428 6646727 3630988 3859935 6260024
3837 6260024 7491858 6509633 5554512 5973002 5840475 3433179 610496 184913 1635395
3828 1635395 2376750 2152620 2797467 4030777 3208455 -56642 -2530918 -2122480 -916040
3819 -916040 -1361012 -2224494 -1220549 480443 -56365 -2411700 -3138260 -1208845 381773
3810 381773 -629322 -2467165 -2411556 -835596 11652 -198497 380308 2669089 5195984
3801 5195984 5909670 4284717 1454849 -882156 -1557108 -669857 533763 1019577 1293288
3792 1293288 2796880 5732847 8087555 7494285 3930797 -170034 -2772939 -4511420
3784 -4511420 -7331685 -11242003 -13652383 -12391300 -8451416 -4939979 -3769530 -4072723
3776 -4072723 -3581155 -1010093 2700636 5247135 5514030 5292691 7315684 11191567 12968490
3767 12968490 9973383 4471451 591883 -1014061 -2842367 -5720768 -7540728 -6992305
3759 -6992305 -5469895 -4326572 -2982806 -1131140 -337730 -1603056 -3241993 -3084674 -1227974
3750 -1227974 1196827 4388964 8791871 12756297 13639779 10909004 6516080 2668338
3742 2668338 566495 495612 1563425 2116453 1963645 3208403 7079864 11048973 11448932
3733 11448932 8259288 4746808 2712544 815824 -2197509 -5220600 -6488239 -5573350
3725 -5573350 -3062466 37756 2164096 2228388 1193215 1014298 1964293 2903044 4003057
3716 4003057 6521753 9542782 9988325 6914429 2893107 -224117 -3836298 -8886311
3708 -8886311 -12662725 -12267375 -9066970 -6505496 -5157406 -3313216 -1210884 -884796 -2114260
3699 -2114260 -2135990 139773 2662789 3686285 3974552 4688496 5520170 6021141 6622683
3690 6622683 7148341 6279912 3795236 1538441 788281 414740 -712394 -1170694 929099
3681 929099 4329958 5550015 3283440 -154510 -2063762 -2362333 -2744975 -4101127 -5662695
3672 -5662695 -6181046 -5320891 -3981388 -3319425 -3324810 -2737995 -945909 500694 -582898
3663 -582898 -3922404 -6521181 -6110816 -3779672 -2180784 -2025964 -1857235 -934221 -491540
3654 -491540 -1577493 -3224080 -3954277 -4071205 -5028082 -7149445 -9500746 -11609676 -13489116
3645 -13489116 -13985067 -11342922 -6258446 -2272883 -1555391 -1969475 -425455 2128104 1852346
3636 1852346 -2126611 -5964197 -6092945 -3594415 -2006156 -2409270 -2666389 -867682 2206896
3627 2206896 4058113 2804613 -1374332 -6172880 -8554621 -7169559 -3722062 -1484176
3619 -1484176 -2298400 -5274991 -8193948 -9605695 -9628475 -9369042 -9796111 -10727699 -10660587
3610 -10660587 -7958711 -2620232 3177051 6583846 6342853 3636349 734699 -1075728
3602 -1075728 -2044272 -2555929 -1863965 1045429 5453244 8671736 8327088 4581615 -120425
3593 -120425 -3098316 -3099012 -768610 1765263 2271860 384556 -1801710 -1868788 130288
3584 130288 1792518 1426252 22867 -442952 135815 -54954 -2210943 -5461109 -8134078
3575 -8134078 -9401257 -9174195 -7502242 -5201063 -4303748 -6191643 -9223244 -9860183 -6804078
3566 -6804078 -2661419 -580185 -534802 -353227 627652 933731 -301321 -1944204 -2558755
3557 -2558755 -1888509 -182051 2408883 5040140 6206756 5518480 4303136 3598186 2863386
3548 2863386 1767238 1694680 3621824 5590008 4653901 1054021 -1838148 -1954137 -703721
3539 -703721 -31116 529226 2333605 4660346 5232712 3275822 507316 -930479 -472715
3530 -472715 904019 1775574 1291523 -27062 -387573 1563559 4889862 6935279 6055152
3521 6055152 3180743 431521 -1031358 -1261605 -495307 1097622 2941676 4321960 5105100
3512 5105100 5435885 4888356 2960874 443826 -978711 -946740 -1033578 -2403220 -4028552
3503 -4028552 -4330952 -3625807 -3619954 -5184324 -7914855 -11085949 -13447433 -12956157 -8968634
3494 -8968634 -4342544 -2836664 -4283724 -4948158 -3098323 -1251877 -1818009 -3665323 -4924083
3485 -4924083 -6140163 -7861208 -7793722 -4092276 331337 961434 -1750645 -3231435 -1970734
3476 -1970734 -1322603 -3340815 -5317038 -4505353 -2589859 -2705020 -4723643 -6342862 -6794755
3467 -6794755 -6644228 -5470584 -2628590 625923 2300291 2250782 1442088 -385947 -3725294
3458 -3725294 -6683701 -6427930 -3526790 -2147368 -4904195 -9397749 -11029504 -8105021
3450 -8105021 -3198526 -80626 87229 -399718 1138374 3907261 4102231 33103 -4846298
3441 -4846298 -5862421 -2752619 1022617 3437645 5084424 5633042 3202688 -1561471
3433 -1561471 -4430290 -2843459 468602 1502603 249655 -887908 -1918901 -4780973
3425 -4780973 -8753270 -10124643 -7180872 -2782480 -817439 -1966841 -4059979 -5140319
3417 -5140319 -5049855 -4972404 -6347461 -9536370 -12903478 -13901676 -11677430 -8058192 -5548608
3408 -5548608 -4956814 -5340517 -5522336 -5074865 -4370394 -4205521 -4968946 -5830979 -5268629 -2724437
3398 -2724437 814137 4121288 6790164 8582027 8798389 7250662 5083757 3525577
3390 3525577 2330061 546052 -1665648 -3230378 -3767225 -3583084 -2437885 -206203 1188327
3381 1188327 -1156078 -7079309 -12356760 -13277223 -10683981 -7757567 -5387127 -2282386
3373 -2282386 1314185 3269218 3201209 3530028 5715181 7771010 7091900 3971008 618382
3364 618382 -1874706 -3747563 -4893077 -5028788 -4930999 -5541721 -6094676 -4895580 -1911779
3355 -1911779 1017771 2586425 3110570 3105583 2302317 486448 -1859418 -4043328 -5313600
3346 -5313600 -4637009 -1730052 1648884 3084371 2557533 2485169 4125960 5663560 4917502
3337 4917502 2486366 739167 556728 510114 -994909 -3729429 -5786293 -5425441 -3068329
3328 -3068329 -1323831 -2217457 -4592630 -5542066 -4254811 -2569855 -1543885 19326 2540238
3319 2540238 3716521 1667335 -1831868 -3616556 -3340640 -3050788 -3548617 -3660928 -2605755
3310 -2605755 -790653 1409123 3569234 4328582 2801083 576593 25928 801118 440973
3301 440973 -1539309 -2709877 -1210765 2208641 5981045 9066485 10081560 7902132
3293 7902132 4092799 2008197 2196924 1422396 -2057317 -4986846 -3381291 1761389 5817392
3284 5817392 6352547 4976951 4185807 4755564 5951644 6435830 5262814 3365776 3270431
3275 3270431 5842129 8467644 8461782 7148895 7942611 10970433 12553205 10261474 5831139
3266 5831139 2350484 873138 849568 1889131 3592564 4890657 4967642 4244477 3556133
3257 3556133 2905410 1775414 275288 -688884 -393639 702413 1063204 -318214 -2253821
3248 -2253821 -2291320 -14822 1789762 618713 -2191254 -3264616 -1735126 284674 1317454
3239 1317454 1941970 2485787 2101566 943932 737083 2046998 3284343 3634973 4542912
3230 4542912 6630744 7671298 6110216 4570932 6665809 11360490 13804522 11660750
3222 11660750 7595835 4922649 3510760 1405126 -1518040 -3512620 -3772977 -3451451
3214 -3451451 -3669552 -3750918 -2307312 292189 1642648 43309 -3306815 -5980092 -7665679
3205 -7665679 -10117381 -13625319 -15550652 -13403618 -7824474 -1318508 4466493 8726841
3197 8726841 10298295 8635773 5277583 2402110 415055 -1373417 -2505098 -1976907
3189 -1976907 -535464 131872 478505 2823374 7442335 11223966 11230659 7914292 3960846
3180 3960846 1515266 1325115 2948469 4639342 4266264 1501136 -1658629 -3175324 -2913670
3171 -2913670 -1996049 -1468282 -2037474 -3743634 -5291132 -5044948 -3245329 -1820307 -1556908
3162 -1556908 -1221349 -108751 601816 46200 -902962 -1706088 -3383631 -5951724 -6986074
3153 -6986074 -5166753 -3243875 -4529833 -7875665 -9252713 -7351917 -4433710 -2260145
3145 -2260145 -506581 951567 1435272 1362525 1759823 1707474 -558852 -3730212 -4234673
3136 -4234673 -1810856 -439562 -2138831 -3696446 -2065602 552024 435235 -1618024
3128 -1618024 -1962034 -2586 1718499 2353071 3440946 4845582 4056602 494621 -2837788
3119 -2837788 -3496833 -2862600 -3660669 -6079356 -7902430 -7296825 -4373061 -969278 489611
3110 489611 -901955 -3083310 -3010690 -424668 1968321 2309829 1333349 -344287 -3769304
3101 -3769304 -8676614 -11672871 -10269282 -6891694 -5621570 -6152914 -4640422 -140999
3093 -140999 3716115 4130830 2525775 1083589 -765517 -4073610 -7214628 -7894493 -6735535
3084 -6735535 -6130558 -6683248 -7473859 -8850731 -11785889 -14725735 -14381506 -10309749 -5903018
3075 -5903018 -3833927 -3079313 -1779871 -556367 -987687 -2689335 -4199167 -5515421 -7488847
3066 -7488847 -9526656 -10136551 -9323914 -8404969 -7714380 -6514482 -5073962 -4739587 -5671425
3057 -5671425 -6427989 -6253527 -5932568 -5693046 -4067947 -36323 4890791 7867833 7361115
3048 7361115 4051936 -24708 -2734467 -3211360 -2582821 -2607351 -3469158 -4113933 -4802271
3039 -4802271 -7343321 -11926088 -15638583 -15638249 -12394851 -8301909 -4469633 -746094 2212338
3030 2212338 3170392 2332339 1344079 1327238 2142832 3202804 3772931 3083461 1517739
3021 1517739 957358 2386607 4025179 3744798 2394044 2201571 2536764 497413 -3966778
3012 -3966778 -6799721 -5063293 -904417 1280964 -321993 -4401870 -8797036 -11414861
3004 -11414861 -10420551 -5715280 317962 4926121 7235190 7575371 5944245 2574940
2996 2574940 -1170655 -4162483 -6832305 -9498687 -10378232 -7451645 -1978843 1956063
2988 1956063 1747897 -1250400 -3688071 -3466903 -986764 1689536 2662586 1864662 838684
2979 838684 481508 -167692 -2042426 -4091247 -4750722 -4468006 -4745104 -5152832 -3586933
2970 -3586933 339679 4219476 5627302 4286120 1222150 -2263962 -4276670 -3132256
2962 -3132256 420340 3525668 4849131 6092000 8555735 10116545 7785313 2125677
2954 2125677 -3167096 -5573223 -5546656 -4317969 -2229481 236523 1754845 1693769 1294995
2945 1294995 2172384 4063518 4915768 3151488 -548921 -3684912 -4080729 -1850248 667149
2936 667149 1183380 -205884 -1130215 596176 4771063 8920703 10300669 7882175 2842674
2927 2842674 -2624593 -7017779 -10098645 -11982095 -12299872 -10753873 -8063705 -5540324
2919 -5540324 -3730863 -2217738 -855525 -358016 -1189006 -2516824 -2964135 -2115933 -719661
2910 -719661 399671 1083193 1694988 2837339 5049457 8032947 10164635 9683339 6758733
2901 6758733 3674763 2441295 2790030 3033800 2211909 603020 -1232324 -2746432 -3023776
2892 -3023776 -1388917 1449543 3877699 5151587 5720417 5719713 4430818 1663174 -1552993
2883 -1552993 -4252429 -6360690 -7646519 -7275654 -5442208 -4101341 -4675936 -6092707 -6539404
2874 -6539404 -6055513 -5617211 -4796712 -2794586 -1209109 -2837463 -7307312 -10613595 -10147074
2865 -10147074 -7995082 -7717017 -9521248 -10470400 -8520045 -4615841 -1069413 851772
2857 851772 1581117 2112822 2413567 1285353 -1640041 -4352404 -4365250 -2033442 -148032
2848 -148032 9801 48715 1194941 2094806 1384525 140259 -415484 -1672368 -5276395
2839 -5276395 -9344700 -10232945 -7634841 -4915434 -4360620 -4972918 -5286997 -5357174 -4993517
2830 -4993517 -2895762 733034 2932609 1445321 -1969752 -3616680 -2308074 -24795
2822 -24795 1079641 588564 -851162 -2487710 -3698278 -4303081 -4592812 -4450397 -3125357
2813 -3125357 -837300 281532 -1564975 -5074457 -7078563 -6529003 -5544595 -6212279 -8106591
2804 -8106591 -9722033 -10764189 -11791086 -12657120 -12631482 -11499335 -9599171 -7411042 -5948051
2795 -5948051 -6558230 -9007041 -10657472 -9378095 -6780375 -6484367 -9216773 -11907932 -12120782
2786 -12120782 -10947194 -10300941 -9607548 -7223981 -3636013 -968474 -77417 -63187 -25745
2777 -25745 512673 2157863 4523055 5253075 2636218 -1174843 -2278323 -399395 728502
2768 728502 -1199098 -4292652 -6114863 -6914018 -7443681 -6464878 -2983019 1110458 3279050
2759 3279050 3695545 3927830 3818404 2440670 959346 1445115 3319377 3830360 1990806
2750 1990806 -450268 -1930572 -2583327 -2746803 -2248814 -1410293 -759298 274981 2304682
2741 2304682 3799150 2550378 -401203 -1005113 2780965 8460314 12268848 12742263 10218975
2732 10218975 5338652 -428039 -4755755 -6660021 -7321977 -7537632 -6039543 -1839039
2724 -1839039 3274122 6271860 5972358 3394015 219032 -1840447 -1399718 1306454 4227262
2715 4227262 5736823 6284046 6945547 7502652 7119994 5943868 4892050 4651189 5616724
2706 5616724 7726038 9733050 10127116 9442462 9773487 11180665 11085386 8712210 7225341
2697 7225341 8866708 10620292 8325536 3274088 515195 1431232 2404701 1067974 -444687
2688 -444687 205850 1722205 1794097 925942 1234580 3022227 4657744 4897022 3603261
2679 3603261 847140 -3129867 -7206132 -9700325 -9573890 -7099604 -3652882 -983891
2671 -983891 -180998 -1030286 -2496432 -3621795 -3800796 -2960987 -2106443 -2677723 -4315703
2662 -4315703 -4434701 -1631781 1658758 2194740 717862 785908 3045528 4012339 1348157
2653 1348157 -2711689 -4640141 -3793989 -1729924 318267 1438838 611428 -1619941 -2752219
2644 -2752219 -1677338 -763871 -2280838 -4371826 -3512463 56028 2592933 2312463 1364804
2635 1364804 1856093 2855701 2651934 1629408 1130045 1039748 422354 -324079 186261 1988874
2625 1988874 3268582 2503619 175507 -1991457 -2801081 -2215236 -838583 509853 907952
2616 907952 -155725 -1993780 -2903264 -1676367 1180730 4064682 5869459 6513106 6172550
2607 6172550 4816564 2649957 352272 -1507201 -2984346 -4472502 -6058843 -7162170
2599 -7162170 -6734980 -4269234 -1019361 420980 -1247100 -4099396 -4762522 -2054734 2080496
2590 2080496 5036019 5738094 4603981 2854010 1975328 2286223 1785086 -1866150 -7798708
2581 -7798708 -12216206 -12800418 -10801911 -7989319 -4182464 379295 2793561 696821
2573 696821 -3574380 -5100451 -2238700 2219929 5350755 6720268 6647673 4904171 2250154
2564 2250154 882522 1804550 3351132 3747449 3783940 5313904 7935708 8970631 6827679
2555 6827679 3176764 1235713 2359778 4867732 6329722 6492169 7061560 8528571 8599835
2546 8599835 4998066 -1002854 -5478784 -6160189 -4425762 -3013594 -3209041 -4516079 -5654445
2537 -5654445 -5407085 -3758114 -2650209 -4241501 -7788341 -9749086 -8001691 -4569143
2529 -4569143 -2710445 -2429402 -873079 3123835 6993015 7635962 5253471 2769479 2024214
2520 2024214 1855993 259437 -2535536 -4168114 -3172342 -770730 897187 1409405 1862859
2511 1862859 2627257 2840941 2316117 2436293 4220205 6343474 6182801 2678140 -2441351
2502 -2441351 -6110566 -6206500 -2796128 2073972 5719630 6579625 5216985 3663564 3502865
2493 3502865 4311798 4082144 1586429 -1704604 -2827034 -902520 1216512 -209383 -5624322
2484 -5624322 -11659232 -14530215 -13129858 -9148162 -5416738 -4184880 -5716904 -8024537
2476 -8024537 -8735121 -7535280 -6118903 -5773789 -6118771 -6386260 -6614847 -6960411 -6988607
2467 -6988607 -6476070 -5987174 -5836753 -5380028 -4266502 -3501969 -4001802 -4710130 -3720110
2458 -3720110 -1247077 40984 -1643359 -4529724 -5041155 -1991508 2055439 4020925
2450 4020925 3877388 3734756 3935927 2316377 -1764208 -4924009 -3714016 95881 1214023
2441 1214023 -2150486 -5887798 -5510779 -1512053 2288809 3651434 3277792 2754947 3095144
2432 3095144 4467068 5825787 5537200 3526327 1757545 1418476 1046111 -979587 -3588555
2423 -3588555 -4764746 -4883947 -5818413 -7499082 -8016976 -6878744 -5667474 -5435705 -5674473
2414 -5674473 -5881562 -5962294 -5158889 -2987807 -1197009 -2032719 -4349073 -4610880 -2567400
2405 -2567400 -2527467 -7275652 -13759386 -17131458 -16540455 -14335569 -11861907 -9247199 -7670374
2396 -7670374 -8195666 -9018403 -7258727 -3407490 -902823 -1096316 -1710161 -957557 -155385
2387 -155385 -800945 -1563942 -229231 2874162 5255922 5226852 3127788 389876 -1462635
2378 -1462635 -1596240 -673583 -188414 -304537 431301 2210789 2414887 -1078976 -6116442
2369 -6116442 -8278544 -6425927 -3845206 -3677673 -5628067 -7915424 -10014408 -11906585
2361 -11906585 -12555577 -11194730 -8966964 -7302964 -5515154 -2028025 2606412 6107483
2353 6107483 7592652 7973091 7171176 3616716 -2544439 -8117861 -10296610 -9677001 -8312732
2344 -8312732 -6567875 -4015719 -2015567 -2617536 -5265433 -7030912 -6252967 -3951546 -1621307
2335 -1621307 136283 444709 -1898343 -6130822 -9159543 -9005253 -7188478 -6196490 -5905630
2326 -5905630 -4427529 -1728584 -243568 -1645329 -4499123 -5778665 -4081825 -963632
2318 -963632 740136 -86319 -1577425 -1106509 1359182 3256165 3021247 2020752 1812435
2309 1812435 1207727 -1832436 -6373626 -9152127 -8963491 -7968830 -8105807 -8452683 -7247199
2300 -7247199 -4659725 -2081085 -9833 1731280 2612089 1973249 614284 233892 1207169
2291 1207169 2080795 1470635 -382945 -2080401 -2398444 -1138633 679802 1448305 441527
2282 441527 -1297589 -2123526 -1740081 -1239574 -1293669 -1393381 -1191391 -1418854 -2549107 -3314820
2272 -3314820 -1818931 1960052 5856297 8007583 8759178 9399323 9612603 7442466 2229796
2263 2229796 -3262619 -4856566 -1389486 3581445 5162120 1966285 -2944843 -5638498
2255 -5638498 -4890462 -2122301 994416 3801745 5998262 7018321 6526699 4919727 2854032
2246 2854032 566041 -1943447 -4204280 -5213463 -4322826 -2144427 -335623 -171581 -1280586
2237 -1280586 -2192434 -2393918 -3263700 -6140745 -9708429 -10542568 -6846909 -834126 3426467
2228 3426467 4104327 2797127 1977807 2242356 2284804 933978 -1249850 -2390728 -1315790
2219 -1315790 900120 1840485 350624 -2409903 -4832263 -6727831 -8398887 -8956049 -7407982
2210 -7407982 -5077697 -4863070 -7653038 -11127296 -12606361 -11449413 -8115071 -2942063
2202 -2942063 2864057 6894391 7973606 7642146 7596480 7086389 4763201 1581608 -673340
2193 -673340 -2509615 -5349369 -7927087 -7752463 -6039517 -7008251 -11219544 -13655918 -10561561
2184 -10561561 -4659666 -713095 1053026 3427842 6340536 6870903 4366966 1476346
2176 1476346 -157435 -1756053 -4291335 -6584171 -7658126 -8499276 -10113695 -11699049
2168 -11699049 -11964575 -10795037 -8713197 -6156115 -4031550 -3410454 -3847209 -3565753 -2100194
2159 -2100194 -1040320 -1237160 -1156412 664019 3207851 4481536 3859018 1527418 -2516787
2150 -2516787 -6969678 -8612199 -5972687 -2414151 -2508274 -5810904 -7329972 -4305875 519482
2141 519482 3158708 3073842 2204121 1677872 1533740 2195487 3950561 5441273 4518982
2132 4518982 784251 -3769607 -6736664 -7199264 -5733612 -3376212 -937470 1073694
2124 1073694 2321302 2650176 2247540 1642018 1364991 1624912 2262539 2720421 2094120
2115 2094120 -92957 -2838654 -4106515 -2841209 165900 3858973 8082152 12049623
2107 12049623 13088350 9122607 1974373 -3962771 -6340558 -6187830 -4766190 -1768819
2099 -1768819 2490030 5597520 5552859 3307395 1267289 439256 456810 1193201 2493070
2090 2493070 2923912 662323 -4112140 -8627878 -9555214 -5626790 1035860 5995656 6104321
2081 6104321 2723526 250279 809771 1880627 124249 -4223673 -8400879 -10878477
2073 -10878477 -11811660 -10963232 -7993463 -4525539 -3228664 -4384762 -5446188 -4548237 -2659398
2064 -2659398 -1670361 -2070225 -3323524 -5081515 -7008873 -8373142 -8601057 -7581285 -5137576
2055 -5137576 -1237630 2913133 5265447 5223162 4585966 5327798 7183312 8337395 7923739
2046 7923739 6821002 6185578 6148159 6176907 6092503 6203296 6577867 6752960 6487126 6346890
2036 6346890 6828613 7160436 6047933 3686797 1817427 1496334 2211598 3592056 6048956
2027 6048956 8746726 9244077 7086030 5632942 7585112 10393077 9544999 5356428 2533742
2018 2533742 3182830 4440158 3796985 2656016 2900425 3592044 3479584 3800269 5815826
2009 5815826 7837836 7506462 5281464 3023740 703367 -2666303 -6090506 -7617310
2001 -7617310 -7659220 -8447924 -10319755 -11034971 -8980189 -5067544 -1296221 926358 1069654
1992 1069654 -294978 -1537072 -1572647 -1222768 -1775943 -2868479 -3359261 -3491449 -4092845
1983 -4092845 -4229859 -2200734 1196434 3064805 2591362 2223866 3546515 4326613 1547684
1974 1547684 -4082139 -8720190 -9992835 -9324683 -9544001 -11383579 -13054942 -12859957 -11259472
1965 -11259472 -9737326 -8257324 -5406738 -1354639 1239024 652694 -1084474 -840786
1957 -840786 1124103 1622586 -963770 -5000425 -8253601 -9773235 -8995486 -5696579 -1738994
1948 -1738994 -463448 -2921471 -6364620 -7601173 -6305260 -4096493 -2236417 -1520693
1940 -1520693 -2544183 -4286865 -3978748 -410880 3704042 4710090 2569790 446281
1932 446281 316429 1198336 1682486 2044974 3147925 4720246 5580875 4791579 2172571
1923 2172571 -1570733 -4899206 -6354094 -5855797 -4644463 -3744453 -3047366 -2164196 -1578865
1914 -1578865 -2363075 -4804189 -7582705 -8413136 -5705121 32771 6278589 10168824 10356929
1905 10356929 7465086 3042394 -1604102 -5602464 -8116372 -8507946 -7173223 -5623500
1897 -5623500 -4950844 -4431253 -2664669 -126929 836664 -785158 -2983609 -3599825 -3588501
1888 -3588501 -5402714 -8863671 -11060999 -10387160 -8307487 -6588948 -5050051 -3102025
1880 -3102025 -1464238 -813556 -292957 926106 1723316 435081 -2484839 -4806029 -5174387
1871 -5174387 -4128844 -2810305 -1955385 -2068807 -3365464 -5132143 -5666076 -3258765 2307788
1862 2307788 8632974 11529914 8574401 2169206 -2547757 -3481282 -3437612 -5251942 -7379245
1853 -7379245 -6473786 -2585708 1039801 2479977 2618570 2416291 1528256 36889 -832792
1844 -832792 -452247 541913 1678231 2855850 2874714 128563 -4407213 -7163470 -6211042
1835 -6211042 -3509875 -1586911 -130086 2132813 4110030 3693233 1469848 288591
1827 288591 1310610 2908172 3480703 2959493 1345207 -1504260 -3797067 -2406239 2590633
1818 2590633 6334326 4694977 -326961 -3596486 -3892913 -4245670 -5649570 -4981868 -686474
1809 -686474 3492695 3403248 308327 -1549991 -1181047 -880186 -1344743 -928873 527692
1800 527692 1214350 1051941 1904781 3320730 2264808 -1370741 -3294948 -1319726 798513
1791 798513 -580751 -2961502 -2380585 -946688 -3696301 -9340119 -10787992 -5733087 -735441
1782 -735441 -2225964 -8062200 -11418529 -9790393 -6307582 -4011888 -2780783 -1696060
1774 -1696060 -1303302 -2444261 -4323286 -4824427 -2639263 1192093 4179779 5151491 5638128
1765 5638128 7726623 11181200 14022712 15315707 15433711 14003583 10273798 5830108
1757 5830108 3940693 4949627 5078168 1700730 -2596734 -3656532 -1532184 224970
1749 224970 -163491 -1193415 -1386502 -1148526 -992607 -394281 764341 1465941 1174071
1740 1174071 751649 885781 803390 -387094 -1898937 -2024419 -515138 775929 -11070
1731 -11070 -2521621 -4699707 -5474491 -6040725 -7772721 -9638881 -9153857 -5825903 -2053837
1722 -2053837 -163277 -87199 -663662 -1536170 -2532034 -2661991 -1433085 -156392 -305078
1713 -305078 -1416299 -2242006 -3028054 -4651492 -6249492 -6087463 -4528329 -3679164 -3905900
1704 -3905900 -3145197 -282892 3115991 5383694 6803387 7749924 6929433 3491644 -602128
1695 -602128 -2579749 -2397575 -2184439 -2779715 -3186252 -3388010 -5118135 -8858985 -12126633
1686 -12126633 -12354573 -10259991 -8618011 -8368129 -7810788 -5661793 -3085398 -1972768 -2560051
1677 -2560051 -3810294 -5150924 -6478113 -7066667 -6147658 -4582368 -4343964 -5807486 -6936736
1668 -6936736 -5968214 -3622760 -1466254 781980 4434039 8666199 10261622 7423472
1660 7423472 2702838 917346 4233685 9881880 12875266 10888336 6361078 3617550
1652 3617550 4006270 4577651 1949869 -3416867 -7900035 -9090810 -7861785 -5976092 -3544119
1643 -3544119 -50161 3410458 4814664 3975873 3052237 3835270 5587728 6168597 4505287
1634 4505287 1267288 -2209881 -4707981 -5269904 -3797340 -1654436 -671695 -1197427 -1958004
1625 -1958004 -2133250 -2491700 -3826196 -5385319 -5966924 -5719122 -5537780 -5322979 -4324266
1616 -4324266 -2755194 -1430555 -144546 1715321 3134889 2316649 -230704 -1971958
1608 -1971958 -2403137 -3986062 -7509264 -9408360 -6424754 -852874 2169444 1456560 384814
1599 384814 1078084 1629218 -62304 -2750612 -3744731 -2280658 595209 3935605 6989647
1590 6989647 8421270 7225965 4321297 2075080 1978441 3193196 3593913 2312809 1118430
1581 1118430 2538318 6234259 8408633 6072032 968195 -2488742 -2445999 -551092 1787599
1572 1787599 4899670 7958058 7926888 3606927 -1439577 -2621675 51439 2277552 811921
1563 811921 -3366758 -6850669 -7062318 -3904442 344019 2721578 2202143 515296 -278429
1554 -278429 -199992 -216369 236928 2594416 6363777 9099128 9461362 8484077 7264208
1545 7264208 5200477 1633124 -2128397 -3965182 -3676964 -3288502 -4549398 -6934483 -8467676
1536 -8467676 -8143063 -6970509 -6357916 -5900773 -3782161 344280 4073597 4977447 3816722
1527 3816722 3470685 4986702 6531976 6559133 6115698 6899204 8323900 7994991 4676043
1518 4676043 -196136 -3705809 -3649089 -158497 4133790 6093329 4967293 2814524 1607455
1509 1607455 894838 -774007 -3324717 -5673919 -7834253 -10292911 -11652002 -9592407
1501 -9592407 -4857978 -1699019 -2714087 -5156631 -4436491 5273 4604172 6632246
1493 6632246 6619322 5801000 3844285 323705 -3345709 -5120979 -4767972 -3847038 -3576155
1484 -3576155 -3626474 -2977416 -1369435 207230 397404 -972647 -2351395 -1992968 -55516
1475 -55516 1425830 735365 -1947703 -5101049 -7104362 -6874665 -4411566 -1262095 379358
1466 379358 -384314 -2580487 -4787819 -6211961 -6273012 -4486447 -1333217 1916166 4788672
1457 4788672 7739719 10181226 10172948 7323527 4436702 4617487 7813663 11655966 14433150
1448 14433150 15493654 14076306 10212163 6166957 4569619 5171285 5368864 3714640
1440 3714640 1046057 -1413445 -2834787 -1977225 1730473 5995381 7182940 4964849
1432 4964849 3271226 5423779 10015654 12847543 11716417 8211829 5565608 5394334
1424 5394334 6101232 4621957 442339 -3021979 -2598793 195830 1405478 511985 629465
1415 629465 2794766 3999394 2140702 -707617 -1966695 -2364416 -3669138 -5266692 -5716971
1406 -5716971 -5669565 -6510597 -7676531 -7783935 -7029634 -6232279 -5024127 -3308022 -2872602
1397 -2872602 -4906758 -7315844 -7315712 -5495085 -4333167 -3666428 -966784 4074855 8314123
1388 8314123 8945851 6347073 2909198 813886 890964 2054957 2143361 664709 -132537
1379 -132537 1559309 4192305 5076691 3917416 1702704 -2056262 -7550918 -11618214 -10656790
1370 -10656790 -6089357 -2836399 -2570331 -2771420 -2515667 -4187478 -8182655 -10780415 -9729622
1361 -9729622 -7988983 -9018783 -11475806 -11566909 -8276501 -3524421 812561 3489205 3432328
1352 3432328 1289635 -107523 806850 1830317 113540 -3654273 -6395866 -6669413 -5386407
1343 -5386407 -3789160 -2904170 -3815479 -6226192 -7767201 -6898493 -5441975 -5964896 -7700835
1334 -7700835 -7674383 -5234994 -2805435 -2246179 -2810858 -2819269 -1433141 1238932 4051512
1325 4051512 4978042 3128274 435916 -471910 135782 -361763 -2901093 -5516023 -6532268
1316 -6532268 -6718833 -7283688 -7625342 -6567140 -4688862 -3848200 -4673609 -5721731 -5408083
1307 -5408083 -4150291 -3925561 -5560504 -7221972 -6664718 -4653728 -4365962 -6836566 -8983507
1298 -8983507 -7671857 -4111817 -2023026 -2408914 -2680592 -782992 2229801 4207559 4518886
1289 4518886 3841148 2765743 1496325 71380 -1693277 -3857366 -5735173 -6349347 -5674588
1280 -5674588 -4735289 -4313765 -4098660 -3133724 -774052 2464793 4726400 4381429 2434362
1271 2434362 2106747 4769852 7621731 7284998 4493559 2588769 2113816 288900 -3737355
1262 -3737355 -6576434 -5238699 -1484081 710432 290359 -675801 -878076 -1241352 -2520230
1253 -2520230 -3608223 -3136396 -1544336 -477891 -499457 -360695 1085843 2805918 2315277
1244 2315277 -1331532 -6131740 -9236238 -9611735 -7839471 -4384727 297684 4512711
1236 4512711 6240192 5617366 4927905 5695362 7170990 8065559 8229953 7951969 7046882
1227 7046882 5594117 4409584 3790845 2731990 331041 -2839194 -5678025 -8135501
1219 -8135501 -10885233 -13952836 -16570308 -18101362 -18448192 -17743422 -16054013 -13268292 -9366813
1210 -9366813 -5295889 -3148968 -4178945 -6592613 -6926589 -4218226 -1327963 -1254870 -3587066
1201 -3587066 -5799389 -6707617 -6917221 -6649422 -5049022 -1729827 2255358 5174952 5652629
1192 5652629 3221864 -1176130 -5253687 -6768673 -5169828 -1752120 1537832 3299748
1184 3299748 3332091 2580601 2018150 1397761 -142545 -2173724 -3038045 -2312216 -1485416
1175 -1485416 -1040367 1238359 6870519 12934471 14629097 11360791 7439336 6158669
1167 6158669 5853276 3189683 -1832686 -6256424 -8255310 -8533045 -7947855 -5940355 -2108878
1158 -2108878 1974706 3765184 2390676 -409559 -2156051 -2096418 -1539481 -1909293 -3058542
1149 -3058542 -3960142 -4636986 -6235822 -8601778 -8780669 -3626630 5714835 13368707 14137695
1140 14137695 8826053 2813246 -312529 -1757446 -3896349 -6223712 -6818330 -6008278
1132 -6008278 -5724960 -5872055 -4360388 -1042472 1249440 617178 -1380283 -2449461 -2594723
1123 -2594723 -2778453 -2618024 -1554773 -690853 -1095370 -1508202 -184325 1954512 2646871
1114 2646871 2092418 2574147 4473063 5540072 4448348 2386867 579153 -1134383 -2426141
1105 -2426141 -1872782 482400 2324234 2300889 1846637 2156738 1706596 -940365 -3899792
1096 -3899792 -4424953 -3287032 -3669360 -6368647 -9104575 -10410962 -11156275 -11747473 -10734558
1087 -10734558 -7378548 -3327541 -349854 1776635 3715483 4629941 3598581 1805709
1079 1805709 1371039 2469349 3228637 2322256 369849 -1152685 -1291218 56686 2169137
1070 2169137 3711136 3629027 1983952 -382017 -2672162 -4289419 -4910021 -5123200 -6152933
1061 -6152933 -7856849 -7873392 -4390336 728381 3481414 2387965 -246603 -1943874 -2950292
1052 -2950292 -4848946 -8106714 -11992797 -15368968 -16538135 -13941179 -8389880 -3247875
1044 -3247875 -916803 -299774 891911 2733488 3740755 3570477 2888446 1561417 -659362
1035 -659362 -2436112 -2393688 -1843434 -3178221 -5787365 -6645478 -5189586 -4253892 -5202463
1026 -5202463 -5525921 -3143272 -139352 376841 -1022169 -1402660 -124305 716373 -148264
1017 -148264 -1800861 -3265660 -4708927 -6169876 -6858626 -6282995 -4951089 -3611505 -2611876
1008 -2611876 -2099299 -2090499 -2251142 -2101177 -1370086 27359 1802112 2851894 2022948
999 2022948 -126144 -1472555 -1042133 -288266 -575135 -829813 622066 2994265 3785893
990 3785893 2006605 -1045051 -3633008 -4577002 -3216033 -434783 847494 -1507280 -5722293
981 -5722293 -7909730 -6832686 -4615024 -2883563 -1028934 1143487 1942063 481087 -1331576
972 -1331576 -1313773 -50951 339335 -473423 -638083 1243441 4253123 6006108 4957060
963 4957060 1930219 -752626 -1935884 -2707929 -3983163 -4275169 -2024069 639040 -372761
954 -372761 -5072672 -8208200 -5608410 796356 6116412 8343977 8689640 7977095 5775783
945 5775783 2521269 -160144 -1431613 -1839501 -1949647 -1819711 -1706672 -2023698 -2744252
936 -2744252 -3841297 -5769752 -8328174 -9766216 -8596410 -5804284 -3630196 -2602272
928 -2602272 -1621913 -660292 -1054621 -2743022 -3465862 -1868260 218314 -47907 -3075522
919 -3075522 -6754572 -8981101 -9045350 -7195006 -4420069 -2702203 -3934188 -7672890 -10711486
910 -10711486 -10027969 -6182291 -2892074 -2884102 -4959331 -5861239 -4332571 -2093692 -1070779
901 -1070779 -1193999 -1336873 -1025941 -350174 732809 1878712 1844400 -380860 -4239569
892 -4239569 -8124056 -10748620 -11409754 -9806257 -6760089 -4425528 -4326134 -5403668 -5280866
883 -5280866 -3284141 -899630 692343 2022076 3904698 5942648 7170710 7304023 6645153
874 6645153 5395463 3735947 2171141 1160390 545415 -271062 -1635500 -3297982 -4643862
865 -4643862 -5181902 -4921456 -4323702 -3845129 -3589523 -3375398 -2875033 -1675584 309160
856 309160 2277337 2933204 1845308 -27851 -1538197 -2548989 -3506191 -4470085 -5263043
847 -5263043 -6029618 -6832537 -7090167 -6211459 -4427895 -2237297 460889 3648369 6050743
838 6050743 6080346 3926035 1413501 -508553 -2939457 -7064944 -11954454 -15190464 -15252918
829 -15252918 -12529703 -8248866 -3355634 1265836 4262712 4511322 2383832 -574636
821 -574636 -3593736 -7293631 -11577689 -14198967 -13278311 -10575853 -9794314 -11424353 -11832903
812 -11832903 -8411566 -3221552 -25852 138669 -1465571 -4121759 -7534647 -10112290
804 -10112290 -10026742 -7665605 -5248911 -4496732 -5844434 -8570793 -10165033 -7581472 -1521547
795 -1521547 2585952 1052907 -2459806 -1684981 3379964 6989366 6239640 3902735 2561464
786 2561464 1549009 1003672 3312040 7951573 9925575 6693567 2403060 1600392 2706675
777 2706675 1957075 241874 921547 3278718 3510088 1062411 -829833 -293598 1763807
768 1763807 4717651 8360563 10366185 8118931 3297190 423391 437269 -70451 -2552072
759 -2552072 -3909625 -1681834 2307189 5465631 7824093 9551510 8702271 4652073 1041512
750 1041512 1712584 5358927 7444824 6236728 3797046 1793976 -365745 -3075563 -5053671
741 -5053671 -5309762 -4786758 -4947894 -5629332 -5151388 -2401769 1480551 3775104 3036929
732 3036929 1034875 611656 1517273 281366 -4746124 -10164634 -11298443 -7927492 -3944763
723 -3944763 -2044072 -1392619 -626187 -372416 -1495338 -2684619 -1630066 1959662 5780741
714 5780741 7279119 5858285 2889913 199245 -1294492 -1821765 -2097829 -2660209 -3717333
705 -3717333 -5120771 -6226817 -6265409 -5325577 -4598583 -5035180 -6006226 -5932473 -4072665 -1058463
695 -1058463 2088641 4569404 5532064 4430373 2219321 1187545 2535139 4527586 4179645
686 4179645 873906 -2664401 -3456325 -1564907 443020 753543 -142829 -1047475 -1705956
677 -1705956 -2139941 -1634953 109296 1450685 263551 -2858828 -4475686 -2167178 2538460
668 2538460 5912141 5835694 3051108 -531499 -3547687 -5465388 -6205252 -5706888 -3622395
659 -3622395 261618 5031144 8698348 9836407 8695927 6264807 3036785 -516825
651 -516825 -3188348 -4110197 -4167436 -4962089 -6469141 -6974207 -5409010 -2647220 -372285
642 -372285 383289 -374077 -1570107 -1483435 536862 2749979 2835449 1135212 398377 1910151
632 1910151 3837832 4339474 4250631 4995030 5517099 3613571 -561220 -4643833 -7314236
623 -7314236 -9062338 -9672147 -7463345 -2087510 3720280 6630786 6099423 4218741 2841459
614 2841459 1801962 -261590 -3946930 -7981725 -10142233 -9573335 -7733543 -6239485 -4518915
605 -4518915 -1317698 1903419 1771851 -2032632 -5330056 -4726140 -2021677 -908460 -1291351
596 -1291351 -295988 2161099 2796987 258501 -2615946 -2976203 -1361580 541189 2695898
587 2695898 5298255 7054705 7286723 7676825 9192287 9063639 4189054 -3409062 -8089771
578 -8089771 -7541806 -5045228 -4397444 -5623142 -6625421 -6295467 -4580674 -1753769 870256
569 870256 1427822 158065 -334226 1049674 1847553 -193585 -3287910 -4105715 -2579791
560 -2579791 -1345101 -1436074 -1697677 -1953526 -3321968 -5137157 -4985292 -2818883 -1847989
551 -1847989 -3641789 -5167460 -3102878 1053120 3052215 1810310 263159 685069 1954564
542 1954564 1985894 712864 -348075 -215172 747912 1442024 1039153 -61971 -270362
533 -270362 1460903 4041432 5347941 4843633 3940870 3706870 3597715 2928436 2292435
524 2292435 2672258 3988922 5275634 5686070 4935948 3606861 3420448 6054790 10909345
515 10909345 15098635 16559469 16071391 15145134 13293867 9294317 4303825 1313088 1330331
506 1330331 2155703 1593155 213492 2023 1537245 3577704 4601731 3814565 1340461
497 1340461 -1553155 -2822625 -1264765 2114872 4804840 4885690 2331265 -1363979 -4399030
488 -4399030 -5658795 -4963204 -2721478 264429 2581079 2566034 -229275 -4215957 -7241627
479 -7241627 -8617565 -8833258 -7917740 -5710991 -3455693 -2934953 -3598933 -2796404 95286
470 95286 1937348 -101459 -4480647 -7283742 -6961946 -5009762 -3068100 -1800392 -1977867
461 -1977867 -4045398 -6566935 -7360338 -6460041 -6038323 -7174548 -8597161 -8891670 -8050558
452 -8050558 -6477070 -4365142 -2537784 -2012227 -2205313 -1469562 95772 520936 -687745
443 -687745 -1528745 -944145 -704813 -2170032 -3631775 -3156902 -1905263 -1861818 -2080571 -515321
433 -515321 1557209 712857 -3106752 -5847451 -4909005 -2391296 -1460388 -2070800 -2163595
424 -2163595 -1261801 -700294 -1093116 -1385571 -375596 1781983 3540302 3069341 -119735
415 -119735 -4242680 -6423050 -5214739 -1701591 1784572 3393881 2532551 187200 -1395625
406 -1395625 -660791 1306516 2065649 1273704 1100258 2562363 3570729 2164891 -146489
397 -146489 -538836 807615 1150893 -466330 -1980237 -1734079 -689472 -318180 -429049
388 -429049 -471325 -1206958 -3169244 -4622864 -3352529 -254344 1005699 -1507795 -5448709
379 -5448709 -7080399 -5584070 -3318851 -2504693 -3071503 -3763286 -4033254 -4191745 -4454965
370 -4454965 -4708319 -4971161 -5351081 -5476159 -4590201 -2569935 -553520 -116747 -1725465
361 -1725465 -4178262 -5731743 -5747887 -5074239 -4786931 -4912550 -4758574 -4210747 -3896566 -3886040
351 -3886040 -3114926 -803134 2121046 3889665 3855463 2641808 610760 -2494580 -6135159
342 -6135159 -8545000 -8517261 -6695113 -4230864 -1073135 3163888 7248650 8940195 7770277
333 7770277 5861743 5367685 6102267 6486051 6035290 5799874 6551698 7560324 7453454
324 7453454 5758938 3344165 1658415 1683233 3249430 5073253 5642681 4386666 2031725
315 2031725 -219432 -1711819 -2454180 -2524032 -1855697 -727840 -6047 -386503 -1395849
306 -1395849 -1598367 -126414 2173984 3510112 3071192 1798672 1058899 1025121 956403
297 956403 826252 1688028 3970315 6156467 6051821 3139844 -1102091 -5023520 -7887651
288 -7887651 -9132279 -8059359 -5183068 -2708511 -2159296 -2136859 -220817 2991534 3847559
279 3847559 500943 -4002657 -5140273 -2290829 1228669 2902526 3476781 4397833 5108211
270 5108211 4274157 2237364 572385 -42670 -3957 589585 1801309 2578935 1463246
261 1463246 -1095166 -2828659 -2739833 -2485791 -3613157 -4946244 -4470852 -2885227 -3160062
252 -3160062 -6568911 -10908826 -13082937 -12116244 -9170717 -5877237 -3416379 -2245859 -1787654
243 -1787654 -897514 703849 1951869 1900045 1063702 687183 1213403 2149779 2948944 3256983
233 3256983 2691080 1223062 -417010 -1483002 -2209072 -3328267 -4711709 -5285154 -4371374
224 -4371374 -2455752 -554313 542803 390382 -866365 -1982943 -1143758 2173280 6065895
215 6065895 7665629 5941664 2717266 717282 911589 2144497 3125826 3916769 4974209
206 4974209 5510339 4079056 871751 -1824490 -2219471 -1317094 -1722128 -4543982 -8346695
197 -8346695 -10968878 -11489257 -10324754 -8246066 -5810437 -3436184 -1569106 -641586 -842237
188 -842237 -1858690 -2841077 -2699151 -689102 2825460 6071238 7050207 5719777 4381130
179 4381130 4851321 5835831 4734341 1782138 139113 1291315 2730941 1647621 -1097460
170 -1097460 -2687340 -2464138 -1925383 -1601166 -525776 1471956 3279736 4348647 5058916
$$ [...]
##END NTUPLES=NMR SPECTRUM
##END=
