##TITLE=31Pdec_DE-79H_F
 D2O, 64 sc
 29.1.2025
##JCAMPDX= 6.0         $$ Bruker NMR JCAMP-DX V2.0
##DATA TYPE= NMR SPECTRUM
##DATA CLASS= NTUPLES
##ORIGIN= UXNMR, Bruker Analytische Messtechnik GmbH
##OWNER= root
$$ XWIN-NMR		Version 3.5
$$ Wed Jan 29 13:49:25 2025 Russian Standard Time (UT+4h)  she@DPX200
##.OBSERVE FREQUENCY= 81.013821
##.OBSERVE NUCLEUS= ^31P
##.ACQUISITION MODE= SIMULTANEOUS
##.ACQUISITION SCHEME= undefined
##.AVERAGES= 64
##.DIGITISER RES= 17
##SPECTROMETER/DATA SYSTEM= spect
##.PULSE SEQUENCE= zgpg30
##.SOLVENT NAME= CDCl3
##.SHIFT REFERENCE= (INTERNAL, CDCl3, 0, 198.062)
##AUDIT TRAIL= $$ (NUMBER, WHEN, WHO, WHERE, WHAT)
$$ ##TITLE= Audit trail, XWIN-NMR		Version 3.5
$$ ##JCAMPDX= 5.01
$$ ##ORIGIN= Bruker BioSpin GmbH
$$ ##OWNER= she
$$ F:/spectra/data/she/nmr/P31/2/pdata/1/auditp.txt
$$ ##AUDIT TRAIL=  $$ (NUMBER, WHEN, WHO, WHERE, WHAT)
(   1,<2025-01-29 13:48:23.40 +0400>,<she>,<DPX200>,
      <created by zg, POWCHK disabled, PULCHK disabled
       configuration hash MD5:
       00 E9 B6 7A A2 85 ED C7 34 08 36 98 17 FE 4E 26
       data hash MD5: 32K
       06 15 01 B2 5A 77 26 B5 08 B5 27 3D A6 BE 75 6F>)
(   2,<2025-01-29 13:48:25.64 +0400>,<she>,<DPX200>,
      <Start of raw data processing
       efp BC_mod = 2 LB = 1.5 FT_mod = 6 PKNL = 1 PHC0 = 1789.994 PHC1 = 45.69019 SI = 64K 
       data hash MD5: 64K
       73 C9 FA 1B BE D4 F4 0A 6D F2 23 51 55 3E 2E DB>)
(   3,<2025-01-29 13:48:56.06 +0400>,<she>,<DPX200>,
      <pk PHC0 = -136.2963 PHC1 = 263.0002 
       data hash MD5: 64K
       E8 FC 31 19 91 55 3F AE 1D BB DB 11 4A 3D CF 31>)
(   4,<2025-01-29 13:49:00.48 +0400>,<she>,<DPX200>,
      <abs ABSG = 5 
       data hash MD5: 64K
       E2 7A AD 1E 59 67 1B EB 9F 38 56 B8 3B 2D 53 02>)
$$ ##END=
$$ 
$$ hash MD5
$$ 52 19 A1 33 47 9B 04 E7 B8 25 85 01 7E 79 99 A2
##$RELAX= 
##$RELAX= 
##$RELAX= 
##$RELAX= 
##$RELAX= 
##$RELAX= 
##$RELAX= 
##$RELAX= 
$$ Bruker specific parameters
$$ --------------------------
##$DU= <F:/spectra>
##$EXPNO= 2
##$NAME= <P31>
##$PROCNO= 1
##$TYPE= <nmr>
##$USER= <she>
##$AMP= (0..31)
100 100 100 100 100 100 100 100 100 100 100 100 100 100 100 100 100 100 
100 100 100 100 100 100 100 100 100 100 100 100 100 100 
##$AQSEQ= 0
##$AQ_mod= 1
##$AUNM= <au_zg>
##$AUTOPOS= <>
##$BF1= 81.014009
##$BF2= 200.13
##$BF3= 200.13
##$BF4= 200.13
##$BF5= 200.13
##$BF6= 200.13
##$BF7= 200.13
##$BF8= 200.13
##$BYTORDA= 1
##$CFDGTYP= 0
##$CFRGTYP= 5
##$CHEMSTR= <none>
##$CNST= (0..31)
1 1 145 1 1 1 1 1 1 1 1 1 1 1 1 1 1 1 1 1 1 1 1 1 1 1 1 1 1 1 1 1 
##$CPDPRG= <waltz16>
##$CPDPRG1= <>
##$CPDPRG2= <waltz16>
##$CPDPRG3= <>
##$CPDPRG4= <mlev>
##$CPDPRG5= <mlev>
##$CPDPRG6= <mlev>
##$CPDPRG7= <mlev>
##$CPDPRG8= <mlev>
##$CPDPRGB= <>
##$CPDPRGT= <>
##$D= (0..31)
0 1 0 0 0 0 0 0 0 0.06 0 0.03 2e-05 3e-06 0 0 0.0002 0 0 0 0 0 0 0 0 0 
0 0 0 0 0 0 
##$DATE= 1738144102
##$DBL= (0..7)
120 120 120 11 120 120 24 19 
##$DBP= (0..7)
150 150 150 150 150 150 150 150 
##$DBP07= 0
##$DBPNAM0= <>
##$DBPNAM1= <>
$$ [...]
##$SUBNAM3= <"">
##$SUBNAM4= <"">
##$SUBNAM5= <"">
##$SUBNAM6= <"">
##$SUBNAM7= <"">
##$SUBNAM8= <"">
##$SUBNAM9= <"">
##$SW= 400.765351723535
##$SWIBOX= (0..15)
0 1 3 0 0 0 0 0 0 0 0 0 0 0 0 0 
##$SW_h= 32467.5324675325
##$TD= 32768
##$TD0= 1
##$TE= 0
##$TE2= 300
##$TE3= 300
##$TEG= 300
##$TL= (0..7)
0 120 53 12 22 120 120 120 
##$TP= (0..7)
150 150 150 150 150 150 150 150 
##$TP07= 0
##$TPNAME0= <>
##$TPNAME1= <>
##$TPNAME2= <>
##$TPNAME3= <>
##$TPNAME4= <>
##$TPNAME5= <>
##$TPNAME6= <>
##$TPNAME7= <>
##$TPOAL= (0..7)
0.5 0.5 0.5 0.5 0.5 0.5 0.5 0.5 
##$TPOFFS= (0..7)
0 0 0 0 0 0 0 0 
##$TUNHIN= 0
##$TUNHOUT= 0
##$TUNXOUT= 0
##$USERA1= <user>
##$USERA2= <user>
##$USERA3= <user>
##$USERA4= <user>
##$USERA5= <user>
##$V9= 5
##$VALIST= <valist>
##$VCLIST= <CCCCCCCCCCCCCCC>
##$VD= 0
##$VDLIST= <DDDDDDDDDDDDDDD>
##$VPLIST= <PPPPPPPPPPPPPPP>
##$VTLIST= <TTTTTTTTTTTTTTT>
##$WBST= 1024
##$WBSW= 4
##$XGAIN= (0..3)
0 0 0 0 
##$XL= 0
##$YL= 0
##$YMAX_a= 11774
##$YMIN_a= -11900
##$ZGOPTNS= <>
##$ZL1= 120
##$ZL2= 120
##$ZL3= 120
##$ZL4= 120
##$ABSF1= 198.0616
##$ABSF2= -202.7028
##$ABSG= 5
##$ABSL= 3
##$ALPHA= 0
##$AQORDER= 0
##$ASSFAC= 0
##$ASSFACI= 0
##$ASSFACX= 0
##$ASSWID= 0
##$AUNMP= <proc_1d>
##$AZFE= 0.1
##$AZFW= 0.5
##$BCFW= 0
##$BC_mod= 2
##$BYTORDP= 0
##$COROFFS= 0
##$CY= -3
##$DATMOD= 1
##$DC= 0
##$DFILT= <>
##$DTYPP= 0
##$F1P= 0
##$F2P= 0
##$FCOR= 1
##$FTSIZE= 65536
##$FT_mod= 6
##$GAMMA= 0
##$GB= 0
##$INTBC= 1
##$INTSCL= 9.790993e-09
##$ISEN= 30
##$LB= 1.5
##$LEV0= 0
##$LPBIN= 0
##$MAXI= 10000
##$MC2= 0
##$MEAN= 0
##$ME_mod= 0
##$MI= 50
##$NCOEF= 0
##$NC_proc= -9
##$NLEV= 6
##$NOISF1= 182.463
##$NOISF2= 159.3651
##$NSP= 0
##$NTH_PI= 0
##$NZP= 0
##$OFFSET= 198.0616
##$PC= 4
##$PHC0= 1653.698
##$PHC1= 308.6904
##$PH_mod= 1
##$PKNL= yes
##$PPARMOD= 0
##$PSCAL= 0
##$PSIGN= 0
##$REVERSE= no
##$SF= 81.0140089999434
##$SI= 65536
##$SIGF1= 159.3651
##$SIGF2= -187.1042
##$SINO= 113.3802
##$SIOLD= 16384
##$SREGLST= <1H.CDCl3>
##$SSB= 0
##$STSI= 65536
##$STSR= 0
##$SW_p= 32467.5324675325
##$SYMM= 0
##$S_DEV= 0
##$TDeff= 32768
##$TDoff= 0
##$TI= <>
##$TILT= no
##$TM1= 0
##$TM2= 0
##$TOPLEV= 0
##$USERP1= <user>
##$USERP2= <user>
##$USERP3= <user>
##$USERP4= <user>
##$USERP5= <user>
##$WDW= 1
##$XDIM= 65536
##$YMAX_p= 469065219
##$YMIN_p= -251170279
$$ End of Bruker specific parameters
$$ ---------------------------------
##NTUPLES= NMR SPECTRUM
##VAR_NAME=  FREQUENCY,     SPECTRUM/REAL,   SPECTRUM/IMAG
##SYMBOL=    X,             R,               I
##VAR_TYPE=  INDEPENDENT,   DEPENDENT,       DEPENDENT
##VAR_FORM=  AFFN,          ASDF,            ASDF
##VAR_DIM=   65536,         65536,           65536
##UNITS=     HZ,            ARBITRARY UNITS, ARBITRARY UNITS
##FACTOR=    0.49542278885378, 1,            1
##FIRST=     16045.7642231865, 0,            0
##LAST=      -16421.768244346, 0,            0
##MIN=       -16421.768244346, -251170279,   0
##MAX=       16045.7642231865, 469065219,    0
$$ Real data points
##PAGE= N=1
##DATA TABLE= (X++(R..R)), XYDATA
$$ [...]
$$ plain form
7380 -561312 225192 3395535 2177194 -1886497 -2453675 269823 -1111307 -9019994 -15133735
7371 -15133735 -11249676 -923462 5394576 3682413 -1260199 -5118093 -9337976 -16339681
7363 -16339681 -24453019 -29720532 -30111513 -26651436 -22057511 -18792551 -17329984 -16543447
7355 -16543447 -16247924 -17365090 -18427362 -15335494 -7548790 -1097010 -1177556 -4921039 -6842365
7346 -6842365 -8319015 -14297336 -22333975 -23892332 -17618572 -12824397 -16678798 -25040910
7338 -25040910 -29681756 -28232731 -22949650 -15855384 -10109743 -10550529 -16920448 -21076176
7330 -21076176 -17074955 -10057977 -8461923 -10929689 -8886151 -331451 7330761 8663638
7322 8663638 6819783 6750096 8066650 7878767 6260005 5397033 5926351 6823496 7284713
$$ packed form
7380e61312P86504L170343j218341m063691n67178K723498j381130p908687o113741
7371a5133735L884059J0326214O318038j712163m942612l857894m219883p001705
7363a6339681q113338n267513l90981L460077M593925L264960J462567P86537
7355a6543447K95523j117166j062272L091868P786704O451780q0546l743483j921326
7346f842365j476650n978321q036639j558357O273760M794175l854401q362112
7338b5040910m640846J449025N283081P094266N745641m40786o369919m155728
7330b1076176M001221P016978J596054k467766K043538Q554700P662212J332877
7322H663638j843855o9687J316554j87883j618762q62972N29318Q97145M61217
$$ plain form
7313 7284713 6923485 5308711 2308161 -1998032 -7523181 -12788452 -14331096 -10324027
7305 -10324027 -4301164 -1885576 -3637348 -4579750 -1283076 4204705 8205210 9102300
7297 9102300 5784412 -3081725 -15248929 -23992875 -24777873 -20426563 -16212846 -12258872
7289 -12258872 -5093724 4931206 12949121 16408659 18007642 20599082 22959901 22444812
7281 22444812 18767437 12924884 4831423 -5306881 -14768100 -20070212 -20394717 -17621096
7273 -17621096 -13927457 -10920528 -9539928 -8373487 -3599646 5865599 13943264 12544423
7265 12544423 1869492 -8795847 -12306517 -11317744 -11888847 -13969783 -13344950 -10131547
7257 -10131547 -8956301 -11131335 -12609395 -10852408 -8632861 -8899623 -9998304 -8689214
$$ packed form
7313G284713l61228j614774l000550m306193n525149n265271j542644M007069
7305a0324027O022863K415588j751772r42402L296674N487781M000505Q97090
7297I102300l317888q866137j2167204q743946p84998M351310M213717L953974
7289a2258872P165148J0024930Q017915L459538J598983K591440K360819n15089
7281B2444812l677375n842553q093461j0138304r461219n302112l24505K773621
7273a7621096L693639L006929J380600J166441M773841R465245Q077665j398841
7265A2544423j0674931j0665339l510670R88773n71103k080936O24833L213403
7257a0131547J175246k175034j478060J756987K219547k66762j098681J309090
$$ plain form
7249 -8689214 -4983767 -1465470 102833 -373886 -1942768 -2777609 -1868199 -1405266 -4761650
7240 -4761650 -11219440 -15975016 -16430931 -14629058 -12193572 -7793748 -1983396 983702
7232 983702 95112 1006391 7279211 12955169 10289412 1110408 -6465141 -9361798 -9937256
7223 -9937256 -8078779 -2233113 3090487 1195927 -4685211 -3578649 6258004 12672435
7215 12672435 6543941 -5858722 -13521454 -15285728 -16049836 -15436466 -9859494 -1627851
7207 -1627851 3770345 7502667 15341281 26094615 30718601 24630501 13908461 6687033
7199 6687033 3915039 1629627 -1912128 -4975099 -6039219 -5938863 -6722804 -9087498 -10509619
7190 -10509619 -6904288 2167620 11116429 13603079 9305543 2934429 -2047718 -5163880
$$ packed form
7249h689214L705447L518297J568303m76719j568882q34841R09410M62933l356384
7240d761650o457790m755576m55915J801873K435486M399824N810352K967098
7232I83702q88590R11279O272820N675958k665757r179004p575549k896657n75458
7223i937256J858477N845666N323600j894560n881138J106562R836653O414431
7215A2672435o128494j2402663p662732j764274p64108O13370N576972Q231643
7207a627851N398196L732322P838614J0753334M623986o088100j0722040p221428
7199F687033k771994k285412l541755l062971j064120J00356p83941k364694j422121
7190a0509619L605331R071908Q948809K486650m297536o371114m982147l116162
$$ plain form
7182 -5163880 -5500133 -1331451 5977110 11421936 11132006 5463862 -2698122 -9827787 -12176270
7173 -12176270 -8284366 -2044978 211776 -3013426 -6817056 -6185326 -575092 8150257
7165 8150257 17740117 23764902 20773550 9170258 -2237438 -4906035 -282088 2700477
7157 2700477 -1204164 -8335727 -11811219 -9210907 -3578395 1423585 5760228 12002181
7149 12002181 20256858 25625738 22809184 12868118 2722234 -2534198 -4122027 -5772043
7141 -5772043 -8747641 -12230984 -15416091 -16790723 -14037843 -7455403 -1375712 488538
7133 488538 -866132 -2841997 -5940680 -11706974 -17682498 -18638870 -12775478 -3757649 3295580
7124 3295580 5796014 4701556 3904275 7300473 13986782 18163099 16736963 14499561
$$ packed form
7182e163880l36253M168682P308561N444826k89930n668144q161984p129665k348483
7173a2176270L891904O239388K256754l225202l803630O31730N610234Q725349
7165H150257R589860O024785k991352j1603292j1407696k668597M623947K982565
7157B700477l904641p131563l475492K600312N632512N001980M336643O241953
7149A2002181Q254677N368880k816554r941066j0145884n256432j587829j650016
7141e772043k975598l483343l185107j374632K752880O582440O079691J864250
7133D88538j354670j975865l098683n766294n975524r56372N863392R017829P053229
7124C295580K500434j094458p97281L396198O686309M176317j426136k237402
$$ plain form
7116 14499561 17315973 22425829 21652532 13590975 5798219 3773364 4528159 3868198 3690483
7107 3690483 7241780 11726672 11505731 6516583 2296696 2237814 3883738 3012791 -1467139
7098 -1467139 -6768924 -8494105 -4310778 2852505 6392877 2811781 -4279141 -8862610
7090 -8862610 -9372358 -8047578 -5451067 -119708 6558964 9718074 6893275 1503764
7082 1503764 -1303415 -226168 2105511 2691127 427852 -3534454 -6291779 -5348752 -1555318
7073 -1555318 1246908 569509 -1996001 -3485637 -3385654 -2899499 -1642485 2245081 8480727
7064 8480727 13309838 12975853 7700043 1457882 -1823249 -1544928 -382784 -1245254 -4055426
7055 -4055426 -5686911 -3641152 425536 1887072 -1826033 -8300765 -12710581 -12342706
$$ packed form
7116A4499561K816412N109856p73297q061557p792756k024855P54795o59961j77715
7107C690483L551297M484892k20941m989148m219887n8882J645924q70947m479930
7098a467139n301785j725181M183327P163283L540372l581096p090922m583469
7090h862610n09748J324780K596511N331359O678672L159110k824799n389511
7082A503764k807179J077247K331679N85616k263275l962306k757325R43027L793434
7073a555318K802226o77399k565510j489636R9983M86155J257014L887566O235646
7064H480727M829111l33985n275810o242161l281131K78321J162144q62470k810172
7055d055426j631485K045759M066688J461536l713105o474732m409816L67875
$$ plain form
7047 -12342706 -7901352 -1591397 4473829 8560108 9936092 9440659 8109293 5420155
7039 5420155 692838 -4029216 -5420242 -4094671 -5071963 -10555020 -14985743 -11046415
7031 -11046415 729757 12062609 15930768 11819660 2893452 -6885126 -12100513 -8203738
7023 -8203738 2136232 9180201 6799684 157862 -1586976 2125509 3321283 -2572516
7015 -2572516 -10491836 -12938879 -9140831 -4466341 -3411467 -5930161 -9444952 -12011356
7007 -12011356 -13315263 -13614404 -12197323 -7534033 103054 6785487 7796820 2980835
6999 2980835 -2487599 -3680167 -845117 2412750 4389942 6566832 10003770 12837086
6991 12837086 12613153 9933549 8010549 8515642 9452229 8223145 5771124 5791819 9715212
$$ packed form
7047a2342706M441354O309955O065226M086279J375984m95433j331366k689138
7039E420155m727317m722054j391026J325571r77292n483057m430723L939328
7031a1046415J1776172J1332852L868159m111108q926208r778578n215387L896775
7023h203738J0339970P043969k380517o641822j744838L712485J195774n893799
7015b572516p919320k447043L798048M674490J054874k518694l514791k566404
7007a2011356j303907k99141J417081M663290P637087O682433J011333m815985
6999B980835n468434j192568K835050L257867J977192K176890L436938K833316
6991A2837086k23933k679604j923000N05093R36587j229084k452021K0695L923393
$$ plain form
6982 9715212 14228331 14815744 10855396 6222882 5205307 8321967 11908810 11841728 8157187
6973 8157187 5392986 7158555 11303006 12836382 11022045 9925271 11327737 11370300 6535075
6964 6535075 -668028 -5024156 -4603750 -407737 6406504 12657163 11880772 1025419
6956 1025419 -13017299 -19497284 -16044903 -9487647 -5119791 -1686377 2224303 3766161
6948 3766161 833204 -3683039 -5931621 -5659806 -4308055 -2302593 -431475 -267 515144
6939 515144 4648352 11337500 13910036 8997026 1889765 -972191 -543739 -1591026 -4478367
6930 -4478367 -5927177 -5178872 -4144783 -3491827 -3222014 -4852566 -8418461 -10058814 -7809407
6921 -7809407 -6825715 -12403210 -20138587 -20529927 -12382524 -3934961 -586837 601811 2971595
$$ packed form
6982I715212M513119N87413l960348m632514j017575L116660L586843o7082l684541
6973H157187k764201J765569M144451J533376j814337j096774J402466M2563m835225
6964F535075p203103m356128M20406M196013O814241O250659p76391j0855353
6956A025419j4042718o479985L452381O557256M367856L433414L910680J541858
6948C766161k932957m516243k248582K71815J351751K005462J871118M31208N15411
6939E15144M133208O689148K572536m913010p107261k861956M28452j047287k887341
6930d478367j448810P48305J034089O52956K69813j630552l565895j640353K249407
6921g809407R83692n577495p735377l91340Q147403Q447563L348124J188648K369784
$$ plain form
6912 2971595 4880143 5235946 7337646 12912148 17654304 16995815 12282035 7736483 5232712
6903 5232712 5213713 8409556 12933330 13908301 10121415 6984699 8368407 9818225 5785587
6894 5785587 -113049 425279 7447199 12397558 11137429 9358648 12276334 15952950
6886 15952950 14029804 8304021 5925253 7735514 6256098 -2876534 -12516899 -11386825
6878 -11386825 1816319 16007962 20190983 14978000 9491886 9373765 11673518 10984363
6870 10984363 6426679 1109067 -2227289 -2829533 -1286276 563103 654299 -322631 1457707
6861 1457707 7976280 15362559 17747800 14401161 9940383 7596009 5833114 2860765
6853 2860765 1092717 3948871 9566163 11341630 5875556 -1901044 -3905111 1228348
$$ packed form
6912B971595J908548L55803K101700N574502M742156o58489m713780m545552k503771
6903E232712j8999L195843M523774R74971l786886l136716J383708J449818m032638
6894E785587n898636N38328P021920M950359j260129j778781K917686L676616
6886A5952950j923146n725783k378768J810261j479416r132632r640365J130074
6878a1386825J3203144J4191643M183021n212983n486114j18121K299753o89155
6870A0984363m557684n317612l336356o02244J543257J849379R1196r76930J780338
6861A457707O518573P386279K385241l346639m460778k344374j762895k972349
6853B860765j768048K856154N617292J775467n466074p776600k004067N133459
$$ plain form
6845 1228348 5957092 2805624 -6165829 -11319453 -6661160 3377976 9340913 6939010
6837 6939010 82033 -5038557 -6355528 -5962117 -5792122 -5412902 -4234044 -3821181 -5791909
6828 -5791909 -7922103 -5474268 2159032 9055757 10093217 8665090 12726622 23586101
6820 23586101 33376417 34821571 29150668 22092472 16047142 9898267 3882083 90862
6812 90862 -1423365 -3499826 -8043621 -13189658 -14925288 -10938739 -3074812 3822990 6447105
6803 6447105 6497542 8085554 11773471 13903051 12439920 9987889 9172816 8486065 5551324
6794 5551324 1624646 -382789 164041 2934860 8950077 17321644 22393157 19748916
6786 19748916 13718482 12902148 18324526 21978260 18129606 10353113 5228034 4164577
$$ packed form
6845A228348M728744l151468q971453n153624M658293J0039136N962937k401903
6837F939010o856977n120590j316971L93411J69995L79220J178858M12863j970728
6828e791909k130194K447835P633300O896725J037460j428127M061532J0859479
6820B3586101R790316J445154n670903p058196o045330o148875o016184l791221
6812I0862j514227k076461m543795n146037j735630L986549P863927O897802K624115
6803F447105N0437J588012L687917K129580j463131k452031q15073o86751k934741
6794E551324l926678k007435N46830K770819O015217Q371567N071513k644241
6786A9748916o030434q16334N422378L653734l848654p776493n125079j063457
$$ plain form
6778 4164577 4560281 4907493 4998470 3863361 1186375 -873236 -274947 1699722 2321502
6769 2321502 1390836 990943 2067133 3483474 4195745 4533958 5172672 5980707 6245105
6760 6245105 5754948 5537027 6975264 9651291 11041976 9686451 7501504 6849420 6554255
6751 6554255 4047100 696781 739152 4546060 7637451 7909404 9108474 14344833 20399722
6742 20399722 22220471 19653700 15583360 10371056 3054531 -3852410 -5862981 -2145510
6734 -2145510 4321277 10801367 14543218 10578748 -3309210 -19308001 -24711611 -16916466
6726 -16916466 -6981661 -4795520 -6965822 -4727372 1858031 5714629 5924693 9694177
6718 9694177 19905441 28663517 27284101 17579121 8755228 6429232 9025861 12625097
$$ packed form
6778D164577L95704L47212R0977j135109k676986k059611N98289J974669O21780
6769B321502r30666l99893J076190J416341P12271L38213O38714Q08035K64398
6760F245105m90157k17921J438237K676027J390685j355525k184947o52084k95165
6751F554255k507155l350319M2371L806908L091391K71953J199070N236359O054889
6742B0399722J820749k566771m070340n212304p316525o906941k010571L717471
6734b145510O466787O480090L741851l964470j3887958j5998791n403610P795145
6726a6916466R934805K186141k170302K238450O585403L856598K10064L769484
6718I694177J0211264Q758076j379416r704980q823893k325996K596629L599236
$$ plain form
6710 12625097 14610037 13363039 8696627 3059093 -681908 -2909888 -6124691 -10275058
6702 -10275058 -12295946 -10643182 -7189385 -3933169 -1052141 641972 -1253260 -7105632
6694 -7105632 -13318308 -16181821 -15391015 -12004153 -5992146 1518784 6692264 7435515 7047167
6685 7047167 9282810 11749701 9049243 1408812 -5015838 -6498961 -5560809 -5768667 -7248970
6676 -7248970 -8587645 -9251499 -8831376 -7308009 -6750949 -8878284 -10512456 -6445084 1978993
6667 1978993 6772243 4144753 -325742 -781330 597139 -573703 -2161203 340298
6659 340298 4483080 3531168 -2862980 -8031646 -8378978 -7191249 -7210279 -5923334 -1052454
6650 -1052454 4212463 4952899 599079 -5222818 -8712278 -8278034 -5417708 -4484252 -8745427
$$ packed form
6710A2625097J984940j246998m666412n637534l741001k227980l214803m150367
6702a0275058k020888J652764L453797L256216K881028J694113j895232n852372
6694g105632o212676k863513P90806L386862O012007P510930N173480P43251l88348
6685G047167K235643K466891k700458p640431o424650j483123R38152k07858j480303
6676g248970j338675o63854M20123J523367N57060k127335j634172M067372Q424077
6667A978993M793250k627490m470495m55588J378469j170842j587500K501501
6659C40298M142782r51912o394148n168666l47332J187729j9030J286945M870880
6650a052454N264917P40436m353820n821897l489460M34244K860326R33456m261175
$$ plain form
6641 -8745427 -15231179 -16546940 -9778557 -730324 3069617 934825 -2269384 -3599969
6633 -3599969 -4292535 -5439671 -5532524 -3367025 -490240 1419463 4385299 12788104 27235973
6624 27235973 41181545 45869851 39146991 27596198 18960409 14503598 10745349 6285604
6616 6285604 2930838 974870 -1806639 -5375926 -5892460 -1267815 4879163 7446210
6608 7446210 5705577 2523095 19009 -1116401 115217 3938784 7702695 7943166
6600 7943166 4524376 455607 -2124934 -3495737 -4139397 -3566484 -1877246 -490537 -451045
6591 -451045 -1099067 -794715 1676979 5868628 8748609 6176325 -2378969 -11016106 -12050885
6582 -12050885 -4093690 6666618 13728404 16290913 16985886 16639173 14214358 10515004
$$ packed form
6641h745427o485752j315761O768383R048233L799941k134792l204209j330585
6633c599969o92566j147136r2853K165499K876785J909703K965836Q402805J4447869
6624B7235973J3945572M688306o722860j1550793q635789m456811l758249m459745
6616F285604l354766j955968k781509l569287n16534M624645O146978K567047
6608G446210j740633l182482k504086j135410J231618L823567L763911K40471
6600G943166l418790m068769k580541j370803o43660N72913J689238J386709L9492
6591d51045o48022L04352K471694M191649K879981k572284q555294q637137j034779
6582a2050885P957195J0760308P061786K562509O94973l46713k424815l699354
$$ plain form
6574 10515004 8435775 8927561 9162664 6241047 1494054 -650431 2122376 7608617
6566 7608617 12464771 16232037 19978154 21910340 17858756 7472663 -3182230 -8188249
6558 -8188249 -8881884 -10591627 -13557192 -12206022 -4184785 5103757 9667905 10442660 12022540
6549 12022540 15318926 18034150 19985894 22531536 23689576 19494734 10779935 3604882
6541 3604882 1590918 2142114 1642980 -96552 -2406511 -5877448 -8946854 -6953143 1397875
6532 1397875 10403235 14412947 14750657 14765170 12252117 4001991 -4844506 -4855393 4121076
6523 4121076 11729037 11203505 7090954 6247130 8742543 11935357 16453910 22101411 23490042
6514 23490042 16880096 7562517 3390050 3860272 2927458 422325 2183315 8839462
$$ packed form
6574A0515004k079229M91786K35103k921617m746993k144485K772807N486241
6566G608617M856154L767266L746117J932186m051584j0386093j0654893n006019
6558h188249o93635j709743k965565J351170Q021237R288542M564148P74755J579880
6549A2022540L296386K715224J951744K545642J158040m194842q714799p175053
6541C604882k013964N51196m99134j739532k309959l470937l069406J993711Q351018
6532A397875R005360M009712L37710J4513k513053q250126q846497j0887Q976469
6523D121076P607961n25532m112551q43824K495413L192814M518553N647501J388631
6514B3490042o609946r317579m172467M70222r32814k505133J760990O656147
$$ plain form
6506 8839462 12887172 9520654 3902469 4048274 10745950 17683215 18666683 12652727 4224679
6497 4224679 225957 3047554 6874055 4405331 -2574471 -4788163 1085326 7041019
6489 7041019 5320134 -614581 -1791073 4407744 13987703 23776990 31911449 33744524
6481 33744524 25869858 14170110 9784652 15010537 19834328 15263464 4215102 -4435408
6473 -4435408 -7306719 -7205673 -6513739 -5756588 -6672499 -10867687 -15676963 -16265546 -12486892
6464 -12486892 -9578065 -10954654 -13858861 -13710819 -9823408 -4957327 -1599514 -620869
6456 -620869 -1638099 -2750778 -1665840 987415 1313592 -2568573 -6727718 -5934733 -755772
6447 -755772 3205556 2465907 -1442367 -5841057 -9602949 -11516274 -10201414 -7120859 -5855629
$$ packed form
6506H839462M047710l366518n618185J45805O697676O937265R83468o013956q428048
6497D224679l998722K821597L826501k468724o979802k213692N873489N955693
6489G041019j720885n934715j176492O198817R579959R789287Q134459J833075
6481C3744524p874666j1699748m385458N225885M823791m570864j1048362q650510
6473d435408k871311J01046O91934P57151r15911m195188m809276n88583L778654
6464a2486892K908827j376589k904207J48042L887411M866081L357813R78645
6456f20869j017230j112679J084938K653255L26177l882165m159145P92985N178961
6447g55772L961328p39649l908274m398690l761892j913325J314860L080555J265230
$$ plain form
6438 -5855629 -6630068 -5431946 -728073 3248246 3102343 1852993 3433589 5385129 2671467
6429 2671467 -3925982 -9434436 -12792711 -16499314 -19277570 -16947925 -11265194 -9854138
6421 -9854138 -14923254 -19565077 -18886516 -17474957 -20495661 -23954953 -21054247 -13635471
6413 -13635471 -9212461 -9083441 -7577184 -2642306 605429 -1484158 -5133255 -4497562
6405 -4497562 1253857 8567393 13829553 14917343 11341212 5292421 846237 319393
6397 319393 2459287 4948631 7073800 9094020 10686335 11300705 11151201 10990532 11337970
6388 11337970 12119420 12717661 12731384 12854423 13652823 12978040 7201252 -2991490 -10792174
6379 -10792174 -10729526 -5991380 -4258982 -7716891 -11832430 -12919650 -11220755 -6586530
$$ packed form
6438e855629p74439J198122M703873L976319j45903j249350J580596J951540k713662
6429B671467o597449n508454l358275l706603k778256K329645N682731J411056
6421i854138n069116m641823O78561J411559l020704l459292K900706P418776
6413a3635471M423010J29020J506257M934878L247735k089587l649097O35693
6405d497562N751419P313536N262160J087790l576131o048791m446184n26844
6397C19393K139894K489344K125169K020220J592315O14370j49504j60669L47438
6388A1337970P81450N98241J3723J23039P98400o74783n776788j0192742p800684
6379a0792174O2648M738146J732398l457909m115539j087220J698895M634225
$$ plain form
6371 -6586530 2266201 12309706 16235492 11315427 3251334 -2279990 -6752595 -12869011
6363 -12869011 -16647687 -12492073 -3683354 -412555 -7088830 -17229960 -21737952 -17663747
6355 -17663747 -8314024 373632 2342942 -4614865 -14785993 -18445397 -12989752 -6990530
6347 -6990530 -9670746 -18948017 -24116409 -18861129 -6962530 4620826 13139148 18617199
6339 18617199 19638506 15105523 8537952 5831512 7928530 9392599 6153327 1592521
6331 1592521 1688029 5922036 7278116 1525825 -7403648 -13044632 -14403149 -15677263 -19698384
6322 -19698384 -24427090 -25335205 -19124289 -5823103 10200988 21331250 21579246 11921446
6314 11921446 -84977 -6610941 -5085763 1687206 8698418 11581121 8583931 1521324
$$ packed form
6371f586530Q852731J0043505L925786m920065q064093n531324m472605o116416
6363a2869011l778676M155614Q808719L270799o676275j0141130m507992M074205
6355a7663747R349723Q687656J969310o957807j0171128l659404N455645N999222
6347f990530k680216r277271n168392N255280J1898599J1583356Q518322N478051
6339A8617199J021307m532983o567571k706440K097018J464069l239272m560806
6331A592521R5508M234007J356080n752291q929473n640984j358517j274114m021121
6322a9698384m728706r08115O210916J3301186J6024091J1130262K47996r657800
6314A1921446j2006423o525964J525178O772969P011212K882703k997190p062607
$$ plain form
6306 1521324 -5862259 -11362112 -15430355 -18382192 -18202597 -13004253 -4870028 1079784
6298 1079784 1957934 -152133 -1545990 -1725157 -3570113 -9190326 -16863752 -22254900 -21967590
6289 -21967590 -15960422 -7434791 -720050 1541142 -103396 -3226575 -6220807 -8958573
6281 -8958573 -10867349 -10137939 -6201219 -1712499 65619 -536580 -203076 2518443 5452725
6272 5452725 6657116 7480118 10014584 13615516 16411460 18714624 21709817 23343465
6264 23343465 19400391 10019107 2065449 2239207 8952503 13573467 9764898 -177249
6256 -177249 -8575825 -10367764 -6966409 -3245974 -2260059 -3188754 -3395532 -1379661 2344463
6247 2344463 6327039 9258550 10121564 8239819 3937167 -944339 -3837885 -3289584 -77477
$$ packed form
6306A521324p383583n499853m068243k951837J79595N198344Q134225N949812
6298A079784Q78150k110067j393857j79167j844956n620213p673426n391148K87310
6289b1967590O007168Q525631O714741K261192j644538l123179k994232k737766
6281h958573j908776P29410L936720M488720J778118o02199L33504K721519K934282
6272E452725J204391Q23002K534466L600932K795944K303164K995193J633648
6264B3343465l943074r381284p953658J73758O713296M620964l808569r942147
6256a77249q398576j791939L401355L720435R85915r28695k06778K015871L724124
6247B344463L982576K931511Q63014j881745m302652m881506k893546N48301L212107
$$ plain form
6238 -77477 3623406 6082873 6802503 5782244 2929066 -1325900 -5491547 -7870778 -7657213
6229 -7657213 -4804357 159802 5052326 6091219 1634210 -4309840 -5335798 -341279
6221 -341279 4960288 5787309 4204439 4301163 4720983 1173235 -5067373 -7502696 -4253881
6212 -4253881 -1454132 -3756623 -6848712 -4534543 485117 -406685 -8999511 -16973255
6204 -16973255 -16554061 -9219591 -1675399 2317545 3006481 1156405 -2413351 -5539522
6196 -5539522 -6457238 -5919267 -4995192 -2284394 3340576 8301771 6763095 -1972055 -11751920
6187 -11751920 -16175996 -14513600 -10747020 -9573993 -13861867 -22765890 -31074394 -33371179
6179 -33371179 -30163917 -26716585 -24529406 -18513539 -5767498 7419734 12700661 10774067
$$ packed form
6238g7477L700883K459467P19630j020259k853178m254966m165647k379231K13565
6229g657213K852856M964159M892524J038893m457009n944050j025958M994519
6221c41279N301567Q27021j582870R6724M19820l547748o240608k435323L248815
6212d253881K799749k302491l092089K314169N019660q91802q592826p973744
6204a6973255M19194P334470P544192L992944O88936j850076l569756l126171
6196e539522r17716N37971R24075K710798N624970M961195j538676q735150r779865
6187a1751920m424076J662396L766580J173027m287874q904023q308504k296785
6179c3371179L207262L447332K187179O015867J2746041J3187232N280927j926594
$$ plain form
6171 10774067 8978416 9462879 7314070 1071817 -2831247 299650 5711321 6260792
6163 6260792 2577161 311261 528420 -346125 -2314802 -644384 6018939 12304161 13224779
6154 13224779 10065190 6642631 3931685 1720938 1903319 5701017 9954155 10738903
6146 10738903 9230156 9330215 10553135 8925821 5330862 6590138 15331951 24075018
6138 24075018 24019125 16186829 8760308 5905161 5079917 4136634 4372057 5591825 4411931
6129 4411931 227773 -2097061 998787 6239595 8520894 8131096 8830481 11556081 14691339
6120 14691339 18312871 22831896 24852141 20442745 12623285 9604257 14041231 19270202
6112 19270202 18530525 13258114 9167398 8136752 7886188 6871574 5337713 3080214
$$ packed form
6171A0774067j795651M84463k148809o242253l903064L130897N411671N49471
6163F260792l683631k265900K17159q74545j968677J670418O663323O285222R20618
6154A3224779l159589l422559k710946k210747J82381L797698M253138P84748
6146A0738903j508747J00059J222920j627314l594959J259276Q741813Q743067
6138B4075018n5893p832296p426521k855147q25244r43283K35423J219768j179894
6129D411931m184158k324834L095848N240808K281299l89798O99385K725600L135258
6120A4691339L621532M519025K020245m409396p819460l019028M436974N228971
6112A9270202p39677n272411m090716j030646k50564j014614j533861k257499
$$ plain form
6104 3080214 -88563 -2446188 -2177267 -737695 -1554025 -5188759 -8011154 -6227045 -62475
6095 -62475 6215130 7966465 4522839 288855 307413 4309910 7045433 5158258 1077392
6086 1077392 -1292308 -1538985 -950530 902732 3928169 4534610 -100501 -6178637 -7029809
6077 -7029809 -2353894 1837074 3107700 6304008 14676982 22696921 22581074 15127739
6069 15127739 8965389 9601736 13380144 13313708 8266188 4330884 7338401 15270401 19680225
6060 19680225 15308701 6371707 862256 290996 -377487 -2767768 -1472246 6286028
6052 6286028 12988390 9311446 -2179151 -8873646 -3957501 5739993 9610403 5757312
6044 5757312 485581 -645595 2869341 8675580 13609381 14195000 8808506 -70448
$$ packed form
6104C080214l168777k357625K68921J439572q16330l634734k822395J784109O164570
6095f2475O277605J751335l443626m233984J8558M002497K735523j887175m080866
6086A077392k369700k46677N88455J853262L025437O06441m635111o078136q51172
6077g029809M675915M190968J270626L196308Q372974Q019939j15847p453335
6069A5127739o162350O36347L778408o6436n047520l935304L007517P932000M409824
6060A9680225m371524q936994n509451n71260o68483k390281J295522P758274
6052F286028O702362l676944j1490597o694495M916145R697494L870410l853091
6044E757312n271731j131176L514936N806239M933801N85619n386494q878954
$$ plain form
6036 -70448 -7844778 -11974998 -12477571 -9417350 -3158171 3009482 4355650 435134 -3516987
6027 -3516987 -2922194 639266 2387000 704928 -2152309 -4124395 -4915386 -4253392 -1844811
6018 -1844811 912492 2084040 2308413 3885763 6388744 6457330 3054820 -455846 -1489925
6009 -1489925 -2388287 -6401006 -11794860 -13645498 -10658983 -6929450 -6928085 -11263342 -17375990
6000 -17375990 -22033102 -22921318 -19975491 -15698638 -12726250 -11169907 -9904721 -9580165
5992 -9580165 -11407838 -13110188 -9933664 -1258274 7160332 10196052 9994102 12116621
5984 12116621 16769178 18429003 14420249 9178737 7457956 6663580 106973 -13135701
5976 -13135701 -25746861 -30314724 -26701234 -19861248 -13486031 -8568077 -5891156 -5834461
$$ packed form
6036g0448p774330m130220n02573L060221O259179O167653J346168l920516l952121
6027c516987N94793L561460J747734j682072k857237j972086p90991O61994K408581
6018a844811K757303J171548K24373J577350K502981O8586l402510l510666j034079
6009a489925q98362m012719n393854j850638K986515L729533J365m335257o112648
6000a7375990m657112q88216K945827M276853K972388J556343J265186L24556
5992i580165j827673j702350L176524Q675390Q418606L035720k01950K122519
5984A2116621M652557J659825m008754n241512j720781p94376o556607j3242674
5976a3135701j2611160m567863L613490O839986O375217M917954K676921N6695
$$ plain form
5968 -5834461 -6028028 -2846460 3915246 10361614 13056544 11910651 8299224 3389744
5960 3389744 -775052 -1830309 -436878 -231400 -2677791 -4978558 -5165825 -5763512 -9201921
5951 -9201921 -12820978 -12677088 -9969138 -8932178 -9808019 -8914510 -5228456 -2093958 -2094423
5942 -2094423 -4474541 -8049301 -12465641 -15884491 -15636689 -12460725 -10358470 -10929132 -11367616
5933 -11367616 -9274104 -5679260 -1922166 2218356 5052531 1986537 -8347128 -19988218
5925 -19988218 -25507684 -23975206 -19690708 -14998958 -8624003 -467637 6342263 9585738
5917 9585738 11426427 15612525 21955502 25492637 22176763 14601598 9814083 10592568
5909 10592568 11611788 6854559 -1794183 -7845573 -10371174 -14456673 -20853721 -22164671
$$ packed form
5968e834461j93567L181568O761706O446368K694930j145893l611427m909480
5960C389744m164796j055257J393431K05478k446391k300767j87267n97687l438409
5951i201921l619057J43890K707950J036960q75841Q93509L686054L134498m65
5942b094423k380118l574760m416340l418850K47802L175964K102255n70662m38484
5933a1367616K093512L594844L757094M140522K834175l065994j0333665j1641090
5925a9988218n519466J532478M284498M691750O374955Q156366O809900L243475
5917I585738J840689M186098O342977L537135l315874p575165m787515P78485
5909A0592568J019220m757229q648742o051390k525601m085499o397048j310950
$$ plain form
5901 -22164671 -13027192 1006177 9409985 8293470 2099089 -3226162 -4324604 4961
5893 4961 8535176 17396038 23009577 24224023 20042348 8866487 -6418873 -16420007
5885 -16420007 -14109967 -4055034 2689851 1860555 -1218851 -1209351 1232389 3721109 6180472
5876 6180472 8120199 6726620 978677 -5408301 -8006263 -6558412 -3823747 -1658010
5868 -1658010 -341621 -152659 -1453482 -3871027 -6633029 -9277085 -11638473 -13814843
5860 -13814843 -15979738 -17258919 -15574382 -10420933 -5064524 -3454528 -5146906 -5950363
5852 -5950363 -3699142 -558534 833225 539361 -339400 -1728521 -3527138 -4754307 -5250318
5843 -5250318 -6287096 -8018550 -8219098 -5368225 -1508776 43894 -897462 -1255129 1036500
$$ packed form
5901b2164671R137479J4033369Q403808j116515o194381n325251j098442M329565
5893D961Q530215Q860862N613539J214446m181675j1175861j5285360j0001134
5885a6420007K310040J0054933O744885q29296l079406R500K441740K488720K459363
5876F180472J939727j393579n747943o386978k597962J447851K734665K165737
5868a658010J316389J88962j300823k417545k762002k644056k361388k176370
5860a3814843k164895j279181J684537N153449N356409J609996j692378q03457
5852e950363K251221L140608J391759k93864q78761j389121j798617j227169m96011
5843e250318j036778j731454k00548K850873L859449J552670r41356l57667K291629
$$ plain form
5834 1036500 4300591 5648993 5386596 6887244 11064087 13027101 7668589 -1794593
5826 -1794593 -5593825 261111 8057638 8778418 4475173 4435573 11395849 18511757 19778214
5817 19778214 16669715 13168010 10461333 9017141 10459828 14115441 15949326 14090660
5809 14090660 11655633 11099569 9685242 4260183 -2841943 -6891163 -7296205 -6825663 -5989438
5800 -5989438 -2446503 4473562 12044980 17091129 18569142 17398183 15117881 12311952
5792 12311952 7900895 1277096 -5091708 -8139083 -9486019 -13779532 -20151129 -20765974
5784 -20765974 -11823927 -1231754 418884 -6570726 -12568953 -11704496 -6806487 -2159372
5776 -2159372 1434887 3075920 -119559 -7882583 -14161142 -13481137 -7633743 -3051960
$$ packed form
5834A036500L264091J348402k62397J500648M176843J963014n358512r463182
5826a794593l799232N854936P796527P20780m303245l9600O960276P115908J266457
5817A9778214l108499l501705k706677j444192J442687L655613J833885j858666
5809A4090660k435027n56064j414327n425059p102126m049220m05042M70542Q36225
5800e989438L542935O920065P571418N046149J478013j170959k280302k805929
5792A2311952m411057o623799o368804l047375j346936m293513o371597o14845
5784b0765974Q942047J0592173J650638o989610n998227Q64457M898009M647115
5776b159372L594259J641033l195479p763024o278559O80005N847394M581783
$$ plain form
5768 -3051960 -3041921 -5100018 -5119924 -2194813 940479 1416929 -312897 -1253117 -328302
5759 -328302 -181961 -2663299 -4402190 -473289 7938568 13508462 11459611 4890778 -319852
5750 -319852 -2777667 -4738175 -6040901 -3074062 5439488 14615205 17822965 14128261
5742 14128261 8911137 6671963 5926845 3376951 673575 2602018 9017830 13918307
5734 13918307 14163327 13820023 16432692 17992521 13095137 4517395 -114403 523372 738805
5725 738805 -1989332 -3485249 -1137568 1200239 -117852 -2548843 -2239392 -591496 -1336756
5716 -1336756 -4100316 -5597494 -5372961 -5803418 -7118190 -6434357 -2076707 3966366 8406292
5707 8406292 9604603 7945976 4762805 1210799 -2491121 -6591393 -10395017 -12218286
$$ packed form
5768c051960J0039k058097j9906K925111L135292M76450j729826r40220R24815
5759c28302J46341k481338j738891L928901Q411857N569894k048851o568833n210630
5750c19852k457815j960508j302726K966839Q513550R175717L207760l694704
5742A4128261n217124k239174p45118k549894k703376J928443O415812M900477
5734A3918307K45020l43304K612669J559829m897384q577742m631798O37775K15433
5725G38805k728137j495917K347681K337807j318091k430991L09451J647896p45260
5716a336756k763560j497178K24533m30457j314772O83833M357650O043073M439926
5707H406292J198311j658627l183171l552006l701920m100272l803624j823269
$$ plain form
5699 -12218286 -11171565 -7972938 -3671978 1205675 6044870 10105376 13051468 13901264
5691 13901264 10435747 2890564 -2530525 1019887 11151033 17324705 14405816 9174689
5683 9174689 8962687 9945627 4145819 -6059399 -9841383 -3580376 4464846 6871246
5675 6871246 6335968 8624984 12942962 14583513 12857710 10990299 10384321 9436680 6814003
5666 6814003 2570349 -2843144 -7961729 -10089027 -8417914 -6172925 -7137254 -11147679
5658 -11147679 -15076287 -16537108 -14316346 -7630196 1318969 5985910 1492154 -8420892
5650 -8420892 -14901194 -14522123 -11839991 -11103951 -10890200 -9203637 -8745237 -12781293 -18834940
5641 -18834940 -20988286 -16996015 -9505751 -1761496 3900777 4579536 -979481 -8175560
$$ packed form
5699a2218286J046721L198627M300960M877653M839195M060506K946092Q49796
5691A3901264l465517p545183n421089L550412J0131146O173672k918889n231127
5683I174689k12002R82940n799808j0205218l781984O261007Q045222K406400
5675F871246n35278K289016M317978J640551j725803j867411o05978r47641k622677
5666F814003m243654n413493n118585k127298J671113K244989r64329m010425
5658a1147679l928608j460821K220762O686150Q949165M666941m493756r913046
5650h420892o480302L79071K682132P36040K13751J686563M58400m036056o053647
5641a8834940k153346L992271P490264P744255N662273O78759n559017p196079
$$ plain form
5633 -8175560 -9585878 -4396180 -741772 -5477690 -14798266 -19170258 -15591143 -9917336
5625 -9917336 -7256028 -5567934 -1262935 3141476 1591122 -6561356 -14460300 -15376129
5617 -15376129 -9705084 -3311225 -980597 -2893030 -6176172 -8376435 -9643024 -11938435
5609 -11938435 -15791457 -18642619 -18252634 -17028004 -19369360 -23968957 -23301355 -13850614
5601 -13850614 -2735021 991263 -1059062 747077 9562524 17578712 17951598 14456491
5593 14456491 15021121 20477946 24923152 24432696 20478474 16136847 13124444 11902524
5585 11902524 11485318 9876300 7136145 6409068 9187927 11787774 10208338 6493943
5577 6493943 5777338 8306705 9243721 5873833 298590 -4961145 -9346304 -11851561 -10733018
$$ packed form
5633h175560j410318N189698L654408m735918r320576m371992L579115N673807
5625i917336K661308J688094M304999M404411j550354q152478p898944r15829
5617a5376129N671045O393859K330628j912433l283142k200263j266589k295411
5609a1938435l853022k851162L89985J224630k341356m599597O67602R450741
5601a3850614J1115593L726284k050325J806139Q815447Q016188L72886l495107
5593A4456491N64630N456825M445206m90456l954222m341627l012403j221920
5585A1902524m17206j609018k740155p27077K778859K599847j579436l714395
5577F493943p16605K529367R37016l369888n575243n259735m385159k505257J118543
$$ plain form
5568 -10733018 -6538050 -1828139 2274907 5505400 5148541 -1378955 -10524709 -15008444
5560 -15008444 -13160712 -9966177 -7722517 -2660242 6563013 14160854 15231834 12325662
5552 12325662 9451250 5642223 17604 -2601761 1862285 8967860 11358479 8473695
5544 8473695 3782116 -3567228 -15585642 -26541557 -27141444 -17850308 -9354761 -8471653
5536 -8471653 -11442303 -12982488 -14018548 -16836777 -18997757 -16626723 -9703692 -763440
5528 -763440 8129861 14626605 16205218 13886388 12541177 14871181 18003717 18281908 16325651
5519 16325651 14866531 14343366 13261281 10874084 7455914 3683598 1131408 1476850
5511 1476850 4301751 7669283 10936421 14121634 14889499 10665897 4347924 2714813
$$ packed form
5568a0733018M194968M709911M103046L230493l56859o527496r145754m483735
5560a5008444J847732L194535K243660N062275R223255P597841J070980k906172
5552A2325662k874412l809027n624619k619365M464046P105575K390619k884784
5544H473695m691579p349344j2018414j0955915n99887R291136Q495547Q83108
5536h471653k970650j540185j036060k818229k160980K371034O923031Q940252
5528g63440Q893301O496744J578613k318830j345211K330004L132536K78191j956257
5519A6325651j459120n23165j082085k387197l418170l772316k552190L45442
5511A476850K824901L367532L267138L185213P67865m223602o317973j633111
$$ plain form
5503 2714813 7292770 11806480 11233032 8326514 7717957 8476690 7319653 5435835 6645625
5494 6645625 10811503 13848166 13088208 8925376 2619570 -3877759 -7265906 -5637502
5486 -5637502 -1029350 3341721 6750703 9409029 10000207 8538531 9182799 15375065 23577513
5477 23577513 26756489 23523032 19202333 18105971 19470856 21350448 23609402 25514027
5469 25514027 24446295 19322062 12638007 7335831 3817888 1423061 435240 673010
5461 673010 -102488 -3976383 -9537125 -12473131 -9871178 -3262317 2966523 6011167 6866356
5452 6866356 7624075 7662973 4711906 -373689 -3054846 -1051264 1706138 -311732 -7259995
5443 -7259995 -14145487 -16731519 -14509971 -8908044 -1846578 3969421 6364283 6243887
$$ packed form
5503B714813M577957M513710n73448k906518o08557P58733j157037j883818J209790
5494F645625M165878L036663p59958m162832o305806o497329l388147J628404
5486e637502M608152M371071L408982K658326N91178j461676O44268O192266Q202448
5477B3577513L178976l233457m320699j096362J364885J879592K258954J904625
5469B5514027j067732n124233o684055n302176l517943k394827r87821K37770
5461F73010p75498l873895n560742k936006K601953O608861O228840L044644Q55189
5452F866356P57719L8898k951067n085595k681157K003582K757402k017870o948263
5443g259995o885492k586032K221548N601927P061466N815999K394862j20396
$$ plain form
5435 6243887 6982327 10367935 14145386 14096844 8259499 -696377 -7206601 -7800380 -4360721
5426 -4360721 -1072176 1255885 4745203 8296525 6780757 -989761 -7885357 -6511908
5418 -6511908 1095958 6400165 5053612 72787 -4294830 -7028829 -8968486 -11125806
5410 -11125806 -14481299 -18430532 -20114883 -18158445 -15419184 -14519220 -12995138 -7782526
5402 -7782526 -2325407 -2792697 -8144101 -11019719 -8899149 -7157918 -9442021 -12259562
5394 -12259562 -12229710 -12055287 -14775439 -17283672 -14625808 -7176263 897597 7227214 11125825
5385 11125825 10875674 5878588 -231712 -2815186 -1503959 944791 3525554 7207697
5377 7207697 11462179 14226361 15085705 15588726 16404047 16472090 15138324 13492159 13312244
$$ packed form
5435F243887P38440L385608L777451m8542n837345q955876o510224n93779L439659
5426d360721L288545K328061L489318L551322j515768p770518o895596J373449
5418f511908P607866N304207j346553m980825m367617k733999j939657k157320
5410a1125806l355493l949233j684351J956438K739261Q99964J524082N212612
5402g782526N457119m67290n351404k875618K120570J741231k284103k817541
5394a2259562K9852J74423k720152k508233K657864P449545Q073860O329617L898611
5385A1125825k50151m997086o110300k583474J311227K448750K580763L682143
5377G207697M254482K764182Q59344N03021Q15321O8043j333766j646165j79915
$$ plain form
5368 13312244 15186122 17260352 16198327 11152534 6456924 7258877 12074882 13756674
5360 13756674 9360322 4325477 3720644 4082419 -826322 -9468629 -14201275 -12306868
5352 -12306868 -8982053 -8708165 -9380144 -7179891 -2761609 723543 3033008 6546917
5344 6546917 11146258 12432161 6648965 -3374944 -9279858 -5831707 2470047 6465513
5336 6465513 4281148 3974411 11698877 21502987 22320972 13034704 3974287 2843659 5454231
5327 5454231 3313685 -4677029 -12689822 -16887364 -18286504 -17643260 -13387772 -6722563
5319 -6722563 -4305046 -11380546 -23499105 -29419656 -23400712 -11608309 -4368899 -4412486
5311 -4412486 -5730430 -2666378 3807521 9319981 11965478 12911653 13314537 12895810 10771450
$$ packed form
5368A3312244J873878K074230j062025n045793m695610Q01953M816005J681792
5360A3756674m396352n034845o04833L61775m908741q642307m732646J894407
5352a2306868L324815K73888o71979K200253M418282L485152K309465L513909
5344F546917M599341J285903n783196j0023909n904914L448151Q301754L995466
5336F465513k184365l06737P724466R804110Q17985r286268r060417j130628K610572
5327E454231k140546p990714q012793m197542j399140O43244M255488O665209
5319f722563K417517p075500j2118559n920551O018944J1792403P239410m3587
5311d412486j317944L064052O473899N512460K645497R46175M02884m18727k124360
$$ plain form
5302 10771450 6364082 229441 -5352654 -7915935 -7711400 -7478873 -8284548 -7380929 -1855546
5293 -1855546 6886887 13975411 15713741 12509317 8394866 8376997 14356620 22186006 24258050
5284 24258050 16509616 1975705 -12652912 -21564557 -21020715 -10956477 1965532 7598603
5276 7598603 3290569 -1619600 2680998 13439454 19974468 18912166 16646516 16697597
5268 16697597 13770228 3968344 -6593021 -9287495 -4503876 207908 625053 -1166648
5260 -1166648 -2547260 -3431387 -3618443 -1767696 2058115 5975124 8774210 10001903 7803009
5251 7803009 500599 -8939413 -13879032 -11254025 -4812800 641279 4811056 8927286
5243 8927286 10753683 7611085 3064758 4943874 15314559 26533081 29459393 22677280
$$ packed form
5302A0771450m407368o134641n582095k563281K04535K32527q05675R03619N525383
5293a855546Q742433P088524J738330l204424m114451j7869N979623P829386K072044
5284B4258050p748434j4533911j4628617q911645N43842J0064238J2922009N633071
5276G598603m308034m910169M300598J0758456O535014j062302k265650N1081
5268A6697597k927369r801884j0561365k694474M783619M711784M17145j791701
5260a166648j380612q84127j87056J850747L825811L917009K799086J227693k198894
5251G803009p302410r440012m939619K625007O441225N454079M169777M116230
5243H927286J826397l142598m546327J879116J0370685J1218522K926312o782113
$$ plain form
5235 22677280 11479645 725414 -7993190 -14000891 -16485266 -16155422 -15408347 -16091220
5227 -16091220 -18108214 -19837687 -18947160 -14163803 -7990293 -5844766 -9462171 -12476662
5219 -12476662 -6710433 7051769 18643374 20002134 13586900 7779045 7129471 9472509
5211 9472509 10381450 7931191 4006667 2266862 4021762 6089566 4647814 942979
5203 942979 -58932 2848246 4898849 2087981 -3708484 -8281886 -9848221 -7988516
5195 -7988516 -2382594 3863588 4131901 -3420192 -10957379 -10071392 -3121079 909186 -37790
5186 -37790 630680 6078738 10205940 7147496 659802 -750836 5124808 12400715 14932253
5177 14932253 12367266 8394531 5343194 1630394 -5579589 -15667101 -23865553 -26444209
$$ packed form
5235B2677280j1197635j0754231q718604o007701k484375L29844P47075o82873
5227a6091220k016994j729473Q90527M783357O173510K145527l617405l014491
5219a2476662N766229J3762202J1591605J358760o415234n807855o49574K343038
5211I472509R08941k450259l924524j739805J754900K067804j441752l704835
5203I42979j001911K907178K050603k810868n796465m573402j566335J859705
5195g988516N605922O246182K68313p552093p537187Q85987O950313M030265r46976
5186c7790O68470N448058M127202l058444o487694j410638N875644P275907K531538
5177A4932253k564987l972735l051337l712800p209983j0087512q198452k578656
$$ plain form
5169 -26444209 -25282968 -25015975 -26334091 -25084241 -18455079 -9398165 -3589028 -3503957 -6523795
5160 -6523795 -8000455 -5688122 -1763130 -459336 -3296860 -7465683 -9598502 -9517350 -8683235
5151 -8683235 -6785198 -2571089 2973840 7132880 8712407 8406145 6627328 3606752
5143 3606752 944162 132030 26043 -1193815 -2129568 31754 3679386 2820260 -5471508
5134 -5471508 -16575523 -23071554 -22043065 -16372131 -10494779 -6331854 -2710956 1959324
5126 1959324 6607294 8092376 5482777 1845947 126717 -632047 -2458527 -4036299
5118 -4036299 -2618586 1180970 4206818 5065243 3789410 -1207148 -10908651 -21065675
5110 -21065675 -24999487 -21602778 -16347154 -14080837 -14872927 -16824737 -18426365 -18004721
$$ packed form
5169b6444209J161241K66993j318116J249850O629162R056914N809137Q5071l019838
5160f523795j476660K312333L924992J303794k837524m168823k132819Q1152Q34115
5151h683235J898037M214109N544929M159040J579527l06262j778817l020576
5143C606752k662590q12132j05987j219858r35753K161322L647632q59126q291768
5134e471508j1104015o496031J028489N670934N877352M162925L620898M670280
5126A959324M647970J485082k609599l636830j719230p58764j826480j577772
5118d036299J417713L799556L025848Q58425j275833m996558r701503j0157024
5110b1065675l933812L396709N255624K266317p92090j951810j601628M21644
$$ plain form
5102 -18004721 -15303647 -13461465 -14820013 -15755408 -11650502 -6058137 -7085772 -14176819
5094 -14176819 -17382082 -12234549 -6272773 -6395431 -8554270 -6640756 -4110359 -8156010
5086 -8156010 -17051868 -21961693 -18886954 -11276340 -2447838 7199083 15650565 18546414
5078 18546414 14489303 7178971 1458658 -303820 1457475 4124147 4621735 2692971
5070 2692971 1181111 1568699 1929311 1277326 2072817 5024145 5443930 -305285 -7766555
5061 -7766555 -9248049 -3846659 2437993 5020999 4244115 2071283 468128 2147538
5053 2147538 7783135 12701917 10818954 1765022 -9453954 -18647888 -24102563 -23828961
5045 -23828961 -16939926 -7533375 -1677907 51625 2179918 6056023 7250402 2665013
$$ packed form
5102a8004721K701074J842182j358548r35395M104906N592365j027635p091047
5094a4176819l205263N147533N961776j22658k158839J913514K530397m045651
5086h156010q895858m909825L074739P610614Q828502R646921Q451482K895849
5078A8546414m057111p310332n720313j762478J761295K666672M97588j928764
5070B692971j511860L87588L60612o51985P95491K951328M19785n749215p461270
5061g766555j481494N401390O284652K583006p76884k172832j603155J679410
5053B147538N635597M918782j882963r053932j1218976r193934n454675K73602
5045b3828961O889035R406551N855468J729532K128293L876105J194379m585389
$$ plain form
5037 2665013 -4471322 -8858186 -8780819 -5677314 -1361926 2249876 3247946 1632461 -453985
5028 -453985 -1539358 -2351440 -3852017 -5320413 -5117454 -2483929 1317017 3034745 -44842
5019 -44842 -6320617 -10621947 -10724340 -10471894 -13204350 -15052915 -10047636 -300338 5311477
5010 5311477 3211173 -144146 2183918 8424238 12051963 11386982 10666683 12633619 14323148
5001 14323148 11742924 6419085 4249466 7344730 9971764 5768990 -2504473 -5202675
4993 -5202675 1702513 11496144 16179254 15793359 14642236 13174291 9092682 3211386
4985 3211386 -1630871 -5545524 -10280411 -14574428 -15695988 -14097776 -12054622 -9607519
4977 -9607519 -6435673 -5195125 -7521661 -9157956 -5290863 1200957 3374637 439150
$$ packed form
5037B665013p136335m386864P7367L103505M315388L611802R98070j615485k086446
5028d53985j085373q12082j500577j468396K02959K633525L800946J717728l079587
5019d4842o275775m301330j02393K52446k732456j848565N005279R747298N611815
5010E311477k100304l355319K328064O240320L627725o64981p20299J966936J689529
5001A4323148k580224n323839k169619L095264K627034m202774q273463k698202
4993e202675O905188R793631M683110l85895j151123j467945m081609n881296
4985C211386m842257l914653m734887m294017j121560J598212K043154K447103
4977i607519L171846J240548k326536j636295L867093O491820K173680k935487
$$ plain form
4969 439150 -2514640 -3429485 -4238021 -3830306 1373876 9163112 12066791 7944892 2828369
4960 2828369 1416606 1884089 2299440 4960537 10963106 16497878 18191511 17462026 16733565
4951 16733565 15624891 13330819 11029905 10160586 11380359 15234328 20022679 20372256
4943 20372256 13581755 5994350 5915859 11093086 11636555 5387916 878385 3394308 7756459
4934 7756459 8160746 6341845 5922316 6360440 6338279 6132613 3775379 -3457113 -11267748
4925 -11267748 -11047395 -3592708 -261733 -5794065 -9968854 -2683202 11601493 21340992
4917 21340992 21881254 15360866 4648032 -5326121 -7329393 -438804 6757493 7366631
4909 7366631 4466476 3604178 4885448 7472798 12836456 17667549 13568962 1045590
$$ packed form
4969D39150k953790r14845q08536M07715N204182P789236K903679m121899n116523
4960B828369j411763M67483M15351K661097O002569N534772J693633p29485p28461
4951A6733565j108674k294072k300914q69319J219773L853969M788351L49577
4943B0372256o790501p587405p8491N177227N43469o248639m509531K515923M362151
4934G756459M04287j818901m19529M38124k2161k05666k357234p232492p810635
4925a1267748K20353P454687L330975n532332m174789P285652J4284695R739499
4917B1340992N40262o520388j0712834r974153k003272O890589P196297O09138
4909G366631k900155q62298J281270K587350N363658M831093m098587j2523372
$$ plain form
4901 1045590 -6328958 -113092 10346562 12259056 6644910 1938223 203962 -226880
4893 -226880 2121907 6105681 4908560 -1917874 -4396669 770118 2773247 -3134153
4885 -3134153 -4697454 4520147 10058993 1790819 -5557873 1572801 10311764 8156556
4877 8156556 11332803 32816566 48931119 46690139 81050664 213379380 391513034
4870 391513034 469065219 375757440 206684759 100249667 80557056 74394631 40087094
4863 40087094 6912430 2007285 8361475 5596565 1249837 4573474 6004626 -811325
4855 -811325 -4524130 2245454 9531275 9756872 9964414 13848538 11601230 -805766 -10129113
4846 -10129113 -5917277 3075479 4381934 471738 390200 4440258 8592093 14120762
$$ packed form
4901A045590p374548O215866J0459654J912494n614146m706687j734261m30842
4893b26880K348787L983774j197121o826434k478795N166787K003129n907400
4885c134153j563301R217601N538846q268174p348692P130674Q738963k155208
4877H156556L176247K1483763J6114553k240980L4360525J32328716J78133654
4870C91513034P7552185r3307779j69072681j06435092j9692611o162425l4307537
4863D0087094l3174664m905145O354190k764910m346728L323637J431152o815951
4855h11325l712805O769584P285821K25597K07542L884124k247308j2406996r323347
4846a0129113M211836Q992756J306455l910196q1538M050058M151835N528669
$$ plain form
4838 14120762 21721454 24485871 17468640 7490329 3828143 5137149 4451064 1525938
4830 1525938 1203452 3764714 5312664 4865793 4142780 2870767 262213 -1214230 1361271
4821 1361271 6923055 12556190 17154495 19719275 17964187 12373632 7538142 5426110
4813 5426110 1732947 -6326966 -12938320 -10372254 99673 9823464 13437815 12487590
4805 12487590 9758209 5915071 2450653 3327772 11308184 24057522 34934646 37704927
4797 37704927 31487816 21751697 15358524 14014017 13586014 9724726 2421773 -4673237
4789 -4673237 -7140427 -2381747 7722560 16850564 20065190 19561275 21425369 27211884
4781 27211884 32720151 34571772 33079468 28776021 21949639 16328899 16880195 22165922
$$ packed form
4838A4120762P600692K764417p017231r978311l662186J309006o86085k925126
4830A525938l22486K561262J547950m46871p23013j272013k608554j476443K575501
4821A361271N561784N633135M598305K564780j755088n590555m835490k112032
4813E426110l693163q059913o611354K566066J0471927R723791L614351r50225
4805A2487590k729381l843138l464418Q77119P980412J2749338J0877124K770281
4797C7704927o217111r736119o393173j344507m28003l861288p302953p095010
4789d673237k467190M758680J0104307R128004L214626n03915J864094N786515
4781B7211884N508267J851621j492304m303447o826382n620740N51296N285727
$$ plain form
4773 22165922 25055472 23104897 21510411 22842887 21357832 12583765 1993914 -2306803
4765 -2306803 -518355 1727347 2696325 3904177 3861891 418016 -2956418 -1461322 1405882
4756 1405882 -2908635 -14013226 -19815462 -11251703 5921895 18089466 18710180 12515618
4748 12515618 7655503 7992332 12373926 17685172 21229372 21738485 19742929 17194329
4740 17194329 16057121 16742305 18074123 18880349 18788280 17124581 12921808 7760732 6530673
4731 6530673 11887061 18979433 19936293 13612255 6423573 2946196 904174 -2533983
4723 -2533983 -4746204 -1720117 5494502 12205883 15438125 14857345 11060617 6165912
4715 6165912 3870910 5938120 10188381 13415605 13510702 7993516 -4245328 -17219144
$$ packed form
4773B2165922K889550j950575j594486J332476j485055q774067j0589851m300717
4765b306803J788448K245702R68978J207852m2286l443875l374434J495096K867204
4756A405882m314517j1104591n802236Q563759J7173598J2167571O20714o194562
4748A2515618m860115L36829M381594N311246L544200N09113j995556k548600
4740A7194329j137208O85184J331818Q06226r2069j663699m202773n161076j230059
4731F530673N356388P092372R56860o324038p188682l477377k042022l438157
4723b533983k212221L026087P214619O711381L232242n80780l796728m894705
4715F165912k295002K067210M250261L227224R5097n517186j2238844j2973816
$$ plain form
4707 -17219144 -20107986 -10162256 1925881 5285747 2473934 2911598 7488806 8811716
4699 8811716 4323914 -487669 -1894280 -2175418 -3008509 -2575152 -1104725 -2027344 -5156353
4690 -5156353 -5336104 -790581 3145328 1908895 -1876878 -3227882 -1492917 1015293
4682 1015293 2950241 3349000 943327 -2896385 -4124551 -1837907 -525861 -3525266
4674 -3525266 -7896360 -9173326 -7689017 -6359423 -5389219 -3598167 -2579654 -4748112
4666 -4748112 -8476664 -9614023 -7511071 -5698979 -6233093 -6526737 -2905477 4453157 11063015
4657 11063015 12120754 7086364 625991 -1661522 1274014 5610011 7576229 6812639
4649 6812639 4667085 1821620 -1022123 -2253921 -1128352 611326 414308 -1966770
$$ packed form
4707a7219144k888842R945730J2088137L359866k811813M37664M577208J322910
4699H811716m487802m811583j406611k81138q33091M33357J470427r22619l129009
4690e156353j79751M545523L935909j236433l785773j351004J734965K508210
4682A015293J934948L98759k405673l839712j228166K286644J312046k999405
4674c525266m371094j276966J484309J329594R70204J791052J018513k168458
4666d748112l728552j137359K102952J812092n34114k93644L621260P358634O609858
4657A1063015J057739n034390o460373k287513K935536M335997J966218p63590
4649F812639k145554k845465k843743j231798J125569J739678j97018k381078
$$ plain form
4641 -1966770 -3390059 659423 11559608 23795301 28092333 21495142 12181316 9612995
4633 9612995 11724644 8422103 -2660797 -12022774 -11978566 -6417561 -2652029 -803090
4625 -803090 2648251 6553396 7440337 6186804 5464272 3614045 -2066497 -8380200 -9656724
4616 -9656724 -6644345 -5137334 -6525922 -6308386 -1838701 4577863 10361217 14642180
4608 14642180 15689737 12402261 8555629 9380142 13439021 14354528 11309606 10492212 14112741
4599 14112741 15720857 10480518 3366186 1637443 4217163 4655295 1315948 -1532047
4591 -1532047 -1193413 331399 544603 -289083 -543535 677030 3097817 5392744 6042342
4582 6042342 5038790 3920214 3572414 3485741 3543695 4222864 4383868 1830718 -2761888
$$ packed form
4641a966770j423289M049482J0900185J2235693M297032o597191r313826k568321
4633I612995K111649l302541j1082900r361977M4208N561005L765532J848939
4625h03090L451341L905145Q86941j253533p22532j850227n680542o313703j276524
4616i656724L012379J507011j388588K17536M469685O416564N783354M280963
4608A4642180J047557l287476l846632Q24513M058879R15507l044922q17394L620529
4599A4112741J608116n240339p114332j728743K579720M38132l339347k847995
4591a532047L38634J524812K13204q33686k54452J220565K420787K294927O49598
4582F042342j003552j118576l47800q6673N7954O79169J61004k553150m592606
$$ plain form
4573 -2761888 -5825234 -6489644 -8318053 -12603014 -13894227 -6904564 4478565 10341071
4565 10341071 6449855 -1561100 -5911036 -4595984 -571699 3529879 7546707 12053225
4557 12053225 16346787 18328640 16274743 11027148 6111892 4914091 7547160 10599415
4549 10599415 9902756 4113995 -3568199 -7895864 -7324228 -6632525 -11431161 -20286416 -25395138
4540 -25395138 -21764277 -12668089 -4884089 -1728942 -2572296 -5967168 -10216273 -12651558
4532 -12651558 -11223819 -6486244 -1116553 1526895 -1199513 -8345029 -13848171 -11977174
4524 -11977174 -5138509 -1570417 -3890106 -5828581 -3265465 -1884218 -8335788 -19110518
4516 -19110518 -25053327 -23375387 -18407006 -13356503 -8432598 -4974846 -4165926 -3080254
$$ packed form
4573b761888l063346o64410j828409m284961j291213O989663J1383129N862506
4565A0341071l891216q010955m349936J315052M024285M101578M016828M506518
4557A2053225M293562J981853k053897n247595m915256j197801K633069L052255
4549A0599415o96659n788761p682194m327665N71636O91703m798636q855255n108722
4540b5395138L630861R096188P784000L155147q43354l394872m249105k435285
4532a2651558J427739M737575N369691K643448k726408p145516n503142J870997
4524a1977174O838665L568092k319689j938475K563116J381247o451570j0774730
4516a9110518n942809J677940M968381N050503M923905L457752Q08920J085672
$$ plain form
4508 -3080254 970363 3812407 -67510 -6778020 -6951827 -365023 3427918 872646
4500 872646 174964 6694798 12490922 8034770 -2846149 -8662855 -6733582 -4966621
4492 -4966621 -8383699 -11898260 -8389697 1030414 7731801 5074005 -4338798 -11350981
4484 -11350981 -10371611 -5282584 -3163672 -4248481 -3033903 1380611 2951367 -1332823
4476 -1332823 -5799769 -4440633 495441 3045383 2262261 1223483 873957 267078 325857
4467 325857 2153799 3488430 1452229 -2889854 -6725644 -9953335 -13259202 -14446050
4459 -14446050 -11625942 -7724127 -6554188 -6517390 -3662706 1145738 4197791 6029016
4451 6029016 9522356 12401356 9828303 4467344 5059482 12976238 18831359 16258692
$$ packed form
4508c080254M050617K842044l879917o710510j73807O586804L792941k555272
4500H72646o97682O519834N796124m456152j0880919n816706J929273J766961
4492d966621l417078l514561L508563R420111O701387k657796r412803p012183
4484a1350981R79370N089027K118912j084809J214578M414514J570756m284190
4476a332823m466946J359136M936074K549942p83122j038778l49526o06879N8779
4467C25857J827942J334631k036201m342083l835790l227691l305867j186848
4459a4446050K820108L901815J169939L6798K854684M808444L052053J831225
4451F029016L493340K879000k573053n360959N92138P916756N855121k572667
$$ plain form
4443 16258692 11079993 11261122 14698090 14419118 11071578 11437960 16244362 18020043 12455794
4434 12455794 5141818 3784568 8089607 11095289 8163528 1141251 -5326961 -8264873
4426 -8264873 -6967995 -2281845 2876820 4127824 -528323 -7597082 -11013564 -8635671
4418 -8635671 -3949020 -785401 1277418 4720383 9359245 12256980 11578572 8681348
4410 8681348 6859030 9167520 16337539 25293177 30821017 30274227 25611631 19787281
4402 19787281 13427053 7144216 4339521 7653127 13734684 15584371 10265855 1428460
4394 1428460 -5488218 -7535557 -4299023 2432234 8295298 8919246 4314702 -1112220
4386 -1112220 -3436856 -2430254 -125199 1615632 2180621 2948176 6538927 13075521 17977934
$$ packed form
4443A6258692n178699J81129L436968k78972l347540L66382M806402J775681n564249
4434A2455794p313976j357250M305039L005682k931761p022277o468212k937912
4426h264873J296878M686150N158665J251004m656147p068759l416482K377893
4418h635671M686651L163619K062819L442965M638862K897735o78408k897224
4410H681348j822318K308490P170019Q955638N527840n46790m662596n824350
4402A9787281o360228o282837k804695L313606O081557J849687n318516q837395
4394A428460o916678k047339L236534O731257N863064O23948m604544n426922
4386a112220k324636J006602K305055J740831N64989P67555L590751O536594M902413
$$ plain form
4377 17977934 16402945 9393249 2585251 -637232 -1267429 -565852 1727848 4410874
4369 4410874 4290991 487879 -3502932 -3382086 2302717 12050639 22063403 27165708
4361 27165708 24787789 18551730 14394923 12906756 9672537 3566389 -759492 -759988 -1074639
4352 -1074639 -6688066 -14448713 -15996409 -8064855 3413235 9520796 7186189 1843552
4344 1843552 1441471 7497523 13530830 13791234 10726037 10094687 11622986 10805643 8563331
4335 8563331 11094418 18937350 24044323 20989423 14578053 12487304 15868739 20935114
4327 20935114 24505281 24165780 18267303 9817648 5142356 4735539 1391872 -7972098
4319 -7972098 -15452250 -13539660 -6984336 -5147845 -7569351 -6340058 516807 7470815
$$ packed form
4377A7977934j574989p009696o807998l222483o30197P01577K293700K683026
4369D410874j19883l803112l990811J20846N684803R747922J0012764N102305
4361B7165708k377919o236059m156807j488167l234219o106148m325881m96l14651
4352a074639n613427p760647j547696P931554J1478090O107561k334607n342637
4344A843552m02081O056052O033307K60404l065197o31350J528299q17343k242312
4335H563331K531087P842932N106973l054900o411370k090749L381435N066375
4327B0935114L570167l39501n898477q449655m675292m06817l343667r363970
4319g972098p480152J912590O555324J836491k421506J229293O856865O954008
$$ plain form
4311 7470815 11337904 13515720 13358666 8546850 2431870 2331394 8970453 15090892 16108798
4302 16108798 15044338 15177948 15023845 13167527 11494679 10524615 7376057 1512274 -2978106
4293 -2978106 -4080279 -5376193 -8999247 -10255273 -4333455 5345396 10772058 9140919
4285 9140919 4461148 1101707 214146 1738564 5553047 9963608 12259438 12177934 12988850
4276 12988850 17581869 24143054 27272578 23992546 17484905 13162814 11664059 8788154
4268 8788154 3028707 -967034 604407 3934775 2723654 -2003832 -2833067 3559416
4260 3559416 11975004 15398870 11913385 4444724 -2118770 -2943735 3099397 10584253
4252 10584253 12476879 9170938 8304456 14106607 21636172 24080849 21349466 17963742
$$ packed form
4311G470815L867089K177816j57054m811816o114980j00476O639059O120439J017906
4302A6108798j064460J33610j54103j856318j672848r70064l148558n863783m490380
4293b978106j102173j295914l623054j256026N921818R678851N426662j631139
4285I140919m679771l359441q87561J524418L814483M410561K295830q1504Q10916
4276A2988850M593019O561185L129524l280032o507641m322091j498755k875905
4268H788154n759447l995741J571441L330368j211121m727486q29235O392483
4260C559416Q415588L423866l485485p468661o563494q24965O043132P484856
4252A0584253J892626l305941q66482N802151P529565K444677k731383l385724
$$ plain form
4244 17963742 16003845 14285395 12325519 11036389 10218766 8370839 4832932 397793
4236 397793 -3619789 -5638319 -4132273 830093 6862498 10851296 10793011 6283922 -1157057
4227 -1157057 -8031142 -11089637 -10442340 -9116214 -9254055 -10309098 -11050648 -11339401 -11473607
4218 -11473607 -11514737 -11616807 -11639579 -10772230 -9239677 -9485261 -13092372 -17236502 -17316478
4209 -17316478 -12888874 -7891990 -5264824 -4836574 -6321551 -10013963 -13585844 -12536446
4201 -12536446 -6023715 820026 2573219 -606548 -4403359 -5757324 -5435715 -6467604
4193 -6467604 -10802392 -16716920 -19915204 -18316363 -14430921 -11131083 -6991185 1180561
4185 1180561 12738331 23316480 29017364 27637424 18628149 6117929 -1137624 1458639
$$ packed form
4244A7963742j959897j718450j959876j289130q17623j847927l537907m435139
4236C97793m017582k018530J506046M962366O032405L988798n8285m509089p440979
4227a157057o874085l058495O47297J326126j37841j055043p41550k88753j34206
4218a1473607m1130j02070k2772Q67349J532553k45584l607111m144130p9976
4209a7316478M427604M996884K627166M28250j484977l692412l571881J049398
4201a2536446O512731O843741J753193l179767l796811j353965L21609j031889
4193f467604m334788n914528l198284J598841L885442L299838M139898Q171746
4185A180561J1557770J0578149N700884j379940r009275j2510220p255553K596263
$$ plain form
4177 1458639 7985457 10274468 9403548 11360160 14287344 10378396 215490 -5426718
4169 -5426718 -332271 9731560 16988740 20504989 22028301 21098569 17941907 14494104
4161 14494104 10042783 2646004 -3883455 -2780717 4397601 8687083 7892391 9668339
4153 9668339 17928449 27246254 34114730 41949339 50577948 53039686 48042074 43312257
4145 43312257 41616595 37033613 29976126 29631550 35237881 34036379 26314969 30024080
4137 30024080 48325219 59015079 54554729 61039366 85430948 74268764 -24049720
4130 -24049720 -168190519 -251170279 -225198567 -150169449 -103703480 -91797116 -76566950
4123 -76566950 -49836752 -35044645 -37972071 -39289332 -30811544 -25079675 -28061613 -29231744
$$ packed form
4177A458639O526818K289011q70920J956612K927184l908948j0162906n642208
4169e426718N094447J0063831P257180L516249J523312r29732l156662l447803
4161A4494104m451321p396779o529459J102738P178318M289482p94692J775948
4153I668339Q260110R317805O868476P834609Q628609K461738m997612m729817
4145D3312257j695662m582982p057487l44576N606331j201502p721410L709111
4137C0024080J8301139J0689860m460350O484637K4391582j1162184r8318484
4130b4049720j44140799q2979760K5971712P5029118M6465969J1906364J5230166
4123g6566950K6730198J4792107k927426j317261Q477788N731869k981938j170131
$$ plain form
4115 -29231744 -22634461 -16657410 -17485262 -18854608 -13766924 -4830599 1308482 1581976
4107 1581976 -3459561 -10496763 -14063275 -11962185 -8573658 -7855984 -7051952 -3270406 -662712
4098 -662712 -3117786 -5508130 -1521869 5141099 7663772 8864013 15081274 21667824
4090 21667824 18328950 7025465 594274 3322333 6288268 3640860 359622 315956
4082 315956 -1289526 -8391392 -16908726 -22281455 -25457099 -26710257 -22436390 -13809934
4074 -13809934 -10201355 -16712770 -24848052 -23232876 -12812444 -3827999 -1146288 -504074
4066 -504074 1814570 2960486 -965281 -7866801 -11231387 -7972921 -2792334 -3124594 -9698945
4057 -9698945 -15025938 -13544145 -9789877 -11362564 -16254351 -14884349 -5183633 2590224
$$ packed form
4115b9231744O597283N977051q27852j369346N087684Q936325O139081K73494
4107A581976n041537p037202l566512K101090L388527P17674Q04032L781546K607694
4098f62712k455074k390344L986261O662968K522673J200241O217261O586550
4090B1667824l338874j1303485o431191K728059K965935k647408l281238m3666
4082C15956j605482p101866q517334n372729l175644j253158M273867Q626456
4074a3809934L608579o511415q135282J615176J0420432Q984445K681711O42214
4066e04074K318644J145916l925767o901520l364586L258466N180587l32260o574351
4057i698945n326993J481793L754268j572687m891787J370002R700716P773857
$$ plain form
4049 2590224 -294690 -8947470 -11833891 -5574769 2490248 3927253 -3232894 -14905842
4041 -14905842 -24846857 -28736116 -27101988 -23771941 -20508316 -15448379 -8150343 -2552444
4033 -2552444 -1795904 -3159738 -2261892 -148626 -1398026 -6032746 -8434912 -5309560 -544922
4024 -544922 70438 -3785103 -7460759 -7590941 -5015247 -1720509 2250466 7192392 10581799
4015 10581799 8302399 -174385 -9575096 -13408905 -10264540 -4494225 -1290448 -2329588
4007 -2329588 -5706607 -8566226 -9729946 -10739483 -14047087 -19314870 -22547083 -20739436
3999 -20739436 -16596357 -15879723 -19726947 -22313384 -17562464 -6269698 5169799 11759960
3991 11759960 13589497 13288442 12370632 10840910 8514406 5101335 52268 -5654467
$$ packed form
4049B590224k884914q652780k886421O259122Q065017J437005p160147j1672948
4041a4905842r941015l889259J634128L330047L263625N059937P298036N597899
4033b552444P56540j363834Q97846K113266j249400m634720k402166L125352M764638
4024e44922O15360l855541l675656j30182K575694L294738L970975M941926L389407
4015A0581799k279400q476784r400711l833809L144365N770315L203777j039140
4007b329588l377019k859619j163720j009537l307604n267783l232213J807647
3999b0739436M143079P16634l847224k586437M750920J1292766J1439497O590161
3991A1759960J829537l01055r17810j529722k326504l413071n049067n706735
$$ plain form
3983 -5654467 -8149698 -4017169 4209306 8891112 5619845 -1915802 -7876240 -11852609
3975 -11852609 -16225954 -18865483 -15128566 -6636341 -1057926 -1791246 -4250009 -4323266 -3721068
3966 -3721068 -3752552 -720680 7568134 16431280 20661722 21016263 19278209 13126049 2907010
3957 2907010 -2474148 4360540 17266922 24244822 24162246 25499897 30117909 29802085 20172038
3948 20172038 7584992 -591349 -3757279 -3416489 606080 5763600 6563549 2741058
3940 2741058 606756 2720039 3726256 469990 -1847848 900226 3899217 1930148
3932 1930148 -769699 2781727 10622958 15139331 14585412 13168906 11977715 8091586
3924 8091586 2096441 -1029913 644268 3471428 3992319 2478724 117624 -2909660
$$ packed form
3983e654467k495231M132529Q226475M681806l271267p535647n960438l976369
3975a1852609m373345k639529L736917Q492225N578415p33320k458763p3257O02198
3966c721068l1484L031872Q288814Q863146M230442L54541j738054o152160j0219039
3957B907010n381158O834688J2906382O977900q2576J337651M618012l15824r630047
3948B0172038j2587046q176341l165930L40790M022569N157520P99949l822491
3940B741058k134302K113283J006217l256266k317838K748074K998991j969069
3932A930148k699847L551426P841231M516373n53919j416506j191191l886129
3924H091586n995145l126354J674181K827160N20891j513595k361100l027284
$$ plain form
3916 -2909660 -5661974 -6501311 -5849734 -5923989 -7190409 -7772160 -6788187 -5878903 -6965205
3907 -6965205 -10231373 -14364894 -17522338 -18619535 -18657906 -19491770 -20503063 -19048036 -15648560
3898 -15648560 -15093157 -19322332 -22900597 -20265557 -14640479 -13704519 -17613526 -18010848 -10081726
3889 -10081726 177384 3582629 -1071980 -6546647 -5886696 772399 7178172 7170347 262220
3880 262220 -8294565 -12916208 -12445333 -9056256 -4239054 1869933 8027510 11487628 10541664
3871 10541664 5997476 181549 -4310115 -5499037 -3421400 -468765 932735 504371
3863 504371 -1000073 -3706637 -7546264 -10468691 -10170441 -7110024 -3688181 -991895 1371487
3854 1371487 2663220 979108 -3633125 -8081669 -9207724 -6868961 -3655352 -2144422
$$ packed form
3916b909660k752314q39337O51577p4255j266420n81751R83973R09284j086302
3907f965205l266168m133521l157444j097197l8371q33864j011293J455027L399476
3898a5648560N55403m229175l578265K635040N625078R35960l909007l97322P929122
3889a0081726J0259110L405245m654609n474667O59951O659095O405773p825o908127
3880B62220q556785m621643M70875L389077M817202O108987O157577L460118r45964
3871A0541664m544188n815927m491664j188922K077637K952635J401500m28364
3863E04371j504444k706564l839627k922427K98250L060417L421843K696286K363382
3854A371487J291733j684112m612233m448544j126055K338763L213609J510930
$$ plain form
3846 -2144422 -2347800 -1462415 3189988 10417714 15371457 14408331 8892321 3516116 1992237
3837 1992237 4797631 9203693 10534060 5598484 -3429601 -10272785 -11178500 -8538223
3829 -8538223 -6676779 -6481188 -6046997 -4190549 -1001621 3038244 6398226 7091788 5681552
3820 5681552 4977180 5090173 2656192 -2592807 -5354648 -2890565 -603680 -3670200 -7550174
3811 -7550174 -4431686 3792886 7607490 3945549 -429050 -177334 2276845 3588821
3803 3588821 4943240 7354981 7875390 4260191 -1530711 -7589955 -14853530 -22458931
3795 -22458931 -25473457 -21467907 -15198144 -12332902 -11873070 -9213991 -4045171 -620736
3787 -620736 -1555869 -4990473 -7104112 -5082371 1127529 8168576 12091599 13218292 15738860
$$ packed form
3846b144422k03378Q85385M652403P227726M953743r63126n516010n376205j523879
3837A992237K805394M406062J330367m935576r028085o843184r05715K640277
3829h538223J861444J95591M34191J856448L188928M039865L359982O93562j410236
3820E681552p04372J12993k433981n248999k761841K464083K286885l066520l879974
3811g550174L118488Q224572L814604l661941m374599K51716K454179J311976
3803C588821J354419K411741N20409l615199n790902o059244p263575p605401
3795b2458931l014526M005550O269763K865242M59832K659079N168820L424435
3787f20736r35133l434604k113639K021741O209900P041047L923023J126693K520568
$$ plain form
3778 15738860 21188333 25883376 26849506 25945448 24777722 20155175 9926214 -139575
3770 -139575 -2036472 3188158 6380441 2762288 -2680063 -3952446 -2719572 -4853012
3762 -4853012 -11815737 -19286135 -22946854 -22660248 -21177520 -20749564 -21439583 -21907514 -21338320
3753 -21338320 -20321852 -19680367 -19213437 -18642992 -19142560 -22050772 -25841832 -26404865 -21710049
3744 -21710049 -15015169 -11599864 -12419492 -12629120 -7145100 3335252 12899417 16462837
3736 16462837 14120938 9879505 7707786 9077960 12523837 14558703 12513852 7754403
3728 7754403 4755528 5739418 8008632 8399525 8105182 9821984 11807924 9396759 2433601
3719 2433601 -3512068 -4827283 -4529120 -6659556 -9556090 -8663215 -4268885 -2093336 -5709832
$$ packed form
3778A5738860N449473M695043R66130r04058j167726m622547j0228961j0065789
3770a39575j896897N224630L192283l618153n442351j272383J232874k133440
3762d853012o962725p470398l660719K86606J482728M27956o90019m67931N69194
3753b1338320J016468O41485M66930N70445m99568k908212l791060n63033M694816
3744b1710049O694880L415305q19628k09628N484020J0480352R564165L563420
3736A6462837k341899m241433k171719J370174L445877K034866k044851m759449
3728G754403k998875R83890K269214L90893k94343J716802J985940k411165o963158
3719B433601n945669j315215K98163k130436k896534Q92875M394330K175549l616496
$$ plain form
3710 -5709832 -11522053 -12984632 -8342518 -2186401 709318 1194297 3607666 8600414
3702 8600414 11183438 7401753 302866 -3670823 -2645214 -180743 1051056 2415531
3694 2415531 5515392 8902232 10410768 10495777 11404297 14014254 16328503 14641501 6948200
3685 6948200 -3397478 -8834109 -5181882 2761268 6367980 3286139 -1135650 -1918846
3677 -1918846 464905 3378916 5817447 7672304 8999382 11011291 14156781 14889172
3669 14889172 9047269 -771359 -6658193 -5915932 -4555824 -7833035 -12945279 -14486081
3661 -14486081 -11764077 -6750676 -6088 6604204 7998916 2328761 -4347381 -5217562
3653 -5217562 -1269868 2282740 4133292 5363752 3628654 -3417060 -10778143 -9998952
$$ packed form
3710e709832n812221j462579M642114O156117K895719M84979K413369M992748
3702H600414K583024l781685p098887l973689J025609K464471J231799J364475
3694B415531L099861L386840J508536Q5009R08520K609957K314249j687002p693301
3685F948200j0345678n436631L652227P943150L606712l081841m421789p83196
3677a918846K383751K914011K438531J854857J327078K011909L145490P32391
3669A4889172n841903r818628n886834P42261J360108l277211n112244j540802
3661a4486081K722004N013401O744588O610292J394712n670155o676142q70181
3653e217562L947694L552608J850552J230460j735098p045714p361083P79191
$$ plain form
3645 -9998952 -346013 10261327 15556977 16335954 15612584 14456451 13520156 13425717 12557251
3636 12557251 8899575 4521749 3707693 6391084 8253225 7649065 7253212 8055068 7083658
3627 7083658 2752314 -2169575 -4628669 -4344682 -1835531 2068074 3736810 -882877
3619 -882877 -9317485 -13080523 -7996188 370608 4417288 3183566 90432 -3270809
3611 -3270809 -6350076 -6334673 -1535410 3488161 1790512 -6753297 -14465097 -15022762 -10195414
3602 -10195414 -6047748 -5238031 -5534117 -4737223 -4119980 -5821797 -8544805 -8430854 -4531185
3593 -4531185 -875741 -1318019 -4136086 -4360371 -612207 3155845 2858955 -889066 -3478742
3584 -3478742 -558331 8076977 17543205 21465545 17799121 10228030 3200810 -1916905
$$ packed form
3645i998952R652939J0607340N295650P78977p23370j156133r36295r4439q68466
3636A2557251l657676m377826q14056K683391J862141o04160l95853Q01856r71410
3627G083658m331344m921889k459094K83987K509151L903605J668736m619687
3619h82877q434608l763038N084335Q366796M046680j233722l093134l361241
3611c270809l079267J5403M799263N023571j697649q543809p711800n57665M827348
3602a0195414M147666Q09717k96086P96894O17243j701817k723008J13951L899669
3593d531185L655444m42278k818067k24285L748164L768052k96890l748021k589676
3584c478742K920411Q635308R466228L922340l666424p571091p027220n117715
$$ plain form
3576 -1916905 -4423172 -2198041 4020111 7729568 3547938 -4983804 -10071801 -10452129
3568 -10452129 -11173233 -13799769 -14439216 -12134389 -11532109 -14920848 -18549519 -20076064 -23359723
3559 -23359723 -31573786 -40538581 -43472469 -38911501 -30266948 -20723215 -11854350 -4474399
3551 -4474399 1849200 7671270 10887449 8953129 4798111 4867820 9091838 9251202 1137572
3542 1137572 -7990775 -9316190 -4298162 -662094 -1462029 -4807178 -10216613 -17471434
3534 -17471434 -21759293 -17885635 -8534307 -1662941 -127322 129429 2150718 4429763
3526 4429763 5431574 5834520 5408662 2585667 -1831424 -4541736 -4055972 -1926525 122479
3517 122479 1104064 -117429 -2791971 -2798961 2107713 6834748 4300282 -4139889 -9330653
$$ packed form
3576a916905k506267K225131O218152L709457m181630q531742n087997l80328
3568a0452129p21104k626536o39447K304827O02280l388739l628671j526545l283659
3559b3359723q214063q964795k933888M560968Q644553R543733Q868865P379951
3551d474399O323599N822070L216179j934320m155018O9709M224018J59364q113630
3542A137572r128347j325415N018028L636068p99935l345149n409435p254821
3534a7471434m287859L873658R351328O871366J535619K56751K021289K279045
3526D429763J001811M02946m25858k822995m417091k710312M85764K129447K049004
3517A22479R81585j221493k674542o990M906674M727035k534466q440171n190764
$$ plain form
3508 -9330653 -5749641 3090685 11167081 16227350 18400784 18067882 17024810 17003551 15332947
3499 15332947 7005396 -6804444 -17217508 -17675735 -11574785 -6961437 -7069107 -9047701
3491 -9047701 -9054630 -5540560 369414 5335360 6349167 4178372 2129338 884656 -1836655
3482 -1836655 -5482113 -5389219 -251256 3398029 -1452943 -12875916 -22005798 -22999475 -17551652
3473 -17551652 -10697150 -5656205 -2693032 -330935 2945761 7077148 10398129 11295930
3465 11295930 9032024 3372242 -4423325 -10405723 -10946631 -7700564 -6208267 -8433702
3457 -8433702 -10500031 -9529137 -8216281 -9444961 -10643670 -8175109 -4270828 -4232735 -8397032
3448 -8397032 -12153630 -13197257 -13511293 -13973356 -12273258 -7909164 -4928467 -6780309 -10930297
$$ packed form
3508i330653L581012Q840326Q076396N060269K173434l32902j043072k1259j670604
3499A5332947q327551j3809840j0413064m58227O100950M613348j07670j978594
3491i047701o929L514070N909974M965946J013807k170795k049034j244682k721311
3482a836655l645458R2894N137963L649285m850972j1422973r129882r93677N447823
3473a7551652O854502N040945K963173K362097L276696M131387L320981Q97801
3465A1295930k263906n659782p795567n982398n40908L246067J492297k225435
3457h433702k066329R70894J312856j228680j198709K468561L904281L8093m164297
3448h397032l756598j043627l14036m62063J700098M364094K980697j851842m149988
$$ plain form
3439 -10930297 -11493063 -6295938 805161 4616600 4338455 4007663 7335461 12840310 15327324
3430 15327324 12205309 6422686 2167251 -220418 -2985626 -6303291 -7818965 -6374524
3422 -6374524 -3513939 -1040750 853768 2721345 4877485 7613460 10873764 13425252
3414 13425252 13644512 11347724 7750690 3672272 -977412 -5857768 -9443906 -9807869
3406 -9807869 -5850136 1286739 7243239 6782070 -405036 -7327542 -6444238 1104574 6303664
3397 6303664 3304016 -3521977 -5640404 -880809 5201538 7111254 4863132 1296434
3389 1296434 -2606919 -7466345 -12411174 -15219380 -15520350 -15346282 -15560259 -13910006 -8556165
3380 -8556165 -2082586 686753 -1341047 -4186185 -3854552 -641131 2294482 2728155 870177
$$ packed form
3439a0930297n62766N197125P101099L811439k78145l30792L327798N504849K487014
3430A5327324l122015n782623m255435k387669k765208l317665j515674J444441
3422f374524K860585K473189J894518J867577K156140K735975L260304K551488
3414A3425252K19260k296788l597034m078418m649684m880356l586138l63963
3406i807869L957733P136875N956500m61169p187106o922506Q83304P548812N199090
3397F303664k999648o825993k118427M759595O082347J909716k248122l566698
3389A296434l903353m859426m944829k808206l00970J74068k13977J650253N353841
3380h556165O473579K769339k027800k845138L31633L213421K935613M33673j857978
$$ plain form
3371 870177 -1270834 -1283980 1173399 2824159 44279 -5486432 -7317671 -2034725 6474825
3362 6474825 12803490 16720385 20514422 22681242 19570859 12209290 5970903 2912677
3354 2912677 -710305 -7841788 -15830932 -20520116 -21677699 -21452867 -19765496 -14542408
3346 -14542408 -5998116 1617692 3157159 -2671520 -11312122 -15785192 -13561901 -9265672
3338 -9265672 -8332814 -9134957 -5384364 3712636 10999278 11163565 7970315 7886890 10694993
3329 10694993 11726953 10522217 10712220 12064422 9425556 1231879 -6492670 -7650266
3321 -7650266 -3637725 -185925 262669 -634772 -1779731 -3982351 -7167531 -9595230 -10201215
3312 -10201215 -9499688 -8239175 -7346092 -8946132 -14651369 -22232780 -26512771 -24681743
$$ packed form
3371H70177k141011j3146K457379J650760k779880n530711j831239N282946Q509550
3362F474825O328665L916895L794037K166820l110383p361569o238387l058226
3354B912677l622982p131483p989144m689184j157583K24832J687371N223088
3346a4542408Q544292P615808J539467n828679q640602m473070K223291M296229
3338i265672R32858q02143L750593R097000P286642J64287l193250q3425K808103
3329A0694993J031960j204736J90003J352202k638866q193677p724549j157596
3321g650266M012541L451800M48594q97441j144959k202620l185180k427699o05985
3312a0201215P01527J260513Q93083j600040n705237p581411m279991J831028
$$ plain form
3304 -24681743 -18786548 -12139223 -5751384 177840 3974346 4539989 3938173 4630992 5060493
3295 5060493 1612786 -4995500 -9057021 -6867499 -1379149 1817831 665441 -3010551
3287 -3010551 -6749205 -8407069 -5802874 1285237 9410140 14505722 16359079 17645550
3279 17645550 18964436 17782853 12723256 6227277 1917580 1175924 2982451 5043792
3271 5043792 4148684 -2303885 -13214859 -23467905 -28486154 -28573419 -27572455 -27929427 -28406617
3262 -28406617 -26326535 -20813732 -13592409 -7251753 -3167567 -1213950 -1138257 -3046827
3254 -3046827 -5858933 -6797444 -4433564 -1377486 -1305728 -3594975 -4087987 -1645742 -267611
3245 -267611 -3029190 -7358652 -8942577 -7380687 -4781972 -1348911 3742194 9062154
$$ packed form
3304b4681743N895195O647325O387839N929224L796506N65643o01816O92819M29501
3295E060493l447707o608286m061521K189522N488350L196980j152390l675992
3287c010551l738654j657864K604195P088111Q124903N095582J853357J286471
3279A7645550J318886j181583n059597o495979m309697p41656J806527K061341
3271E043792q95108o452569j0910974j0253046n018249q7265J000964l56972m77190
3262b8406617K080082N512803P221323O340656M084186J953617P5693j908570
3254c046827k812106r38511K363880L056078P1758k289247m93012K442245J378131
3245b67611k761579m329462j583925J561890K598715L433061N091105N319960
$$ plain form
3237 9062154 12928569 17223024 24189866 30163795 28374047 18817704 9431447 5252374
3229 5252374 2144387 -5032317 -13205106 -15347188 -10270179 -2202382 6779135 16879125
3221 16879125 24105102 21656578 9967715 -1311776 -5284740 -6577408 -13157912 -23295504
3213 -23295504 -27207311 -20628176 -10564936 -6325594 -9471606 -14721277 -17114617 -15368522
3205 -15368522 -10640478 -5523468 -3479015 -6120281 -10635398 -12171777 -9644557 -7483216
3197 -7483216 -10360614 -17346657 -23000353 -23980057 -22707295 -23594606 -26961035 -28529818 -24919618
3188 -24919618 -17774659 -11358185 -7342977 -3887009 402011 3764754 3601945 115849
3180 115849 -3943774 -6714995 -8856470 -11535353 -14127178 -14821299 -12934055 -9765786 -7316740
$$ packed form
3237I062154L866415M294455O966842N973929j789748r556343r386257m179073
3229E252374l107987p176704q172789k142082N077009Q067797Q981517J0099990
3221A6879125P225977k448524j1688863j1279491l972964j292668o580504j0137592
3213b3295504l911807O579135J0063240M239342l146012n249671k393340J746095
3205a5368522M728044N117010K044453k641266m515117j536379K527220K161341
3197g483216k877398o986043n653696r79704J272762q87311l366429j568783L610200
3188b4919618P144959O416474M015208L455968M289020L362743j62809l486096
3180A15849m059623k771221k141475k678883k591825o94121J887244L168269K449046
$$ plain form
3171 -7316740 -6738941 -7831795 -9289659 -9470426 -7832753 -5888985 -5777046 -7328389 -7647531
3162 -7647531 -4763601 -822273 111170 -2817620 -6206461 -6734073 -4716526 -2905167 -3857074
3153 -3857074 -9289950 -19256066 -29753012 -33596651 -27287305 -16143592 -9143858 -8932877
3145 -8932877 -10514922 -9891418 -9302039 -11747312 -14416403 -11664957 -2740502 7281163
3137 7281163 13700047 16120822 16334592 15496545 14281641 13396024 12610803 10834622 8207782
3128 8207782 6804232 8182499 11353787 14279868 16291478 17505845 16670807 11962595
3120 11962595 4660834 153578 3229814 12536703 21368870 24464840 22728872 20583982
3112 20583982 20383169 21227551 22019241 22773467 22769325 20246430 15157862 10048857 6718535
$$ packed form
3171g316740N77799j092854j457864j80767J637673J943768J11939j551343l19142
3162g647531K883930L941328R33443k928790l388841n27612K017547J811359r51907
3153c857074n432876r966116j0496946l843639O309346J1143713O999734K10981
3145h932877j582045O23504N89379k445273k669091K751446Q924455J0021665
3137G281163O418884K420775K13770q38047j214904q85617p85221j776181k626840
3128H207782j403550J378267L171288K926081K011610J214367q35038m708212
3120A1962595p301761m507256L076236R306889Q832167L095970j735968k144890
3112B0583982k00813Q44382P91690P54226m142k522895n088568n109005l330322
$$ plain form
3103 6718535 3926941 119025 -3601435 -5749582 -8122190 -13688227 -20961603 -23905072
3095 -23905072 -18775003 -8891501 -1122661 926766 -1167733 -4310500 -7444695 -11217362
3087 -11217362 -15301330 -17129449 -13804997 -5375391 4073343 8919856 5855440 -3960144
3079 -3960144 -15356820 -21918430 -20459296 -14348289 -11215773 -15399846 -22913913 -25397620
3071 -25397620 -18938329 -7729000 777754 2871608 550663 -2258666 -4506000 -8567893
3063 -8567893 -15602590 -21495294 -20250045 -12075931 -4691148 -4195864 -7733868 -8790048
3055 -8790048 -6871521 -6542632 -8405447 -7828637 -3532634 -774995 -2942592 -5560359 -3209830
3046 -3209830 1708205 2643477 -897578 -2511263 1885545 8686733 11562103 8568101
$$ packed form
3103F718535k791594l807916l720460k148147k372608n566037p273376k943469
3095b3905072N130069R883502P768840K049427k094499l142767l134195l772667
3087a1217362m083968j828119L324452Q429606R448734M846513l064416r815584
3079c960144j1396676o561610J459134O111007L132516m184073p514067k483707
3071b5397620O459291J1209329Q506754K093854k320945k809329k247334m061893
3063h567893p034697n892704J245249Q174114P384783M95284l538004j056180
3055h790048J918527L28889j862815N76810M296003K757639k167597k617767K350529
3046c209830M918035R35272l541055j613685M396808O801188K875370k994002
$$ plain form
3038 8568101 2933246 -1055227 -1459364 843428 3657102 5136611 4249282 640060 -4426129
3029 -4426129 -7447995 -5752347 -1948402 -2265465 -8588494 -15143448 -15872272 -12213693 -9643910
3020 -9643910 -8880014 -5891527 175 3822553 2159892 -2105239 -4704058 -5882693
3012 -5882693 -8179067 -10731258 -9359514 -1804546 9301251 18475761 21344404 17580105
3004 17580105 11315974 7877160 8774442 10422194 8686083 3827520 -213970 -683622
2996 -683622 1276460 2574442 1612445 -580304 -2172859 -2941191 -4138301 -5564738 -4005004
2987 -4005004 3432706 14608219 23289308 25453246 22556950 17724474 11418162 3081472
2979 3081472 -5108659 -9473091 -9293207 -7255441 -5446646 -3447916 -786785 1254053
$$ packed form
3038H568101n634855l988473m04137K302792K813674J479509q87329l609222n066189
3029d426129l021866J695648L803945l17063o323029o554954p28824L658579K569783
3020i643910P63896K988487N891702L822378j662661m265131k598819j178635
3012e882693k296374k552191J371744P554968J1105797R174510K868643l764299
3004A7580105o264131l438814Q97282J647752j736111m858563m041490m69652
2996f83622J960082J297982r61997k192749j592555p68332j197110j426437J559734
2987d005004P437710J1175513Q681089K163938k896296m832476o306312q336690
2979C081472q190131m364432J79884K037766J808795J998730K661131K040838
$$ plain form
2971 1254053 1470358 558554 -294986 -1415168 -3821607 -7153085 -9710639 -10335639 -9436269
2962 -9436269 -8412486 -8596147 -10181804 -11428976 -9511934 -3335354 4629439 10485075
2954 10485075 13078265 14852392 17886245 20248338 17972666 10692100 3589323 2422337
2946 2422337 7287321 12883682 15005284 15032845 16999606 21576913 24798145 22488012 14551205
2937 14551205 5067450 -484723 1367597 8967146 15260243 13363639 4254210 -2988430
2929 -2988430 -844774 8079983 14492543 13192752 7456182 3245431 2545158 3146110 2116846
2920 2116846 -1807031 -7214389 -10486450 -9288939 -6102310 -5646184 -8139988 -8567582 -4169130
2911 -4169130 1207662 3046532 2836825 4750825 8387077 9861021 9015655 10655672 18213023
$$ packed form
2971A254053K16305r11804q53540j120182k406439l331478k557554o25000Q99370
2962i436269J023783j83661j585657j247172J917042O176580P964793N855636
2954A0485075K593190J774127L033853K362093k275672p280566p102777j166986
2946B422337M864984N596361K121602K7561J966761M577307L221232k310133p936807
2937A4551205r483755n552173J852320P599549O293097j896604r109429p242640
2929b988430K143656Q924757O412560j299791n736570m210751p00273O00952j029264
2920B116846l923877n407358l272061J197511L186629M56126k493804m27594M398452
2911d169130N376792J838870k09707J914000L636252J473944q45366J640017P557351
$$ plain form
2902 18213023 29512255 38803946 40416256 31744208 16281004 2454119 -4607060 -8663626
2894 -8663626 -15086418 -20445212 -16902742 -6323612 -631078 -5479629 -12298296 -11271133
2886 -11271133 -4523700 -309766 -863863 -3517977 -8431466 -16542890 -23337184 -23407475 -19210269
2877 -19210269 -17041240 -16075789 -10455394 -1541248 2029390 -1837517 -4589000 -497913
2869 -497913 4516910 3117559 -1643047 -1887422 2565353 4931498 2470096 -230560 1230494
2860 1230494 5742929 9635049 10805287 8619871 2715603 -6040880 -14317527 -17483102
2852 -17483102 -12963509 -3196854 5329593 7704371 5259848 2904227 2399806 1391127
2844 1391127 -1003369 -2221547 -1653995 -3346385 -9504730 -14662959 -11364765 -561083
$$ packed form
2902A8213023J1299232R291691J612310q672048j5463204j3826885p061179m056566
2894h663626o422792n358794L542470J0579130N692534m848551o818667J027163
2886a1271133O747433M213934n54097k654114m913489q111424o794294p0291M197206
2877a9210269K169029R65451N620395Q914146L570638l866907k751483M091087
2869d97913N014823j399351m760606k44375M452775K366145k461402k700656J461054
2860A230494M512435L892120J170238k185416n904268q756483q276647l165575
2852a7483102M519593R766655Q526447K374778k444523k355621n04421j008679
2844A391127k394496j218178N67552j692390o158345n158229L298194J0803682
$$ plain form
2836 -561083 8124571 6920079 -2228556 -10657456 -11598202 -5472585 1617122 4044226 1800797
2827 1800797 -729455 -754310 350153 1006146 2638428 6416584 9611493 8897282 5530090
2818 5530090 3174906 1667683 -2352247 -8473657 -11228918 -7818140 -3049611 -3202116
2810 -3202116 -7475165 -9501921 -6436850 -2335615 -1518347 -2320399 -459341 3612970 5160734
2801 5160734 2951855 1710783 4335383 5887703 -60280 -11629395 -20708976 -23719652
2793 -23719652 -24176160 -24332532 -21310251 -14190654 -8555784 -9245063 -12991642 -13153134 -8487237
2784 -8487237 -2592579 2321277 6090525 7593652 6432794 5715093 7760923 8589740 2538082
2775 2538082 -8310044 -15200551 -13436089 -6666865 -167035 4411371 6319130 3601790
$$ packed form
2836e61083Q685654j204492r148635q428900r40746O125617P089707K427104k243429
2827A800797k530252k4855J104463O55993J632282L778156L194909p14211l367192
2818E530090k355184j507223m019930o121410k755261L410778M768529j52505
2810c202116m273049k026756L065071M101235Q17268q02052J861058M072311J547764
2801E160734k208879j241072K624600J552320n947983j1569115r079581l010676
2793b3719652m56508j56372L022281P119597N634870o89279l746579j61492M665897
2784h487237N894658M913856L769248J503127j160858p17701K045830Q28817o051658
2775B538082j0848126o890507J764462O769224O499830M578406J907759k717340
$$ plain form
2767 3601790 -3165713 -8947563 -9303833 -5394657 -2140754 -3038783 -7461872 -11204478 -9853103
2758 -9853103 -4058443 -669244 -5201140 -14027687 -18349687 -15151141 -8881512 -2753664
2750 -2753664 4585442 12383666 15437512 12138878 8362649 8492655 8100431 1263934 -9282713
2741 -9282713 -15743401 -16107529 -15151424 -16355993 -18650494 -20276052 -20589923 -18399017 -13185869
2732 -13185869 -7796437 -5619311 -5276147 -2381078 3281765 6503052 3286219 -4733046
2724 -4733046 -13189098 -19132270 -21509253 -20470227 -17485916 -14384541 -11679481 -9040167
2716 -9040167 -6808751 -5298106 -3567562 -1008258 1196238 2709562 6208691 13219294
2708 13219294 19531390 19637142 14845788 11392823 10445443 6431110 -2821740 -10582421
$$ packed form
2767C601790o767503n781850l56270L909176L253903q98029m423089l742606J351375
2758i853103N794660L389199m531896q826547m322000L198546O269629O127848
2750b753664P339106P798224L053846l298634l776229J30006l92224o836497j0546647
2741i282713o460688l64128R56105j204569k294501j625558l13871K190906N213148
2732a3185869N389432K177126L43164K895069N662843L221287l216833q019265
2724d733046q456052n943172k376983J039026K984311L101375K705060K639314
2716i040167K231416J510645J730544K559304K204496J513324L499129P010603
2708A3219294O312096J05752m791354l452965r47380m014333r252850p760681
$$ plain form
2700 -10582421 -9726004 -2091559 4971040 7772673 7425310 4816537 -81456 -5097698
2692 -5097698 -7187509 -7059045 -8425070 -12062086 -14053585 -10863299 -3346725 5204950
2684 5204950 12420838 17081312 18324246 16275866 12102090 6420026 -726768 -7286114
2676 -7286114 -8802847 -2998887 6275527 12101694 11367868 6797616 2568571 348536
2668 348536 -68302 1085201 3335641 5802373 8603427 12538864 15981214 14799643 8261217
2659 8261217 2616006 4424803 11373804 14693743 10838899 5373898 3826274 4363785
2651 4363785 2789256 -343460 -2428169 -4622374 -9022851 -12428393 -9322178 -484124
2643 -484124 7076894 8914942 6730790 3130694 -1339919 -4719260 -3142754 3309332
$$ packed form
2700a0582421Q56417P634445P062599K801633l47363k608773m897993n016242
2692e097698k089811J28464j366025l637016j991499L190286P516574Q551675
2684E204950P215888M660474J242934k048380m173776n682064p146794o559346
2676g286114j516733N803960R274414N826167p33826m570252m229045k220035
2668C48536m16838J153503K250440K466732K801054L935437L442350j181571o538426
2659H261217n645211J808797O949001L319939l854844n465001j547624N37511
2651D363785j574529l132716k084709k194205m400477l405542L106215Q838054
2643d84124P561018J838048k184152l600096m470613l379341J576506O452086
$$ plain form
2635 3309332 8993687 10214587 10476571 14741759 21712347 25677522 23720700 17478036
2627 17478036 9610698 2188149 -2606374 -3662800 -2657477 -2331681 -3483132 -5114279
2619 -5114279 -6277408 -6184343 -4246673 -1928692 -2544331 -6855247 -10878674 -10646159 -6914328
2610 -6914328 -2211502 3880058 11838329 16751571 11996574 -1276725 -13772297 -18665954
2602 -18665954 -18199966 -18030101 -19345891 -19361209 -16419823 -11553790 -6874883 -4682236 -6372427
2593 -6372427 -10140500 -11344724 -7157010 234840 6190160 7677708 3883050 -4339914
2585 -4339914 -13303858 -17291687 -13869984 -7235918 -3493104 -3808968 -5255415 -7113577
2577 -7113577 -12005580 -20237493 -26933243 -26869532 -20066028 -10982180 -3858765 -406075 -644324
$$ packed form
2635C309332N684355J220900K61984M265188O970588L965175j956822o242664
2627A7478036p867338p422549m794523j056426J005323L25796j151451j631147
2619e114279j163129R3065J937670K317981o15639m310916m023427K32515L731831
2610f914328M702826O091560P958271M913242m754997j3273299j2495572m893657
2602a8665954M65988J69865j315790j5318K941386M866033M678907K192647j690191
2593f372427l768073j204224M187714P391850N955320J487548l794658q222964
2585d339914q963944l987829L421703O634066L742814l15864j446447j858162
2577g113577m892003q231913o695750O3711O803504R083848P123415L452690k38249
$$ plain form
2568 -644324 -3909266 -8974200 -14035572 -16691431 -14374477 -6329922 4226915 11479128
2560 11479128 12090875 8491432 6118432 7823829 11745527 13930698 11856823 5878199
2552 5878199 -1264111 -6149211 -7068838 -5379222 -4226891 -5943601 -10819538 -17518689
2544 -17518689 -23567613 -26211195 -24793133 -22336445 -22550946 -24561661 -23024893 -15156901
2536 -15156901 -5394503 -275525 -187353 141460 3343466 5897255 4180922 38209 -2495497
2527 -2495497 -2989430 -3400802 -3014403 913315 7769912 13051131 13967805 12032601 9115502
2518 9115502 4835497 -98657 -1796868 1903260 6769416 6425864 278008 -6333464
2510 -6333464 -9260333 -9284541 -8962907 -9467026 -11009408 -12806470 -11854779 -5690472 2132009
$$ packed form
2568f44324l264942n064934n061372k655859K316954Q044555J0556837P252213
2560A1479128O11747l599443k373000J705397L921698K185171k073875n978624
2552E878199p142310m885100r19627J689616J152331j716710m875937o699151
2544a7518689o048924k643582J418062K456688k14501k010715J536768P867992
2536a5156901R762398N118978Q8172L28813L202006K553789j716333m142713k533706
2527b495497m93933m11372L86399L927718O856597N281219R16674j935204k917099
2518I115502m280005m934154j698211L700128M866156l43552o147856o611472
2510f333464k926869k4208L21634n04119j542382j797062R51691O164307P822481
$$ plain form
2501 2132009 3649725 -3420835 -10968661 -10095721 -2767927 1040736 -3826455 -13229371
2493 -13229371 -21383996 -26493859 -27298157 -20700336 -7402590 4467798 7146772 3029277
2485 3029277 1688526 7539057 14941118 16077526 9709788 728841 -5744300 -7745940
2477 -7745940 -6195247 -3636046 -2570368 -3635236 -5480385 -6307306 -4568955 1048049
2469 1048049 9754799 16733828 16533885 9888503 3926820 3264490 4140590 987181 -4236763
2460 -4236763 -4944388 -1015138 -142823 -6205942 -12384975 -10209964 -1388960 4643344 2575922
2451 2575922 -5011073 -14374042 -24149138 -30789418 -27446649 -12459138 4944726 13236062
2443 13236062 11537982 8980306 11779669 16502603 17169095 13487661 8902454 4711950
$$ packed form
2501B132009J517716p070560p547826Q72940P327794L808663m867191r402916
2493a3229371q154625n109863q04298O597821J3297746J1870388K678974m117495
2485C029277j340751N850531P402061J136408o367738q980947o473141k001640
2477g745940J550693K559201J065678j064868j845149q26921J738351N617004
2469A048049Q706750O979029j99943o645382n961683o62330Q76100l153409n223944
2460d236763p07625L929250Q72315o063119o179033K175011Q821004O032304k067422
2451B575922p586995r362969r775096o640280L342769J4987511J7403864Q291336
2443A3236062j698080k557676K799363M722934O66492l681434m585207m190504
$$ plain form
2435 4711950 485247 -2322579 -1989712 -661557 -2341314 -6913569 -10327414 -10906435 -10963935
2426 -10963935 -11116762 -7978039 -367724 6393443 6719030 2722824 1344585 4934329
2418 4934329 9544811 12299106 15226904 20155327 24241765 23784710 19727996 15791172
2410 15791172 12511296 6873968 -1980088 -9922968 -12304481 -9526303 -6419528 -6781232
2402 -6781232 -10091156 -13508720 -15523994 -16857458 -18688864 -21008761 -22271733 -19881249
2394 -19881249 -11886646 80272 9926766 11681788 5949533 -327106 -2029659 -1608403
2386 -1608403 -4246430 -9316383 -10805455 -6179067 -486987 281541 -3262049 -5881256
2378 -5881256 -5303068 -4478764 -6530155 -10152053 -10900067 -5845709 3372572 11337010 13009005
$$ packed form
2435D711950m226703k807826L32867J328155j679757m572255l413845n79021n7500
2426a0963935j52827L138723P610315O761167L25587l996206j378239L589744
2418D934329M610482K754295K927798M928423M086438m57055m056714l936824
2410A5791172l279876n637328q854056p942880k381513K778178L106775l61704
2402f781232l309924l417564k015274j333464j831406k319897j262972K390484
2394a9881249P994603J1966918R846494J755022n732255o276639j702553M21256
2386a608403k638027n069953j489072M626388N692080P68528l543590k619207
2378e881256N78188Q24304k051391l621898p48014N054358R218281P964438J671995
$$ plain form
2369 13009005 8387414 2881495 1659123 3733746 3427462 -2130429 -9402618 -13663737
$$ packed form
2369A3009005m621591n505919j222372K074623l06284n557891p272189m261119
$$ [...]
##END NTUPLES=NMR SPECTRUM
##END=
