##TITLE=31Pdec_DE-79H_DEK2
 D2O, 64 sc
 29.1.2025
##JCAMPDX= 6.0         $$ Bruker NMR JCAMP-DX V2.0
##DATA TYPE= NMR SPECTRUM
##DATA CLASS= NTUPLES
##ORIGIN= UXNMR, Bruker Analytische Messtechnik GmbH
##OWNER= root
$$ XWIN-NMR		Version 3.5
$$ Wed Jan 29 14:00:10 2025 Russian Standard Time (UT+4h)  she@DPX200
##.OBSERVE FREQUENCY= 81.013821
##.OBSERVE NUCLEUS= ^31P
##.ACQUISITION MODE= SIMULTANEOUS
##.ACQUISITION SCHEME= undefined
##.AVERAGES= 64
##.DIGITISER RES= 17
##SPECTROMETER/DATA SYSTEM= spect
##.PULSE SEQUENCE= zgpg30
##.SOLVENT NAME= CDCl3
##.SHIFT REFERENCE= (INTERNAL, CDCl3, 0, 198.062)
##AUDIT TRAIL= $$ (NUMBER, WHEN, WHO, WHERE, WHAT)
$$ ##TITLE= Audit trail, XWIN-NMR		Version 3.5
$$ ##JCAMPDX= 5.01
$$ ##ORIGIN= Bruker BioSpin GmbH
$$ ##OWNER= she
$$ F:/spectra/data/she/nmr/P31/2/pdata/1/auditp.txt
$$ ##AUDIT TRAIL=  $$ (NUMBER, WHEN, WHO, WHERE, WHAT)
(   1,<2025-01-29 13:59:15.76 +0400>,<she>,<DPX200>,
      <created by zg, POWCHK disabled, PULCHK disabled
       configuration hash MD5:
       00 E9 B6 7A A2 85 ED C7 34 08 36 98 17 FE 4E 26
       data hash MD5: 32K
       BD CB DC BD FA A9 D9 42 44 FC D3 1E DF D1 56 03>)
(   2,<2025-01-29 13:59:17.82 +0400>,<she>,<DPX200>,
      <Start of raw data processing
       efp BC_mod = 2 LB = 1.5 FT_mod = 6 PKNL = 1 PHC0 = 1653.698 PHC1 = 308.6904 SI = 64K 
       data hash MD5: 64K
       50 D9 E6 6B 99 27 46 4D D8 39 1A 08 C1 FE 90 5C>)
(   3,<2025-01-29 13:59:36.09 +0400>,<she>,<DPX200>,
      <pk PHC0 = -11.0568 PHC1 = 0 
       data hash MD5: 64K
       B5 80 28 6A 45 75 10 93 93 7E 4E 16 82 34 F0 C3>)
(   4,<2025-01-29 13:59:39.40 +0400>,<she>,<DPX200>,
      <abs ABSG = 5 
       data hash MD5: 64K
       A8 B9 06 FD 92 17 CC A3 22 E7 20 DC 04 D9 F5 2E>)
$$ ##END=
$$ 
$$ hash MD5
$$ 45 DD 14 3F B8 C3 09 96 37 F0 A6 09 7A B9 3B D7
##$RELAX= 
##$RELAX= 
##$RELAX= 
##$RELAX= 
##$RELAX= 
##$RELAX= 
##$RELAX= 
##$RELAX= 
$$ Bruker specific parameters
$$ --------------------------
##$DU= <F:/spectra>
##$EXPNO= 2
##$NAME= <P31>
##$PROCNO= 1
##$TYPE= <nmr>
##$USER= <she>
##$AMP= (0..31)
100 100 100 100 100 100 100 100 100 100 100 100 100 100 100 100 100 100 
100 100 100 100 100 100 100 100 100 100 100 100 100 100 
##$AQSEQ= 0
##$AQ_mod= 1
##$AUNM= <au_zg>
##$AUTOPOS= <>
##$BF1= 81.014009
##$BF2= 200.13
##$BF3= 200.13
##$BF4= 200.13
##$BF5= 200.13
##$BF6= 200.13
##$BF7= 200.13
##$BF8= 200.13
##$BYTORDA= 1
##$CFDGTYP= 0
##$CFRGTYP= 5
##$CHEMSTR= <none>
##$CNST= (0..31)
1 1 145 1 1 1 1 1 1 1 1 1 1 1 1 1 1 1 1 1 1 1 1 1 1 1 1 1 1 1 1 1 
##$CPDPRG= <waltz16>
##$CPDPRG1= <>
##$CPDPRG2= <waltz16>
##$CPDPRG3= <>
##$CPDPRG4= <mlev>
##$CPDPRG5= <mlev>
##$CPDPRG6= <mlev>
##$CPDPRG7= <mlev>
##$CPDPRG8= <mlev>
##$CPDPRGB= <>
##$CPDPRGT= <>
##$D= (0..31)
0 1 0 0 0 0 0 0 0 0.06 0 0.03 2e-05 3e-06 0 0 0.0002 0 0 0 0 0 0 0 0 0 
0 0 0 0 0 0 
##$DATE= 1738144755
##$DBL= (0..7)
120 120 120 11 120 120 24 19 
##$DBP= (0..7)
150 150 150 150 150 150 150 150 
##$DBP07= 0
##$DBPNAM0= <>
##$DBPNAM1= <>
$$ [...]
##$SUBNAM3= <"">
##$SUBNAM4= <"">
##$SUBNAM5= <"">
##$SUBNAM6= <"">
##$SUBNAM7= <"">
##$SUBNAM8= <"">
##$SUBNAM9= <"">
##$SW= 400.765351723535
##$SWIBOX= (0..15)
0 1 3 0 0 0 0 0 0 0 0 0 0 0 0 0 
##$SW_h= 32467.5324675325
##$TD= 32768
##$TD0= 1
##$TE= 0
##$TE2= 300
##$TE3= 300
##$TEG= 300
##$TL= (0..7)
0 120 53 12 22 120 120 120 
##$TP= (0..7)
150 150 150 150 150 150 150 150 
##$TP07= 0
##$TPNAME0= <>
##$TPNAME1= <>
##$TPNAME2= <>
##$TPNAME3= <>
##$TPNAME4= <>
##$TPNAME5= <>
##$TPNAME6= <>
##$TPNAME7= <>
##$TPOAL= (0..7)
0.5 0.5 0.5 0.5 0.5 0.5 0.5 0.5 
##$TPOFFS= (0..7)
0 0 0 0 0 0 0 0 
##$TUNHIN= 0
##$TUNHOUT= 0
##$TUNXOUT= 0
##$USERA1= <user>
##$USERA2= <user>
##$USERA3= <user>
##$USERA4= <user>
##$USERA5= <user>
##$V9= 5
##$VALIST= <valist>
##$VCLIST= <CCCCCCCCCCCCCCC>
##$VD= 0
##$VDLIST= <DDDDDDDDDDDDDDD>
##$VPLIST= <PPPPPPPPPPPPPPP>
##$VTLIST= <TTTTTTTTTTTTTTT>
##$WBST= 1024
##$WBSW= 4
##$XGAIN= (0..3)
0 0 0 0 
##$XL= 0
##$YL= 0
##$YMAX_a= 7935
##$YMIN_a= -16069
##$ZGOPTNS= <>
##$ZL1= 120
##$ZL2= 120
##$ZL3= 120
##$ZL4= 120
##$ABSF1= 198.0616
##$ABSF2= -202.7028
##$ABSG= 5
##$ABSL= 3
##$ALPHA= 0
##$AQORDER= 0
##$ASSFAC= 0
##$ASSFACI= 0
##$ASSFACX= 0
##$ASSWID= 0
##$AUNMP= <proc_1d>
##$AZFE= 0.1
##$AZFW= 0.5
##$BCFW= 0
##$BC_mod= 2
##$BYTORDP= 0
##$COROFFS= 0
##$CY= -3
##$DATMOD= 1
##$DC= 0
##$DFILT= <>
##$DTYPP= 0
##$F1P= 0
##$F2P= 0
##$FCOR= 1
##$FTSIZE= 65536
##$FT_mod= 6
##$GAMMA= 0
##$GB= 0
##$INTBC= 1
##$INTSCL= 9.790993e-09
##$ISEN= 30
##$LB= 1.5
##$LEV0= 0
##$LPBIN= 0
##$MAXI= 10000
##$MC2= 0
##$MEAN= 0
##$ME_mod= 0
##$MI= 50
##$NCOEF= 0
##$NC_proc= -9
##$NLEV= 6
##$NOISF1= 182.463
##$NOISF2= 159.3651
##$NSP= 0
##$NTH_PI= 0
##$NZP= 0
##$OFFSET= 198.0616
##$PC= 4
##$PHC0= 1642.641
##$PHC1= 308.6904
##$PH_mod= 1
##$PKNL= yes
##$PPARMOD= 0
##$PSCAL= 0
##$PSIGN= 0
##$REVERSE= no
##$SF= 81.0140089999434
##$SI= 65536
##$SIGF1= 159.3651
##$SIGF2= -187.1042
##$SINO= 113.3802
##$SIOLD= 16384
##$SREGLST= <1H.CDCl3>
##$SSB= 0
##$STSI= 65536
##$STSR= 0
##$SW_p= 32467.5324675325
##$SYMM= 0
##$S_DEV= 0
##$TDeff= 32768
##$TDoff= 0
##$TI= <>
##$TILT= no
##$TM1= 0
##$TM2= 0
##$TOPLEV= 0
##$USERP1= <user>
##$USERP2= <user>
##$USERP3= <user>
##$USERP4= <user>
##$USERP5= <user>
##$WDW= 1
##$XDIM= 65536
##$YMAX_p= 250058166
##$YMIN_p= -313580090
$$ End of Bruker specific parameters
$$ ---------------------------------
##NTUPLES= NMR SPECTRUM
##VAR_NAME=  FREQUENCY,     SPECTRUM/REAL,   SPECTRUM/IMAG
##SYMBOL=    X,             R,               I
##VAR_TYPE=  INDEPENDENT,   DEPENDENT,       DEPENDENT
##VAR_FORM=  AFFN,          ASDF,            ASDF
##VAR_DIM=   65536,         65536,           65536
##UNITS=     HZ,            ARBITRARY UNITS, ARBITRARY UNITS
##FACTOR=    0.49542278885378, 1,            1
##FIRST=     16045.7642231865, 0,            0
##LAST=      -16421.768244346, 0,            0
##MIN=       -16421.768244346, -313580090,   0
##MAX=       16045.7642231865, 250058166,    0
$$ Real data points
##PAGE= N=1
##DATA TABLE= (X++(R..R)), XYDATA
$$ [...]
##PAGE= N=2
##DATA TABLE= (X++(I..I)), XYDATA
7339e713586l709684o328686m999823M22280L523268R39755k784051k205885K402862
$$ -5713586 -9423270 -15751956 -20751779 -20329499 -16806231 -15866476 -18650527 -20856412 -18453550
7330a8453550P526747J0732918J0384480N325938k513252q157006q384690m701972
$$ -18453550 -10926803 -193885 10190595 15516533 13003281 4846275 -3538415 -8240387
7322h240387p93787R43839K53364j163706o95362J982575L335623L48052m335628
$$ -8240387 -9034174 -8090335 -7836971 -9000677 -9696039 -7713464 -4377841 -4029789 -8365417
7313h365417n011721k40248N837812R205781R431166P426468L446258j784576
$$ -8365417 -13377138 -13617386 -7779574 1426207 10857373 18283841 21730099 19945523
7305A9945523o489218r027359q323604m162856J090081L148829J076999m52285
$$ 19945523 13456305 4428946 -3894658 -8057514 -6967433 -3818604 -2741605 -3193890
7297c193890K168314N302591L543982j187525k467772J61138Q34899k542213n291882
$$ -3193890 -1025576 4277015 7820997 6633472 4165700 4326838 5161737 2619524 -2672358
7288b672358m323909k414758j948098j016862J394075K519294J388786J480218
$$ -2672358 -6996267 -9411025 -11359123 -12375985 -10981910 -8462616 -7073830 -5593612
7280e593612M213113N508178K944092O48919K058663L233639m10078n276577m776609
$$ -5593612 -1380499 4127679 7071771 7720690 9779353 13012992 12602914 7326337 2549728
7271B549728k48056J101634k244254m378256k032031Q73962M30621j832439l433045
$$ 2549728 2301672 3403306 1159052 -3219204 -5251235 -4377273 -3946652 -5779091 -9212136
7262i212136n408637q504168r092840l724634M412082Q293100N879138K192315
$$ -9212136 -14620773 -23124941 -32217781 -35942415 -31530333 -23237233 -17358095 -15165780
7254a5165780K105016M586234N707577M480039K932486K020887Q21736n43421
$$ -15165780 -13060764 -8474530 -2766953 1713086 4645572 6666459 7488195 6944774
7246F944774p22247o36026l432324q700965j0180269l162235P848579J3441903
$$ 6944774 6222527 5586501 2154177 -6546788 -16727057 -19889292 -12040713 1401190
7238A401190J0560817M901305K055292J309266k76942k489887l697782m339462
$$ 1401190 11962007 16863312 18918604 20227870 19950928 17461041 13763259 9423797
7230I423797n147167m570328j762376j10204l394014r189600j0606389n314048
$$ 9423797 4276630 -293698 -2056074 -2166278 -5560292 -14749892 -25356281 -30670329
7222c0670329J129237K809650R90511R71104L628067M717503K748877K395117
$$ -30670329 -29541092 -26731442 -25740931 -24769827 -21141760 -16424257 -13675380 -11280263
7214a1280263O822578J0596101O074203m523538j0454412p161768k419830l867250
$$ -11280263 -4457685 6138416 12212619 7689081 -2765331 -9927099 -12346929 -16214179
7206a6214179p290779m229659L803669P694947M981947K194608K979378L402268
$$ -16214179 -23504958 -27734617 -23930948 -16236001 -11254054 -9059446 -6080068 -2677800
7198b677800J102880L1644K219454L034646k00456k248615J022907M225149R26337
$$ -2677800 -1574920 -1543276 676178 3710824 3510368 1261753 2284660 6509809 7436146
7189G436146m583732l340195L276294M572159l239224j1099339j0058621k664564
$$ 7436146 2852414 -487781 2788513 7360672 4121448 -6977891 -17036512 -19701076
7181a9701076K790697L690870L323658L132414R56711l239224n050237j261053
$$ -19701076 -16910379 -13219509 -9895851 -6763437 -5806726 -9045950 -14096187 -15357240
7173a5357240N053837P902727N592121J588416j318773l753281n685305m479594
$$ -15357240 -10303403 -2400676 3191445 4779861 3461088 -292193 -5977498 -10457092
7165a0457092l77502P62879m033429p451647j134835R733244J1345294J550788
$$ -10457092 -10834594 -10071715 -14105144 -21556791 -22691626 -12958382 -1613088 -62300
7157f2300o022182k096008N233079M863720j23135k13774L296856J764115m149759
$$ -62300 -6084482 -8180490 -2947411 1916309 1793174 1579400 4876256 6640371 2490612
7148B490612m840211J654993O026278K816209j830116j368667J580050J877964
$$ 2490612 -2349599 -694606 5331672 8147881 6317765 4949098 6529148 8407112
7140H407112M07984K58620K89511j531672k582305P29558O083365P160503J803566
$$ 8407112 8815096 9073716 9363227 7831555 5249250 5978808 12062173 19222676 21026242
7131B1026242n111203p041180k548489L202253L845942o59917l805706j919228
$$ 21026242 15915039 8873859 6325370 9527623 13373565 12713648 8907942 6988714
7123F988714l57706n201881j1822418r976312J73102O674447K885780l366356
$$ 6988714 6631008 1429127 -10393291 -20369603 -20196501 -13522054 -10636274 -14002630
7115a4002630k646402K480032L855871J150009R1489J307930J60452l567664m319757
$$ -14002630 -16649032 -14169000 -10313129 -9163120 -9071631 -7763701 -7603249 -11170913 -15490670
7106a5490670o2394L917678K848700p33775r23103L495987P463893N532272j733748
$$ -15490670 -15553064 -11635386 -8786686 -9520461 -10443564 -6947577 516316 6048588 4314840
7097D314840p793449p368896k799790m09656r72777J109147P446805J0734470
$$ 4314840 -3478609 -10847505 -13647295 -14056951 -15029728 -13920581 -6473776 4260694
7089D260694N001653m317263p334140l417113l57316j673794l182160k421889
$$ 4260694 9262347 4945084 -2389056 -5806169 -6163485 -7837279 -11019439 -13441328
7081a3441328k823310n790517o336953j321162L891829K881904j646625j600494
$$ -13441328 -16264638 -22055155 -28392108 -29713270 -25821441 -22939537 -24586162 -26186656
7073b6186656M317512Q509135N162727k078321n289165j731320M591026Q852548
$$ -26186656 -21869144 -13360009 -8197282 -10275603 -15564768 -17296088 -12705062 -3852514
7065c852514R657728P664019L164020l112437q346859r324392o011579j778099
$$ -3852514 5805214 13469233 16633253 13520816 5173957 -4150435 -10162014 -11940113
7057a1940113L77346L56094o70978k430616m708632n823353l858616R26657O022606
$$ -11940113 -11562767 -11206673 -11877651 -14308267 -19016899 -24840252 -28698868 -27772211 -21749605
7048b1749605Q618973P167997K202672l431738o291141n385402k669549k7359
$$ -21749605 -13130632 -5962635 -3759963 -7191701 -13482842 -18868244 -21537793 -21565152
7040b1565152K499443M683047M775032K080566j169030k634170k676034k276936
$$ -21565152 -19065709 -14382662 -9607630 -7527064 -8696094 -11330264 -14006298 -16283234
7032a6283234o00176K457477L775772J067330k451914k081234R51497J411693
$$ -16283234 -16883410 -14425933 -10650161 -9582831 -12034745 -14115979 -13164482 -11752789
7024a1752789j060309j109778L175217O523874M830357J636365J720300K663258
$$ -11752789 -12813098 -13922876 -10747659 -4223785 606572 2242937 3963237 6626495
7016F626495r97007p394162q054856R2347R071543R207570O64613p883817j0197893
$$ 6626495 5629488 -1764674 -9819530 -9727183 -655640 8551930 9216543 1332726 -8865167
7007h865167q051061o011749m896914k826667o8142J007565J89006r8355Q42124
$$ -8865167 -16916228 -22927977 -27824891 -30651558 -30719700 -29712135 -29523129 -29621484 -28779360
6998b8779360P82943p04330l1657M880726R728308Q477053J456060m956292n885886
$$ -28779360 -27996417 -28700747 -28732404 -23851678 -14123370 -5646317 -4190257 -9146549 -15032435
6989a5032435j820797M006075Q164100P685503K622500j992763j056751L442601
$$ -15032435 -16853232 -12847157 -4683057 3002446 5624946 3632183 2575432 6018033
6981F018033M654370O66843l187496l111618k010427k936381l035931J202807
$$ 6018033 10672403 11339246 8151750 5040132 3029705 93324 -2942607 -1739800
6973a739800O834924Q092746M614129Q62280r28214k116297k996949j968224M52059
$$ -1739800 5095124 13187870 17801999 18664279 17736065 15619768 12622819 10654595 11106654
6964A1106654J202356q27146l134707l114737o58812K737870M825447L084842
$$ 11106654 12309010 11481864 8347157 5232420 4573608 7311478 12136925 15221767
6956A5221767k318773o481161m636601P77817K404614j750894n212662k539390
$$ 15221767 12902994 6421833 1785232 2563049 4967663 3216769 -1995893 -4535283
6948d535283K688420L289959j394161n406196m451791J10698M683261O623615
$$ -4535283 -1846863 1443096 48935 -5357261 -9809052 -9698354 -5015093 1608522
6940A608522M344653j399507n772608l853915K030268L435435k735879q127888
$$ 1608522 5953175 4553668 -1218940 -5072855 -3042587 392848 -2343031 -10470919
6932a0470919l509767P064960R742572o96442j2834025j3086787k985180M377274
$$ -10470919 -13980686 -6915726 2826846 2130404 -10703621 -23790408 -26775588 -22398314
6924b2398314K591385j214393J069585O518450O761532J256521j879689J988797
$$ -22398314 -19806929 -21021322 -19951737 -13433287 -6671755 -5415234 -7294923 -5306126
6916e306126P048764M927745l994078j1011736r758985k755419L420514O152065
$$ -5306126 1742638 6670383 2676305 -8335431 -18094416 -20849835 -17429321 -11277256
6908a1277256P219457P256350M358153j002975m154253k425913J39028j271834
$$ -11277256 -4057799 3198551 7556704 6553729 2399476 -26437 112591 -1159243
6900a159243l964518j449940N236796P318090J568170l447821M60974Q391132
$$ -1159243 -5123761 -6573701 -1336905 5981185 7549355 4101534 4562508 12953640
6892A2953640Q950354L50669p965399q829146m686349n34673K917792N974847
$$ 12953640 21903994 22254663 14289264 5460118 773769 239096 3156888 9131735
6884I131735O165340K422361j218351r79005N24760j625296o404333p824116l601017
$$ 9131735 15297075 17719436 16501085 15522080 16046840 14421544 8017211 193095 -3407922
6875c407922J905192M038480L118523J947993J312612K07668j409291k460401
$$ -3407922 -1502730 2535750 5654273 7602266 8914878 9122546 7713255 5252854
6867E252854k648553k732781l001997k822944k072969j984341l444507m635357
$$ 5252854 2604301 -128480 -3130477 -5953421 -8026390 -10010731 -13455238 -18090595
6859a8090595k007953N069073J1754205J2255000O841211J435574n68233k332367
$$ -18090595 -20098548 -15029475 -3275270 8979730 15820941 17256515 16688282 14355915
6851A4355915o861940j0215145o778144O53739L001135k059087o160133k660404
$$ 14355915 7493975 -2721170 -9499314 -8845575 -5844440 -7903527 -14063660 -16724064
6843a6724064L448472L933567O52950K082080Q444283R942326J846682p248566
$$ -16724064 -13275592 -9342025 -8689075 -6606995 1837288 11779614 13626296 6377730
6835F377730p229252j80585M070944J886258j757570k474140j049047N13238J107170
$$ 6377730 -851522 -1032107 3038837 4925095 3167525 693385 -355662 157576 1264746
6826A264746j142214o231757p992969k58514J1078061J1121460m051408j8512552
$$ 1264746 122532 -6109225 -14102194 -14360708 -3282647 7838813 3787405 -14725147
6818a4725147j5267986J713680J3293752R685421o32030n721861l778159N25573
$$ -14725147 -29993133 -28279453 -14985701 -5300280 -5932310 -11654171 -15432330 -14906757
6810a4906757M567915P631437P821688M387846J50957k033510k732630l259972
$$ -14906757 -10338842 -2707405 5114283 9502129 9653086 7619576 4886946 1626974
6802A626974k660803l58095J138187l74279k840579k646586L26809L061420L306140
$$ 1626974 -1033829 -1391924 -253737 -628016 -3468595 -6115181 -5788372 -2726952 579188
6793E79188R10568k867513n242202l369344J608627M365108J883433k421075l965723
$$ 579188 1489756 -1377757 -6619959 -9989303 -8380676 -4015568 -2132135 -4553210 -8518933
6784h518933l311874l347167l229645m07314L212873K933306j313790m444570
$$ -8518933 -11830807 -15177974 -18407619 -18814933 -15602060 -12668754 -13982544 -18427114
6776a8427114l292170M26575M248532P303153Q302789O233423L709214M460989
$$ -18427114 -21719284 -21292709 -17044177 -9741024 -1438235 4795188 8504402 12965391
6768A2965391O473519L345746n453823j1600485q860128k060496l01270m631442
$$ 12965391 19438910 22784656 17330833 5730348 -3129780 -5190276 -5491546 -10122988
6760a0122988p774024m582538J940897N168283K393868k677046l914667N12025
$$ -10122988 -17897012 -22479550 -20538653 -15370370 -12976502 -15653548 -19568215 -19056190
6752a9056190N686056N991640K661475J319598K415041M84156n135569o461197
$$ -19056190 -13370134 -7378494 -4717019 -3397421 -982380 -498224 -5633793 -12094990
6744a2094990R05625Q314185N034460n366201r075106j174964Q738430J1129895
$$ -12094990 -11189365 -2875180 2159280 -3206921 -12282027 -13456991 -4718561 6411334
6736F411334P716948M694914K515937j851163p284951r303099o636143k395778
$$ 6411334 14128282 18823196 21339133 19487970 12203019 2899920 -3736223 -6132001
6728f132001O05736K352412L658125M141081K607028j323827n917573q078081
$$ -6132001 -5526265 -3173853 484272 4625353 7232381 5908554 -9019 -8087100
6720h087100o648707m269582l733939l344933M83584O104912O944988O90680o361457
$$ -8087100 -14735807 -19005389 -22739328 -26084261 -25600677 -19495765 -12550777 -11860097 -18221554
6711a8221554p249698k954470P37641J929285L348121N891340O562284L508958
$$ -18221554 -25471252 -28425722 -27688081 -25758796 -22410675 -16519335 -9957051 -6448093
6703f448093n61829j534678J396742N080291N437094R69959n802206j0421523
$$ -6448093 -7009922 -8544600 -7147858 -2067567 3369527 4339486 -1462720 -11884243
6695a1884243j0548907p476221l458538P56107M676701O355128M251490M971k705084
$$ -11884243 -22433150 -29909371 -33367909 -32611802 -27935101 -21579973 -17328483 -17323512 -20028596
6686b0028596j881115J363366M388287M906160K255868j826596m387579m079228
$$ -20028596 -21909711 -20546345 -16158058 -11251898 -8996030 -10822626 -15210205 -19289433
6678a9289433j849108J415287N613276Q914041P801590K110344k868100k666925
$$ -19289433 -21138541 -19723254 -14109978 -5195937 2605653 4715997 1847897 -819028
6670h19028K85661P00961j512250j942238O83411K778266K014394J98729j024300
$$ -819028 -533367 167594 -1344656 -3286894 -2603483 174783 2189177 2387906 1363606
6661A363606k706404m999396n251927k371141L39046j05838j366864R11472O210716
$$ 1363606 -1342798 -6342194 -11594121 -13965262 -13626216 -13732054 -15098918 -14187446 -7976730
6652g976730R221677O732809J333137k641725m337846n535836o033525l206574
$$ -7976730 1244947 7977756 9310893 6669168 2331322 -3204514 -9238039 -12444613
6644a2444613K806984O575115L435542l311041n737799j922134J915305J416122
$$ -12444613 -9637629 -3062514 373028 -2938013 -8675812 -10597946 -8682641 -7266519
6636g266519K21215K329109M300260J427853k965028k471364J139396Q03659k985007
$$ -7266519 -7045304 -4716195 -415935 1011918 -1953110 -4424474 -3285078 -2481419 -5466426
6627e466426k398365L762072O915112K883472q74932K161236O726516M982587
$$ -5466426 -7864791 -4102719 2812393 5695865 4820933 6982169 13708685 18691272
6619A8691272o58789k706635j410570l031061q173954j0833593q160740l565498
$$ 18691272 18032483 15325848 13915278 10884217 2710263 -8123330 -16284070 -19849568
6611a9849568k55392J881282L069354K985986K912436L493297J814245l467177
$$ -19849568 -20104960 -18223678 -15154324 -12168338 -9255902 -5762605 -3948360 -7415537
6603g415537o162967M40311J1325993J3444586L271471p805254q882606k635649
$$ -7415537 -13578504 -13138193 -1812200 11632386 14903857 7098603 -1784003 -4419652
6595d419652J651924J555108J708337M590365P447069P029815L002182k694331
$$ -4419652 -2767728 -1212620 495717 5086082 12533151 19562966 22565148 19870817
6587A9870817p150736q223567o797886n747127n401890k668849L565725R055125
$$ 19870817 12720081 4496514 -2301372 -8048499 -13450389 -16119238 -12553513 -3498388
6579c498388Q826708L213222k922575n314505l205211P34316K147095q84169m499927
$$ -3498388 5328320 8541542 5618967 304462 -2900749 -2166433 -19338 -903507 -5403434
6570e403434l039604K719456N675109K605148r24175O53993M269675L583398r03368
$$ -5403434 -8443038 -5723582 -48473 2556675 1632500 2286493 6556168 10139566 9236198
6561I236198l377858k140143j100766k513017m029310l506561j964279p62693
$$ 9236198 5858340 3718197 2617431 104414 -3924896 -7431457 -9395736 -10158429
6553a0158429M39012J927601K944793L017420K224559N09862j308954j214424
$$ -10158429 -9719417 -7791816 -4847023 -1829603 394956 904818 -404136 -1618560
6545a618560P93947J161835k138159n296349l934600m31175j77895k200019p41245
$$ -1618560 -824613 337222 -1800937 -7097286 -11031886 -11463061 -11640956 -13840975 -14582220
6536a4582220M069561N375392J179691j633401J154178L410963j113838p136785
$$ -14582220 -10512659 -5137267 -3957576 -5590977 -4436799 -1025836 -2139674 -9276459
6528i276459m856131M617178R751546M514313l877606n409758K10456N094572
$$ -9276459 -14132590 -9515412 236134 4750447 872841 -4536917 -4326461 768111
6520G68111L924046p89378l414198k134257L8514J13514r93554n81745J199521
$$ 768111 4692157 3902779 488581 -1645676 -1607162 -1493648 -2487202 -3068947 -1869426
6511a869426J526669l64025j865141j509598j474991l484699n249568l870001
$$ -1869426 -342757 -706782 -2571923 -4081521 -5556512 -9041211 -14290779 -18160780
6503a8160780l08890K638138M570926O306632O712552M643270K080805J034647
$$ -18160780 -18469670 -15831532 -11260606 -4953974 1758578 6401848 8482653 9517300
6495I517300p21872n653351r937237p489974j20601L587958P08816k140692J9820
$$ 9517300 8795428 3142077 -6795160 -14285134 -14405735 -10817777 -10108961 -12249653 -12229833
6486a2229833K974062J526736j499396r17284J400292L03407k864344k333231
$$ -12229833 -9255771 -7729035 -9228431 -10145715 -8745423 -8442016 -11306360 -13639591
6478a3639591J847869L546336N62085k238277q06298L287898P058626R150538
$$ -13639591 -11791722 -8245386 -7683301 -9921578 -10727876 -7439978 -381352 8769186
6470H769186P564940P87870o929289q071188k444746J350238j477856m984668
$$ 8769186 16334126 17121996 10192707 2121519 -323227 1027011 -450845 -5435513
6462e435513l182976k37343k336496n510431j507113P603998J1444302P143031
$$ -5435513 -8618489 -8855832 -11192328 -16702759 -18209872 -10605874 838428 7981459
6454G981459K604399K675682K292354k909480q171236p423895k690191L78763
$$ 7981459 10585858 13261540 15553894 12644414 4473178 -2950717 -5640908 -5262145
6446e262145J065312J603725J097336j993761m466919k215618K370086L189811
$$ -5262145 -4196833 -2593108 -1495772 -3489533 -7956452 -10172070 -7801984 -4612173
6438d612173l06151k698817j404422j19938k221381n375286m885225K17456N896299
$$ -4612173 -4918324 -7617141 -9021563 -9141501 -11362882 -16738168 -21623393 -21405937 -15509638
6429a5509638O781943J552411m102862k068088P901645J5176370J0089032l233062
$$ -15509638 -8727695 -7175284 -11278146 -13346234 -5444589 9731781 19820813 16587751
6421A6587751j1495016q584692r15457L455699L782630K888646J449155l42766
$$ 16587751 5092735 -3491957 -4407414 -951715 2830915 5719561 7168716 6825950
6413F825950p54838Q9354o95325l021363k246376K775665N510081J009619n459219
$$ 6825950 6071112 6160466 5465141 2443778 197402 2973067 8483148 9492767 4033548
6404D033548n668338n02500K705243K141383K223346L355341L38010p277524j1813005
$$ 4033548 -1634790 -2137290 567953 2709336 4932682 8288023 8626033 1348509 -10464496
6395a0464496q290773j803039O77167K08292J890946N165961M790586k59315n012272
$$ -10464496 -18755269 -20558308 -19881141 -19672849 -17781903 -12615942 -7825356 -8084671 -13096943
6386a3096943n567642k968400M86049M221811P268103P142662L387695m02642
$$ -13096943 -18664585 -21632985 -21146936 -16925125 -9657022 -2514360 873335 470693
6378D70693q05822Q41222P89679j306287k111696j08992J999741J714314N42205
$$ 470693 -335129 506093 1295772 -10515 -2122211 -2231203 -231462 1482852 2025057
6369B025057Q29966J200564j002457l975085l021914J753221M589543K907647
$$ 2025057 2855023 4055587 3053130 -921955 -3943869 -2190648 2398895 5306542
6361E306542J520612M033419N354248n30389q906378r250224j142117M134602
$$ 5306542 6827154 10860573 16214821 15684432 6778054 -2472170 -3614287 520315
6353E20315J84507n356146l363470K896439M179125K36049r88103K891444N103414
$$ 520315 704822 -4651324 -8014794 -5118355 -939230 -703181 -1691284 1200160 6303574
6344F303574R32411n282652p172743m454412p59641J888250K785624N89267m113541
$$ 6303574 7235985 1953333 -5219410 -9673822 -10433463 -8545213 -5759589 -5170322 -9283863
6335i283863o694366l142480M103578Q199101N355812j947583q330970r755514
$$ -9283863 -15978229 -19120709 -15017131 -6818030 -1462218 -3409801 -11740771 -21496285
6327b1496285n303370K342799P929436P451993J932756l545823m796510j806435
$$ -21496285 -26799655 -24456856 -16527420 -9075427 -7142671 -10688494 -15485004 -17291439
6319a7291439K450043N034343M806175K563005J97077p37945j07277J050231J661809
$$ -17291439 -14841396 -9807053 -5000878 -2437873 -2240796 -2978741 -3086018 -2035787 -373978
6310c73978J435451Q22733K90138m84677k313604m962511o657317o114216m241672
$$ -373978 1061473 1884206 2174344 1689667 -623937 -5586448 -12243765 -18357981 -22599653
6301b2599653k463417n58378J669553K160487k49933j621720K668475R068179
$$ -22599653 -25063070 -25621448 -23951895 -21791408 -22041341 -23663061 -20994586 -11926407
6293a1926407Q373654k53475n351134J070246J0564950R679578k22558n258532
$$ -11926407 -3552753 -3806228 -9157362 -8087116 2477834 12157412 11934854 6676322
6285F676322L00890P099753O331562J427042p76167j295115m202713p231764n478743
$$ 6676322 6977212 14076965 20408527 21835569 21059402 19764287 15561574 8329810 2851067
6276B851067p21256P77688k010249m064952k460261M09141J600771Q65634j002049
$$ 2851067 2129811 2907499 897250 -3167702 -5627963 -5218822 -3618051 -2752417 -3754466
6267c754466l261625m688373m784932m716019m632387k195706L109029P029172
$$ -3754466 -7016091 -11704464 -16489396 -21205415 -25837802 -28033508 -24924479 -17895307
6259a7895307O086703L092985K060899Q77751m227376r599827q022544p73330
$$ -17895307 -11808604 -8715619 -6654720 -5776969 -10004345 -19604172 -27626716 -28400046
6251b8400046L204732Q73014j309809P33291K785442J976371K805378P717682
$$ -28400046 -25195314 -24322300 -25632109 -24898818 -22113376 -20137005 -17331627 -9613945
6243i613945J0253944N199656j516552j745154J788753R87884l261889l077281
$$ -9613945 639999 5839655 4323103 2577949 4366702 5354586 2092697 -984584
6235i84584K010058L901018l3651k433315J273250M828633J255771n937289q117379
$$ -984584 1025474 4926492 4892841 2459526 3732776 8561409 9817180 3879891 -4237488
6226d237488l794007P92693J206768o84538j401654o41345l14740j244372k163734
$$ -4237488 -8031495 -7238802 -6032034 -6716572 -8118226 -8759571 -9074311 -10318683 -12482417
6217a2482417j494038L73614J143627k71593j506399L92831M076450M649032L24596
$$ -12482417 -13976455 -13602841 -12459214 -12730807 -14237206 -13844375 -9767925 -5118893 -4794297
6208d794297m244540l404180K202819O231796M454383n3822q91551L130878N666641
$$ -4794297 -9038837 -12443017 -10240198 -4008402 445981 392159 -499392 2631486 8298127
6199H298127Q19637q025817j1157622m879983L520941N667503K549082P00783
$$ 8298127 9117764 1091947 -10065675 -14945658 -11424717 -5757214 -3208132 -2507349
6191b507349J775597K266109J307997J240123R28139l353813r122153q155735
$$ -2507349 -731752 1534357 2842354 4082477 5010616 1656803 -7465350 -15621085
6183a5621085Q62442Q024895N726239l57470n76637M046175M890723L4715l696553
$$ -15621085 -14758643 -6733748 -1007509 -1364979 -1941616 2104559 6995282 7029997 3333444
6174C333444k231936P20497J334070R43685J224995L39114k713400m751269l217323
$$ 3333444 1101508 1822005 3156075 4099760 5324755 5663869 2950469 -1800800 -5018123
6165e018123p45237j174348l618814m116497j412841K120868M027060L371697
$$ -5018123 -5763360 -6937708 -10556522 -14673019 -16085860 -13964992 -9937932 -6566235
6157f566235J27360l958705m851154j82753O168788O942166J94651p509323q399586
$$ -6566235 -6438875 -10397580 -15248734 -15431487 -9262699 -2320533 -2125882 -9635205 -18034791
6148a8034791k155814M590506N941602J792249l685325n968666k904649L718545
$$ -18034791 -20190605 -15600099 -9658497 -7866248 -11551573 -17520239 -20424888 -16706343
6140a6706343Q783270Q373135M238941J248725J27918l217043r517597j2498141
$$ -16706343 -7923073 450062 4689003 5937728 6065646 2848603 -6668994 -19167135
6132a9167135p830723j220458p10351l741298o43722R208154J4531433Q518736
$$ -19167135 -26997858 -28218316 -28928667 -32669965 -33313687 -24105533 -9574100 -1055364
6124a055364r83067l402677K3287J249327q87366j180516J048690J240684r68573
$$ -1055364 -2038431 -5441108 -5417821 -4168494 -5055860 -6236376 -5187686 -3947002 -4915575
6115d915575n71881L522003N831077K927400j878430m579065n078567l640149
$$ -4915575 -5487456 -1965453 3865624 6793024 4914594 335529 -4743038 -8383187
6107h383187Q60634O047028N610814j826719q405546o460380J476107O791742
$$ -8383187 -7522553 -1475525 4135289 2308570 -6096976 -12557356 -11081249 -4289507
6099d289507N810822J944240q41131j923461k430750l408821m985434n248186
$$ -4289507 1521315 3465555 2624424 700963 -1729787 -5138608 -10124042 -15372228
6091a5372228j669846M438485P631550N032757L76281j540300j134355j316490
$$ -15372228 -17042074 -12603589 -4972039 60718 436999 -1103301 -2237656 -3554146
6083c554146k082066k139601k484276l393025j406366M670268Q195568K797002
$$ -3554146 -5636212 -7775813 -10260089 -13653114 -15059480 -10389212 -2193644 603358
6075F03358o246043p673387p67662L445409r15131o287240m342980J757983L944619
$$ 603358 -5642685 -13316072 -14083734 -10638325 -11553456 -17840696 -22183676 -20425693 -16481074
6066a6481074J354363j167059j884261k232732j274387K651436O321843M425254
$$ -16481074 -15126711 -16293770 -18178031 -20410763 -21685150 -19033714 -12711871 -8286617
6058h286617k154750o372715l814759K820057Q148887Q987524M761967k689845
$$ -8286617 -10441367 -16814082 -20628841 -17808784 -9659897 -672373 4089594 1399749
6050A399749q778072r068625l815265K558753O676898Q488912Q569310O348576
$$ 1399749 -7378323 -16446948 -20262213 -17703460 -11026562 -2537650 6031660 12380236
6042A2380236J828475l310760p026310p818697m881960L38129L487316J368554
$$ 12380236 14208711 10897951 3871641 -3947056 -8829016 -8490887 -5003571 -3635017
6034c635017l427597n070431j752105K674854M247347K526480j372035o046648
$$ -3635017 -7062614 -12133045 -13885150 -11210296 -6962949 -4436469 -5808504 -11855152
6026a1855152q191658m441670K898918O181879J674189m829920n265071M22320
$$ -11855152 -20046810 -24488480 -21589562 -15407683 -13733494 -18563414 -23828485 -23406165
6018b3406165N269458M952551K110801J070267J968089J636730j479469n004474
$$ -23406165 -18136707 -13184156 -11073355 -10003088 -8034999 -6398269 -7877738 -12882212
6010a2882212n374263k256359R85082J851062J859710L004067L240760k04193
$$ -12882212 -18256475 -20512834 -19527752 -17676690 -15816980 -12812913 -9572153 -9776346
6002i776346m291528l016439K599224M338513o80474m511697m35574O120462O038678
$$ -9776346 -14067874 -17084313 -14485089 -10146576 -10827050 -15338747 -15774321 -9653859 -3615181
5993c615181Q77612k29321M567688P630526M361942r55361l424109l784824l829104
$$ -3615181 -2737569 -2966890 1600798 9231324 13593266 12637905 9213796 5428972 1599868
5984A599868k449090M24816J670179J34768r52599K50731Q68347j183139l213660
$$ 1599868 -849222 -424406 1245773 1380541 427942 678673 1547020 363881 -2849779
5975b849779k667279j223532l94801J892640N854936O043730j135303r892680
$$ -2849779 -5517058 -6740590 -7135391 -5242751 612185 6655915 5520612 -4372068
5967d372068j1401654n219018J552597M380426M454135L320208R38737j152330
$$ -4372068 -15773722 -20992740 -19440143 -15059717 -10605582 -7285374 -6346637 -7498967
5959g498967o54735J169878J113294j01868R52074L179554J304986n035968q829053
$$ -7498967 -8153702 -6983824 -5870530 -5972398 -5020324 -1840770 -535784 -5571752 -14400805
5950a4400805n402367O40870K250317l81603j674390M14369K447326J946261J307202
$$ -14400805 -19803172 -19162302 -16911985 -17293588 -18967978 -18553609 -16106283 -14160022 -12852820
5941a2852820L770818P782548P540842l92514j1600202j6401638r470934L624860
$$ -12852820 -9082002 -1299454 6241388 5848874 -5751328 -22152966 -31623900 -27999040
5933b7999040J1479563Q650648N55999l793508j755838J629314R07535l148000
$$ -27999040 -16519477 -7868829 -7312830 -11106338 -12862176 -11232862 -10325327 -13473327
5925a3473327m716108l95359N650670N957304n59137o182479l935923L151901
$$ -13473327 -18189435 -18584794 -12934124 -6976820 -7535957 -13718436 -17654359 -14502458
5917a4502458O153971J962667l841438n549153l782682k202443k001897j758251
$$ -14502458 -8348487 -6385820 -10227258 -15776411 -19559093 -21761536 -23763433 -25521684
5909b5521684J20189M303121R352619J0980104N940333k309056n823006j884057
$$ -25521684 -25401495 -21098374 -11745755 -765651 5174682 2865626 -2957380 -4841437
5901d841437L401368L592968L8476j773215m03589J282831J671502J630504J232148
$$ -4841437 -1440069 2152899 2191375 418160 14571 1297402 2968904 4599408 5831556
5892E831556o99989l838776o090110o062994l822790K0656L918966N315127L528898
$$ 5831556 5131567 1292791 -4797319 -10860313 -14683103 -14662447 -10743481 -5428354 -1899456
5883a899456J628694K562947M303916K195132m021351r049151q799222n200292
$$ -1899456 -270762 2292185 6596101 8791233 4769882 -4279269 -13078491 -18278783
5875a8278783k406051o30481L070492Q399115R932725M117446l947076n192494
$$ -18278783 -20684834 -21315315 -18244823 -9845708 87017 4204463 257387 -4935107
5867d935107J342065O136723K116687m923669m952045Q42040K218184l166764
$$ -4935107 -3593042 2543681 4660368 -263301 -5215346 -4373306 -2155122 -5321886
5859e321886n633865M44131O742855L988203l499400n401096j558491K4293k080533
$$ -5321886 -10955751 -10511620 -3768765 219438 -3279962 -8681058 -10239549 -10215256 -12295789
5850a2295789j340209L776306O327331K721755j153413N31443N155137P102682
$$ -12295789 -13635998 -9859692 -3532361 -810606 -1964019 -1432576 3722561 10825243
5842A0825243N753172L526344P25879k973884n414929m776760l078129l168160
$$ 10825243 16578415 20104759 20830638 17856754 12441825 7665065 4586936 1418776
5834A418776m322891m161555l006714k899942l519036k316892J557947N755977
$$ 1418776 -2904115 -7065670 -10072384 -12972326 -16491362 -18808254 -17250307 -11494330
5826a1494330P183413M798077L24105l083257l419448j442740P08348J851204
$$ -11494330 -4310917 487160 811265 -2271992 -5691440 -7134180 -6425832 -4574628
5818d574628J640581m03106l323241l607223P19803N636762N155968j07419l173864
$$ -4574628 -2934047 -3337153 -6660394 -10267617 -9547814 -3911052 1244916 1137497 -2036367
5809b036367m31202L807019M278164J514257r77194j915380j580858J14889J629471
$$ -2036367 -2467569 1339450 5617614 7131871 6154677 4239297 2658439 2773328 4402799
5800D402799l80773n620444q130390l805492L250920O287071M805406K864341
$$ 4402799 4022026 -1598418 -9728808 -13534300 -10283380 -3996309 809097 3673438
5792C673438J124217l131858q879847j0584345n804869J026547M077492K169234
$$ 3673438 4797655 1665797 -7214050 -17798395 -23603264 -22576717 -18499225 -16329991
5784a6329991j687566l850940k152089K753419O857437N904425L88949m241957
$$ -16329991 -18017557 -21868497 -24020586 -21267167 -14409730 -8505305 -8116356 -12358313
5776a2358313l561615J001005M384699L892228J619963J037098K286930K101947
$$ -12358313 -15919928 -14918923 -10534224 -6641996 -5022033 -3984935 -1698005 403942
5768D03942j346641n180523n358234k371537j78264L10126K283074O222206O960937
$$ 403942 -942699 -6123222 -11481456 -13852993 -14031257 -13721131 -11438057 -5215851 1745086
5759A745086J156663o179635p595976l340132k40176j445701k842432l64255M095642
$$ 1745086 2901749 -3277886 -10873862 -14213994 -14454170 -15899871 -18742303 -19106558 -15010916
5750a5010916O271767N564533M640731M688705L826081M22716l613392m355515
$$ -15010916 -8739149 -3174616 1466115 6154820 9980901 10403617 6790225 2434710
5742B434710r43715K406816J298862l079741n978372o020266n813733n720098
$$ 2434710 1490995 3897811 5196673 2116932 -3861440 -9881706 -15695439 -21415537
5734b1415537k902481J712181K256103k414223m543093J109245P728076O174154
$$ -21415537 -24318018 -22605837 -20349734 -22763957 -27307050 -26197805 -18469729 -12295575
5726a2295575n84980k260396K548676N376423K208454j795730k770728l051624
$$ -12295575 -12880555 -15140951 -12592275 -7215852 -5007398 -6803128 -9573856 -12625480
5718a2625480l395259m13052M530782L627541m781200j0648870n890254L828580
$$ -12625480 -16020739 -16433791 -11903009 -8275468 -13056668 -23705538 -29595792 -25767212
5710b5767212Q238565O873465O092436O924153N132037O05885k012613j127726
$$ -25767212 -17528647 -10655182 -4562746 2361407 7493444 8099329 6086716 4958990
5702D958990M41835J063057R95694j354719p337498j2782326j1341865l381032
$$ 4958990 5400825 6463882 7459576 6104857 -1232641 -14014967 -25356832 -28737864
5694b8737864M203697P230408P683450P791044O790552M718895L635801L228259
$$ -28737864 -24534167 -17303759 -9620309 -1829265 4961287 9680182 13315983 16544242
5686A6544242L05264n223817q432609n725232O62570O194467Q271803N796235
$$ 16544242 16849506 11625689 3193080 -2532152 -1869582 4324885 12596688 18392923
5678A8392923p23275o706977o188855J74488M441003J860660k938407m179620
$$ 18392923 17669648 10962671 4773816 4948304 9389307 11249967 8311560 4131940
5670D131940l867565o403985q872971n053894K788956N172769n24733n493489
$$ 4131940 264375 -6139610 -15012581 -20066475 -17277519 -12104750 -12629483 -18122972
5662a8122972k229421N023631P393669L758223J32881n0229J182058J764222J909467
$$ -18122972 -20352393 -15328762 -7935093 -4176870 -4043989 -4094218 -2912160 -1147938 761529
5653G61529R95047k412861o349103o135928j120943L561684M191137L169816L552464
$$ 761529 1756576 -656285 -7005388 -13141316 -14262259 -10700575 -6509438 -3339622 212842
5644B12842L262397n23153m532092k966501L434548P812309O493702K275442j770956
$$ 212842 3475239 2952086 -1580006 -4546507 -1111959 6700350 13194052 15469494 13698538
5635A3698538n431462o910279k400334O052047Q669006J2725j1565844j3686300
$$ 13698538 8267076 1356797 -1043537 5008510 13677516 13690241 2124397 -11561903
5627a1561903o443141j256272l892887p109691k672713O530476J1352057Q794675
$$ -11561903 -18005044 -19261316 -23154203 -30263894 -32936607 -26406131 -15054074 -6259399
5619f259399L855869J056613k84539k054611l143369j454888K037425L666462
$$ -6259399 -2403530 -1346917 -1631456 -3686067 -6829436 -8284324 -6246899 -2580437
5611b580437J396215k534568l936325j385224K056056K292323j028814m095107
$$ -2580437 -1184222 -3718790 -7655115 -9040339 -6984283 -4691960 -5720774 -9815881
5603i815881l412965J70216K520998Q32782l454713o220454m624434N42358N890288
$$ -9815881 -13228846 -13058630 -10537632 -9704850 -13159563 -19380017 -24004451 -23462093 -17571805
5594a7571805Q239759O636216K645634o93279j081721O24694P53178k741676o406098
$$ -17571805 -9332046 -2695830 -50196 -743475 -1825196 -1200502 -447324 -3189000 -9595098
5585i595098m326691M010391J1288342R980208J134506o806966p546113l101467
$$ -9595098 -13921789 -9911398 1376944 11357152 12491658 5684692 -1861421 -4962888
5577d962888j85254k211309n978257n829934m13725N289189N338317j02986m687111
$$ -4962888 -5148142 -7359451 -13337708 -19167642 -19581367 -14292178 -8953861 -9056847 -13743958
5568a3743958l355801J997960N649141M972168K029820n03347j991448k280293
$$ -13743958 -17099759 -15101799 -9452658 -4480490 -2450670 -2954017 -4945465 -7225758
5560g225758l08186M070945Q087398P740172K032566n102441q119957n477221
$$ -7225758 -7533944 -3462999 4624399 12364571 14397137 9294696 1174739 -4302482
5552d302482r74298J266129J546898K319896K991389J012501k358414k500571
$$ -4302482 -5276780 -4010651 -2463753 -143857 2847532 3860033 1501619 -998952
5544i98952J119261L152457N85955k388606j502037N83324m46262k676964j819489
$$ -998952 120309 3272766 3858721 1470115 -31922 551402 105140 -2571824 -4391313
5535d391313M85404l72641k984387j997738J871066K498242p54984j760313J185502
$$ -4391313 -3905909 -4278550 -7262937 -9260675 -7389609 -4891367 -5646351 -7406664 -6221162
5526f221162K160667j064439j801593L860330Q467208M135730m099284m959021
$$ -6221162 -4060495 -5124934 -6926527 -3066197 5401011 9536741 5437457 478436
5518D78436K508630Q032962M738333l300491q657398r054038o615687l672111
$$ 478436 2987066 11020028 15758361 12457870 3800472 -5253566 -11869253 -15541364
5510a5541364j498133k96075Q72301K453759L141624K325752K389590N361341
$$ -15541364 -17039497 -17335572 -16463271 -14009512 -10867888 -8542136 -6152546 -791205
5502g91205Q415351O534289n93855p634575r446735n355319J293215M945987J109583
$$ -791205 7624146 14158435 13564580 5930005 -3516730 -8872049 -7578834 -2632847 -1523264
5493a523264q059343j3060119o989050M850094J0796748P485179K020500l86730
$$ -1523264 -9582607 -22642726 -29631776 -24781682 -13984934 -6499755 -4479255 -4865985
5485d865985k509881o214098o209454J134968R068477Q318861J39927o070115
$$ -4865985 -7375866 -13589964 -19799418 -18664450 -9595973 -1277112 -1137185 -7207300
5477g207300o122417m213781l267168m10467N565378R304856O059860o55650l451888
$$ -7207300 -13329717 -17543498 -20810666 -21221133 -15655755 -6350899 -291039 -946689 -4398577
5468d398577n13585L798504N906693N685792K949460l182858r992335j1198137
$$ -4398577 -4912162 -1113658 4793035 10478827 13428287 10245429 253094 -10945043
5460a0945043m702486K970108M138689o5405j811969K206918P004305P524220
$$ -10945043 -15647529 -12677421 -8538732 -8604137 -10416106 -8209188 -1204883 6319337
5452F319337M986906K191932k206782r494884j4533521j0526457M56833Q185910
$$ 6319337 11306243 13498175 11291393 1796509 -12737012 -23263469 -22806636 -14620726
5444a4620726O737467Q01117k376485j913535q28444M22929K779522M016276J229191
$$ -14620726 -7883259 -7082142 -9458627 -11372162 -12200606 -11777677 -8998155 -4981879 -3752688
5435c752688l199904l721276K0571K202536l09482l041481q91652L926458N347586
$$ -3752688 -6952592 -10673868 -10653297 -8450761 -8760243 -11801724 -12693376 -8766918 -3419332
5426c419332K558619L84772Q85398J74429m068805o699950j728287P296575R730768
$$ -3419332 -860713 -475941 409457 583886 -3484919 -10184869 -11913156 -4616581 5114187
5417E114187J854404p101496o748564O18760L836910r88863n249480p52298Q327224
$$ 5114187 6968591 -132905 -6881469 -6262709 -2425799 -3414662 -8664142 -9416440 -1089216
5408a089216J1349250N317443l036416p811262r828398j0806010q240516n60821
$$ -1089216 10260034 15577477 12541061 4729799 -5098599 -15904609 -24145125 -24705946
5400b4705946O735872O198149j139190n896198k235608M738391O211112J219330
$$ -24705946 -17970074 -11771925 -12911115 -18807313 -21042921 -16304530 -10093418 -8874088
5392h874088l061466j689499J680736N33674n082073q047968l099151O199521
$$ -8874088 -11935554 -13625053 -11944317 -11410643 -16492716 -24540684 -27639835 -21440314
5384b1440314J1080236P393222j10371l785350j636499J835943K330805N14326
$$ -21440314 -10360078 -2966856 -3077227 -6862577 -8499076 -6663133 -4332328 -3818002
5376c818002o06517m31091n29621r91637J1635K739536M409292K478223j996208
$$ -3818002 -4424519 -4855610 -5385231 -6376868 -6365233 -3625697 783595 3261818 1265610
5367A265610n578300o231829m632627k113023J223070N539512R014514Q159088
$$ 1265610 -4312690 -10544519 -15177146 -17290169 -16067099 -10527587 -1513073 6646015
5359F646015J851018n420568o822837j058083N043401M211168k393500p126586
$$ 6646015 8497033 3076465 -3746372 -4804455 238946 4450114 2056614 -5069972
5351e069972n846754j857805N41659J728453L507512M155720Q44244m932305q376608
$$ -5069972 -10916726 -12774531 -12232872 -10504419 -6996907 -2841187 -1996943 -6929248 -15305856
5342a5305856p209953l308045Q32923L939072M553902J570804k844150m065264
$$ -15305856 -22515809 -25823854 -24990931 -21051859 -16497957 -14927153 -17771303 -21836567
5334b1836567o29367L073208J854719l596478p079068l898930L708243Q743915
$$ -21836567 -22465934 -19392726 -17538007 -21134485 -28213553 -32112483 -28404240 -19660325
5326a9660325O753243K74183m611319n454222n185716o371152o672369k563280
$$ -19660325 -12907082 -12632899 -17244218 -22698440 -27884156 -34255308 -40927677 -43490957
5318d3490957M372271Q505292P250977L798983K244247K908796L624328L287100
$$ -43490957 -39118686 -30613394 -23362417 -19563434 -17319187 -14410391 -10786063 -7498963
5310g498963K557059K344348K661240K255367m31660m450957n246467O02740R319818
$$ -7498963 -4941904 -2597556 63684 2319051 1887391 -2563566 -7810033 -7207293 2112525
5301B112525J2291492O125905k910859o868511n465739m081543m861066m661519
$$ 2112525 14404017 20529922 17619063 10750552 5284813 1203270 -3657796 -8319315
5293h319315j526640J634052J696149K18894O35358K225705N51512n494656j0130774
$$ -8319315 -9845955 -8211903 -6515754 -6296860 -5661502 -3435797 -2884285 -8378941 -18509715
5284a8509715o951785K181415P969830M672206k677156m964499q44701K585080
$$ -18509715 -25461500 -23280085 -15310255 -10638049 -13315205 -18279704 -19124405 -16539325
5276a6539325O80204k526525j363578K684789L677622M28541j982955J12503L951572
$$ -16539325 -15859121 -18385646 -19749224 -17064435 -13386813 -12958272 -14941227 -14828724 -10877152
5267a0877152M400904L88168m390968n742760k641148K561207O517663P479028
$$ -10877152 -6476248 -6088080 -10479048 -16221808 -18862956 -16301749 -9784086 -2305058
5259b305058N770869K259740k255731n707868n062945r9729M656515M615211Q73915
$$ -2305058 3465811 5725551 3469820 -2238048 -7300993 -7400722 -2744207 1871004 2744919
5250B744919j758691j727019j724519k707256j873948J577343L515541J097011
$$ 2744919 986228 -740791 -2465310 -5172566 -7046514 -5469171 -1953630 -856619
5242h56619k132705j755671L51271o8834j271081J739134O940707O206166j626211
$$ -856619 -2989324 -4744995 -4393724 -4462558 -5733639 -3994505 2946202 9152368 7526157
5233G526157o973698l430645K035853R4044n471909l122603P857246J4756527
$$ 7526157 552459 -2878186 -842333 -748289 -6220198 -9342801 -1485555 13270972
5225A3270972Q986616k997177j0117695j0255899q017432n284579j132083K611738
$$ 13270972 22257588 19260411 9142716 -1113183 -9130615 -14415194 -15547277 -12935539
5217a2935539L057150J890570K880015M656843K443783k952459m640237m0658
$$ -12935539 -9878389 -7987819 -5107804 -450961 1992822 -959637 -5599874 -5640532
5209e640532M281178J790341m568022o768351k931835Q83058k75366l795771l786257
$$ -5640532 -1359354 430987 -4137035 -10905386 -13837221 -12954163 -13229529 -17025300 -20811557
5200b0811557O51724M110713J876102l812829o394843l374533O77109Q21434j274600
$$ -20811557 -20159833 -16049120 -14173018 -17985847 -24380690 -27755223 -27078114 -26256680 -27531280
5191b7531280k42994M657585Q375192P400219M036754J793776L21237k203078
$$ -27531280 -27774274 -23116689 -14741497 -7341278 -3304524 -1510748 -1189511 -3392589
5183c392589m455168l612185n33733N63398j860523m034270j907768L142473N932109
$$ -3392589 -7847757 -11459942 -11993675 -11430277 -13290800 -17325070 -19232838 -16090365 -10158256
5174a0158256M177394J185565J147365L807578N716733N487711M933671M961324
$$ -10158256 -5980862 -4795297 -3647932 159646 5876379 11364090 16297761 21259085
5166B1259085L474188j148096o782252r673227q349488m177882M6925Q43930l702776
$$ 21259085 24733273 23585177 16802925 7129698 -1219790 -5397672 -5350747 -4506817 -8209593
5157h209593j0067744j0668075k703217O706707Q326622J975340m508214n823183
$$ -8209593 -18277337 -28945412 -31648629 -24941922 -16615300 -14639960 -19148174 -24971357
5149b4971357l405911O4819M046531O933531N344727o09436n427399m378228J208916
$$ -24971357 -28377268 -28312449 -24265918 -17332387 -11987660 -12597096 -18024495 -22402723 -21193807
5140b1193807O654072R052535P978553M048122r30944m310178m862887l527826
$$ -21193807 -14539735 -5487200 2491353 6539475 5608531 1298353 -3564534 -7092360
5132g092360j550449L20705J022735J27908n86623P04788K606005K492715R31101
$$ -7092360 -8642809 -8322104 -7299369 -7171461 -7758084 -7053296 -4447291 -1954576 -1023475
5123a023475L77452N50887m48197j696926j481708k233796o598497r788600m539345
$$ -1023475 -646023 -95136 -543333 -2240259 -3721967 -5955763 -12554260 -22342860 -26882205
5114b6882205O098923J0755705O380695K265853L784737L698093l451423r158078
$$ -26882205 -20783282 -10027577 -3646882 -1381029 2403708 6101801 2650378 -6507700
5106f507700l425453Q306423J1999532M325407n087430p894230m545907M04054
$$ -6507700 -9933153 -1626730 10372802 14698209 9610779 1716549 -2829358 -2425304
5098b425304K790164N29321k968288m28086Q148441J1300531J256709j2344177
$$ -2425304 364860 894181 -2074107 -2502193 5646248 16946779 18203488 5859311
5090E859311j4504401o247968j478657m823924o468262p4682P466095Q279735
$$ 5859311 -8645090 -14893058 -16371715 -21195639 -27663901 -27738583 -20272488 -11992753
5082a1992753M604913K283009J555193q6419j933858j768672M26681L091248L998456
$$ -11992753 -7387840 -5104831 -3549638 -3636057 -5569915 -7338587 -6911906 -3820658 177798
5073A77798L77997p114106j1493205p030249J162935L031995j427851k435791
$$ 177798 555795 -6558311 -18051516 -25081765 -23918830 -20886835 -22314686 -24750477
5065b4750477L604393Q817164P275976L469657K847265L097468L89843l518361
$$ -24750477 -21146084 -12328920 -5052944 -1583287 1263978 4361446 4751289 1232928
5057A232928n978167q206898j0037242o872914K363407J0582723J1558414P745645
$$ 1232928 -4745239 -12952137 -22989379 -29862293 -27498886 -16916163 -5357749 2387896
5049B387896L900322m78732o279252r145913o333978l650543p226522j2373167
$$ 2387896 6288218 5809486 -469766 -9615679 -15949657 -19600200 -26826722 -39199889
5041c9199889r127677L251510J4821612J6988243J0190013P72665m727975l401883
$$ -39199889 -48327566 -45076056 -30254444 -13266201 -3076188 -2303523 -7031498 -10433381
5033a0433381J613260L812426J431068N1049L880738Q520265P139427J96283o369760
$$ -10433381 -8820121 -5007695 -3576627 -3525578 355160 8875425 16014852 16211135 9841375
5024I841375r511656r959650p402124j097182N779978P953258M350366r18676
$$ 9841375 329719 -9629931 -17032055 -18129237 -12349259 -4396001 -45635 -964311
5016i64311l354835j467645K866314N168083J923659m485592p567946n306521
$$ -964311 -4319146 -5786791 -2920477 2247606 4171265 -314327 -7882273 -13188794
5008a3188794k534632k473996j805723K029886N084927M001315K737730N301435
$$ -13188794 -15723426 -18197422 -20003145 -17973259 -12888332 -8887017 -6149287 -847852
5000h47852P263542K768975m269510n130112R8587K898258p76214o327093q948494
$$ -847852 6415690 9184665 4915155 -214957 -116370 2781888 2005674 -4321419 -13269913
4991a3269913q544213n999001j592081K247231K776067J897534L598651O759738
$$ -13269913 -21814126 -27813127 -29405208 -27157977 -24381910 -22484376 -18885725 -12125987
4983a2125987O772668M038734L691627O038695M767236k701139r586522q515026
$$ -12125987 -5353319 -1314585 2377042 8415737 13182973 10481834 895312 -7619714
4975g619714j399828L649128K617274r54194j711371J127360L489006J508056
$$ -7619714 -9019542 -5370414 -2753140 -3707334 -5418705 -4291345 -802339 705717
4967G05717l841402p736301o848177k336718K453747N259477N584789M420238
$$ 705717 -3135685 -10871986 -17720163 -20056881 -17603134 -12343657 -6758868 -2338630
4959b338630L557316L018035J68573n153045o774740K15945R343298Q914353j078069
$$ -2338630 1218686 4236721 4405294 -747751 -7522491 -7306546 2036752 10951105 9873036
4950I873036q117136n505255n56868k47861p49853J604561R52343o283051j0737040
$$ 9873036 1755900 -3749355 -4306223 -4554084 -5303937 -3699376 -2747033 -9030084 -19767124
4941a9767124l683581P047601Q077353R19984k381606R18393L095839J443477
$$ -19767124 -23450705 -16403104 -8325751 -7405767 -9787373 -8868980 -5773141 -4329664
4933d329664P27443J523230n18168l903768k209794L574181M962613m46075n212235
$$ -4329664 -3602221 -2078991 -2597159 -6500927 -8710721 -5136540 -173927 -620002 -5832237
4924e832237l332330K837774P517092O764266M7038p537758q085364j933713K48569
$$ -5832237 -9164567 -6326793 1190299 7954565 8001603 463845 -7621519 -9555232 -9306663
4915i306663o231089j0487446l212657O450852N254147k173562k544511K854667
$$ -9306663 -15537752 -26025198 -29237855 -22787003 -17532856 -19706418 -22250929 -19396262
4907a9396262L211122N3772L169144Q989018M967381o647699j1252559o998467
$$ -19396262 -16185140 -16131368 -12962224 -3973206 994175 -5653524 -16906083 -23904550
4899b3904550n675345r192101p566842l68890K570872J906633O840837J3017445
$$ -23904550 -29579895 -38771996 -46338838 -46707728 -44136856 -42230223 -35389386 -22371941
4891b2371941P691146l480750k423129Q563938R917600R30644m92293N053262
$$ -22371941 -14680795 -18161545 -20584674 -12020736 -2103136 -1172492 -1664785 3388477
4883C388477n33605j2250770n604051J3611710J2288864p611717o387611J8030341
$$ 3388477 2854872 -9395898 -14999949 -1388239 10900625 3288908 -3098703 14931638
4875A4931638K0109589J367866L4603287J35442824J87180890Q5543074r2948440
$$ 14931638 35041227 36409093 71012380 206455204 393636094 479179168 386230728
4868C86230728j73819147j11963058k7063232j4640225l5745344k3315304O273783
$$ 386230728 212411581 100448523 73385291 58745066 22999722 -315582 5958201
4861E958201O370308j1255381q349854Q084583P635312l759861n58074J1026658
$$ 5958201 12328509 1073128 -7276726 807857 8443169 4683308 4125234 15151892
4853A5151892P425285n848733o281999K888892K463635l784152J555956J2421712
$$ 15151892 22577177 16728444 10446445 13335337 15798972 12014820 13570776 25992488
4845B5992488Q527381o564936j1481323m704495k969183p125210k515092R055733
$$ 25992488 34519869 27954933 16473610 11769115 8799932 1674722 -840370 8215363
4837H215363R683513j808491p145615j058630J469184n442912q339867k35415
$$ 8215363 17898876 16090385 8944770 7886140 9355324 3912412 -4427455 -4662870
4829d662870O801296L278204l167636l280896K06028J924385K655003K645140
$$ -4662870 2138426 5416630 2248994 -1031902 -825874 1098511 3753514 6398654
4821F398654j248135p101787q262275n007932m185595n841692l093371L551541
$$ 6398654 5150519 -1951268 -10213543 -15221475 -19407070 -25248762 -28342133 -24790592
4813b4790592N759073K895607L294073P613822O395934j854241n734171J43589
$$ -24790592 -19031519 -16135912 -12841839 -5228017 1167917 -686324 -6420495 -6276906
4805f276906O050141M046785K15945J617994L538823n23923o487027p287085m593257
$$ -6276906 -226765 3820020 4035965 5653959 9192782 8668859 2181832 -5105253 -9698510
4796i698510l543747k827062R77539N024793M673731J613329N5706o85427k731769
$$ -9698510 -13242257 -16069319 -15091780 -10066987 -5393256 -3779927 -3724221 -4409648 -7141417
4787g141417l227252J000032N747799M143634k761214p091753n220464j644031
$$ -7141417 -10368669 -9368637 -3620838 522796 -2238418 -9330171 -14550635 -16194666
4779a6194666j325745l160826k788360J070247N122484N556201K333901j135474
$$ -16194666 -17520411 -20681237 -23469597 -22399350 -17276866 -11720665 -9386764 -10522238
4771a0522238k218427j352514K52895K440437L893528J563419m233895p412699
$$ -10522238 -12740665 -14093179 -13840284 -11399847 -7506319 -5942900 -10176795 -17589494
4763a7589494l593960K676829L779314o9591k088021L83949L427457M230257M135780
$$ -17589494 -21183454 -18506625 -14727311 -14796902 -16884923 -16500974 -13073517 -8843260 -4707480
4754d707480L697865J539067r97657n04645K212414K688497L67514q04334l2461
$$ -4707480 -1009615 529452 -468205 -972850 1239564 3928061 4295575 3491241 3458780
4745C458780r11807l813788m296767r71759K090605K759132L428247M222339J654491
$$ 3458780 2546973 -1266815 -5563582 -6535341 -4444736 -1685604 1742643 5964982 7619473
4736G619473l010655k595235M320622Q666323L634492m822595o756593j715804
$$ 7619473 4608818 2013583 6334205 15000528 18635020 13812425 7055832 5340028
4728E340028L174647L898103J790869j164990l392881l141095j460141j996727
$$ 5340028 8514675 12412778 14203647 13038657 9645776 6504681 5044540 3047813
4720C047813l959124r98940P693608J2024384M525521o842886r281438l864002
$$ 3047813 -911311 -1910251 5783357 17807741 22333262 15490376 6208938 2344936
4712B344936j957477n527902m681750L715235Q659826K232470o860021n895739
$$ 2344936 387459 -5140443 -9822193 -6106958 2552868 4785338 -2074683 -7970422
4704g970422L122954P497041K739038k895628k451943O00611K30893k406943k259651
$$ -7970422 -4847468 2649573 5388611 2492983 41040 641651 872544 -1534399 -3794050
4695c794050Q40807K546283J651630J878744N293454Q335772O526387K69282o232781
$$ -3794050 -2953243 -406960 1244670 3123414 8416868 16752640 23279027 23548309 17315528
4686A7315528r601593q628901l442009L405031O677485L296385k958931n314245
$$ 17315528 7713935 -914966 -4356975 -951944 5725541 9021926 6062995 748750
4678G48750k605283n6319p93568j160230K938314Q662946R188786K547624n948444
$$ 748750 -1856533 -1912852 -2706420 -3866650 -928336 7734610 16923396 19471020 13522576
4669A3522576r853529p655679k782700L16252j61928k040807j339477K903992
$$ 13522576 3669047 -3986632 -6769332 -6453080 -6615008 -8655815 -9995292 -7091300
4661g091300O331261M003679k234653m206425K425254J0795926R916894j156750
$$ -7091300 -760039 3243640 1008987 -3197438 -772184 10023742 19940636 18783886
4653A8783886j1136470j0433835k611202K104690P91944r73770M2619M25985k220767
$$ 18783886 7647416 -2786419 -5397621 -3292931 -2500987 -3474757 -3432138 -3006153 -5226920
4644e226920m335269k378049J508283L403785K950939J470971j181636m410067
$$ -5226920 -9562189 -11940238 -10431955 -7028170 -4077231 -2606260 -3787896 -8197963
4636h197963n383797l243156j018548j86336K062525O369795P519831K592287
$$ -8197963 -13581760 -16824916 -17843464 -18029800 -15967275 -9597480 -2077649 514638
4628E14638k339933m33006N099117N831286Q26216l228066k772466q23168m39800
$$ 514638 -1825295 -2258301 2840816 8672102 9498318 6270252 3497786 2674618 2234818
4619B234818j234091j968466j507081J431358M915626L242468m917983j1864941
$$ 2234818 1000727 -967739 -2474820 -1043462 3872164 7114632 2196649 -9668292
4611i668292j0812300n739514l550909k027451M129977J0443923Q694685K381480
$$ -9668292 -20480592 -26220106 -29771015 -31798466 -27668489 -17224566 -8529881 -6148401
4603f148401J852663N683624K525662p973462j2616385o246038L56244m00778
$$ -6148401 -4295738 1387886 3913548 -4059914 -16676299 -22922337 -22566093 -22966871
4595b2966871j635070K617051N706413J948589j286726L489752R769038P786271
$$ -22966871 -24601941 -21984890 -16278477 -14329888 -15616614 -12126862 -2357824 5428447
4587E428447M44504l213025k813654l466663m420759k246829J91828j336807l496033
$$ 5428447 5872951 2659926 -153728 -3620391 -8041150 -10287979 -10096151 -11432958 -14928991
4578a4928991j264053K460375K820298K676494N830389O778101n04308q631560
$$ -14928991 -16193044 -13732669 -10912371 -8235877 -2405488 4372613 3868305 -4763255
4570d763255n344509O822863J2979807P024240k461161p560293r689190j1005892
$$ -4763255 -10107764 -3284901 9694906 16719146 14257985 6697692 -2991498 -13997390
4562a3997390q616614j282870O339338R491425P628507K198099m049565o308737
$$ -13997390 -22614004 -23896874 -17557536 -8066111 -437604 1760495 -2289070 -8597807
4554h597807k981823k87539m151969r575675p164405J385214N024011O16719k716898
$$ -8597807 -11579630 -11867169 -16019138 -25594813 -32759218 -31374004 -26349993 -25733274 -28450172
4545b8450172J422858P861748R441802O417275K431168r83880k198163R45141
$$ -28450172 -27027314 -19165566 -9723764 -3306489 -875321 -1859201 -4057364 -3112223
4537c112223N792254N839590K84966l861605k137661J538039K341588J002849
$$ -3112223 2680031 8519621 8804587 4942982 2805321 4343360 6684948 7687797
4529G687797n67118l296321o702055p026731l803366k249645m739091n812940
$$ 7687797 7120679 3824358 -2877697 -9904428 -13707794 -15957439 -20696530 -26509470
4521b6509470q09622N742899O173768M96867m217574l081899K154180O206523
$$ -26509470 -27319092 -21576193 -15402425 -14905558 -19123132 -22205031 -20050851 -13844328
4513a3844328N010375p96765n502004l932863J739153M457820K094093l57324
$$ -13844328 -8833953 -9630718 -15132722 -19065585 -17326432 -12868612 -10774519 -11131843
4505a1131843K67395M54689k728535n617506l937543K5780J598122J420361L390801
$$ -11131843 -10864448 -10409759 -13138294 -18755800 -22693343 -22667563 -21069441 -19649080 -16258279
4496a6258279P250529Q642553N685553J162322j614984j963977j081646n32372
$$ -16258279 -9007750 -365197 5320356 6482678 4867694 2903717 1822071 1289699
4488A289699j310384k886814l630814k896659j523672J54933K751023N392594
$$ 1289699 -20685 -2907499 -6538313 -9434972 -10958644 -10803711 -8052688 -2660094
4480b660094N227711J063734m159117o297864m503102j470738K76207J198084
$$ -2660094 2567617 3631351 -527766 -6825630 -11328732 -12799470 -12523263 -11325179
4472a1325179L318866O253326O397880K149856j753064K46080M971898L198795
$$ -11325179 -8006313 -1752987 4644893 6794749 5041685 5287765 10259663 13458458
4464A3458458o146307j2384205q327030q62811R75375L17498M410415R217631
$$ 13458458 7312151 -5072054 -13399084 -14261895 -13286520 -12969022 -8558607 659024
4456F59024N545170l500373o017428r60973R52560l211398m030845J813223M303408
$$ 659024 6204194 2703821 -3313607 -4274580 -3322020 -6533418 -10564263 -8751040 -4447632
4447d447632k217409q537546o263754j208555j237293k179156K718315Q661569
$$ -4447632 -6665041 -15202587 -21466341 -22674896 -23912189 -26091345 -23373030 -14711461
4439a4711461O986430J05945l150169j941785j815965k858986o49288L607592
$$ -14711461 -7725031 -7619086 -10769255 -12711040 -14527005 -17385991 -18035279 -14427687
4431a4427687M279345J133069j052022j279851k441383m047361k905283l1922
$$ -14427687 -10148342 -9015273 -10067295 -11347146 -13788529 -17835890 -20741173 -20773095
4423b0773095O02016o07355K47468L288912M937799M383267L836117L384177J492630
$$ -20773095 -20171079 -20778434 -20530966 -17242054 -12304255 -7920988 -4084871 -700694 791936
4414G91936n39133k77328J036576P12855j99369O34263J476828n76542l665375
$$ 791936 252803 -24525 1012051 1724906 1525537 2159800 3636628 3060086 -605289
4405f05289m082168k614594j888719m31024L733745O736915M036024p77551r24388
$$ -605289 -4687457 -7302051 -9190770 -9621794 -5888049 848866 4884890 4107339 3182951
4396C182951K083716J266190l156666m178894o80256J039908p33552o20868K079663
$$ 3182951 5266667 6532857 3376191 -802703 -1482959 -443051 -1176603 -1797471 282192
4387B82192N15967o307544q217951P92224J0910730R401107q83010n854187k09048
$$ 282192 798159 -5509385 -13727336 -12935112 -2024382 7376725 6493715 639528 430480
4378D30480O634213N081525k321753o493654m488437j536285j968811l111006
$$ 430480 7064693 12146218 9824465 3330811 -1157626 -2693911 -4662722 -7773728
4370g773728l87326M460995M721613j591499p805131o636699J085032Q486704
$$ -7773728 -8161054 -3700059 1021554 -569945 -8375076 -15011775 -13926743 -5440039
4362e440039J0558618P014111K65677n650770o602633k830892J06088j579301
$$ -5440039 5118579 12132690 12398367 6747597 144964 -2685928 -2579840 -4159141
4354d159141m488417l657371l79713P45732k59532J16010J736324J278625r81485
$$ -4159141 -8647558 -12304929 -12684642 -11938910 -12198442 -12082432 -10346108 -9067483 -10048968
4345a0048968r97573K319079N282554M567427L87344m607210o400161k127720
$$ -10048968 -11046541 -8727462 -3444908 1122519 1509863 -3097347 -9497508 -11625228
4337a1625228M625252M992304l380794j0345827o233183L738596P052789K054394
$$ -11625228 -6999976 -2007672 -5388466 -15734293 -21967476 -18228880 -11176091 -9121697
4329i121697k128670j226893N56081J662319N188272Q739318N104847m065210
$$ -9121697 -11250367 -12477260 -11921179 -10258860 -5070588 3668730 8773577 4708367
4321D708367p640238k241969J927126k018291o606849l137313M601224Q245380
$$ 4708367 -2931871 -5173840 -3246714 -5265005 -11871854 -15009167 -10407943 -2162563
4313b162563P697003P096993N387234O7951n555360p469000q017697r986231r393967
$$ -2162563 5534440 12631433 18018667 18086618 12531258 5062258 -2955439 -12941670 -22335637
4304b2335637k819413L698887K871347j314023J81571O033758O662692L02634
$$ -22335637 -25155050 -21456163 -18584816 -19898839 -19717268 -13683510 -7020818 -6718184
4296f718184m401440k466228J395074K933149M585196P636218O982987l33108
$$ -6718184 -11119624 -13585852 -12190778 -9257629 -4672433 2963785 9946772 9613664
4288I613664p658931o519918J530074O754797L328036n130234j1212319j0699441
$$ 9613664 1954733 -4565185 -3035111 3719686 7047722 1917488 -9294831 -19994272
4280a9994272m059742M842249J0203953P804228k59923o090252m103265K201733
$$ -19994272 -24054014 -19211765 -9007812 -1203584 -1463507 -7553759 -11657024 -9455291
4272i455291M663752J235536j834665L69589M477998M727483J552318n99530r45994
$$ -9455291 -4791539 -3556003 -5390668 -5021079 -543081 4184402 5736720 5137190 4191196
4263D191196k009334l387914k183074Q63369J638186q23688l555265n142563o032319
$$ 4191196 2181862 -1206052 -3389126 -2525757 -887571 -1711259 -5266524 -10409087 -16441406
4254a6441406l812023M347308J3616132J3960319L558586p286945r114880l834197
$$ -16441406 -20253429 -15906121 -2289989 11670330 15228916 7941971 -1172909 -5007106
4246e007106J145669K737575J762120j206473m344344l699879J243989N113890
$$ -5007106 -3861437 -1123862 638258 -568215 -4912559 -8612438 -7368449 -2254559
4238b254559L896332N34085m40608P94361K313657M565055O924100N231220j822534
$$ -2254559 1641773 2175858 1735250 2529611 4843268 9408323 16332423 21563643 19741109
4229A9741109q222004q030898l447617l50059J45358K33704m10787k872918m568602
$$ 19741109 11519105 3488207 40590 -309469 -164111 69593 -341194 -3214112 -7782714
4220g782714k593657R54994K294320J983381K596945L235279J581221j187697
$$ -7782714 -10376371 -9421377 -7127057 -5143676 -2546731 688548 2269769 1082072
4212A082072k483683k590681k366767j95711L896784N237137J355339k437234
$$ 1082072 -1401611 -3992292 -6359059 -6554770 -2657986 2579151 3934490 1497256
4204A497256r09740J999799j62330m512288l177244K655999L535818k982982p892095
$$ 1497256 587516 2587315 2424985 -2087303 -5264547 -2608548 927270 -2055712 -9947807
4195i947807m395321K378989L846437M1820k129413O10233M202225L542505q16076
$$ -9947807 -14343128 -11964139 -8117702 -8075882 -10205295 -9595062 -5392837 -1850332 -2666408
4186b666408l645383j979153Q54712j60634m429134o440476l472240J570431N295440
$$ -2666408 -6311791 -8290944 -7436232 -7596866 -12026000 -18466476 -21938716 -20368285 -15072845
4177a5072845O940680N734601J019131l630889k981297J247065J760770j829141
$$ -15072845 -8132165 -2397564 -1378433 -5009322 -7990619 -6743554 -4982784 -6811925
4169f811925q77112P546438J3319816P582390l932489r771106p812806l506486
$$ -6811925 -7689037 -142599 13177217 20759607 16827118 7056012 -756794 -4263280
4161d263280J26978K454173J447245j968117j754991L765129P155680L607857
$$ -4263280 -4136302 -1682129 -234884 -2203001 -3957992 -192863 6962817 10570674
4153A0570674q98455p60323k41003l005681l238992K411471N863016K112009m90750
$$ 10570674 9672219 8911896 8670893 5665212 2426220 4837691 10700707 12812716 12321966
4144A2321966K665929R51566r843336j2737114K205692J4251487M010603j0249798
$$ 12321966 14987895 15939461 6096125 -6640989 -4435297 9816190 13826793 3576995
4136C576995k489051J3944212J2917838J2741818M8072760Q8722528N7914663
$$ 3576995 1087944 15032156 27949994 40691812 88764572 177487100 235401763
4129B35401763m7947380j26269203r6843762q417272L5882187J5510907q652347
$$ 235401763 187454383 61185180 -35658582 -44075854 -8193667 7317240 -1335107
4122a335107k986779M619628n944161j2005227K336764J4549823M677246j0576085
$$ -1335107 -4321886 297742 -5646419 -17651646 -15314882 -765059 3912187 -6663898
4114f663898q298481N061478J0480702O260268J471133k534366o755107n612894
$$ -6663898 -14962379 -9900901 579801 6840069 8311202 5776836 -978271 -6591165
4106f591165J700427M242323l369082r544566l817150O199502Q206016L845473
$$ -6591165 -4890738 -648415 -4017497 -13562063 -17379213 -11179711 -2973695 871778
4098H71778J518765J221686r08113k164539M92684J992017j758277m459878l41451
$$ 871778 2390543 3612229 2704116 539577 1032261 3024278 1266001 -3193877 -3535328
4089c535328L799966l15789o969929n439421J712700L540933m32261r32534L634453
$$ -3535328 264638 -51151 -7021080 -12460501 -10747801 -7206868 -7639129 -8571663 -4937210
4080d937210N049142Q51639j655758P06241J563498k552888n365961k035123K058144
$$ -4937210 111932 963571 -692187 14054 1577552 -975336 -6341297 -8376420 -6318276
4071f318276L80977m164430n009088k767187k474090l621637j359909L570725
$$ -6318276 -5937299 -10101729 -15110817 -17878004 -20352094 -23973731 -25333640 -21762915
4063b1762915M432154n46101l984583K54362P845500J0001045N151957p27823
$$ -21762915 -17330761 -17876862 -21861445 -21607083 -13761583 -3760538 1391419 663596
4055F63596l285805l367926k210857O04951L445620K829176n74950j597364J192641
$$ 663596 -2622209 -5990135 -8200992 -7596041 -4150421 -1321245 -1896195 -3493559 -2300918
4046b300918K399653j691867p043250q443657o615840l870304J245752Q384147
$$ -2300918 98735 -1593132 -8636382 -17080039 -23695879 -27566183 -26320431 -17936284
4038a7936284J0434150K838824o543516o589943J091629N421616K822584j99235
$$ -17936284 -7502134 -4663310 -11206826 -17796769 -16705140 -11283524 -8460940 -8660175
4030h660175m12439j549720l531419n00639O916849R065847K068298n298551n351635
$$ -8660175 -9072614 -10622334 -14153753 -14654392 -7737543 1328304 3396602 -1901949 -7253584
4021g253584k212932k078510k446087N81571K739561q81756n389688l442699J877580
$$ -7253584 -9466516 -11545026 -13991113 -13409542 -10669981 -11551737 -16941425 -20384124 -18506544
4012a8506544J977176k881478m637877j168915J258945n00137j649087J982908
$$ -18506544 -16529368 -19410846 -24048723 -25217638 -23958693 -24458830 -26107917 -24125009
4004b4125009P611578R989992P251265J064294m793901n792756r25195M503175
$$ -24125009 -16513431 -6523439 727826 1792120 -3001781 -8794537 -9719732 -5216557
3996e216557M707513J353126O89277L592924M599277J130600k796617l709031
$$ -5216557 -509044 844082 1533359 5126283 9725560 10856160 8059543 4350512
3988D350512l440593m078245l595060k85373K757313K058998k40656M72883L614269
$$ 4350512 909919 -3168326 -6763386 -7048759 -4291446 -2232448 -2473104 -2000221 1614048
3979A614048L661001j437623o115562l849029L950042Q747412M947803l334375
$$ 1614048 5275049 3837426 -2278136 -6127165 -2177123 6570289 11518092 8183717
3971H183717p483863m808242o33901j94710k266905k576437k38436K219714L205336
$$ 8183717 699854 -4108388 -4742289 -4936999 -7203904 -9780341 -10018777 -7799063 -4593727
3962d593727L146365K256597K07238k309078l992341m582112m288147k403773
$$ -4593727 -1447362 809235 1016473 -1292605 -5284946 -9867058 -14155205 -16558978
3954a6558978J429147N330554O767437N523013L144920K40064l308379n909868
$$ -16558978 -15129831 -9799277 -3031840 2491173 5636093 5876157 2567778 -3342090
3946c342090m791015L27263N698194O638403J981903m440908p036835m168791
$$ -3342090 -8133105 -7805842 -2107648 4530755 6512658 2071750 -4965085 -9133876
3938i133876j70318J89848j709966r41131K253645K094766k690457n106306n62615
$$ -9133876 -9304194 -9114346 -10824312 -11765443 -9511798 -7417032 -10107489 -15213795 -15776410
3929a5776410M717890K530369m569167p114263k476513L433067O588491Q314304
$$ -15776410 -11058520 -8528151 -13097318 -20211581 -22688094 -19255027 -12666536 -4352232
3921d352232Q567674M653763j865445n082359l717116k618113l246997j148885
$$ -4352232 4215442 8869205 7003760 1921401 -1795715 -4413828 -7660825 -8809710
3913h809710L862804M336998k335180o816759j177814P720660P707709q29315
$$ -8809710 -4946906 -609908 -2945088 -9761847 -10939661 -3219001 4488708 3659393
3905C659393o863434n607068k799530k740102k395311P88130L983444M801395
$$ 3659393 -3204041 -8811109 -11610639 -14350741 -16746052 -15957922 -11974478 -7173083
3897g173083M894228M929641K526368j791147k978419M94072K885822k35106m961711
$$ -7173083 -2278855 2650786 5177154 3386007 407588 901660 3787482 3552376 -1409335
3888a409335n448703k709484j603461k688343k675823m26581K607114N671301
$$ -1409335 -6858038 -9567522 -11170983 -13859326 -16535149 -16961730 -14354616 -8683315
3880h683315P815159O347791J131193k477936o79360J689057j983722q525538
$$ -8683315 -868156 5479635 6610828 4132892 3453532 5142589 3158867 -5366671
3872e366671q657025j399920M290556L280121M14572K68877L908k646078k578112
$$ -5366671 -14023696 -15423616 -11133060 -7852939 -7438367 -7169490 -7165582 -9811660 -12389772
3863a2389772M443026J2725355J3364519O183967j699215n932936p083988n813429
$$ -12389772 -7946746 4778609 18143128 24327095 22627880 16694944 9610956 3797527
3855C797527k867224j753145m566621o755676k926083L503706M022018j948817
$$ 3797527 930303 -822842 -5389463 -12145139 -15071222 -11567516 -7545498 -9494315
3847i494315n685118j971743M242148O317653M238891J262548j675295m137445
$$ -9494315 -15179433 -17151176 -12909028 -6591375 -2352484 -1089936 -2765231 -6902676
3839f902676l640984N98839M802324N427386M051992M017910M882620L816508
$$ -6902676 -10543660 -9944821 -5142497 284889 4336881 8354791 13237411 17053919
3831A7053919M31320l260658o142916q067055p912435m800412p38257P87985q17681
$$ 17053919 17485239 14224581 8081665 14610 -7897825 -12698237 -13436494 -12648509 -13466190
3822a3466190k166812J60943N290698Q260103N045289k446015p592293o294070
$$ -13466190 -15633002 -15472059 -10181361 -1921258 3124031 678016 -6914277 -13208347
3814a3208347j418013J806012K729099M279015O645098O690942L655381Q52518
$$ -13208347 -14626360 -12820348 -10091249 -5812234 832864 7523806 11179187 12031705
3806A2031705O42386J427333O96215k093861o095272r275827q353968k640845
$$ 12031705 12674091 14101424 14797639 12703778 6608506 -2667321 -11021289 -13662134
3798a3662134K534370J443253l109642k746592L791095Q023101M162076k841737
$$ -13662134 -11127764 -9684511 -12794153 -15540745 -11749650 -3726549 435527 -2406210
3790b406210n387936l109806l10536R88828Q12841j159177l335057k072043K278689
$$ -2406210 -7794146 -10903952 -11214488 -10225660 -9412819 -10571996 -13907053 -15979096 -13700407
3781a3700407M195104J676936K2591K193634K467557l473454q848845n168913
$$ -13700407 -9505303 -7828367 -7805776 -5612142 -3144585 -6618039 -15466884 -20635797
3773b0635797L645730O544781J788655j978656K06238M302578O225664O939399
$$ -20635797 -16990067 -10445286 -8656631 -10635287 -10429049 -6126471 99193 7038592
3765G038592O923539L602055k810202o994930n109969L71162M279572M092906
$$ 7038592 13962131 17564186 14753984 7759054 2649085 3020247 7299819 11392725
3757A1392725J007908j474649l04908L217879L846083n49368n273666n916718
$$ 11392725 12400633 10925984 10621076 13838955 17685038 17135670 11862004 5945286
3749E945286n143179p016566q831855n748445j2569K535197K244740L286486M278864
$$ 5945286 802107 -6214459 -15046314 -20794759 -20807328 -18272131 -16027391 -12740905 -8462041
3740h462041J113475l045613j692263K266045O2456o281041m616456O873774J3746742
$$ -8462041 -7348566 -10394179 -12086442 -9820397 -9757941 -16038982 -20655438 -13781664 -34922
3731c4922O203256o227788r357814l757707J60553j003066k024090l9228K020880
$$ -34922 6168334 -59454 -9417268 -13174975 -13014422 -14017488 -16041578 -16080806 -14059926
3722a4059926J440483j012370k785741j335210L245586N809932J134597p189404
$$ -14059926 -12619443 -13631813 -16417554 -17752764 -14507178 -8697246 -7562649 -14752053
3714a4752053r466950l686827J499916Q85241K47725M313502P112348K538714
$$ -14752053 -24219003 -27905830 -26405914 -25520673 -25272948 -20959446 -13847098 -11308384
3706a1308384l999652m078713M38945K349912J338450J251343O60389l260058
$$ -11308384 -15308036 -19386749 -18947804 -16597892 -15259442 -14008099 -13347710 -16607768
3698a6607768o160298k718454K795883L342584K157020O304907J0906756M820968
$$ -16607768 -22768066 -25486520 -22690637 -19348053 -17191033 -10886126 20630 4841598
3690D841598q872100j3989337n217285M169262L385332j246879j16089L771496
$$ 4841598 -4030502 -18019839 -23237124 -19067862 -15682530 -16929409 -17045498 -13274002
3682a3274002K641148j620735j836052J532940K188447n29079j180191K040649
$$ -13274002 -10632854 -12253589 -14089641 -12556701 -10368254 -10897333 -12077524 -10036875
3674a0036875M761521L697596O29285j529672k394040k913144l153229k127839
$$ -10036875 -5275354 -1577758 -948473 -2478145 -4872185 -7785329 -10938558 -13066397
3666a3066397Q86531M516702N219528J281260l363112k928910J998767M345074
$$ -13066397 -12179866 -7663164 -2443636 -1162376 -4525488 -7454398 -5455631 -1110557
3658a110557K65673n401123n951803j144829M281511O910521O197612K704320
$$ -1110557 -844884 -6246007 -12197810 -13342639 -9061128 -2150607 4047005 6751325
3650F751325j853345m902748n721421n533614l742273J631525P750403P110445
$$ 6751325 4897980 -4768 -5726189 -11259803 -15002076 -13370551 -5620148 1490297
3642A490297j664711q744449n211386M141053P806107M072081J296490K938421
$$ 1490297 -174414 -8918863 -14130249 -9989196 -2183089 1888992 3185482 6123903
3634F123903K834908k427128o351089l083018K501948K249697k887684n431391
$$ 6123903 8958811 6531683 180594 -2902424 -400476 1849221 -1038463 -6469854
3626f469854l193040p89129o27912l6937K025741K453065K50684q86288O79758
$$ -6469854 -9662894 -10452023 -11079935 -11116872 -9091131 -6638066 -6387382 -7273670 -6593912
3617f593912P85759l407991p401842n697787m59358K009719P30526l19785j07813
$$ -6593912 -5808153 -9216144 -16617986 -22315773 -22775131 -20765412 -20034886 -20354671 -20462484
3608b0462484j034274k301762l10486L777193M429425J215448K01370L541721
$$ -20462484 -21496758 -23798520 -24109006 -20331813 -15902388 -14686940 -14485570 -10943849
3600a0943849N848668M470499M550420Q370050Q682178O71377p535286o446800
$$ -10943849 -5095181 -624682 3925738 12295788 20977966 21649343 14114057 7667257
3592G667257p14901j344968p402416q755383m056874j384752j572374L332865
$$ 7667257 6952356 5607388 -1795028 -10550411 -14607285 -15992037 -17564411 -14231546
3584a4231546J2405324J2750027O02385q974426l061181J0225445J4710168Q303172
$$ -14231546 -1826222 10923805 11526190 2551764 -509417 9716028 24426196 32729368
3576C2729368K24142n850379j2194050j5580748r676751K209613Q887800O332792
$$ 32729368 32953510 27103131 14909081 -671667 -10348418 -8138805 748995 7081787
3568G081787J131150j181393j564419q87412K184538N094657K455260m366540
$$ 7081787 8212937 7031544 5467125 4579713 6764251 11858908 14314168 9947628
3560I947628p206075l365245K03067j910873o078926o973898m844346j431831
$$ 9947628 2741553 -623692 -420625 -2331498 -8410424 -15384322 -20228668 -21660499
3552b1660499L879261R168828Q690507K060269k352947M62306L715292P7488n432776
$$ -21660499 -17781238 -8612410 78097 2138366 -214581 247725 3963017 4040505 -1392271
3543a392271l501090L843761O849330M124336L005722M754813K193278n700277
$$ -1392271 -4893361 -1049600 5799730 9924066 12929788 17684601 19877879 14177602
3535A4177602r167898k940342M290044K928897l286249m679062j090000k56937
$$ 14177602 5009704 2069362 6359406 9288303 6002054 1322992 232992 -23945
3527b3945m068685o104373k546688K438467L415853n8539m846758p157449l937372
$$ -23945 -4092630 -10197003 -12743691 -10305224 -6889371 -6947910 -11794668 -18952117 -22889489
3518b2889489L689935Q517271M509353l848922o132382r35912J755119l576300
$$ -22889489 -19199554 -10682283 -6172930 -10021852 -16154234 -17090146 -15335027 -18911327
3510a8911327q361716l002912P405862J0093196L620776j068240J591322M050902
$$ -18911327 -27273043 -30275955 -22870093 -12776897 -9156121 -10224361 -8633039 -4582137
3502d582137o53651o923832n271842L092318Q365555N913692L34692l181115m204307
$$ -4582137 -5235788 -12159620 -17431462 -14339144 -5973589 -59897 274795 -2906320 -7110627
3493g110627l143105Q48900N284180L934572m226913j0209098n208362O707762
$$ -7110627 -10253732 -9404832 -4120652 -186080 -4412993 -14622091 -19830453 -13122691
3485a3122691J2578417O863974k490181n586437k120172J784493L087737L082137
$$ -13122691 -544274 6319700 3829519 -1756918 -3877090 -2092597 995140 4077277
3477D077277K279714j50149k805289l092403j928512k707323m880476l377230
$$ 4077277 6356991 6206842 3401553 309150 -1619362 -4326685 -9207161 -12584391
3469a2584391L461066R415371P315232j600744q441557o322718K637762R891371
$$ -12584391 -9123325 292046 7607278 6006534 -2435023 -8757741 -6119979 3771392
3461C771392R115590K296631k982967k480104K10112l05479l290136m014840k034337
$$ 3771392 12886982 15183613 12200646 9720542 9930654 9625175 6335039 2320199 285862
3452B85862j492134l198141k961057M85642K512518O45195q55645J200818K777182
$$ 285862 -1206272 -4404413 -7365470 -6879828 -4367310 -3722115 -4577760 -3376942 -599760
3443e99760n1189l317833j813189J311913p2181l682799k280978L301482M672854
$$ -599760 -650949 -3968782 -5781971 -4470058 -4542239 -8225038 -10506016 -7204534 -2531680
3434b531680k08400l382733M81002O329250P134629L029525j717017m782837n137542
$$ -2531680 -2740080 -6122813 -5641811 687439 7822068 10851593 9134576 4351739 -785803
3425g85803j822715K827027L694892J75748j892308Q96267L859513J704151l156885
$$ -785803 -2608518 218509 3913401 4089149 2196841 3093108 6952621 8656772 5499887
3416E499887m769059k318202L34151P96017p01335l566326o096091n171382o49080
$$ 5499887 730828 -1587374 -1253223 -457206 -1158541 -4724867 -10820958 -15992340 -16641420
3407a6641420K768692J851731k41150N38424K403923J491247j116159j808262
$$ -16641420 -13872728 -12020997 -12262147 -11723723 -9319800 -7828553 -8944712 -10752974
3399a0752974r52624r05583j63138L760048P630180O085823R52074o91319K248767
$$ -10752974 -11705598 -12611181 -12774319 -9014271 -1384091 4701732 5653806 4962487 7211254
3390G211254L420771o5429l240796k457398j470073m024977o600676m093173J551201
$$ 7211254 10632025 10566596 7325800 4868402 3398329 -626648 -7227324 -11320497 -9769296
3381i769296M138416K135347m58576q49596m54576j349740l210371m215437k976235
$$ -9769296 -5630880 -3495533 -3954109 -4803705 -5258281 -6608021 -9818392 -14033829 -17010064
3372a7010064L75217L788917M907706M214665M759389P006264O499030N1816p655904
$$ -17010064 -16634847 -12845930 -7938224 -3723559 1035830 8042094 14541124 14592940 6937036
3363F937036q571088k267069K873602J425495j213638K886647J1493527J4136411
$$ 6937036 -1634052 -3901121 -1027519 397976 -815662 2070985 13564512 27700923
3355B7700923O325113m397530q658616o291531l611174l881002n451822o688237
$$ 27700923 34026036 29628506 20969890 14678359 11067185 7186183 1734361 -4953876
3347d953876p077652m666516J723648P726146O796083m45289n785893m305611
$$ -4953876 -12031528 -16698044 -14974396 -7248250 -452167 -897456 -6683349 -10988960
3339a0988960k97785M41767j106678p31410J584578K773188K357333K285298K918093
$$ -10988960 -11286745 -10844978 -11951656 -12683066 -11098488 -8325300 -5967967 -3682669 -764576
3330g64576L083499K517134J154251j793284n075120m718229K60663M656919L859694
$$ -764576 2318923 4836057 5990308 4197024 -878096 -5596325 -5335662 -678743 3180951
3321C180951O25578K44178K272696K898875K440937L469856L676451j317146q609852
$$ 3180951 3806529 4050707 6323403 9222278 11663215 15133071 18809522 17492376 8882524
3312H882524r716268k779933M168700M077701j338770o607971r117872q297584
$$ 8882524 -833744 -3613677 555023 4632724 3293954 -3314017 -12431889 -20729473
3304b0729473l964676J433855L631613K343602K079793M959590P069880M360691
$$ -20729473 -24694149 -23260294 -19628681 -17285079 -15205286 -10245696 -3175816 1184875
3296A184875j762943o752254p220240k060832O183352J0575202O302691j092119
$$ 1184875 -578068 -7330322 -14550562 -16611394 -10428042 147160 6449851 5357732
3288E357732r84648P126151J1863738O563096j503278l783033k966027m885840
$$ 5357732 4373084 11499235 23362973 29926069 28422791 24639758 21673731 16787891
3280A6787891o440261k326386K475934m89295p333368o172537L217744P601922
$$ 16787891 10347630 8021244 10497178 10007883 2674515 -3498022 -280278 7321644
3272G321644Q31988o483460l774618L642350M062723k656111o486498k878500
$$ 7321644 8153632 1670172 -2104446 1537904 5600627 2944516 -3541982 -6420482
3264f420482K436194L639949J732855k31185k301737m875748n274141j276685
$$ -6420482 -3984288 -344339 1388516 1157331 -1144406 -6020154 -11294295 -12570980
3256a2570980L947519M556876k05932m171080j723871M804183P665824L189236
$$ -12570980 -8623461 -4066585 -4272517 -8443597 -10167468 -5363285 2302539 5491775
3248E491775l816514o043168j944139L832625O771924O529528M906863K715836
$$ 5491775 1675261 -4367907 -6312046 -2479421 4292503 10822031 15728894 18444730
3240A8444730p2354k987016n616018q383987j0963798j0746003n431849K540669
$$ 18444730 18372376 15385360 9769342 1385355 -9578443 -20324446 -25756295 -23215626
3232b3215626O885992M549867j17322q70310K160131L272427j25647m019078m152330
$$ -23215626 -16329634 -11779767 -11897089 -12767399 -10607268 -7334841 -7460488 -11479566 -15631896
3223a5631896j480741J305217M475254Q375920R274362L603298n236279r793058
$$ -15631896 -17112637 -15807420 -11332166 -2956246 6318116 9921414 4685135 -5107923
3215e107923p862504l969636j881087q74410J66700L58636n6260J067012L649497
$$ -5107923 -12970427 -16940063 -18821150 -19695560 -19528860 -19170224 -19226484 -18159472 -14509975
3206a4509975M569962K573088J25323j032853k242184m422442o111596o285719
$$ -14509975 -9940013 -7366925 -7241602 -8274455 -10516639 -14939081 -21050677 -27336396
3198b7336396n313380k416833L302125Q781522R316771N703488L073351J990506
$$ -27336396 -32649776 -35066609 -31764484 -22982962 -13666191 -7962703 -4889352 -2898846
3190b898846j788291p330732p518637j362584K499998K687p09001O338687J2407473
$$ -2898846 -4687137 -12017869 -19536506 -20899090 -18399092 -18396405 -19105406 -12766719 -359246
3181c59246O532465o478808j2285908o873172R83262L934828K047740k906795
$$ -359246 6173219 -305589 -12591497 -19464669 -18481407 -14546579 -12498839 -15405634
3173a5405634q553280r094153j568975O699878O807748K089487K348265O873138
$$ -15405634 -23958914 -33053067 -34622042 -27922164 -21114416 -19024929 -16676664 -9803526
3165i803526O275654J34644j797982K753798M671124M97380j468668K481751L605095
$$ -9803526 -3527872 -3393228 -5191210 -2437412 2233712 2731092 1262424 3744175 7349270
3156G349270l150739q671931m960914J129611N06012k324307J432303Q037454
$$ 7349270 4198531 -4473400 -9434314 -8304703 -7798691 -10122998 -8690695 -653241
3148f53241P211276o00930n880725n265298l143575r11655L509497P050081L931671
$$ -653241 6558035 5957105 76380 -5188918 -8332493 -9244148 -5734651 1315430 5247101
3139E247101l369144n966809j940811J511546N3842k571352k546701r61334P87798
$$ 5247101 1877957 -4088852 -6029663 -4518117 -4464275 -7035627 -9582328 -10543662 -9755864
3130i755864L182875M765366K950394m36086j164323l06572k322992n413580k974984
$$ -9755864 -6572989 -1807623 1142771 706685 -457638 -764210 -3087202 -8500782 -11475766
3121a1475766L969832N941035j5565m578991p81402M996382M043809p30133j188427
$$ -11475766 -7505934 -1564899 -1580464 -6159455 -6940857 -1944475 2099334 1369201 180774
3112A80774J501018n49841p322965r484657k622576N736926O563569Q68803l144244
$$ 180774 1681792 1131951 -6191014 -15675671 -18298247 -12561321 -5997752 -5128949 -8273193
3103h273193j069062L502145M815101K082925l25012Q73347L167463J529718m230923
$$ -8273193 -9342255 -5840110 -1025009 1057916 732904 1606251 4773714 6303432 2072509
3094B072509q277594n761393J640725Q466492J0916168P942937L81893p926292
$$ 2072509 -6205085 -11966478 -10325753 -1859261 9056907 16999844 17381737 9455445
3086I455445j0952407o354328R74112M510337L522919J482957n37163l802511
$$ 9455445 -1496962 -7851290 -6877178 -2366841 1156078 2639035 2101872 -1700639
3078a700639o632320n343782r99509P34813j707409k861872R85611N396839M835928
$$ -1700639 -8332959 -13676741 -14676250 -13941437 -15648846 -18510718 -17525107 -12128268 -7292340
3069g292340J982228L833817J0461186J4087930R638218O93587o380892r444999
$$ -7292340 -5310112 -1476295 8984891 23072821 32711039 33404626 27023734 17578735
3061A7578735r663731p974664n620879m879117n705391m218754J711736P678701
$$ 17578735 7915004 -59660 -5680539 -10559656 -16265047 -20483801 -18772065 -11093364
3053a1093364Q155236N109045N427891R653093R731967P75233j0336086j2939564
$$ -11093364 -2938128 2170917 7598808 17251901 26983868 27759101 17423015 4483451
3045D483451o119709J017548J466691k316484l737578n40510L965590N527552
$$ 4483451 -1636258 -618710 847981 -1468503 -5206081 -5746591 -1781001 3746551
3037C746551K569171l542024r812211j3175083j1871689o164602J758725Q630419
$$ 3746551 6315722 2773698 -7038513 -20213596 -32085285 -38249887 -36491162 -27860743
3029b7860743J1807157J0843961P040375J620606m208746p545060n237383J174169
$$ -27860743 -16053586 -5209625 1830750 3451356 -757390 -8302450 -13539833 -12365664
3021a2365664M927518J696648m273433n503894j165989K986057L637131L195244
$$ -12365664 -7438146 -5741498 -10014931 -15518825 -16684814 -13698757 -10061626 -6866382
3013f866382L515347K539258k75408r01723K632160N118814J083581o205892q543450
$$ -6866382 -3351035 -811777 -1087185 -1988908 643252 5762066 6845647 639755 -7903695
3004g903695m043905J272607K690000J680575Q27539l47427k145508k035598J419246
$$ -7903695 -11947600 -10674993 -7984993 -6304418 -5476879 -5824306 -7969814 -10005412 -8586166
2995h586166N190397N531450K758488l91694k750019m148025l297943R1530K798878
$$ -8586166 -3395769 2135681 4894169 4502475 1752456 -2395569 -5693512 -5601982 -2803104
2986b803104J645936j469534k108593j70113K63068j928997k836697j26674K809084
$$ -2803104 -1157168 -2626702 -4735295 -4905408 -4642340 -6571337 -9408034 -9534708 -6725624
2977f725624K031594j124022k587586j313682P06603K167273L038799L105892
$$ -6725624 -4694030 -5818052 -8405638 -9719320 -9012717 -6845444 -3806645 -700753
2969g00753K883747M249976P038046P047471J424420n745616p990083n292142
$$ -700753 2182994 6432970 13471016 20518487 21942907 16197291 8207208 2915066
2961B915066k769547j295814L309592J0432742J2094944M735367l217985k352041
$$ 2915066 145519 -1150295 2159297 12592039 24686983 29422350 26204365 23852324
2953B3852324L760867L688143m858440j1752373r084905j463010J571042k139008
$$ 23852324 27613191 31301334 26442894 14690521 5605616 4142606 5713648 3574640
2945C574640o961319p975817n345645j575749J760054M319476O207164P368863
$$ 3574640 -3386679 -11362496 -16708141 -18283890 -16523836 -12204360 -5997196 1371667
2937A371667P011127M060404j052232n775583p532213n980518k683242O55386
$$ 1371667 8382794 12443198 11390966 5615383 -1916830 -7897348 -10580590 -9925204
2929i925204K957666L703445L089707J802716O2276k402100m886140n349585k753310
$$ -9925204 -6967538 -3264093 -174386 1628330 1690606 -711494 -5597634 -10947219 -13700529
2920a3700529Q98131K281563M62733k269781l402107k923197k508801k778797
$$ -13700529 -12802398 -10520835 -10058102 -12327883 -15729990 -18653187 -21161988 -23940785
2912b3940785k378704J40352M211092P501812Q078094N893918K291913j240105
$$ -23940785 -26319489 -26179137 -21968045 -14466233 -6388139 -494221 1797692 557587
2904E57587l517127l617476j348231K189038N074918N882516M421256J382340
$$ 557587 -2959540 -6577016 -7925247 -5736209 -661291 5221225 9642481 11024821
2896A1024821k190308m842138m751720j043595M313829O960588M281668j014237
$$ 11024821 8834513 3992375 -759345 -1802940 2510889 9471477 13753145 12738908
2888A2738908l707020k989102l363996o602441o900543P44374J0027067R054347
$$ 12738908 9031888 6042786 2678790 -3923651 -10824194 -10079820 -52753 9001594
2880I001594k785900j1943532q372183J382968M701183R3176m244543m470132
$$ 9001594 6215694 -5727838 -14100021 -12717053 -8015870 -7922694 -12167237 -16637369
2872a6637369l727024k711300J641961P161126O496646o64446m902688j240741
$$ -16637369 -20364393 -23075693 -21433732 -14272606 -7775960 -8440406 -13343094 -14583835
2864a4583835K952543O25867k880394O29578P378174P579474K334339J975278
$$ -14583835 -11631292 -11005425 -13885819 -13256241 -5878067 1701407 4035746 6011024
2856F011024P929092R010399p02305j1507129j2008096m745708O2596M3056O95613
$$ 6011024 13940116 22950515 22248210 10741081 -1267015 -6012723 -5950127 -5907071 -5211458
2847e211458L543321M049781R97968p32349J396658L265309J022276l083874m883165
$$ -5211458 -1668137 2381644 3379612 2647263 4043921 7309230 8331506 5247632 364467
2838C64467l875917j587668J570550M378708L592839j195459m607671j897747
$$ 364467 -3511450 -5099118 -3528568 850140 4442979 3247520 -1360151 -3257898
2830c257898M133876P162016N835842L193950Q5890m359618p284171m771195N7305
$$ -3257898 875978 8037994 13873836 17067786 17153676 12794058 5509887 738692 795997
2821G95997k76593n534243p002586j623353K375770r28308n142959k864354J306629
$$ 795997 519404 -5014839 -12017425 -13640778 -11265008 -12193316 -17336275 -20200629 -18894000
2812a8894000n39139m263545K38625J0767067J4235134O553098j880016l005640
$$ -18894000 -19433139 -23696684 -23458059 -12690992 1544142 8097240 6217224 3211584
2804C211584j109965j640438j772407J190696K280994j948534n214630j651690
$$ 3211584 2101619 461181 -1311226 -120530 2160464 211930 -5002700 -6654390
2796f654390L115153J295267k710480Q50460R583845J1206227K787349m829285
$$ -6654390 -3539237 -2243970 -4954450 -4103990 5479855 16686082 19473431 14644146
2788A4644146m179681j230320l267407o468817l243864M253459O542525M78984
$$ 14644146 10464465 9234145 5966738 -502079 -3745943 507516 7050041 7529025
2780G529025o831482q279259n584554n447467r484206j1426195n383866N145666
$$ 7529025 697543 -7581716 -13166270 -18613737 -28097943 -39524138 -44908004 -39762338
2772c9762338J0103778N416212j446581j614163L325439N081375J753252j99103
$$ -39762338 -29658560 -24242348 -25688929 -27303092 -23977653 -18896278 -17143026 -17342129
2764a7342129K809749N851641L749325j194403l569158k280133M01222L394283
$$ -17342129 -14532380 -8680739 -4931414 -6125817 -9694975 -11975108 -11573886 -8179603
2756h179603O285819P272647N626656L748612L184785J334986l870083q792369
$$ -8179603 -1893784 5378863 11005519 14754131 17938916 19273902 15403819 6611450
2748F611450q541338m601177k496866k965413j550359K768936M929135J910051
$$ 6611450 -1929888 -6531065 -9027931 -11993344 -13543703 -10774767 -5845632 -3935581
2740c935581k071669k060361M00085J135458J118611M405509R441723Q970425
$$ -3935581 -6007250 -8067611 -7667526 -6532068 -5413457 -1007948 8433775 17404200
2732A7404200M07894q945937j0600364n183159J67962K060773L008588M301232
$$ 17404200 17812094 8866157 -1734207 -6917366 -6749404 -4688631 -1680043 2621189
2724B621189L160674j240313m554272l546373j327737k213023m926284n657427
$$ 2621189 5781863 4541550 -12722 -3559095 -4886832 -7099855 -12026139 -17683566
2716a7683566m805014n020443m790415m75771O256021R747148Q950686P880518
$$ -17683566 -22488580 -27509023 -32299438 -32775209 -26519188 -16772040 -7821354 59164
2708E9164P281473L763348j353852j371136L904285M729864l905908j2500586
$$ 59164 7340637 11103985 9750133 8378997 12283282 17013146 13107238 606652
2700F06652j0468464k586748j377425p401854r258301k220777N197483N493473
$$ 606652 -9861812 -12448560 -13825985 -21227839 -30486140 -32706917 -27509434 -22015961
2692b2015961K340355K053353L514873K479769k38820q92941R61327L328591N526053
$$ -22015961 -19675606 -17622253 -14107380 -11627611 -11866431 -12759372 -11798045 -8469454 -2943401
2683b943401O828697M807150n09297l937151j518646K752857J731820m638664
$$ -2943401 3885296 8692446 8183149 4245998 2727352 5480209 7212029 2573365
2675B573365q850896n517623K484223Q027898O959836R06185m938800o506443
$$ 2573365 -6277531 -11795154 -9310931 -1283033 5676803 6582988 1644188 -4862255
2667d862255m535884l061631l653194l359535Q846L494281L128556K42267l92032
$$ -4862255 -9398139 -12459770 -16112964 -19472499 -19463653 -15969372 -12840816 -12598549 -12990581
2658a2990581K375516M765790L439742j168329o499790r752398q685446l746931
$$ -12990581 -10615065 -5849275 -2409533 -3577862 -10077652 -19830050 -28515496 -32262427
2650c2262427J102129K608594K166623K401275K033348r84910l314920o0209N925717
$$ -32262427 -31160298 -28551704 -26385081 -23983806 -21950458 -22935368 -26250288 -26310497 -20384780
2641b0384780O568279J459805n56899M181936P361239K264890m341038k797962
$$ -20384780 -13816501 -12356696 -12913595 -8731659 -1370420 894470 -3446568 -6244530
2633f244530L293092K545780n683910r951982m210451M115766O208846K777232
$$ -6244530 -2951438 -405658 -6089568 -16041550 -20252001 -16136235 -9927389 -7150157
2625g150157j058611l663720m552191j201200N480762Q031024J786810o640697
$$ -7150157 -8208768 -11872488 -16424679 -17625879 -12145117 -4114093 -2327283 -8967980
2617h967980p501173j692847J248528k483612o657819n611014j585040R48733
$$ -8967980 -16469153 -18162000 -16913472 -19397084 -26054903 -31665917 -33250957 -32302224
2609c2302224K001200L532515M887560M600359L452582K401593M35779k260392
$$ -32302224 -30301024 -26768509 -21880949 -17280590 -13828008 -11426415 -10990636 -13251028
2601a3251028k093326K889444Q058790P010441L09076m957806m120057N88434
$$ -13251028 -15344354 -12454910 -4396120 2614321 2923397 -2034409 -6154466 -5566032
2593e566032M563144N751824M193660N11986l354768m776649l492912j806966
$$ -5566032 -1002888 4748936 8942596 9454582 6099814 1323165 -2169747 -3976713
2585c976713p35780J102863L482495L137474j057289m792791l778235M9340J749879
$$ -3976713 -4712493 -3609630 -127135 3010339 1953050 -2839741 -6617976 -6568636 -4818757
2576d818757P85037O42219K334095L274359K376346J330399M49012j717119l691147
$$ -4818757 -4033720 -3391501 -1057406 2216953 4593299 5923698 6372710 4655591 964444
2567I64444j430543M559471P774582M536020n53471j893375j031962k448568n114308
$$ 964444 -466099 4093372 11867954 16403974 15850503 13957128 12925166 10476598 5362290
2558E362290m650305j529334k67577j350789q89115J286503J39024n847112j0562163
$$ 5362290 711985 -817349 -1084926 -2435715 -3324830 -2038327 -1899303 -7746415 -18308578
2549a8308578q422813k121201J658139J075609j41071J255115M743446P775798
$$ -18308578 -26731391 -28852592 -27194453 -26118844 -26259915 -25004800 -20261354 -12485556
2541a2485556Q251942N878048K602935Q66811N87323o75147l924177p058238p694953
$$ -12485556 -4233614 1644434 4247369 5114180 5701503 5026356 1102179 -5956059 -13651012
2532a3651012n498736j224313L767015O525541M685176P41597J26061L445191
$$ -13651012 -19149748 -20374061 -16607046 -10081505 -5396329 -4654732 -4528671 -1083480
2524a083480N277107K880131M65640J034786J38970n943683j1075198o941711
$$ -1083480 4193627 7073758 7539398 8574184 8713154 2769471 -8305727 -15247438
2516a5247438K923951O328838m35538p627869o157314J284451O443087O144415
$$ -15247438 -12323487 -5994649 -6430187 -14058056 -20215370 -18930919 -12487832 -6343417
2508f343417K607288j529128m067393l167566l63315j96361l448698m642921j66744
$$ -6343417 -3736129 -5265257 -9332650 -12500216 -12863531 -13059892 -16508590 -21151511 -21318255
2499b1318255N223189N089634J072907j99404K159537K612251q72644l132776
$$ -21318255 -16095066 -11005432 -9932525 -10131929 -7972392 -5360141 -6232785 -9365561
2491i365561l26709L374453J595204m840854q557545m887482K757857P316327
$$ -9365561 -9692270 -6317817 -4722613 -9563467 -18121012 -23008494 -20250637 -12934310
2483a2934310N876545J866085K00102J681616K959691J353601j844604l383378
$$ -12934310 -7057765 -5191680 -4991578 -3309962 -350271 1003330 -841274 -4224652
2475d224652k059673M06296J725082J068528p94265k223277j753290N89887L004200
$$ -4224652 -6284325 -5878029 -4152947 -3084419 -3878684 -6101961 -7855251 -7265364 -4261164
2466d261164L573056K091504j73437k065861l240597l692880l301629j732083
$$ -4261164 -688108 1403396 1229959 -835902 -4076499 -7769379 -11071008 -12803091
2458a2803091J321501N123410P116866M793812o27594m067857k208590J746374
$$ -12803091 -11481590 -6358180 758686 5552498 4924904 857047 -1351543 394831
2450C94831J649922l334848p260387n518688j279959m78450k249597M02061R209060
$$ 394831 2044753 -1290095 -8550482 -14069170 -15349129 -15827579 -18077176 -17675115 -8466055
2441h466055J5181640R243865m404132j1840764o609887K784843N040807M4311
$$ -8466055 6715585 15959450 11555318 -285446 -6895333 -4110490 930317 974628
2433I74628l966697k831651M50202K879744M509705M267838l33462p264652r577741
$$ 974628 -2992069 -5823720 -5373518 -2493774 2015931 6283769 5950307 -1314345 -10892086
2424a0892086m134661L651545P026141N985296M650363M068276K053612j804759
$$ -10892086 -15026747 -11375202 -4349061 1636235 6286598 10354874 12408486 10603727
2416A0603727n109969n789376l421812J328500N990582O590818J769121m412239
$$ 10603727 5493758 -295618 -3717430 -2388930 3601652 10192470 11961591 7549352
2408G549352o516027l711415N55845L392006M142518K617112r07267m155439m162254
$$ 7549352 1033325 -2678090 -2122245 1269761 5412279 8029391 7122124 2966685 -1195569
2399a195569m10612M875862R007236J0108250P543834K843732j131212l345407
$$ -1195569 -1606181 3269681 12276917 22385167 29929001 32772733 31641521 28296114
$$ [...]
##END NTUPLES=NMR SPECTRUM
##END=
