##TITLE=31Pdec_DE-79H_DEK
 D2O, 24 sc
 28.1.2025
##JCAMPDX= 6.0         $$ Bruker NMR JCAMP-DX V2.0
##DATA TYPE= NMR SPECTRUM
##DATA CLASS= NTUPLES
##ORIGIN= UXNMR, Bruker Analytische Messtechnik GmbH
##OWNER= root
$$ XWIN-NMR		Version 3.5
$$ Tue Jan 28 14:14:30 2025 Russian Standard Time (UT+4h)  she@DPX200
##.OBSERVE FREQUENCY= 81.013821
##.OBSERVE NUCLEUS= ^31P
##.ACQUISITION MODE= SIMULTANEOUS
##.ACQUISITION SCHEME= undefined
##.AVERAGES= 64
##.DIGITISER RES= 17
##SPECTROMETER/DATA SYSTEM= spect
##.PULSE SEQUENCE= zgpg30
##.SOLVENT NAME= CDCl3
##.SHIFT REFERENCE= (INTERNAL, CDCl3, 0, 198.062)
##AUDIT TRAIL= $$ (NUMBER, WHEN, WHO, WHERE, WHAT)
$$ ##TITLE= Audit trail, XWIN-NMR		Version 3.5
$$ ##JCAMPDX= 5.01
$$ ##ORIGIN= Bruker BioSpin GmbH
$$ ##OWNER= she
$$ F:/spectra/data/she/nmr/P31/2/pdata/1/auditp.txt
$$ ##AUDIT TRAIL=  $$ (NUMBER, WHEN, WHO, WHERE, WHAT)
(   1,<2025-01-28 14:13:11.70 +0400>,<she>,<DPX200>,
      <created by zg, POWCHK disabled, PULCHK disabled
       configuration hash MD5:
       00 E9 B6 7A A2 85 ED C7 34 08 36 98 17 FE 4E 26
       data hash MD5: 32K
       34 5B 79 45 91 F5 F7 6D 19 E3 86 5E C9 9F 33 5F>)
(   2,<2025-01-28 14:13:14.00 +0400>,<she>,<DPX200>,
      <Start of raw data processing
       efp BC_mod = 2 LB = 1.5 FT_mod = 6 PKNL = 1 PHC0 = 2058.435 PHC1 = 208.6872 SI = 64K 
       data hash MD5: 64K
       51 9D A5 EF CD E1 D1 8B A3 11 03 1F 6C F0 BB 82>)
(   3,<2025-01-28 14:13:30.34 +0400>,<she>,<DPX200>,
      <pk PHC0 = -18.96318 PHC1 = 0 
       data hash MD5: 64K
       F0 D8 28 30 F9 EF A0 F4 A8 C3 43 E7 2C A7 8D 48>)
(   4,<2025-01-28 14:13:57.35 +0400>,<she>,<DPX200>,
      <pk PHC0 = -19.02671 PHC1 = 49.19989 
       data hash MD5: 64K
       56 E2 F7 65 FF 2F E0 D8 06 1D ED 28 2A E3 60 79>)
(   5,<2025-01-28 14:14:01.81 +0400>,<she>,<DPX200>,
      <abs ABSG = 5 
       data hash MD5: 64K
       B0 88 61 51 64 15 28 40 FF FD 75 79 18 1E C2 64>)
$$ ##END=
$$ 
$$ hash MD5
$$ 9D 32 3D C9 A7 F8 07 42 82 39 A6 0D D6 E1 C1 DA
##$RELAX= 
##$RELAX= 
##$RELAX= 
##$RELAX= 
##$RELAX= 
##$RELAX= 
##$RELAX= 
##$RELAX= 
$$ Bruker specific parameters
$$ --------------------------
##$DU= <F:/spectra>
##$EXPNO= 2
##$NAME= <P31>
##$PROCNO= 1
##$TYPE= <nmr>
##$USER= <she>
##$AMP= (0..31)
100 100 100 100 100 100 100 100 100 100 100 100 100 100 100 100 100 100 
100 100 100 100 100 100 100 100 100 100 100 100 100 100 
##$AQSEQ= 0
##$AQ_mod= 1
##$AUNM= <au_zg>
##$AUTOPOS= <>
##$BF1= 81.014009
##$BF2= 200.13
##$BF3= 200.13
##$BF4= 200.13
##$BF5= 200.13
##$BF6= 200.13
##$BF7= 200.13
##$BF8= 200.13
##$BYTORDA= 1
##$CFDGTYP= 0
##$CFRGTYP= 5
##$CHEMSTR= <none>
##$CNST= (0..31)
1 1 145 1 1 1 1 1 1 1 1 1 1 1 1 1 1 1 1 1 1 1 1 1 1 1 1 1 1 1 1 1 
##$CPDPRG= <waltz16>
##$CPDPRG1= <>
##$CPDPRG2= <waltz16>
##$CPDPRG3= <>
##$CPDPRG4= <mlev>
##$CPDPRG5= <mlev>
##$CPDPRG6= <mlev>
##$CPDPRG7= <mlev>
##$CPDPRG8= <mlev>
##$CPDPRGB= <>
##$CPDPRGT= <>
##$D= (0..31)
0 1 0 0 0 0 0 0 0 0.06 0 0.03 2e-05 3e-06 0 0 0.0002 0 0 0 0 0 0 0 0 0 
$$ [...]
##$SUBNAM3= <"">
##$SUBNAM4= <"">
##$SUBNAM5= <"">
##$SUBNAM6= <"">
##$SUBNAM7= <"">
##$SUBNAM8= <"">
##$SUBNAM9= <"">
##$SW= 400.765351723535
##$SWIBOX= (0..15)
0 1 3 0 0 0 0 0 0 0 0 0 0 0 0 0 
##$SW_h= 32467.5324675325
##$TD= 32768
##$TD0= 1
##$TE= 0
##$TE2= 300
##$TE3= 300
##$TEG= 300
##$TL= (0..7)
0 120 53 12 22 120 120 120 
##$TP= (0..7)
150 150 150 150 150 150 150 150 
##$TP07= 0
##$TPNAME0= <>
##$TPNAME1= <>
##$TPNAME2= <>
##$TPNAME3= <>
##$TPNAME4= <>
##$TPNAME5= <>
##$TPNAME6= <>
##$TPNAME7= <>
##$TPOAL= (0..7)
0.5 0.5 0.5 0.5 0.5 0.5 0.5 0.5 
##$TPOFFS= (0..7)
0 0 0 0 0 0 0 0 
##$TUNHIN= 0
##$TUNHOUT= 0
##$TUNXOUT= 0
##$USERA1= <user>
##$USERA2= <user>
##$USERA3= <user>
##$USERA4= <user>
##$USERA5= <user>
##$V9= 5
##$VALIST= <valist>
##$VCLIST= <CCCCCCCCCCCCCCC>
##$VD= 0
##$VDLIST= <DDDDDDDDDDDDDDD>
##$VPLIST= <PPPPPPPPPPPPPPP>
##$VTLIST= <TTTTTTTTTTTTTTT>
##$WBST= 1024
##$WBSW= 4
##$XGAIN= (0..3)
0 0 0 0 
##$XL= 0
##$YL= 0
##$YMAX_a= 4599
##$YMIN_a= -4206
##$ZGOPTNS= <>
##$ZL1= 120
##$ZL2= 120
##$ZL3= 120
##$ZL4= 120
##$ABSF1= 198.0616
##$ABSF2= -202.7028
##$ABSG= 5
##$ABSL= 3
##$ALPHA= 0
##$AQORDER= 0
##$ASSFAC= 0
##$ASSFACI= 0
##$ASSFACX= 0
##$ASSWID= 0
##$AUNMP= <proc_1d>
##$AZFE= 0.1
##$AZFW= 0.5
##$BCFW= 0
##$BC_mod= 2
##$BYTORDP= 0
##$COROFFS= 0
##$CY= -3
##$DATMOD= 1
##$DC= 0
##$DFILT= <>
##$DTYPP= 0
##$F1P= 0
##$F2P= 0
##$FCOR= 1
##$FTSIZE= 65536
##$FT_mod= 6
##$GAMMA= 0
##$GB= 0
##$INTBC= 1
##$INTSCL= 9.790993e-09
##$ISEN= 30
##$LB= 1.5
##$LEV0= 0
##$LPBIN= 0
##$MAXI= 10000
##$MC2= 0
##$MEAN= 0
##$ME_mod= 0
##$MI= 50
##$NCOEF= 0
##$NC_proc= -9
##$NLEV= 6
##$NOISF1= 182.463
##$NOISF2= 159.3651
##$NSP= 0
##$NTH_PI= 0
##$NZP= 0
##$OFFSET= 198.0616
##$PC= 4
##$PHC0= 2020.445
##$PHC1= 257.8871
##$PH_mod= 1
##$PKNL= yes
##$PPARMOD= 0
##$PSCAL= 0
##$PSIGN= 0
##$REVERSE= no
##$SF= 81.0140089999434
##$SI= 65536
##$SIGF1= 159.3651
##$SIGF2= -187.1042
##$SINO= 113.3802
##$SIOLD= 16384
##$SREGLST= <1H.CDCl3>
##$SSB= 0
##$STSI= 65536
##$STSR= 0
##$SW_p= 32467.5324675325
##$SYMM= 0
##$S_DEV= 0
##$TDeff= 32768
##$TDoff= 0
##$TI= <>
##$TILT= no
##$TM1= 0
##$TM2= 0
##$TOPLEV= 0
##$USERP1= <user>
##$USERP2= <user>
##$USERP3= <user>
##$USERP4= <user>
##$USERP5= <user>
##$WDW= 1
##$XDIM= 65536
##$YMAX_p= 270569060
##$YMIN_p= -255983535
$$ End of Bruker specific parameters
$$ ---------------------------------
##NTUPLES= NMR SPECTRUM
##VAR_NAME=  FREQUENCY,     SPECTRUM/REAL,   SPECTRUM/IMAG
##SYMBOL=    X,             R,               I
##VAR_TYPE=  INDEPENDENT,   DEPENDENT,       DEPENDENT
##VAR_FORM=  AFFN,          ASDF,            ASDF
##VAR_DIM=   65536,         65536,           65536
##UNITS=     HZ,            ARBITRARY UNITS, ARBITRARY UNITS
##FACTOR=    0.49542278885378, 1,            1
##FIRST=     16045.7642231865, 0,            0
##LAST=      -16421.768244346, 0,            0
##MIN=       -16421.768244346, -255983535,   0
##MAX=       16045.7642231865, 270569060,    0
$$ Real data points
##PAGE= N=1
##DATA TABLE= (X++(R..R)), XYDATA
$$ [...]
##PAGE= N=2
##DATA TABLE= (X++(I..I)), XYDATA
7372f464661M123324O169885M688190L452474M620251M165659j252556p085348
7364A2417218p465065n165502o265287p940814k526047P233218R329126R47534
7356E64381o162358l176737L677758M387369p64182n068884n549709k706928K838574
7347a1960716P332138M680322l609146o928641o23158N877335L857860q71090
7339b245096P46507M639492J705158m323970k333343O277182Q798112J810581
7331A5074623m420840l721110j886285l445488m015422r87991L32724k430266
7323e500055k750535K714334O088455P57878o721465o521284l49843L439856L874354
7314d968305N838343Q205983M672821m316014j0445691r447643n853842m115421
$$ y = [-6464661, -2341337, 3828548, 8516738, 11969212, 16589463, 20755122, 19502566, 12417218, 4952153, -213349, -6478636, -14419450, -16945497, -9712279, -383153, 564381, -5597977, -8774714, -5096956, -709587, -1473769, -6542653, -12092362, -14799290, -11960716, -4628578, 51744, -3557402, -10486043, -11109201, -5231866, -1374006, -2245096, -1498589, 3140903, 4846061, 522091, -1811252, 4465930, 13264042, 15074623, 10653783, 6932673, 5046388, 1600900, -2414522, -3402513, -3069789, -5500055, -8250590, -5536256, 552199, 1310077, -5411388, -11932672, -12282515, -8842659, -4968305, 870038, 9076021, 13748842, 9432828, -1012863, -10460506, -16314348, -20429769]
7306b0429769k570340P86379L119071J735185m02277R00934L877501L076298k039589
7297a1946607n528312l063811K174020M236751K505215J338479K661001L552833
7289d070431K209386J458922L313462M301502R78143l163958k338580J900776
7281D589222K597074j438424l786108j051839J946003N93862k381702k299797
7273a231709L01455K447195M199870O446199O823357K959627k707921n886992
7265A3351081o140874n710101m919876k908986r54739q60727j437021k76233K296737
7256g560739M205321M797266M025069Q02631m304223p155467m727580M40052M224559
7247e253111O543313Q574505P667945J278747o046209o626254l16528N145282
$$ y = [-20429769, -23000109, -22213730, -19094659, -17359474, -17761751, -16860817, -12983316, -9907018, -11946607, -17474919, -20538730, -18364710, -14127959, -11622744, -10284265, -7623264, -4070431, -1861045, -402123, 2911339, 7212841, 8190984, 5027026, 2688446, 4589222, 7186296, 5747872, 1961764, 909925, 2855928, 3449790, 1068088, -1231709, -930254, 1516941, 5716811, 12163010, 18986367, 21945994, 19238073, 13351081, 7210207, 1500106, -3419770, -6328756, -7283495, -8144222, -9581243, -9857476, -7560739, -3355418, 1441848, 5466917, 6269548, 1965325, -5190142, -9917722, -9477670, -5253111, 1290202, 9864707, 17532652, 18811399, 12765190, 6138936, 5822408, 10967690]
7239A0967690M833069J666931p7064l37655n31290l85698J27104m10021k218723
7230A3634343l698210m430582n337090n359161k231231K682461N006639L962199
7222D229368L323272M113907J971289n083750j1360811j0348033l288236L175407
7214a3267587M997916K679716j626426m618926k205662N547945J1447672Q357520
7206A1312168j146109p206869n032265J1300J032539j166715p09988M170066Q538909
7197I803036P221752R12746n350421p983364p193481m453673n82731K797988K927125
7188a901023k31692j879130J948944P553445P188501L1652n594247l206985L392921
7179G302386O379856M533037K368846J337899j498446o102910p273253k326620
$$ y = [10967690, 15800759, 17467690, 17390626, 17052971, 16521681, 16135983, 16263087, 15853066, 13634343, 9936133, 5505551, 168461, -5190700, -7421931, -4739470, 267169, 4229368, 7552640, 11666547, 13637836, 8554086, -2806725, -13154758, -16442994, -13267587, -8269671, -5589955, -7216381, -11835307, -14040969, -8493024, 2954648, 11312168, 10166059, 2959190, -2073075, -2061775, -1029236, -2195951, -2905939, 1264127, 9803036, 17024788, 17937534, 12587113, 4603749, -2589732, -7043405, -7626136, -4828148, -1901023, -2132715, -4011845, -2062901, 5490544, 12679045, 12710697, 7116450, 3909465, 7302386, 13682242, 18215279, 20584125, 21922024, 20423578, 14320668, 7047415, 4720795]
7171D720795L774047M666669J007158j376804j49506J092345p77715l606103l555813
7162E795073r05709N74762r56111l267304l317412n46353L312278N709022M291239
7153A0689485j124262o625549o737082o22545O215532Q205469N584157K012356
7145A7597561r79028l766028m992902k714333J337494K807907L58169l063932
7137F584908m543961l509776k65043L739392M625955Q2305n157479l649001L570810
7128A478110O474170j76626q554523q130204L29490O886588N581200l52397m874164
7119a338356n370443k768166L47809J391039J47084r26956m80773m01707j911089
7110a1311558k424501J38466K704253J316948k098023k491957J74203J235810
$$ y = [4720795, 8494842, 13161511, 14168669, 12791865, 12642359, 13734704, 12956989, 9350886, 5795073, 4889364, 5464126, 4508015, 1240711, -2076701, -2623054, 689224, 6398246, 10689485, 9565223, 2939674, -3797408, -4419953, 1795579, 10001048, 15585205, 17597561, 16618533, 12852505, 7859603, 5145270, 6482764, 9290671, 9648840, 6584908, 2040947, -1468829, -1733872, 2005520, 6631475, 6713780, 1556301, -2092700, 1478110, 7952280, 7775654, -778869, -8909073, -8579583, -1692995, 3888205, 3535808, -1338356, -6708799, -9476965, -9129156, -7738117, -7591033, -8517989, -8998762, -9400469, -11311558, -13736059, -13597593, -10893340, -9576392, -11674415, -14166372, -13992169, -12756359]
7102a2756359o36363j448100J335090N144270O791602O254244M578067J904762
7094A1167213r46323k311616k262814k252531j745666R52479L953894K569347
7086I123983l485780q094766o352615m32784M467823O202237M961561M73757o126701
7077G36715j0449283r127662m433024j105889k5379J374660L542845L892011J746364
7068a3848642M03254K432133N282194M247591n95671l094010J494034R092448
7060E413331J0358355K402158o921127r142347n724684l658539l785509r35383
7052a1993745N091508P270788K424070l118811l120934k92489l26781k456511
7044f522905k144560O92583K538022K702170K837792K081990j273299m646700
$$ y = [-12756359, -13392722, -14840822, -13505732, -8361462, -1569860, 4684384, 9262451, 11167213, 10220890, 7909274, 5646460, 3393929, 1648263, 2600742, 6554636, 9123983, 5638203, -2456563, -8809178, -9241962, -4774139, 1428098, 6389659, 6863416, 736715, -9712568, -18840230, -23273254, -24379143, -24404522, -23029862, -19487017, -15595006, -13848642, -13445388, -11013255, -5731061, -1483470, -2079141, -5173151, -3679117, 5413331, 15771686, 18173844, 11252717, 2110370, -3614314, -7272853, -11058362, -11993745, -6902237, 368551, 2792621, -326190, -3447124, -3739613, -4066394, -6522905, -8667465, -7974882, -5436860, -2734690, 103102, 2185092, 911793, -3734907]
7036c734907l722989M16604K289520L2737k709397l014411j873378p67170K99846
7027a2783545P17044m62881j447489R97303O238294R458949P631928K667661j947418
7018A1069846m565591n054006m003998k584760j055023J569769M094293K255466
7010A725996m529507q855316m189428M508161O950312K602869M9642J687998O21840
7001E72567m664198n007090L591443R941498L183787r823701j3732555o071008
6993b2009257K016206L621886L208067N635445Q123729O033534o5554n862162
6985G01894p569629l705716L434372P937863N912287O57014j730992p54881p29991
6976D152221k867804m018216k991141k098277j894343j18900L158645M657793
$$ y = [-3734907, -7457896, -7041292, -4751772, -4719035, -7428432, -10442843, -12316221, -13083391, -12783545, -12066501, -12529382, -13976871, -12979568, -6741274, 2717675, 10349603, 13017264, 11069846, 6504255, 1450249, -2553749, -5138509, -6193532, -4623763, -529470, 1725996, -2803511, -11658827, -15848255, -11340094, -4389782, -1786913, -1737271, -49273, 572567, -4091631, -9098721, -5507278, 4434220, 7618007, -2205694, -15938249, -22009257, -19993051, -16371165, -13163098, -7527653, 596076, 6629610, 6564056, 701894, -6867735, -10573451, -7139079, 798784, 6711071, 7368085, 5637093, 4882212, 4152221, 1284417, -2733799, -5724940, -7823217, -9717560, -9836460, -6677815, -2020022]
6968b020022L238898J258667q9376j646092k079896J170712N673283N229409n81945
6959A0153638m540438k439402O38999j299123o058582p357522l723048J490374
6951a3135104N481346O880768M342749j169521m988382l675063N63248L614504
6943b085455N126212O930819Q290158O705710K008558l496162p585569q698391
6935G195880o345036l134335l343109o917868q350322m345806J454072M798001
6927a8988523P006397R969806R904921K994029o056869q627413l746045J794303
6919e749394L589534L031636J527385j377608l976567l367137r94707q44871j882965
6910a0044694O58400N835252O774610J904150j563220J230378N568201N474342
$$ y = [-2020022, 1218876, 2477543, 2388167, 742075, -1337821, -167109, 5506174, 10735583, 10153638, 5613200, 3173798, 3812797, 2513674, -3544908, -10902430, -14625478, -13135104, -7653758, -772990, 3569759, 2400238, -2588144, -6263207, -5699959, -2085455, 3040757, 9971576, 18261734, 24967444, 26976002, 23479840, 15894271, 7195880, 850844, -2283491, -5626600, -12544468, -20894790, -25240596, -23786524, -18988523, -11982126, -2012320, 7892601, 10886630, 4829761, -3797652, -7543697, -5749394, -2159860, 871776, 2399161, 1021553, -2955014, -6322151, -7316858, -8161729, -10044694, -9386294, -3551042, 3223568, 5127718, 3564498, 4794876, 10363077, 15837419]
6902A5837419K447167N66550r96897m202803n855118k304832K878340L163047
6894A1532873r26864k890561m10154K093905J103350j863002m647119p448767
6886c456339r650971q412368l045110K610565M740502L985992L181011L036907
6878g009811K506928J540324P30650n69589k911243m083798r53691N406667R318360
6869C974797O996679J368260j973855k053865k450576m542048n106186k151425
6861e938219Q17143k73455l349526k584800L235892Q642905Q274645K762429l088961
6852H498053n766459n558267m869758m925042m144353n28091M282949N685866
6844g325102K220317j831111k355881q13099k84047L77336L235116N011211R59903
$$ y = [15837419, 18284586, 18851136, 17854239, 13651436, 7796318, 5491486, 8369826, 11532873, 10606009, 7715448, 7305294, 9399199, 10502549, 8639547, 3992428, -3456339, -13107310, -21519678, -24564788, -21954223, -17213721, -13227729, -10046718, -7009811, -4502883, -2962559, -2231909, -2801498, -5712741, -9796539, -10750230, -5343563, 3974797, 10971476, 12339736, 10365881, 8312016, 5861440, 1319392, -3786794, -5938219, -5121076, -5394531, -8744057, -11328857, -8092965, 549940, 8824585, 11587014, 8498053, 2731594, -2826673, -7696431, -12621473, -16765826, -17293917, -13010968, -7325102, -5104785, -6935896, -9291777, -10104876, -10388923, -10011587, -6776471, -1765260, -805357]
6835h05357o265786q775695m393926J426684M674769O263167O038825J997215
6827A59896k770505j613597M080790M537214k579730o344813M49134Q691248P123963
6818A1733600K61659k17855M481610L173214n361424j0068487n816661k94606
6810b108950K56974k9661L016022M914597J037951m125485l617478J429202M661045
6801E434217M138193K827656J890035p04739n385727q963363p993656k516326
6793a1273710L472849N192765K057169j010452M63286M241517M694636J388108
6785I226168p79100K4654J42918k196169l446243j598392o07541l788747p496116
6776a0518568o103458Q2230O155058Q973947Q276131M308979j397507n092533
$$ y = [-805357, -7071143, -15846838, -20240764, -18814080, -14139311, -7876144, -1837319, 159896, -2610609, -4224206, -143416, 4393798, 1814068, -4530745, -4081611, 4609637, 11733600, 11995259, 11777404, 16259014, 19432228, 14070804, 4002317, -1814344, -2108950, -1851976, -1881637, 1134385, 6048982, 7086933, 2961448, -656030, 773172, 5434217, 9572410, 12400066, 14290101, 13585362, 8199635, -763728, -8757384, -11273710, -7800861, -2608096, -550927, -1561379, -1098093, 3143424, 7838060, 9226168, 8447068, 8471722, 8614640, 6418471, 2972228, 1373836, 766295, -3022452, -10518568, -16622026, -16539796, -10384738, -1410791, 6865340, 11174319, 9776812, 4684279]
6768D684279m698394k970342l292031m263830k270679K181405M839466L858766
6760a931360K029018K600550N266547O765453M587043K81147j341417J853483
6752B0110464M947782J299051p646970j2847505r340199j996185K657910M201533
6744A385881M234834J202869m807636p858452m090125O22974j071544n941063
6736a6322262n517616o73301r1565m731096n371770J796141P892770M801897k908321
6727b1125123o078779m092772k495841k459838o62078K894800M543509L832928
6719b5643194M303572O868235P887753N289904K134700J800301K814873J317703
6711F773847k929876n712287l506384K265204O772682O738609L034335j298677
$$ y = [4684279, -14115, -2984457, -6276488, -10540318, -12810997, -10629592, -5790126, -1931360, 97658, 2698208, 7964755, 14730208, 19317251, 19598398, 18256981, 20110464, 25058246, 26357297, 18710327, 5862822, -3477377, -5473562, -2815652, 1385881, 5620715, 6823584, 2015948, -5842504, -9932629, -9309655, -10381199, -16322262, -21839878, -22513179, -22604744, -27335840, -32707610, -30911469, -23018699, -18216802, -21125123, -27203902, -31296674, -33792515, -36252353, -36914431, -34019631, -29476122, -25643194, -21339622, -14471387, -6583634, -1293730, 840970, 2641271, 5456144, 6773847, 3843971, -1868316, -5374700, -3109496, 3663186, 10401795, 13436130, 12137453]
6703A2137453m293501n676890n355604k849252J658368O563479R337401P796150
6695A9317604J916922m919922p853617n149601N8722L795448N323135N417539
6687A7906230L070397k258642o527198m359416K907771P139427L471525l289441
6679A8060653n215224j435137J744257l67570n356907p447702m510103J28497
6671d399236K422552K495444L135437M130940J750198m319198p514520k500771
6663d799154N704323O722124j558035j0365964j1565810n646271K867571J0909171
6655g732045J4979428J0977485Q61255o335622n578511k609684l790593n082486
6647d310773N01262R017530R679578J306368n873485n664897l052942l232256
$$ y = [12137453, 7843952, 2167062, -3188542, -6037794, -4379426, 2184053, 11521454, 19317604, 21234526, 16314604, 8460987, 3311386, 3370108, 7165556, 12488691, 17906230, 20976627, 18717985, 12190787, 7831371, 10739142, 17878569, 21350094, 18060653, 12845429, 11410292, 13154549, 12786979, 7430072, -17630, -4527733, -4399236, -1976684, 518760, 3654197, 7785137, 9535335, 5216137, -2298383, -4799154, 905169, 7627293, 6069258, -4296706, -15862516, -21508787, -18641216, -7732045, 7247383, 18224868, 19086123, 12750501, 7171990, 4562306, 771713, -4310773, -3809511, 5208019, 14887597, 16193965, 10320480, 4655583, 1602641, -1629615]
6639a629615l127856J070963N753818N732535K733511J658655K435417J717110
6631A6344538m92300j936685l304867o236942p937020m107161L370150P679833
6623C379546O241610L138980J703353J73462l444508p005127p458541n114091
6615h385316k291714m19159k90841k266570m205142k307790L352807O997339M101167
6606e715219k038154m392603j381816K037254J905575k18416r85424k2536O98953
6597a0112386K9869j474367k481572j596231J544011M941459N468031K624975
6589a056211l51528p08875r7745j839676m984590m473013J590300P779378P329028
6580C187068Q40255m413555l738542J11912K412218K796006L080624K134382k068513
$$ y = [-1629615, -4757471, -3686508, 2067310, 7799845, 10533356, 12192011, 14627428, 16344538, 15852238, 13915553, 10610686, 4373744, -3563276, -7670437, -4300287, 3379546, 9621156, 12760136, 14463489, 14636951, 11192443, 4187316, -3271225, -8385316, -10677030, -11096189, -11387030, -13653600, -17858742, -20166532, -16813725, -9816386, -5715219, -7753373, -12145976, -13527792, -11490538, -9584963, -9803379, -10788803, -10811339, -10112386, -10082517, -11556884, -14038456, -15634687, -14090676, -9149217, -3681186, -1056211, -1407739, -2116614, -2214359, -4054035, -9038625, -13511638, -11921338, -4141960, 3187068, 4027323, -386232, -4124774, -4012862, -1600644, 1195362, 4275986, 6410368, 4341855]
6571D341855o704601o226681q93818K389216r8639l495778k420405L55729j132578
6562a3885700n522109n419836J299068Q045923Q878507N781608L730716K889299
6554E797476J1892m633087o403562k737012K679987L935114q2278m459301m254888
6545a0145659q5229L700135N039598N366947N144984K584422j481161k102777
6537H021260K627418O824437M337000j999430m785768l465405l744387o286538
6529A528587m667054L299244J0123719Q641592J334782m776335p357913q000989
6521A25633o555179j767430M731149R422498J0390852P391131J225805m650340
6513B0314119n663795k148153J08640j707714l201051o47551K296896R91548k113596
$$ y = [4341855, -2362746, -8589427, -9483245, -7094029, -7192668, -10688446, -13108851, -12753122, -13885700, -19407809, -24827645, -23528577, -15482654, -6604147, -822539, 2908177, 5797476, 5809368, 1176281, -5227281, -7964293, -5284306, -1349192, -1431470, -5890771, -10145659, -10230888, -6530753, -1491155, 3875792, 9020776, 11605198, 10124037, 8021260, 10648678, 17473115, 21810115, 19810685, 15024917, 11559512, 7815125, 1528587, -3138467, 160777, 10284496, 18926088, 20260870, 15484535, 8126622, 125633, -6429546, -8196976, -3465827, 5956671, 16347523, 23738654, 24964459, 20314119, 14650324, 12502171, 12610811, 10903097, 7702046, 7054495, 9351391, 10342939, 8229343]
6504H229343k159824l98058r50901k450202n11257L701981M870756K041627j135836
6495A1237629l186979m951449m637479k21605M467555L842212j83460j090054
6487E276370Q94965n97631n888286p358384j733563M791507O623870N641135M676267
6478A2326250K224255k113894m073636j323413K210690K664918J500434J105699
6470A4521303P52145J00476R78237K645732J265887l095049n358424l899211k760715
6461E150381k676981J229078Q551703J0071701J568921p697390p985629k570030
6453E641754M5264k36698J211553K924968N54179l822086n177971m082720k998119
6444e939876O47637P944263J0890709L112274o603782m867099N320809Q549545
$$ y = [8229343, 6069519, 5671461, 4720560, 2270358, 1759101, 5461082, 10331838, 12373465, 11237629, 8050650, 3099201, -1538278, -1759883, 2707672, 6549884, 6366424, 5276370, 6171335, 5573704, -314582, -7672966, -9406529, -4615022, 2008848, 7649983, 12326250, 14550505, 12436611, 8362975, 7039562, 9250252, 11915170, 13415604, 14521303, 15273448, 15373924, 16352161, 18997893, 20263780, 17168731, 11810307, 7911096, 5150381, 2473400, 3702478, 12254181, 22325882, 23894803, 16197413, 8211784, 5641754, 5687018, 5450320, 6661873, 9586841, 10141020, 6318934, 1140963, -2941757, -5939876, -5292239, 2652024, 13542733, 16655007, 10051225, 5184126, 10504935, 19054480]
6436A9054480R03771n241520j951970L519639L082236l37922j645212l163532
6428A4219970p825781j1367073q952184l309652L45379K247816N020845P248689
6420b371991N853675J715196j714652l012385k785976j514251K65768J873386
6412a691230L687782N839950N939879J964093l181961m784242l222692k214032
6404B337547j469602J790304N020533K757083k995186m232786l0703J837648j428512
6395C586326k969498J046450M604651K751982o47209j654013k862624n078312
6387a222247k608778N638918J0284289N269431j913382k977508k079344n541760
6379D849619q030242k246144N574610M716936j318910p64721N770839O880722
$$ y = [19054480, 19958251, 14716731, 12764761, 16284400, 19366636, 19028714, 17383502, 14219970, 6394189, -4972884, -13925068, -17234720, -16889341, -14641525, -9620680, -2371991, 3481684, 5196880, 3482228, 469843, -2316133, -3830384, -3564616, -1691230, 1996552, 7836502, 13776381, 15740474, 12558513, 7774271, 4551579, 2337547, 867945, 2658249, 7678782, 10435865, 7440679, 3207893, 3177190, 5014838, 3586326, 616828, 1663278, 6267929, 9019911, 8372702, 6718689, 3856065, -1222247, -3831025, 1807893, 12092182, 17361613, 15448231, 12470723, 10391379, 4849619, -3180623, -5426767, 147843, 4864779, 3545869, 2781148, 8551987, 15432709]
6371A5432709Q10280k123419J793139M341878J222348j609881j288763l502072
6363A5076219r220226r390409k01133Q021940N684031j940760m317392j407863
6355B304407n36898l491178n852232n419644l630728j293791J071500J406004
6347a5442560l90530l85777L410770O827979N954350L526497L659913M485440
6339A1646082K133643j607995k291699p94106j620310m993032o996577o415330
6331a0939324n334253l736021L41259N200826N858413J134729m117275m955229
6323a6546875j028331M976909R901734J0785176O658844N01464l385158m100224
6315G763539l574101k166635J045847L817419J756585m478937p564258k293365
$$ y = [15432709, 16242989, 14119570, 15912709, 20254587, 21476935, 19867054, 18578291, 15076219, 5855993, -3534416, -3735549, 4286391, 9970422, 8029662, 3712270, 2304407, 1767509, -1723669, -7575901, -12995545, -16626273, -17920064, -16848564, -15442560, -15833090, -16218867, -12808097, -5980118, -25768, 3500729, 7160642, 11646082, 13779725, 12171730, 9880031, 9085925, 7465615, 2472583, -4523994, -10939324, -16273577, -20009598, -19668339, -14467513, -8609100, -7474371, -11591646, -16546875, -17575206, -12598297, -2696563, 8088613, 14747457, 15248921, 11863763, 7763539, 4189438, 2022803, 3068650, 6886069, 8642654, 4163717, -3400541, -5693906]
6307e693906O863328J0423770M858351l896375p536036l968881J473115K327900
6299D851266k061383o168730m982267M1252L352506K896600K307784M534055O386477
6290A1157560K668243n463104j0265893o889224j33882J213326m380797r162982
6282b1256753n949449L227361J0401121J1076074P236630K571115j260512l517429
6274B528158l318201j083608J375680L190452M740001N318834L435076J52807
6266A6339199j242516k23015r2137k256432l352156r25652J832043Q88379k371232
6257H596481m269118n417932q615106j1910698j0067659k858650L997795O990885
6249b3554002Q224813R144190O800972k04229o780856o921701j518115L444834
$$ y = [-5693906, 1169422, 11593192, 16451543, 12555168, 5019132, 1050251, 2523366, 4851266, 2789883, -3378847, -8361114, -8319862, -4967356, -2070756, 237028, 4771083, 11157560, 13825803, 8362699, -1903194, -8792418, -8926300, -7712974, -12093771, -21256753, -27206202, -23978841, -13577720, -2501646, 4734984, 7306099, 6045587, 2528158, -790043, -1873651, -497971, 2692481, 7432482, 12751316, 16186392, 16339199, 15096683, 14873668, 14781531, 12525099, 9172943, 8247291, 10079334, 10967713, 8596481, 4327363, -1090569, -9705675, -21616373, -31684032, -34542682, -30544887, -23554002, -15329189, -6184999, 615973, 411744, -6369112, -13290813, -14808928, -11364094]
6241a1364094M553326L029596P93255j224393j328828K072681O912752Q121102
6233A1565397L531012l084116o558121o183302n055035m851450m027892j414296
6225a6077803J103668J352956O71138K073612M877598M557898m97819n186071
6217g124823l863867J618268M346794K229653L45965K076830L233742r65784o962682
6208e065904o843028k8182N262775L452768j071893j304143K059187K610948j592044
6199b519516n467456m765625j430915Q15898K026518L867464N049170L383918
6191I59456Q78325J708407M893962M163830k700660q904656p031325M96250M349766
6182a186645P32267m300106l901413P94737L616987J857647j687830l635591l444905
$$ y = [-11364094, -6810768, -3781172, -2987917, -4212310, -5541138, -3468457, 3444295, 11565397, 15096409, 12012293, 5454172, -729130, -5784165, -10635615, -14663507, -16077803, -14974135, -13621179, -12950041, -10876429, -5998831, -1440933, -1938752, -7124823, -10988690, -9370422, -5023628, -2793975, -2448010, -371180, 2862562, 1896778, -5065904, -11908932, -11937114, -6674339, -3221571, -4293464, -5597607, -3538420, -927472, -2519516, -7986972, -12752597, -14183512, -13367614, -11341096, -7473632, -2424462, 959456, 1837781, 3546188, 8440150, 12603980, 9903320, 998664, -6032661, -5536411, -1186645, -454378, -4754484, -8655897, -7861160, -4244173, -2386526, -4074356, -7709947, -11154852]
6173a1154852k055578j4585K119133L237717K558139L26353k488958m341444l335317
6164a5149392R05338N373246N851229K134493q50647Q09976M098696K198147o358604
6155i87518j4426806j3614660l434313Q360450J3683395J0984228M856935N97076
6147F018787j84285P17107J606671K977324N481829P023160M305203k224293p507438
6138A8214065p699000m844976l324819l387495j837180J461662K139967k233586
6130a511362p779874q835726m635528R47766M655413O239541O622968O254624
6122A957822N175864L067729l35397l583559l571542N09726M447932L358299j587222
6113I439652m254234j824721J799810K440697J597953K652219M030230J102647
$$ y = [-11154852, -13210430, -13225015, -11105882, -7868165, -5310026, -4983673, -7472631, -11814075, -15149392, -14244054, -8870808, -3019579, -885086, -1735733, -925757, 3172939, 5371086, -987518, -15414324, -29028984, -32463297, -24102847, -10419452, 564776, 5421711, 6018787, 5834502, 6551609, 8158280, 11135604, 16617433, 23640593, 27945796, 25721503, 18214065, 10515065, 5670089, 2345270, -1042225, -2879405, -1417743, 722224, -1511362, -9291236, -18126962, -22762490, -21814724, -17159311, -10919770, -4296802, 1957822, 7133686, 10201415, 9866018, 6282459, 2710917, 3220643, 7668575, 11026874, 9439652, 5185418, 3360697, 5160507, 7601204, 9199157, 11851376, 15881606, 16984253]
6105A6984253n614938r087949m428421M329721Q747738N581106n84388l448132
6097A2478990j415681K123372L082571N03192l097208m643917l820012l200184
6089B011123m900821p806785q641939n055137K668077J1360963J5491011J0408448
6081A5534940j975986j2191094j1725605k580129N104471N088665P29966k056943
6073d071715k581869l366288m480508l945252j406820K098355O067408R206568
6065b480121Q704790M384203J018980K386816N435166M952368J467449j024885
6057B4844766k673983o118545q926554o073036M7435J122668l794872n736951
6049g309072j71502N155644K454265m078167n890427l245560k164237k895448
$$ y = [16984253, 11369315, 2281366, -2147055, 2182666, 10930404, 16511510, 15927122, 12478990, 11063309, 13186681, 16269252, 16772444, 13675236, 9031319, 5211307, 2011123, -2889698, -10696483, -19338422, -24393559, -21725482, -10364519, 5126492, 15534940, 13558954, 1367860, -10357745, -12937874, -7833403, -2744738, -2014772, -4071715, -6653584, -10019872, -14500380, -18445632, -19852452, -17754097, -11686689, -2480121, 6224669, 10608872, 11627852, 14014668, 19449834, 24402202, 25869651, 24844766, 22170783, 16052238, 7125684, 1052648, 1100083, 2222751, -1572121, -7309072, -7480574, -2324930, 129335, -3948832, -9839259, -13084819, -15249056, -18144504]
6041a8144504p16546M203517O502181M354622J084309j252476k968462k399108
6033i336467K056248N966491K946162m690099p484808k673275J811559J32403
6025a1271786k890891r49078L162772K820869j491666l784668k365420j088454
6017a7858322j701153j177648K480276O508596P180846M408709R75614r58292
6009a41374j207699m87955O43735J642177J469024o98832l701566m452416j323815
6000h258721L107471M547499J913220k096715m808331n431065l445028J566304
5992a2905366P661373J0983850R777492N958394K000076j491236m442513o024269
5984A1517801n732715l966317j198204J600138K336404L59480j269988K49009
$$ y = [-18144504, -18861050, -14657533, -8155352, -3800730, -2716421, -3968897, -6937359, -9336467, -7280219, -1313728, 1632434, -3057665, -10542473, -13215748, -11404189, -11271786, -14162677, -15111755, -11948983, -9128114, -10619780, -14404448, -16769868, -17858322, -19559475, -20737123, -18256847, -11748251, -4567405, -158696, 816918, -141374, -1349073, -1837028, -1193293, 448884, 1917908, 1219076, -2482490, -6934906, -8258721, -5151250, -603751, 1309469, -787246, -5595577, -11026642, -14471670, -12905366, -5243993, 5739857, 15517349, 21475743, 23475819, 21984583, 17542070, 11517801, 5785086, 1818769, 620565, 2220703, 4557107, 4916587, 3646599, 3895608]
5976C895608K340654Q87156j836378L8752M965605M322722l475153q162093k423063
5967E53810O478348P364431Q99712m040371m488739l900421k250987L166131Q356153
5958A2138067N557855l252924o636336n05881N345486K236142m919062o558192
5950C405155k545666M18460K62405K33561J107498N35987r55675k55176J968421
5941D174970J157319l907555q683311r089032o185071l071915m87836K538021
5933b3554410O003837Q757591R617617P724896L305294j243124k891104j647874
5925F072723j010141l533972p457886r099689p249988l578449R9444K866856L766462
5916a9124640K355746M12433P14536L214972M543611K786167P68085K117284N305424
$$ y = [3895608, 6236262, 7123418, 5287040, 5325792, 10291397, 14614119, 11138966, 2976873, 553810, 7032158, 14396589, 15296301, 11255930, 6767191, 2866770, 615783, 3781914, 12138067, 17695922, 14442998, 7806662, 7300781, 12646267, 14882409, 9963347, 3405155, 859489, 1277949, 1540354, 1773915, 2881413, 3417400, 2461725, 2206549, 4174970, 5332289, 1424734, -7258577, -16347609, -22532680, -25604595, -26092431, -23554410, -17550573, -8792982, 824635, 8549531, 11854825, 10611701, 7720597, 6072723, 5062582, 1528610, -5929276, -15028965, -22278953, -25857402, -25757958, -22891102, -19124640, -16768894, -16356461, -15641925, -12426953, -7883342, -5097175, -4329090, -2211806, 3093618]
5907C093618M971817n25977o188502o761204l564142k083832l795835l726712
5899a8580769K729813J2588603J7059049J0811216j713032j0385568r724490l837114
5891a052292l68900j318095k329153k92230K119587R33173l063309n386153l574319
5882a4331691M83756L246537K870025N79665r2366L347278Q530414R576516M137007
5873A8347141k905761n368116l472767k223419l602189m773219l776228k393059
5865a0167617k223561j854394J23262K262613K560140J474560P97209J190428
5857e837360K330834L863476M796603L471737l86321m616083o534096m969658
5849g880868m01104M955307P082467L159811m208250q596112p162094l556879
$$ y = [3093618, 8065435, 7539458, 1350956, -5410248, -8974390, -11058222, -14854057, -18580769, -15850956, -3262353, 13796696, 24607912, 22894880, 12509312, 2784822, -1052292, -1421192, -2739287, -5068440, -5360670, -3241083, -2307910, -5371219, -10757372, -14331691, -13847935, -10601398, -7731373, -7151708, -7244074, -3896796, 4633618, 14210134, 18347141, 15441380, 10073264, 6600497, 4377078, 774889, -3998330, -7774558, -10167617, -12391178, -14245572, -14122310, -11859697, -9299557, -7824997, -7027788, -5837360, -3506526, 356950, 5153553, 8625290, 8238969, 3622886, -2911210, -7880868, -8281972, -3326665, 3755802, 6915613, 2707363, -5888749, -13050843, -16607722]
5841a6607722j582690L60703M889215Q849708O449630j569828p326374n570748
5833a2108106J96194L320848K196047J92047k1968J175698K471821L083019K453385
5824B958985R19705M73153K428653M382590K441217k713896n178746j349894M593018
5815H954785N836975J626882l066213n356734o991965q744574p683552k602915
5807a8027311K176973K138168j250283l321317k669997r77193J252091M137194
5799a6541675N226475K056115k519895k617483K514164P030865O079851J036042
5791B264459l515676m309597n18272N511765Q116154L479538m164315o375797
5783D88259j715845K376142O95749l019326l702149k737722l027689k119246K852397
$$ y = [-16607722, -18190412, -17829709, -12940494, -4090786, 2358844, 789016, -6537358, -12108106, -11911912, -8591064, -6395017, -6202970, -6224938, -5049240, -2577419, 505600, 2958985, 3878690, 4351843, 6780496, 11163086, 13604303, 10890407, 5711661, 4361767, 8954785, 14791760, 16418642, 13352429, 7995695, 1003730, -7740844, -15424396, -18027311, -15850338, -13712170, -14962453, -18283770, -20953767, -21930960, -20678869, -16541675, -11315200, -9259085, -11778980, -14396463, -11882299, -4851434, 1228417, 2264459, -1251217, -5560814, -6079086, -567321, 7548833, 11028371, 6864056, 488259, -1227586, 1148556, 1844305, -1175021, -4877170, -7614892, -10642581, -12761827, -9909430]
5774i909430P537680N519650j068528l821179l84310K800089P69852l612325n394978
5765g563479l892064q01672L245357P230211Q509082O219015L426299L117975
5757A9490724L960726K588131j253662m288742m003910j607926m34102j977432
5749A2473807l876582k505695K107134N387728L612326j254531m178269l134596
5741H631322Q842L172698N033215L472138k177165p325479n919021N38264L170089
5732H604903k212863q458323p064822n00546J884353k050247m735308r82726M637815
5723a0877764N655443L118215K054611K389640p0735m831333n790249o81219M474804
5714d558587L816751J6769m15231L003760N034464L132311k04537k821503m594283
$$ y = [-9909430, -2371750, 3147900, 2079372, -1741807, -2126117, 673972, 1443824, -2168501, -7563479, -11455543, -12257215, -9011858, -1781647, 6727435, 12946450, 16372749, 19490724, 23451450, 26039581, 24785919, 20497177, 16493267, 14885341, 14451239, 12473807, 8597225, 6091530, 8198664, 13586392, 17198718, 15944187, 11765918, 8631322, 8640164, 11812862, 16846077, 20318215, 18141050, 10815571, 4896550, 5434814, 8604903, 6392040, -2066283, -9131105, -9631651, -7747298, -9797545, -14532853, -15515579, -10877764, -5222321, -2104106, -49495, 2340145, 2269410, -2561923, -8352172, -9033391, -4558587, -741836, -725067, -1140298, 1863462, 6897926, 10030237, 9825700, 7004197, 2409914]
5705B409914l571358K730189J0337878J0188202L94592q960897q430767j345944
5697C751809K714433J891879J697641L575688K708111k632872p290751o688369
5689b72431k428395J301936K278428r590m630953q007113o548454j418724L095291
5680a6640005N808225Q436967R634781N739361j557509n196156k632288Q68541
5672D461917J440819J935716M201067L679264k239440p092745m269394J898750
5664D015954K492294j968558l151075R04461K964580q63206m760052l016513Q64591
5655b517524K35492m041222n040349k90475M574309L701010j086695l007408K78587
5646g194275L323906M46229n863552p646909k024430N076316O764262K899458
$$ y = [2409914, -1161444, 1568745, 11906623, 22094825, 22489417, 13528520, 5097753, 3751809, 6466242, 8358121, 10055762, 13631450, 16339561, 13706689, 6415938, -272431, -2700826, -1398890, 879538, 869948, -3761005, -11768118, -18316572, -19735296, -16640005, -10831780, -2394813, 7239968, 12979329, 11421820, 6225664, 3593376, 4461917, 5902736, 7838452, 12039519, 15718783, 13479343, 6386598, 2117204, 4015954, 6508248, 4539690, 1388615, 2293076, 5257656, 4394450, -365602, -3382115, -2517524, -2282032, -6323254, -11363603, -11654078, -7079769, -3378759, -4465454, -7472862, -7194275, -3870369, -3424140, -9287692, -16934601, -18959031, -13882715, -7118453, -4218995]
5638d218995j881990m101814k796991J460456N513288M696846j227619n869647
5630h426466l820448K179462N847378O144648O113931N476212J172553n352297
5622I334973q147844n098466q01855K94753r39169j291106P21504M726570Q629429
5613G428789Q510250K747164l520260l271447K230852M055339j665528p739662
5605H775497o211982O37824M354364J667873l094614m691481j798607L336304
5597B975178O567171M460092j788331o276960m836940j98895J718924p58289l934292
5588b072342l943575o63479K915405L544383P46657k014215o97976L972216O835174
5579H622248N072907J775485J028936K657052M304286N487525O201568M257443
$$ y = [-4218995, -6100985, -10202799, -12999790, -11539334, -6026046, -1329200, -2556819, -8426466, -12246914, -10067452, -4220074, 1924574, 8038505, 13514717, 14687270, 9334973, 1187129, -3911337, -4713192, -4418439, -5357608, -6648714, -5927210, -1200640, 7428789, 15939039, 18686203, 15165943, 11894496, 14125348, 18180687, 16515159, 8775497, 2563515, 3201339, 7555703, 9223576, 6128962, 1437481, -361126, 2975178, 9542349, 14002441, 12214110, 5937150, 1100210, 901315, 2620239, 1861950, -2072342, -6015917, -6679396, -3763991, -219608, 527049, -1487166, -2185142, 1787074, 8622248, 13695155, 15470640, 16499576, 19156628, 23460914, 28948439, 35150007, 39407450]
5571C9407450j873416r128809j2504896j0735862o523862k501341K02002R32991
5563b725743L6524r38850j842483m360978p321517n309009L559214J1919173J1238576
5554D254907L402598k252697j957698l04066m88835J58011L221880N106539K986079
5545A4126718q25562l212490l729587j561711M783163J1628913J0660500J94062
5537C2064006r777608r537512j951982L134673K456265M42828K26302J041677
5529A8098649K581815M694800M144820j158173o003289l904393J408143k72373
5521A9589999r334227j3782592o743758K860814L512524k626427m782888J93964
5513a1112591N496987N749403K477289j117610l677181l711523k98007L569644
$$ y = [39407450, 37534034, 28405225, 15900329, 5164467, -1359395, -3860736, -3658734, -2725743, -2689219, -3628069, -5470552, -9831530, -17153047, -22462056, -18902842, -6983669, 4254907, 7657505, 5404808, 3447110, 3143044, 2654209, 2812220, 6034100, 11140639, 14126718, 13301156, 10088666, 6359079, 4797368, 9580531, 21209444, 31869944, 32064006, 22286398, 12748886, 10796904, 13931577, 16387842, 16830670, 17056972, 18098649, 20680464, 25375264, 29520084, 28361911, 22358622, 18454229, 19862372, 19589999, 10255772, -3526820, -10270578, -7409764, -3897240, -6523667, -11306555, -11112591, -5615604, 133799, 2611088, 1493478, -2183703, -5895226, -6193233, -2623589]
5505b623589L699574J174392P24812K501174J932391j148152p45012M699584P275538
5496A7490712Q52517q359964r724803l030606K433430J963885K80373J593839
5488C499383K908707P02156j962300k27073M312678N638624K088318j867176k638007
5479A2455310j939816k786030m461209m179074j986532q46801j857804k287436
5471g889392J77815L425504L826479K027130K142605M641785M267246k033977
5463A0585195q445586o580291K450720P746635K073669q722073j2970943p124432
5455b0987106J510391N007124L540457K410926L404794K853641j363686m383089
5447h006548L32113J0741650J5974861R070714l456602r247198n241293M28361
$$ y = [-2623589, 1075985, 2250377, 2975189, 5476363, 7408754, 6260602, 5515590, 10215174, 17490712, 18343229, 9983265, 258462, -2772144, -338714, 1625171, 1905544, 3499383, 6408090, 7110246, 5147946, 4920873, 9233551, 14872175, 16960493, 15093317, 12455310, 10515494, 7729464, 3268255, -910819, -2897351, -3744152, -5601956, -7889392, -7711577, -4286073, -459594, 1567536, 3710141, 8351926, 12619172, 10585195, 2139609, -4440682, -1989962, 5756673, 7830342, -891731, -13862674, -20987106, -19476715, -14469591, -10929134, -8518208, -5113414, -2259773, -3623459, -8006548, -7674435, 3067215, 19042076, 28112790, 24656188, 15408990, 10167697, 10596058]
5439A0596058J053566j072334j628408j784989l844757m701606m39626N345218
5431C523122M983565k085793q062849p404353k834198P51252K692744M051429
5423d385081L626697O81719j608543P2970L676126M094924K02214l974068m870073
5414b483115k962468m28976J830615L717521M466592L047651o55699n460167r042355
5405g970401q890873m578865R17774L761030L337572K221948J931531J059395
5397h210889j290392k721596p12684K903722L802973J343367l10455J715072M575104
5388A094222L629133q75152l877702k101921J822483K676415j324291o813916
5380e770729q870312n500528J086101O787178Q793039O854109K480145k062832
$$ y = [10596058, 11649624, 10577290, 8948882, 7163893, 3319136, -1382470, -1822096, 3523122, 8506687, 6420894, -1641955, -9046308, -11880506, -11129254, -8436510, -4385081, -758384, -76665, -1685208, -1612238, 2063888, 6158812, 6361026, 2386958, -2483115, -5445583, -5874559, -4043944, -326423, 4140169, 7187820, 6532121, 1071954, -7970401, -16861274, -21440139, -20522365, -16761335, -13423763, -11201815, -9270284, -8210889, -9501281, -12222877, -12935561, -10031839, -6228866, -4885499, -5195954, -3480882, 1094222, 4723355, 3848203, -29499, -2131420, -308937, 2367478, 1043187, -5770729, -14641041, -20141569, -19055468, -12268290, -3475251, 3378858, 5859003, 3796171]
5372C796171m422465l649225j578040j019494j691483m3374N210672R691148Q334532
5363A4628442K042881m105379p806807j0196692j0411406n487427K920522P597182
5355a0818684M923196M28719J122407N861528P910301M467082j008115m172027
5347H714407l186382J659212P392464Q857229M155354j716506l048539j453775
5339B1373464k374670n297812m511167M45518K740667j358917o878232p872988
5331c734137m773370p54440L275696O020131L912093k843329p130997l676556
5323i704909K869201M539349J306108q43470k95942p82542l187396l895636j599910
5314a1595147R42754K718354N626646Q666087P424586J503978l589568m635308
$$ y = [3796171, -626294, -4275519, -5853559, -6873053, -8564536, -8607910, -3397238, 6293910, 14628442, 16671323, 12565944, 4759137, -5437555, -15848961, -21336388, -18415866, -10818684, -5895488, -5466769, -4344362, 1517166, 9427467, 13894549, 12886434, 8714407, 5528025, 7187237, 14579701, 23436930, 27592284, 25875778, 22827239, 21373464, 18998794, 13700982, 9189815, 9635333, 12376000, 11017083, 4138851, -3734137, -8507507, -9261947, -5986251, 33880, 3945973, 1102644, -6028353, -9704909, -6835708, -2296359, -990251, -1833721, -2129663, -2912205, -6099601, -9995237, -11595147, -10652393, -7934039, -2307393, 6358694, 13783280, 15287258, 11697690, 7062382]
5306G062382m877217o679176o077749K77127P720514R350851N896334L279491
5298A5952557K444449j203491q270983j2267507q389139m56121M027911K636550
5290e525774r41641k450792j001807J384886K084427J61893k532087l131945j141849
5281a3094689R81298J029857o54681k661275m332033m854606k553073K695432
5273b3443770P551004Q220183N014058J706474M64896k19306j971260l142259
5265e819980o59708N533218J1257667J1579596N482567k671622o667372m181003
5257A3853363J136465L929504K778658L37371j203590k314846l751954m736173
5249A0028798m596793m002072l232297j279687J793967L592915K360619m37407
$$ y = [7062382, 2185165, -4494011, -10571760, -10294633, -2574119, 6776732, 12673066, 15952557, 18397006, 17193515, 8922532, -3344975, -11734114, -12190235, -8162324, -5525774, -6467415, -8918207, -9920014, -8535128, -6450701, -6288808, -8820895, -11952840, -13094689, -12113391, -11083534, -11738215, -14399490, -18731523, -23586129, -26139202, -23443770, -15892766, -7672583, -2658525, -952051, -487155, -706461, -2677721, -5819980, -6479688, -946470, 10311197, 21890793, 27373360, 24701738, 18034366, 13853363, 14989828, 18919332, 21697990, 22035361, 20831771, 18516925, 14764971, 10028798, 5432005, 1429933, -1802364, -3082051, -1288084, 2304831, 4665450, 4228043]
5241D228043k271477k508679j439665J329012M993172O397104L920657L41800
5233A4989967j658782m069383q686496j0515596l494074P951638J1832029N059921
5225A1409224j708745l3907L895691J47775q232320r450471j127465O240080M859743
5216E999605m40213j342609J944959L034722l97503m093503l564897R54777N717751
5207G813089P132311M213916q74039m376394l972831p73391J642529L28920m210350
5198F923760p992458p332052l236047n67219j776591l481435j301809L954465
5190a4809386P944413Q907006Q241622O084251J138833m779059o901214l857406
5182A969060P7002Q84913p29761k641242m880038o919397n346551J284212P784618
$$ y = [4228043, 1956566, -552113, -1991778, -662766, 4330406, 10727510, 14648167, 14989967, 13331185, 9261802, 575306, -9940290, -13434364, -5482726, 6349303, 11409224, 9700479, 9666572, 13562263, 13710038, 5477718, -3972753, -5100218, 1139862, 5999605, 5559392, 4216783, 6161742, 9196464, 8798961, 4705458, 1140561, 2095338, 7813089, 14945400, 19159316, 18285277, 13908883, 9936052, 9162661, 10805190, 11134110, 6923760, -1068698, -8400750, -11636797, -12204016, -13980607, -17462042, -18763851, -14809386, -6864973, 2042033, 10283655, 16367906, 17506739, 12727680, 5826466, 1969060, 2046062, 2930975, 2201214, -440028, -5320066, -12239463, -17586014, -16301802, -8517184]
5173h517184P500003J284768l215844j436815K952825L860856N02686k617638
5165C13657j644228K552906N591003L798511k426676q820074j0918928p873497
5157a9427326k792986M56171P64205M17936K214520N677205O851394L050451k817763
5148e606193m788792r19554M455990O286362M132060N83962k880608n802453o523100
5139a1062326l649689P47391K641185J145280n55091p6219R20745j17497k253441
5130a2259662k310804O4499J268387j177811m312368l128871J994638M601352
5122a5260640P36860m675563l794664L255255Q267103O090607R39922n26428J950432
5113c017116L804141K935890J286585O69342O68959J03656j835164m944778o829514
$$ y = [-8517184, -1017181, 267587, -2948257, -4385072, -1432247, 2428609, 2931295, 313657, -1330571, 1222335, 6813338, 10611849, 8185173, -634901, -11553829, -19427326, -22220312, -21764141, -20999936, -20582000, -18367480, -12690275, -5838881, -2788430, -5606193, -10394985, -11314539, -6858549, -572187, 3559873, 4143835, 1263227, -4539226, -11062326, -14712015, -13964624, -11323439, -10178159, -10733250, -10809469, -9888724, -10006221, -12259662, -14570466, -14505967, -13237580, -14415391, -18727759, -21856630, -19861992, -15260640, -14523780, -19199343, -22994007, -19738752, -11471649, -5381042, -4441120, -4967548, -3017116, 787025, 3722915, 5009500, 5678842, 6347801, 6451457, 4616293, -328485, -7157999]
5104g157999m493531P91520L274097N51009j914890J206061N979428M677214j645188
5095A267721l957552J175595O710751N828778M55248l954690n797373n729934
5087d001456l409547j92790j64379l941478n964809k509472K362745L997676N074876
5078h748634R450153J2665814P532885l134345q817317o174042k569862l392732
5070c188080m688885j792492K404964K813304K66839q77246L95702J712555J507966
5061a445373j27350k486385l791637k436940l10952j086186l565219j929886M589480
5052a2590448Q288480L826225l173865m366090n15136K091643K730197M986513
5044A277519P081036L230142n422002j0329667p526290k281965K9668L52615J036728
$$ y = [-7157999, -11651530, -10860010, -7585913, -7034904, -8949794, -7743733, -1764305, 2912909, 1267721, -2689831, -1514236, 5196515, 11025293, 11480541, 7525851, 1728478, -4001456, -7411003, -7603793, -7768172, -11709650, -17674459, -20183931, -17821186, -13823510, -8748634, 701519, 13367333, 20900218, 17765873, 8948556, 2774514, 204652, -3188080, -7876965, -9669457, -7264493, -4451189, -4184350, -5061596, -4665894, -2953339, -1445373, -1572723, -4059108, -7850745, -10287685, -10598637, -11684823, -15250042, -17179928, -12590448, -4301968, -475743, -3649608, -8015698, -8530834, -6439191, -3708994, 1277519, 8358555, 11588697, 6166695, -4162972, -11689262, -13971227, -13941559, -13588944, -12552216]
5035a2552216J629560K273807M609911O620486L602928k684841l646987L058851
5027B911499Q092758M084488l022176m079899j266164k599973o902774n724496
5019h506737J590344O169514L774871M38159J326685L069074J419626r73723q588
5010H299225K099988N46337l730121n125561j586487K879058L953521J776734
5002I112694r27705k916688m587482n072349k106069L664417O680818K626784
4994F474420m220652m886047K114705Q192322O782898J703710j028172l057446
4986A2075738q071980j1717492o817695L879083J0072967Q411095N084777L600424
4978A6516917J7641p129610j1550233q402327j760423J658740Q68527q10093n80016
$$ y = [-12552216, -10922656, -8648849, -4038938, 2581548, 6184476, 3499635, -147352, 2911499, 11004257, 15088745, 12066569, 7986670, 6720506, 4120533, -2782241, -8506737, -6916393, -746879, 3027992, 3466151, 4792836, 7861910, 9281536, 8307813, 8299225, 10399213, 10945550, 7215429, 2089868, 503381, 3382439, 7335960, 9112694, 8184989, 5268301, 680819, -4391530, -6497599, -2833182, 3847636, 6474420, 2253768, -2632279, -517574, 7674748, 14457646, 16161356, 15133184, 12075738, 4003758, -7713734, -14531429, -10652346, -579379, 7831716, 12916493, 16516917, 16534558, 9404948, -2145285, -10547612, -12308035, -10649295, -9780768, -10590861, -11170877]
4969a1170877L134327R640662J3379918Q221764l092272r960670p389386k243050
4961E20416k573539o884844q293263m108681K925225Q593831R283585M505410
4953C968140n71098j52012L639879L939212J274704L047771Q968888Q651994j294386
4944C1473092r561913p102735r49487j702310o892509p766011m717269m151582
4936a1370724n705910l959232J150388N341870P470847P747991L794176l262062
4928A207344n303360R83531N989268R85619p584317q865924m526130k115990J05552
4919a9124407O651903J0819812M505191m007124p72353R470953R410990k466229
4911A4488736r869785n393186N66059p1224k482302j960768q24699Q88713O119332
$$ y = [-11170877, -8036550, 1604112, 14984030, 23205794, 20113522, 10152852, 2763466, 520416, -2053123, -8937967, -17231230, -21339911, -18414686, -9820855, -537270, 3968140, 3397042, 3245030, 6884909, 10824121, 12098825, 15146596, 24115484, 32767478, 31473092, 21911179, 14808444, 13858957, 12156647, 5264138, -2501873, -7219142, -11370724, -17076634, -21035866, -19885478, -14543608, -7072761, 675230, 4469406, 1207344, -4096016, -3112485, 2876783, 3862402, -3721915, -12587839, -17113969, -19229959, -19124407, -12472504, -1652692, 2852499, -1154625, -1926978, 7543975, 16954965, 14488736, 4618951, -774235, -208176, -279400, -2761702, -4722470, -5547169, -4658456, 1460876]
4902A460876J0312344N982235j663149p08558N950740M141871o344513j1104167
4894H027679o815735m826314o889088j957092Q890620J0283180R29664k550660
4886E092254L501428L578307n137274o031626K756893J685760j1415105j3787179
4878a9756542k495385l081127j6225693r578462Q849177k5603438j23334681j75555939
4870c66782090q3436570Q6093855J68613896J12387472K4279494J776895J9531230
4863c7535818J4809040n727196l225784J4042504J3797153J977101L719539J0670556
4855A2527095l85146j8071181j4260981M806001J0153872L65800j888299O042434
4847g10405O735097K98295L172125J2711697R839118l867009o990359K523599
$$ y = [1460876, 11773220, 17755455, 16092306, 15383748, 21334488, 25476359, 19131846, 8027679, 1211944, -3614370, -10503458, -12460550, -3569930, 6713250, 7642914, 5092254, 8593682, 12171989, 7034715, 1003089, 3759982, 5445742, -5969363, -19756542, -22251927, -25333054, -41558747, -51137209, -42288032, -67891470, -191226151, -366782090, -450218660, -364124805, -195510909, -83123437, -58843943, -57067048, -37535818, -22726778, -28453974, -31679758, -17637254, -3840101, -1863000, 1856539, 12527095, 12141949, -5929232, -20190213, -15384212, -5230340, -4864540, -6752839, -710405, 6024692, 6322987, 9495112, 22206809, 32045927, 28178918, 21188559, 23712158]
4839B3712158L091328j1353784k0305831j2198601j515837q22934k135742K605364
4831a8923879N838703J585373j375210M057213J0065135Q335991L493849K118794
4823A5195969J194219l282664p443491p169976m540371j114677M566267Q648060
4815F053336L534306p551656j0771988k017663O305934N086742J207176K588504
4807D434691M316051j14351n587530m723819q51853n21753j273522K030526N633073
4798C341513K958191k889526l602491O85581K164769j958483n999778m677172
4790i977396P39768N108935M416561r43172n611710m222197J695372N331470M017809
4781E55440J897436K066950K619504K555343M206838O581366M057058l855913
$$ y = [23712158, 26803486, 15449702, -4856129, -17054730, -18570567, -19393501, -21529243, -18923879, -13085176, -11499803, -12875013, -8817800, 1247335, 9583326, 13077175, 15195969, 16390188, 13107524, 5664033, -1505943, -6046314, -7160991, -2594724, 6053336, 9587642, 2035986, -8736002, -10753665, -4447731, 639011, 1846187, 4434691, 8750742, 8636391, 3048861, -1674958, -2526811, -3048564, -4322086, -2291560, 3341513, 6299704, 3410178, -192313, 493268, 2658037, 699554, -5300224, -9977396, -9237628, -4128693, 287868, -655304, -6267014, -10489211, -8793839, -3462369, 555440, 2452876, 4519826, 7139330, 9694673, 13901511, 20482877, 24539935, 20684022]
4773B0684022q924268n579131J072389M023780L952768L832944J432733m732535
4765A5762702q149609k366260P557482J0607358M593969k528697m501604k489851
4757A8485490K22360K355200K986586J130503k086732m175805m305267l341218
4749A1271117j956476p72516p58479j665507k012973j757896k140228k249146
4741b042104J4682K708576J135078l942900n662655j237135L822911M755177L582907
4732C134537K351261j414839p119703p560882k89040N524941K338333l035271
4724f070663k55972P299918Q084945R29200m621374m475221l790961m475876j252555
4715h628559O931684J1917319P385100k138445p324259m351446L056993P876927
$$ y = [20684022, 11759754, 6180623, 7253012, 11276792, 15229560, 19062504, 20495237, 15762702, 7613093, 5246833, 12804315, 23411673, 28005642, 25476945, 20975341, 18485490, 18707850, 21063050, 24049636, 25180139, 23093407, 18917602, 14612335, 11271117, 9314641, 8542125, 7783646, 6118139, 4105166, 2347270, 207042, -2042104, -2027422, 681154, 1816232, -2126668, -7789323, -9026458, -5203547, -448370, 3134537, 5485798, 4070959, -3048744, -10609626, -10898666, -5373725, -3035392, -6070663, -6326635, 973283, 9058228, 9987428, 5366054, 890833, -2900128, -7376004, -8628559, -1696875, 10220444, 17605544, 15467099, 8142840, 3791394, 6848387, 14725314]
4707A4725314N192324k871563q023154n341676J32939J020203j720174k499890
4699F14323j729224l593010n815923k420733M112446M913139k53525j897845K819817
4690c250535M871254p49055n613930j444146O748726R321586N760693J297969
4682A6942562l161533q418307r943301l574784N153958O960419K086815j320819
4674D725010p62971j882089o816633r266623m496906K813910N440889L756342
4666f489071L917735Q066085J1145040P955156K28742n371015n405158l442166
4658A0605348m557141p955836q087241k841569L004058M114122J453847K28699
4650d035713K697173N829221N670960J970164j759416j883953J548598M438047
$$ y = [14725314, 19917638, 17046075, 9022921, 3681245, 3814184, 4834387, 3114213, 614323, -1114901, -4707911, -10523834, -12944567, -8832121, -3918982, -4172507, -6070352, -3250535, 1620719, 871664, -4742266, -6186412, 562314, 9883900, 15644593, 16942562, 13781029, 5362722, -4580579, -8155363, -3001405, 3959014, 6045829, 4725010, 3962039, 2079950, -4736683, -14003306, -18500212, -15686302, -10245413, -6489071, -2571336, 5494749, 16639789, 24594945, 24823687, 19452672, 14047514, 10605348, 6048207, -1907629, -9994870, -12836439, -9832381, -5718259, -4264412, -4035713, -1338540, 4490681, 10161641, 12131805, 10372389, 8488436, 10037034, 14475081]
4642A4475081K798232k558544o608084n653145j104460K561528K467503l41577
4634F036534k336541j216730J313576J312724k208441n696891o028645m494517
4626a3318931l391669j690025J991806M861177L506681r1763j703738j980042
4618a1816504l820629m519572R33548R066994J0110023K711824l164133j274460
4610a772909K639701K280351O95622K003995K266934k551952o815513l434630
4602d688401L373975L861413k145880n916907l528838N63931K633332L579841
4594b267534M064498L546001L799156O182044O407546k47724r484955j2016653
4586a7621o611458o90226J774744L770003O236470N403228J052723j819396k016612
$$ y = [14475081, 17273313, 14714769, 8106685, 2453540, 1349080, 3910608, 6378111, 6036534, 3699993, 2483263, 3796839, 5109563, 2901122, -2795769, -8824414, -13318931, -16710600, -18400625, -16408819, -11547642, -8040961, -8132724, -9836462, -11816504, -15637133, -20156705, -19223157, -10156163, -46140, 2665684, -498449, -1772909, 866792, 3147143, 3842765, 5846760, 8113694, 5561742, -1253771, -4688401, -1314426, 2546987, 401107, -5515800, -9044638, -8480707, -5847375, -2267534, 1796964, 5342965, 9142121, 15324165, 21731711, 21483987, 11999032, -17621, -6629079, -7319305, -5544561, -1774558, 4461912, 9865140, 10917863, 9098467, 7081855]
4577G081855l749092o714799m374945M135680J0206028Q696419N147375M560510
4569B4989031K959121k761716o459452l363541k68119m406849r606418n711427
4561d629370L781877O697560J392255k442721q07355K42541k025373k301860J294604
4552A202158K871817M4278j143545K323023L953351r30896o192247m750426k96436
4543b918923p62367n287355o293447j497450L987800N984649N084319L095202
4535A392428J250257J239264L230295L746924K7056m563328m239922P03067L968980
4526F755021K056248j467876j629062J375394K925406k44057n937738q077898
4518d244562l276691M270108P064591L903832J053984K283736L287929j77597
$$ y = [7081855, 3332763, -3382036, -7756981, -3621301, 6584727, 15281146, 20428521, 24989031, 27948152, 25186436, 18726984, 15363443, 15095324, 10688475, 1082057, -4629370, -847493, 5850067, 7242322, 4799601, 3992246, 4234787, 2209414, -92446, 1202158, 4073975, 4118253, 2974708, 5297731, 9251082, 8320186, 2127939, -2622487, -2918923, -3681290, -8968645, -15262092, -16759542, -12771742, -6787093, -1702774, 1392428, 2642685, 3881949, 7112244, 10859168, 10886224, 6322896, 2082974, 2786041, 6755021, 8811269, 7343393, 5714331, 7089725, 10015131, 9771074, 3833336, -4244562, -7521253, -3251145, 3813446, 7717278, 8771262, 11054998, 14342927, 14165330]
4510A4165330m408704m124041j841938l062041n627747l030442L469705N806385
4502A346507K142257r28999n41401j710310o099167o725804M07955P864070P021280
4493B776388K99162m106921m334230m011708l468816m5142M824985O234343K967133
4484A135194j573444m787144o280642n071090n60887M310299N509371L218307
4476d100036J130993J361224L157750M967452M777264J139071k873063r02565
4468H658090O798781R847325J301053r816816r227969J937143Q243564J758583
4460A9499754q463394j1183578o746336j501832K358339N249530N561018L080892
4452G854393J912228M283104N940124K843477k062676l995478l738949m160137
$$ y = [14165330, 9756626, 5632585, 3790647, 728606, -4899141, -7929583, -4459878, 1346507, 3488764, 2559765, 2018364, 308054, -5791113, -12516917, -12108962, -4244892, 2776388, 3075550, -1031371, -5365601, -9377309, -12846125, -12891267, -8066282, -1831939, 1135194, -438250, -5225394, -11506036, -16577126, -17138013, -12827714, -7318343, -4100036, -2969043, -1607819, 1549931, 6517383, 11294647, 12433718, 9560655, 8658090, 15456871, 25304196, 26605249, 16788433, 7560464, 9497607, 17741171, 19499754, 11036360, -147218, -6893554, -8395386, -6037047, -787517, 4773501, 7854393, 9766621, 14049725, 19989849, 22833326, 20770650, 16775172, 13036223, 8876086]
4444H876086l587465O06834M968390L792747j538838l999985j424853P80930j662265
4435F811581n897940o605887l009658R24948J407556j359407l531196j754323
4427a3014326K714170N251715L691907N14259j824958m299348p595131q529740
4419b3091452m163707K836705P031275O789348M373653J329796j947052l463947
4411a0305381j141814L255927N637477M750769K438168l74623l948710o622912
4403f311099n826498k379649J03292L75686N46044J803002K789426K455452J101551
4394e342793j359721m638726o020827l228532J157431K923590L246807O294428
4386f968343R777768O103992m338343r753737k889044O774740N415153n233685
$$ y = [8876086, 5288621, 5895455, 10863845, 14656592, 13117754, 9117769, 7692916, 8473846, 6811581, 913641, -5692246, -8701904, -7776956, -6369400, -7728807, -11260003, -13014326, -10300156, -5048441, -1356534, -842275, -2667233, -6966581, -14561712, -23091452, -27255159, -24418454, -17387179, -10597831, -6224178, -4894382, -6841434, -10305381, -11447195, -8191268, -2553791, 2196978, 4635146, 4260523, 311813, -6311099, -12137597, -14517246, -14413954, -14038268, -13492224, -11689222, -8899796, -6444344, -5342793, -6702514, -11341240, -17362067, -20590599, -19433168, -16509578, -13262771, -6968343, 2809425, 8913417, 4575074, -5178663, -8067707, -1292967, 4122186, -1111499]
4378a111499j0696733m986687K014422P99524m238358l686837J810038L991812
4370a6104318J017879j55426M263153Q692747P047092J628307j540699j966214
4362B882521l463674n959624n020819q035L019519q29183q109755j0819238n590771
4353c3899059L249295Q855718Q332497M395875J605115J267438R12940p55188
4345f035369r54006K330094N155856K542522k584036k279651L634309N563868
4337G373587j277602p827969l569988P371881J1140827K928156p624009j0082748
4329a567865m913234N75227K185946J283830M92759K37217j000375m098176p041678
4320a3846349o272335j183612M420106O838515O372651M949154K680368n07495
$$ y = [-1111499, -11808232, -16794919, -14780497, -13980973, -18219331, -21906168, -20096130, -16104318, -15086439, -15241865, -10978712, -2285965, 4761127, 6389434, 4848735, 2882521, -581153, -6540777, -11561596, -11569631, -8550112, -9379295, -17489050, -28308288, -33899059, -30649764, -21794046, -13461549, -9065674, -7460559, -6193121, -5280181, -6035369, -6989375, -4659281, 496575, 3039097, 455061, -1824590, 1809719, 7373587, 6095985, -1731984, -5301972, 2069909, 13210736, 16138892, 8514883, -1567865, -6481099, -5905872, -3719926, -2436096, -1943337, -1706120, -2706495, -6804671, -13846349, -20118684, -21302296, -16882190, -10043675, -3671024, 1278130, 3958498, 3451003]
4312C451003k689116k685117k248500k203364P0820N076428P201723K195389m817849
4303C351417n808149j703436L7836k030263j935498K700519O869405O683330M003201
4294A2168362J032253k440872m832523l115203Q27831J500908q46512j34510M161253
4285H320987M587204j584862o397381l552477J487386N53169m936597p995835
4277i518406o697319l549249P30073N465840O495760J966113k061195N45681N692875
4268i29827M609520k510911o638889l028448L232494N287027K116978k645701
4260e07757m869274k601325J803544L008112o22453l802823j710518K474268K787924
4251d040302L20265J004834N301466P505657N083780J602664k47404j831839l534745
$$ y = [3451003, 761887, -1923230, -4171730, -6375094, -6304274, -1227846, 5973877, 8169266, 3351417, -2456732, -4160168, -4122332, -6152595, -8088093, -5387574, 1481831, 8165161, 12168362, 13200615, 10759743, 5927220, 2812017, 3639848, 5140756, 4294244, 4159734, 8320987, 12908191, 11323329, 4925948, 1373471, 2860857, 3414026, -1522571, -9518406, -16215725, -19764974, -19034901, -13569061, -7073301, -5107188, -7168383, -6622702, -929827, 3679693, 1168782, -5470107, -8498555, -5266061, 20966, 2137944, -507757, -5377031, -7978356, -6174812, -3166700, -3789153, -7591976, -9302494, -6828226, -4040302, -3720037, -2715203, 2586263, 10091920, 15175700, 16778364, 16530960, 14699121, 11164376]
4242A1164376k947753j45032Q85476j492681l880953l998930m695815q382287
4234a3493599j1380279q124116R24047R257059J1725780R428356P030818O876012
4226A2244078O902726M458090Q09447l33502J281305J300153k885279p843753
4218A5933265q900702o493173m383279l807014l146069j672539J97420K991507
4210i280584O749774Q632883N667600p38095n915590o661732k829883L433901
4202i41726P486298M557892l856984r141471n436580K633603O503805M254479
4194F059316m63554n653807j0195506r827367k466585N015096M393415j096323
4186a4235315j011665N979973J0243943O431504K72489k367422l468559n865867
$$ y = [11164376, 8216623, 8071591, 8957067, 7464386, 3583433, -415497, -5111312, -13493599, -24873878, -32997994, -32073947, -22816888, -11091108, -1662752, 5368066, 12244078, 19146804, 23604894, 24414341, 24080839, 25362144, 26662297, 23777018, 15933265, 7032563, 539390, -3843889, -7650903, -10796972, -12469511, -12272091, -9280584, -2530810, 6102073, 11769673, 11031578, 5115988, -1545744, -4375627, -941726, 6544572, 11102464, 7245480, -1895991, -7332571, -4698968, 1804837, 6059316, 5595762, -58045, -10253551, -20080918, -22547503, -17532407, -13138992, -14235315, -15246980, -9267007, 976936, 7408440, 7680929, 5313507, 1844948, -4020919]
4178d020919o778329l517210O52804J165685j843635n288145o591794l785026
4170c0006569K767376P688005N517159q41698l129072L19741L272761K835581
4162a1576716K885558M609721L496221j179607l589840j631209j57143m04947
4154g547962K756731Q545597P703619j170905n703048P74779O517754k27544j1681385
4145c2364j3296079o389726k515109k728984P65826O966699O845897j57476n541391
4136a6082707o448765o993040o622787j745396K747049m01668m044536N974207
4128c3617643K5089670L1069699J6017372j682894n683885l362151p096316j0994246
4120I739606l408379R336239J0939081Q14306o130704l223578O87963j591597
$$ y = [-4020919, -10799248, -14316458, -13663654, -12497969, -14341604, -19629749, -26221543, -30006569, -27239193, -19551188, -14034029, -14875727, -18004799, -17685058, -14412297, -11576716, -8691158, -4081437, -585216, -1764823, -5354663, -6985872, -7143015, -7547962, -4791231, 3754366, 11457985, 10287080, 4584032, 5358811, 11876565, 11649021, -32364, -13328443, -19718169, -22233278, -24962262, -24196436, -17229737, -10383840, -10541316, -16082707, -22531472, -29524512, -36147299, -37892695, -35145646, -35547314, -39591850, -33617643, -8527973, 22541726, 38559098, 36876204, 31192319, 27830168, 20733852, 9739606, 6331227, 15667466, 26606547, 27420853, 21290149, 18066571, 18754534, 17162937]
4112A7162937n549032n509496l612462l301226k506696J433498O206217Q455245
4104A2778985Q561399P598202L830373l309373q895763p257760j50240M249230
4096A7405053J350014m213722n122513j236003R18898j681908l755258J04177
4088C768738O590174Q311946M820092K317599K949414K034323k350264m854180
4080B3587842k093090L07577m116710j2198392j5264119j0614716k827052L940155
4072a9278505Q717162J0357626P684112K866788l69050j764831l454133m771171
4064a2002l130072M18927J847739N51448n0147J261267J959838J279275J658349
4055E784622L072558J674234l158921n887107k853047J494624J440890o64019
$$ y = [17162937, 11613905, 6104409, 2491947, -809279, -3315975, -1882477, 4323740, 12778985, 21340384, 28938586, 32768959, 29459586, 20563823, 13306063, 13155823, 17405053, 18755067, 14541345, 9418832, 8182829, 9101727, 7419819, 3664561, 3768738, 10358912, 18670858, 23490950, 25808549, 28757963, 30792286, 28442022, 23587842, 21494752, 21802329, 17685619, 5487227, -9776892, -20391608, -23218660, -19278505, -10561343, -203717, 7480395, 10347183, 9978133, 8213302, 4759169, -12002, -3142074, -2723147, -875408, -323960, -374107, 887160, 2846998, 4126273, 5784622, 8857180, 10531414, 7372493, 1485386, -1367661, 126963, 1567853, 903834]
4047I03834J902662Q992482J2538409P396583j973892p509006o395919j741675
4039A4113478K547553M583840L814298O31146l195859n544702n891433n353324
4031E704997m741178l564359j287349J281278K565281J914396J60505j498639
4023E34932k697380l756431m672679m797021l675244j809140j92971O64132P94167
4014a9607635K19609o71027l08428K837321P324624Q684973M318555k407217n399498
4005e008723l030881N41319J570262J075367J581678K707204K781453K442110
3997D659789L019142K849913n99921n329875o013222j633498K220646R10927k828458
3988b744557l235731J65952K744364K364043K218696M760860O702518L465563
$$ y = [903834, 2806496, 11798978, 24337387, 31733970, 29760078, 22251072, 15855153, 14113478, 16661031, 21244871, 25059169, 25690315, 22494456, 16949754, 11058321, 5704997, 963819, -2600540, -3887889, -2606611, -41330, 1873066, 2033571, 534932, -2162448, -5918879, -10591558, -15388579, -19063823, -20872963, -21065934, -20401802, -19607635, -19388026, -20059053, -20367481, -17530160, -10205536, -1520563, 2797992, 390775, -5008723, -8039604, -7498285, -5928023, -4852656, -3270978, -563774, 2217679, 4659789, 7678931, 10528844, 9928923, 4599048, -1414174, -3047672, -827026, 83901, -2744557, -5980288, -5814336, -3069972, -705929, 1512767, 6273627, 12976145, 16441708]
3980A6441708l241742o534726l489047P27338J57680l523200l743863J242137
3972a963715N951320N350512O93640l710848n700129n178085k463042O15712J232600
3963e172035R4631K044461Q541794J3092905R091884n04473o905691o924177m647029
3954H712270l058062r98400J272456N78754l029069m528049j172300L094327L300431
3945D172358j07775k943918k491175P18694L795621L433662l02252k570570J33204
3936C837849L759376K124111k750170l331922O10793J333180l043846m629797
3928b090426O5553L032067j119700m333144J675999J0017642Q609794m90770n064282
3919A0302733k577584k079057o781996q628538l067217K827826K151096j328420
$$ y = [16441708, 13199966, 6665240, 3176193, 3903531, 4061211, 538011, -3205852, -1963715, 3987605, 9338117, 10031757, 6320909, 620780, -4557305, -7020347, -6404635, -5172035, -5077404, -3032943, 5508851, 18601756, 27693640, 27189167, 20283476, 13359299, 8712270, 5654208, 4655808, 5928264, 6507018, 3477949, -1050100, -2222400, 871927, 4172358, 4064583, 1120665, -1370510, -651816, 3143805, 6577467, 6275215, 3704645, 3837849, 7597225, 9721336, 6971166, 3639244, 4250037, 5583217, 2539371, -2090426, -2024873, 1007194, -112506, -4445650, -2769651, 7247991, 15857785, 15367015, 10302733, 7725149, 5646092, -1135904, -9764442, -12831659, -10003833, -7852737, -9181157]
3911i181157m47627M417260P531717O252139K492593r98764k422486j546585m00333
3902E696757q78666j675928j280316k585157q163556j1857313m168415J1989078
3894a2923516K0530455J2174901k954463r107894m390967J137797J321547j191403
3886D596457l136889m857988o304942n569426k376327J470200N130447Q263206
3878b785262Q406549L507850l295398o192176m308090k430404l551535n037196
3870a5685662l588311j80287K085541K363886K087209K238607K464532K170384
3862f044101J409102R73354J700592L105274L217198J049629j224483l61012L575399
3853G400952O665324N537946R32195l801874o412004o824754n558815l001627
$$ y = [-9181157, -9628784, -5211524, 2320193, 8572332, 11064925, 10066161, 7643675, 6097090, 5696757, 4818091, 3142163, 1861847, -723310, -8886866, -20744179, -24912594, -12923516, 7606939, 19781840, 16827377, 7719483, 3328516, 4466313, 5787860, 4596457, 1459568, -3398420, -9703362, -15272788, -17649115, -16178915, -11048468, -2785262, 5621287, 9129137, 5833739, -358437, -4666527, -7096931, -10648466, -15685662, -19273973, -19454260, -17368719, -15004833, -12917624, -10679017, -8214485, -6044101, -4634999, -3661645, -1961053, 1144221, 4361419, 5411048, 4186565, 3825553, 7400952, 14066276, 19604222, 20536417, 16734543, 10322539, 3497785, -2061030, -5062657]
3845e062657n59450o47869l759771o373224m336865J268419M525063K518064k95927
3836a2724217J241204M567764K698840m847449j0118388p072614R80413O572937
3828a8701510O645487L223611p65172k907713j321056L100928O200799N257395
3820G32769K397684O93385o83702l798270o619941n154997l25610K061905q20389
3811a1517166m886799m918131j342235J391127J558907K028361N022637P970684
3803d692615P057303L401039J790754K940159J900255l119070n604423r2666P465560
3794A1046296O858716r40880n238219k687047j785197p021275r968027l249095
3786a2984728O257396P604483J959639j677832j480042k494316n032710m750535
$$ y = [-5062657, -5622107, -6269976, -10029747, -16402971, -20739836, -19471417, -14946354, -12428290, -12724217, -11483013, -6915249, -4216409, -9063858, -19182246, -26254860, -25274447, -18701510, -12056023, -8832412, -9597584, -12505297, -13826353, -10725425, -4524626, 732769, 3130453, 3823838, 3140136, -658134, -7278075, -12433072, -12758682, -10696777, -11517166, -16403965, -21322096, -22664331, -21273204, -19714297, -17685936, -12663299, -4692615, 2364688, 5765727, 7556481, 10496640, 12396895, 9277825, 3673402, 3580736, 11046296, 17905012, 16964132, 11725913, 9038866, 7253669, 232394, -9735633, -12984728, -6727332, 877151, 2836790, 1158958, -321084, -2815400, -7848110, -12598645]
3778a2598645k413366k419771k473323L726430J2930756J3392852K322007q594537
3770C872403r393092l843150k07774Q76510K747811M492889L816181K848859M242979
3761I453616N429604K760013j992340m543788m345243l144560n93718L830638
3753F854222P363290P013273L704352l07167n069531j0303430j2684412r933285
3745a3362688m456237O34411N121473P846057M993889k504858n909364j97875
3737g835192O831998N682189L72986J690554Q575599R194434N24993o404563m069755
3728A4563243R70718P28957j755111m86815J654876j261273o428669o341106j390741
3719B54079J098309q80177j671729J716033M983851M085608O62304k534000n630742
$$ y = [-12598645, -15012011, -17431782, -19905105, -16178675, -3247919, 10144933, 12466940, 3872403, -5520689, -9363839, -9571613, -8695103, -5947292, -1454403, 2361778, 5210637, 9453616, 14883220, 17643233, 15650893, 11107105, 6761862, 3617302, 3023584, 6854222, 14217512, 21230785, 24935137, 24627970, 19558439, 9255009, -3429403, -13362688, -17818925, -17184514, -12063041, -4216984, 776905, -1727953, -7637317, -7835192, -1003194, 4678995, 5051981, 6742535, 15318134, 24512568, 25037561, 18632998, 14563243, 15533961, 16262918, 14507807, 14020992, 15675868, 14414595, 7985926, 1644820, 254079, 1352388, 472211, -1199518, 516515, 5500366, 9585974, 10248278, 7714278, 2083536]
3710B083536p864540n393546K496960R079739P440934k26162n594120m949041
3702b926240j864301p2377M86403K2995k517879n015929k174332O197309J2015413
3693D151062R193461K801788J604503M890487M689892o76064m398526l012544
3685A9244059j165649k195507l028120k343250m559760r788701r023333K006930
3677a0853331J2132088Q992332j801639m679232K013674M785985j912535o538278
3669B139064L62619J0634208J0710788M39832r344624j2025732r358968m644763
3661a1087576m448J908252N23681J14485M163062Q937257Q409295L462208q6083
3652A6340133q87944k462397m962918m240268j93213J298254k406573n778025
$$ y = [2083536, -5781004, -11174550, -8677590, 402149, 7843083, 7616921, 2022801, -2926240, -4790541, -4862918, -4376515, -4353520, -6871399, -11887328, -14061660, -7864351, 4151062, 13344523, 16146311, 17750814, 22641301, 27331193, 26655129, 22256603, 19244059, 18078410, 15882903, 12854783, 10511533, 5951773, -3836928, -12860261, -10853331, 1278757, 10271089, 8469450, 3790218, 5803892, 10589877, 8677342, 2139064, 2501683, 13135891, 23846679, 24286511, 14941887, 2916155, -6442813, -11087576, -11092024, -9183772, -8660091, -8545606, -4382544, 4554713, 12964008, 16426216, 16340133, 15452189, 12989792, 8026874, 3786606, 3593393, 4891647, 2485074, -3292951]
3644c292951l338276K143276M447133L342701L728119O890514Q101679L672709
3636B5694904l631645q086891p491900m203994j277031R3306k20257k033518l824414
3627d981440k855472J682170O416683O843681K689099j716958k818900j573905
3619C684958r08656j431020j430711m8389J360512Q46368k040185n440493o177470
3610a1585086k623423K812645N345081K971679j070482k064788Q32156L980720
3602a401498L340939j484982o589186o914960j256863N657477P522769L101585
3594A975281l107302o631373o817436m682460o15050M132926O846676O526648
3586b372090N240250M481499L040623M76837q16551O8105k49399m042870p532471
$$ y = [-3292951, -6631227, -4487951, -40818, 3301883, 7030002, 13920516, 22022195, 25694904, 22063259, 13976368, 6484468, 2280474, 1003443, 1096749, 876492, -1157026, -4981440, -7836912, -6154742, 261941, 7105622, 9794721, 8077763, 5258863, 3684958, 2776302, 1345282, -85429, -133818, 1226694, 2073062, 32877, -5407616, -11585086, -14208509, -11395864, -6050783, -3079104, -4149586, -6214374, -5382218, -1401498, 1939441, 454459, -6134727, -13049687, -14306550, -8649073, -1126304, 1975281, -1132021, -7763394, -14580830, -19263290, -19878340, -15745414, -8898738, -2372090, 2868160, 7349659, 10390282, 10867119, 10050568, 10118673, 9869274, 5826404, -1706067]
3577a706067o064662j607789K99244q54118r91601N37007m759l120238l934727
3568a7447710O2151M360208L730126m48842k417723O14532N942401Q819339O765486
3559I979968J548564k170720j248786K565306M814265L387110m26789m947870
3551A3501048r117089j0807490p783195j367986L635221M006529J342951l90825
3543f980836R59050M140887N853680M213530J641824K216506M946387L770559
3535B0761587k544491n781691J59529P832312N722013l590116o385437O79942
3527A6853648M802999k777799j2648063j1362395q64373O008403L896992r41095
3519B968317k129150k44136R68959o96122m553495o435287j550961Q334245J4038409
$$ y = [-1706067, -7770729, -9378518, -9079274, -9933392, -10924993, -10387986, -10392745, -13512983, -17447710, -17385559, -13025351, -9295225, -9744067, -12161790, -11547258, -5604857, 3214482, 9979968, 11528532, 9357812, 8109026, 10674332, 15488597, 18875707, 18448918, 13501048, 4383959, -6423531, -14206726, -15574712, -11939491, -7932962, -6590011, -6980836, -6021786, -1880899, 3972781, 8186311, 9828135, 12044641, 16991028, 20761587, 18217096, 12435405, 12594934, 20427246, 26149259, 22559143, 16173706, 16853648, 21656647, 18878848, 6230785, -5131610, -5995983, 12420, 3909412, 2968317, 839167, 595031, 1563990, 867868, -3685627, -10120914, -11671875, -3337630, 10700779]
3510A0700779R924817J877770j224534J8764j418634o601422r370610o298055
3502b391125n31244L972858N585234K964648l423572p902306m483996M159247
3494b050256Q795484N515147l32059k895579k490588j940056j792304j538489
3486A271300j568823k077313k811518m063713m940075k103878N263863J1053949
3478B3792Q826507J657488j496957J297076L419719J377437n28409Q53153K282690
3469A7712496J212026O73078L009709N036379L449520l97406m204837p360416
3461A9130549p400675j179356P028143O890684l311446j1472303p721353J916458
3453C880701N839277L724740L159441M696941J698484o775196j3293406j2710893
$$ y = [10700779, 20625596, 22503366, 21278832, 21297596, 19878962, 13277540, 3906930, -2391125, -2922369, 1050489, 6635723, 9600371, 6176799, -1725507, -6209503, -2050256, 6745228, 12260375, 11928316, 9032737, 6542149, 4602093, 2809789, 1271300, -297523, -2374836, -5186354, -9250067, -14190142, -16294020, -11030157, 23792, 8850299, 10507787, 9010830, 10307906, 13727625, 15105062, 14576653, 15429806, 17712496, 18924522, 19597600, 22607309, 27643688, 31093208, 30695802, 26490965, 19130549, 11729874, 10550518, 17578661, 24469345, 21157899, 9685596, 1964243, 3880701, 9719978, 13444718, 16604159, 21301100, 22999584, 16224388, 2930982, -9779911]
3445i779911p575941k537782N367j043132m348713m632046J255028P545202N857177
3436a5254751k194427o280986j698121N257311P668881O235451M551673K998986
3428A284017J013588J20755J004236J554119O42977m065q77k026449o516044q735493
3418a1663236m727946K748539P425649O466521J877047k556697l518663M2184
3410c906602M837824N138971p80479p790406r523828n264086L95978K970287J543541
3401a2378800j413323k144403R07531M683205M558999O68657j625166Q68699M404503
3392a470098L646966p00719l206369j492250R98131M19235k198572k724962L56516
3383f372122M003385M706172K902874J565013J255339k55777k837799k536463
$$ y = [-9779911, -17355852, -19893634, -19888267, -20931399, -25280112, -29912158, -28657130, -21111928, -15254751, -17449178, -23730164, -25428285, -20170974, -12502093, -6266642, -1714969, 1284017, 2297605, 2418360, 3422596, 4976715, 5619692, 5615627, 5614750, 3588301, -2927743, -11663236, -16391182, -13642643, -6216994, 249527, 2126574, -430123, -3948786, -3906602, 931222, 6070193, 5289714, -2500692, -12024520, -17288606, -16892628, -13922341, -12378800, -13792123, -15936526, -15028995, -10345790, -5786791, -5118134, -6743300, -5874601, -1470098, 2176868, 1476149, -1730220, -3222470, -2224339, -1805104, -4003676, -6728638, -6372122, -2368737, 2337435, 5240309, 6805322, 8060661, 7804884, 4967085, 2430622]
3375B430622J957683N190508K044901l693878l893875J979895O158230M156717
3367A6330803J61220j120885j290559l244792m925565k999787R54115K783058
3359F647608J885493Q22794O03214O6600j246372k606041l514783l545271k049126
3350b935884M85858K498139L658666M630145M171849M92499l761985l363349P50718
3341F626656J128155m334974p518234k691806L459219K629118j016531J452780
3333b65617O730867L642112o643131r572283K51098R213226M539713p122337j0580158
3324i806510l593019L307280L757913J345051L8080j066737k365571j283748K205737
3315g461524L565590J28060m649805n879025k966743J336359M649786N691306
$$ y = [2430622, 4388305, 9578813, 11623714, 7929836, 4035961, 6015856, 12174086, 16330803, 16492023, 15371138, 14080579, 10835787, 5910222, 2910435, 3864550, 6647608, 8533101, 9355895, 9959109, 10025709, 8779337, 6173296, 2658513, -886758, -2935884, -2450026, 48113, 3706779, 8336924, 12508773, 13001272, 9239287, 5875938, 6626656, 7754811, 3419837, -4098397, -6790203, -3330984, -701866, -1718397, -265617, 6465250, 10107362, 3464231, -6108052, -5856954, 3356272, 7895985, 773648, -9806510, -13399529, -10092249, -6334336, -4989285, -4951205, -6017942, -8383513, -9667261, -7461524, -3895934, -3767874, -8417679, -14296704, -17263447, -15927088, -11277302, -5585996]
3307e585996L854105L00581k201408k238969j140659l26351P24360K356024K758334
3298a499979N33852k099333j470872K329180M711104J738910n197746j0431635
3290a1386519r319662k685109L556105L849011j081749m543988j305951O124523
3282a6793339J0363161P643367J189827l668651m871892l360293n20605J914577
3274h103848J558551k183617o158888o283660k017188L550443P242143P673631
3266d722433M845917N21932j645280O78521N106633O867939M411587O598m631182
3257A1440232r278744j1568929p622653J292733P350453N315787k09106j128400
3249d408627L000895N281931J835459l483504n239760k698316J469234M917228
$$ y = [-5585996, -1731891, -1431310, -3632718, -5871687, -7012346, -7338697, -6614337, -4258313, -1499979, -966127, -3065460, -4536332, -2207152, 2503952, 4242862, -954884, -11386519, -20706181, -23391290, -19835185, -15986174, -17067923, -21611911, -22917862, -16793339, -6430178, 1213189, 2403016, -1265635, -6137527, -9497820, -10018425, -8103848, -6545297, -8728914, -14887802, -21171462, -23188650, -19638207, -12396064, -4722433, 123484, 645416, -999864, -321343, 4785290, 11653229, 16064816, 16071414, 11440232, 2161488, -9407441, -17030094, -15737361, -8386908, -3071121, -3280227, -4408627, -1407732, 3874199, 5709658, 2226154, -3013606, -5711922, -4242688, 674540]
3241F74540N971406L292380j996362n459496l340439K746997O699976L901693
3233A2490695l917090r721270p564795J211912Q724266Q755781L474510p3206
3225A3380803O39138J280689j586551m617152k729254K666833M966812J436840
3217A5438158l215280l495645l9431K296704J001874k148751m568612n387474
3209a18457m550658j961651J663971M807747O685111P303468N802078J097903
3201B0729512m921355p606030m925007l43924J912698J980919J846398O62044
3193I335255k789067n134630k062090L618766M351425o08411l045117J821763
3185E487894P482014N611545j950711o850649o148003l939760l043723j662774
$$ y = [674540, 6645946, 9938326, 7941964, 2482468, -857971, 1889026, 8589002, 12490695, 8573605, -1147665, -8712460, -7500548, 1223718, 9979499, 13454009, 13380803, 14019941, 15300630, 13714079, 9096927, 6367673, 9034506, 14001318, 15438158, 12222878, 8727233, 8687802, 10984506, 11986380, 9837629, 5269017, -118457, -4669115, -6630766, -4966795, -159048, 6526063, 13829531, 19631609, 20729512, 15808157, 8202127, 3277120, 2933196, 4845894, 6826813, 8673211, 9335255, 6546188, 1411558, -650532, 2968234, 7319659, 6711248, 3666131, 5487894, 12969908, 18581453, 16630742, 9780093, 3632090, -307670, -3351393, -5014167]
3177e014167J701555N186703O126362L446382k046035p004129o930576j740205
3169f274110K298043M70027l124378j691570L430424N172384K459653J184891
3161C925364L242516L499137p5389j951905J181078L977475J338364k770531j995225
3152A0370884K031968L270402J569340J521282K782217l39051q611438j3910750
3144a315146q852908L112819J0655274O976639k639712o737876j070816O095443
3136F223717M595146l814116p807384k672634L243805J500343m259171n276572
3128h266866j341852M75682k258150m843080l872205q95619K181803M850720N232440
3119h737127J990783j010725J300284O398838O823991K364134R15393M836665
$$ y = [-5014167, -3312612, 1874091, 8000453, 11446835, 9400800, 2396671, -4533905, -6274110, -3976067, -3506040, -6630418, -8321988, -4891564, 280820, 2740473, 3925364, 7167880, 10667017, 10591628, 8639723, 9820801, 13798276, 15136640, 12366109, 10370884, 12402852, 15673254, 17242594, 18763876, 21546093, 21207042, 12595604, -1315146, -10168054, -7055235, 3600039, 10576678, 7936966, 1199090, 128274, 6223717, 10818863, 7004747, -802637, -3475271, -231466, 1268877, -2990294, -8266866, -9608718, -9133036, -11391186, -16234266, -20106471, -21002090, -18820287, -13969567, -8737127, -6746344, -7757069, -6456785, -57947, 6766044, 9130178, 10045571, 14882236]
3111A4882236N968500p15317p517663n772359J10886J4051n457483o898624k285874
3102g671647L06363k797397m599185K43349N929692M701503j067516l380872j091781
3093i427491p1454k657329m516213k672070k47622q61147k963740k767758K64495
3084b5920329L805402O471343Q399579R111315P314127K796195k720440o429184
3076B828008n951134j410553L441139M154586P97578j816814m99534K315001L091978
3067F950255K655182L417589L683955j03145o362687r098593o057608j120169
3059f035221K281072M702896N955917K845132m554875r332187n634025K934303
3051f836988P822260O306821K851928J208891L28483j915720n161107p387732
$$ y = [14882236, 20850736, 20135419, 12617756, 6845397, 6956283, 6970334, 1512851, -5385773, -7671647, -7365284, -10162681, -14761866, -14518517, -8588825, -3887322, -4954838, -8335710, -9427491, -9498945, -12156274, -16672487, -19344557, -19592179, -20453326, -23417066, -26184824, -25920329, -22114927, -15643584, -7244005, 1867310, 9181437, 11977632, 9257192, 2828008, -3123126, -4533679, -1092540, 3062046, 3859624, 2042810, 1543276, 3858277, 6950255, 9605437, 13023026, 16706981, 16603836, 10241149, 1142556, -4915052, -6035221, -3754149, 948747, 6904664, 9749796, 5194921, -4137266, -9771291, -6836988, 985272, 7292093, 10144021, 11352912, 11681395, 9765675, 4604568, -2783164]
3043b783164o768869l009097J173363J683428j107493r63733N451602J1433034
3035E109071Q313162j172338n734792j907786J525254j753118n651916k418657
3027c691120M238565N223604N33287j688050J383687M027976K627803P87999J300754
3018A4744505Q23818k970820n370259j865480L047221J495183n559082r252938
3010d907852n827870j123424o1045R27948O114432J1072395Q478932L91086l471277
3001A1593325K48384L953934Q33035n535968p444129l885073j71363j5352k683599
2992c106806n667415o046318j587641N426348Q211920L899040j134360J46661
2984A41429M838938N246674J613547L40598R61442l597210j2220126j3444922
$$ y = [-2783164, -9552033, -12561130, -11387767, -9704339, -10811832, -11775565, -6323963, 5109071, 13422233, 12249895, 6515103, 4607317, 6132571, 4379453, -1272463, -3691120, 547445, 5771049, 6304336, 4616286, 5999973, 10027949, 12655752, 13443751, 14744505, 15568323, 12597503, 7227244, 5361764, 8408985, 9904168, 4345086, -4907852, -10735722, -11859146, -11920191, -10992243, -4877811, 6194584, 14673516, 15064602, 11593325, 11841709, 15795643, 16628678, 11092710, 3648581, -236492, -407855, -423207, -3106806, -8774221, -14820539, -16408180, -10981832, -2769912, 1129128, -5232, 141429, 4980367, 10227041, 11840588, 12181186, 13142628, 9545418, -2674708, -16119630]
2976a6119630l245001O539178N540186M87721K992285J0099665J0222712L219094
2968A9736210k32107K199267R93730p213934j2083570n828685M299075P331480
2960I201466L615768L95757n57399j939554k574374N82918M750356M116726q63634
2951A6728030m290290m032585l173766k961186j631646l86014k891851p328103
2943i967411o339951K072289J0054103J0129271M495325j38764k016998l420807
2935D867057m197874k255422J474093L977259M909192N605152M553800p29982
2927A8203275p472524q853911k866249M504460O797858M047621K75849k344066
2919A2292313l924822m106380k287486L64002J687428J009086o22236k043894
$$ y = [-16119630, -19364631, -12825453, -7285267, -6797546, -3805261, 6294404, 16517116, 19736210, 19504103, 21703370, 22697100, 15483166, 3399596, -2429089, 1869986, 9201466, 12817234, 13212991, 12655592, 10716038, 8141664, 8724582, 13474938, 17591664, 16728030, 12437740, 8405155, 5231389, 2270203, 638557, 252543, -2639308, -9967411, -16307362, -14235073, -4180970, 5948301, 10443626, 10304862, 8287864, 4867057, 669183, -1586239, -112146, 3865113, 8774305, 14379457, 18933257, 18203275, 10730751, 1876840, -989409, 3515051, 10312909, 14360530, 14636379, 12292313, 8367491, 4261111, 1973625, 2337627, 4025055, 5034141, 4411905, 2368011]
2911B368011k648847k253385j314884m03719J155532M493620Q073045P624551
2903A7093924J444116n902493q033468m163972P18311K683399K650112K794166
2895I284095K498909Q7933l349425m569222k275772J299988L026636J667905j967181
2886E703866n909920p356482l965065L167771Q616787P187685j43321o788899
2878E12422p802118m649451j774707q93118q99563j265807k146211k123260N52450
2869b0489363M568293O679970O362796N974068N967585L873932o60105l648255
2861H628921j919555K312762M353626K352252k008150n795804o203669k324773
2853f04390K633676L713192O53233j176976J580431N392004N525612K815289Q43118
$$ y = [2368011, -280836, -2534221, -3849105, -4252824, -3097292, 1396328, 9469373, 17093924, 18538040, 12635547, 4602079, 438107, 1156418, 3839817, 6489929, 9284095, 11783004, 11870937, 8521512, 3952290, 1676518, 2976506, 6003142, 7671047, 5703866, -206054, -7562536, -11527601, -8359830, 256957, 7444642, 7301321, 512422, -7289696, -11939147, -13713854, -14606972, -15506535, -16772342, -18918553, -21041813, -20489363, -15921070, -9241100, -2878304, 3095764, 9063349, 12937281, 12277176, 8628921, 6709366, 9022128, 13375754, 15728006, 13719856, 7924052, 1720383, -604390, 2029286, 5742478, 6395711, 5218735, 6799166, 12191170, 17716782, 20532071, 21375189]
2844B1375189k38695k442344n098709n986046n301078m238771j939946J684017
2836b186383K865708r01902n184598m070684Q39027L411795K876181L183981L973646
2827D806771J017473m154076m341738J594057N720833K902104k123861l192534
2819B229029r17923J608943M180797N818319K664428m832333q854839m633007
2811b736586J500020J188929l546192m350818O00454N444521O321470N095471
2803I517269M098849L103360J575484k19261j937891k370700j42906K338639j75617
2794A5787226p090681r439064j893396P626232P946644M08247m033091j005235
2786H306882L225126L041193j54547l172868m474979j968162M560484Q468020
$$ y = [21375189, 21136494, 18694150, 13595441, 7609395, 2308317, -1930454, -3870400, -2186383, 679325, -222577, -5407175, -9477859, -8638832, -5227037, -2350856, 833125, 4806771, 5824244, 1670168, -2671570, -1077513, 4643320, 7545424, 5421563, 2229029, 1311106, 2920049, 7100846, 12919165, 15583593, 10751260, 1896421, -2736586, -1236566, -47637, -3593829, -7944647, -7344193, -1899672, 4421798, 9517269, 13616118, 16719478, 18294962, 18075701, 16137810, 13767110, 13624204, 15962843, 15787226, 8696545, -742519, -2635915, 4990317, 12936961, 13345208, 9312117, 8306882, 11532008, 14573201, 14418654, 11245786, 6770807, 4802645, 9363129, 17831149]
2778A7831149K580258q405506j1433066l443165L807225J513367l722057k081699
2770c353494L636967L802351k184329o007203l990133j190874j869462l572160
2762a4728337k560972L25731J756111P30953p15503l30409J740375K953519J588394
2753i240138k36451R33475M054560M028245k77710k941969L55610M721511K824106
2744D221239l275536m187642K861671R229395O755009j103879m626289r65171
2736H908797L545806L332409L10385j049196r30521k454622m993907m285908M03110
2727B786353L897114K058503k555230m928563m328528l077308j287225K375252
2719e059632O170328O613531L922854J554638O22101n67479j772902q80925J187161
$$ y = [17831149, 20411407, 12005901, 572835, -2870330, 936895, 2450262, -1271795, -3353494, 283473, 4085824, 1901495, -4105708, -8095841, -9286715, -11156177, -14728337, -17289309, -16963578, -15207467, -14476514, -15192017, -15522426, -13782051, -10828532, -9240138, -9476589, -8543114, -4488554, -460309, -738019, -3679988, -3324378, 1397133, 4221239, 945703, -3241939, -380268, 8849127, 15604136, 14500257, 9873968, 8908797, 12454603, 15787012, 16097397, 15048201, 14117680, 11663058, 6669151, 2383243, 2786353, 6683467, 8741970, 6186740, 1258177, -3070351, -6147659, -7434884, -5059632, 1110696, 7724227, 11647081, 13201719, 13823820, 13256341, 11483439, 10602514, 11789675]
2710A1789675J185376m67750m53487J61979l300146r339288r480163j070325P038490
2701c935639O932095K366568N08821J38377l251364o407923k933073M249872N935397
2692C603131J286321j025208K722743N649073J995256m077562n737655k940429
2684A475670j47763L03066j575691n481025r125066q186924j873388M405962N405176
2675a4799983K485922N25416R76696J541999R10588K93051R08384K349522L078394
2666a730011J483702k384813n547746m588041j30662L603180M327029L578333
2658a389029K332473p97373m823743m680426J764198Q735906R211913L729600
2650A4083519k027017n523797p669182p189603j784319N316712O881392J423290
$$ y = [11789675, 12975051, 12507301, 12053814, 12215793, 8915647, -423641, -9903804, -10974129, -3935639, 2996456, 5363024, 5871845, 6010222, 2758858, -3649065, -6582138, -2332266, 3603131, 4889452, 3864244, 6586987, 12236060, 14231316, 10153754, 4416099, 1475670, 1327907, 1630973, 55282, -5425743, -14550809, -22737733, -24611121, -20205159, -14799983, -12314061, -11788645, -10811949, -9269950, -8359362, -8066311, -7157927, -4808405, -1730011, -246309, -2631122, -8178868, -12766909, -12897571, -9294391, -4967362, -1389029, 943444, 146071, -4677672, -9358098, -7593900, 1142006, 10353919, 14083519, 12056502, 6532705, -1136477, -8326080, -10110399, -4793687, 2087705, 3510995]
2642C510995m184216l915891N09356M155877N385817M866287K580419l93065q22220
2633A1693359J897649L126250m71158m711760l457052J784963L867776Q37268
2625A4567295j589492P47028M629542N169062K507328k32602j984931l391862
2617B0421368m078142l451028k379806j579314k43856J416522O36921l957156
2609F785509q842763r278212n067731K64339M307059O371575N135628K58136m373594
2600d440054l850499Q45837L536603J449377j174254N1944L054137K539166k554120
2591e41863p794327q365652l403446L956078R237300R773141O312482J605168
2583A0778881k358793n079080o348578n930709m023796n79477M934477J1156328
$$ y = [3510995, -673221, -4589112, -4079756, 76121, 5461938, 10328225, 12908644, 12515579, 11693359, 13591008, 16717258, 16246100, 11534340, 8077288, 9862251, 13730027, 14567295, 12977803, 13724831, 18354373, 23523435, 26030763, 25798161, 23813230, 20421368, 16343226, 12892198, 10512392, 8933078, 8689222, 10105744, 10742665, 6785509, -2057254, -11335466, -16403197, -16138858, -11831799, -5460224, -324596, -66460, -4440054, -8290553, -7444716, -3908113, -2458736, -3632990, -3581046, -526909, 2012257, -541863, -8336190, -16701842, -20105288, -16149210, -6911910, 2861231, 9173713, 10778881, 8420088, 3341008, -3007570, -8938279, -12962075, -13541552, -8607075, 2549253]
2575B549253J3600094Q943179o6369p157398r480568q800283o840732l933244
2567a1186068j890586k992483n377259m364161O88285N683942Q483222J0476265
2559d78843J0709337N811867j848206l974717J387643N230876J159642l968644
2551A4028955j000833O258395O773710n16999n816091l719199L98600J42284l890412
2542A2658410p610013q541150n863391n52983L691007M225936L758631N885350
2534G651797P845868M381908k295882m488646j160719N75667k260079l708711
2526F541203K74166M588352L631182O7534q78815r9832j262500l266966k549546
2517G044778j3374K94507k303732m806702n340548m222191j698071J656378L659634
$$ y = [2549253, 16149347, 25092526, 25026157, 17868759, 8388191, -412092, -7252824, -11186068, -13076654, -16069137, -21446396, -25810557, -25122272, -19438330, -10955108, -478843, 10230494, 16042361, 14194155, 10219438, 11607081, 16837957, 17997599, 14028955, 13028122, 19286517, 26060227, 25543228, 19727137, 16007938, 16406538, 16548822, 12658410, 5048397, -3492753, -9356144, -9909127, -6218120, -1992184, 1766447, 7651797, 15497665, 19879573, 17583691, 13095045, 11934326, 12509993, 10249914, 6541203, 6815369, 11403721, 15034903, 15102437, 14223622, 14123790, 12861290, 9594324, 7044778, 7031404, 7325911, 5022179, 215477, -5125071, -9347262, -11045333, -9388955, -5729321]
2508e729321L010826J714784K088459L011585K179553L62293J37408J726319L246961
2499A1748867L993253M397835L585588O7193n140369q353870o624212n42065N937296
2490I069516Q333516N586418J137735j588998l749231p675462j0021072m464431
2482c372009P294957J3989995Q397035k889293q483175o517847l723170l631919
2474A064574l232605m93925J880531J572179L41627O11086J790265J801697J32503
2465E467932j845540k462359j419957m93776j628650l694840l239474K99260L100216
2456e917188K855430K586473M946430O247236J648487n831237p955001k799393
2448d218763K561021K413363j3938J588540P031426R982327O529382q7514l874614
$$ y = [-5729321, -2718495, -1003711, 1084748, 4096333, 6275886, 6638179, 6775587, 8501906, 11748867, 15742120, 20139955, 23725543, 23792736, 18652367, 10298497, 3674285, 3132220, 9069516, 17403032, 22989450, 24127185, 22538187, 18788956, 11113494, 1092422, -3372009, 3922948, 17912943, 26309978, 23420685, 14937510, 8419663, 4696493, 1064574, -2168031, -2661956, -781425, 790754, 1132381, 1743467, 3533732, 5335429, 5467932, 3622392, 1160033, -259924, -753700, -2382350, -6077190, -9316664, -9017404, -5917188, -3061758, -475285, 4471145, 10718381, 12366868, 6535631, -1419370, -4218763, -1657742, 755621, 741683, 2330223, 9361649, 19343976, 25873358, 25785844, 21911230]
2439B1911230l157630j500095j872358k407619j05133L128036K434461k023199
2431A6407693m234871j412315J296956j199612n764318n758751o08891M594064
2423C319955O442628M849052j30257o896268r485545l219896O881842J0090635
2415A1852146L556190m052381m329521Q71157L968624J830973k077387l388099
2407H231702j772220o72963k897497o285975n249148J748066Q574032Q504214
2399A0180211K766402k076990l212593k842688j950113P92759L907684L291574
2391A0856246j188196m665837m258785k296205j549355k103221l799885o503749
2383a5508987o977425j330321P803080J2359652R134476L263952n03232l508867
$$ y = [21911230, 18753600, 17253505, 15381147, 12973528, 12868395, 15996431, 18430892, 16407693, 12172822, 10760507, 12057463, 10857851, 5093533, -665218, -1274109, 3319955, 9762583, 14611635, 14481378, 7585110, -1900435, -5120331, 1761511, 11852146, 15408336, 11355955, 7026434, 7897591, 11866215, 13697188, 11619801, 8231702, 6459482, 5786519, 2889022, -3396953, -8646101, -6898035, 1675997, 10180211, 12946613, 10869623, 7657030, 4814342, 2864229, 3656988, 7564672, 10856246, 9668050, 5002213, 743428, -1552777, -3102132, -5205353, -9005238, -15508987, -22486412, -23816733, -16013653, -3654001, 5480475, 8744427, 8241195, 4732328]
2375D732328p245233q519195n112001o83567Q60596J214248L257043N365737M992741
$$ y = [4732328, -2512905, -11032100, -16144101, -16827668, -15967072, -14752824, -11495781, -6130044, -1137303]
$$ [...]
##END NTUPLES=NMR SPECTRUM
##END=
