##TITLE=31Pdec_DE-79H2
 D2O, 64 sc
 5.2.2025
##JCAMPDX= 6.0         $$ Bruker NMR JCAMP-DX V2.0
##DATA TYPE= NMR SPECTRUM
##DATA CLASS= NTUPLES
##ORIGIN= UXNMR, Bruker Analytische Messtechnik GmbH
##OWNER= root
$$ XWIN-NMR		Version 3.5
$$ Wed Feb  5 16:13:14 2025 Russian Standard Time (UT+4h)  she@DPX200
##.OBSERVE FREQUENCY= 81.013821
##.OBSERVE NUCLEUS= ^31P
##.ACQUISITION MODE= SIMULTANEOUS
##.ACQUISITION SCHEME= undefined
##.AVERAGES= 64
##.DIGITISER RES= 17
##SPECTROMETER/DATA SYSTEM= spect
##.PULSE SEQUENCE= zgpg30
##.SOLVENT NAME= CDCl3
##.SHIFT REFERENCE= (INTERNAL, CDCl3, 0, 198.062)
##AUDIT TRAIL= $$ (NUMBER, WHEN, WHO, WHERE, WHAT)
$$ ##TITLE= Audit trail, XWIN-NMR		Version 3.5
$$ ##JCAMPDX= 5.01
$$ ##ORIGIN= Bruker BioSpin GmbH
$$ ##OWNER= she
$$ F:/spectra/data/she/nmr/P31/2/pdata/1/auditp.txt
$$ ##AUDIT TRAIL=  $$ (NUMBER, WHEN, WHO, WHERE, WHAT)
(   1,<2025-02-05 16:12:13.81 +0400>,<she>,<DPX200>,
      <created by zg, POWCHK disabled, PULCHK disabled
       configuration hash MD5:
       00 E9 B6 7A A2 85 ED C7 34 08 36 98 17 FE 4E 26
       data hash MD5: 32K
       94 58 21 C8 47 2D C0 F5 98 23 45 9B 6E 03 0E 2B>)
(   2,<2025-02-05 16:12:16.54 +0400>,<she>,<DPX200>,
      <Start of raw data processing
       efp BC_mod = 2 LB = 1.5 FT_mod = 6 PKNL = 1 PHC0 = 1212.113 PHC1 = 1369.295 SI = 64K 
       data hash MD5: 64K
       A1 D1 AE D2 4D 05 29 42 09 1C DC E3 7C A0 8B 98>)
(   3,<2025-02-05 16:12:48.03 +0400>,<she>,<DPX200>,
      <pk PHC0 = 8.400008 PHC1 = 0 
       data hash MD5: 64K
       13 2D 1E 9E C4 46 6C 25 BC 00 A5 DE AA 1E A2 7E>)
$$ ##END=
$$ 
$$ hash MD5
$$ 01 BD 79 FA 13 9C 2A B8 25 D2 FE 0D C4 E8 9A AE
##$RELAX= 
##$RELAX= 
##$RELAX= 
##$RELAX= 
##$RELAX= 
##$RELAX= 
##$RELAX= 
##$RELAX= 
$$ Bruker specific parameters
$$ --------------------------
##$DU= <F:/spectra>
##$EXPNO= 2
##$NAME= <P31>
##$PROCNO= 1
##$TYPE= <nmr>
##$USER= <she>
##$AMP= (0..31)
100 100 100 100 100 100 100 100 100 100 100 100 100 100 100 100 100 100 
100 100 100 100 100 100 100 100 100 100 100 100 100 100 
##$AQSEQ= 0
##$AQ_mod= 1
##$AUNM= <au_zg>
##$AUTOPOS= <>
##$BF1= 81.014009
##$BF2= 200.13
##$BF3= 200.13
##$BF4= 200.13
##$BF5= 200.13
##$BF6= 200.13
##$BF7= 200.13
##$BF8= 200.13
##$BYTORDA= 1
##$CFDGTYP= 0
##$CFRGTYP= 5
##$CHEMSTR= <none>
##$CNST= (0..31)
1 1 145 1 1 1 1 1 1 1 1 1 1 1 1 1 1 1 1 1 1 1 1 1 1 1 1 1 1 1 1 1 
##$CPDPRG= <waltz16>
##$CPDPRG1= <>
##$CPDPRG2= <waltz16>
##$CPDPRG3= <>
##$CPDPRG4= <mlev>
##$CPDPRG5= <mlev>
##$CPDPRG6= <mlev>
##$CPDPRG7= <mlev>
##$CPDPRG8= <mlev>
##$CPDPRGB= <>
##$CPDPRGT= <>
##$D= (0..31)
0 1 0 0 0 0 0 0 0 0.06 0 0.03 2e-05 3e-06 0 0 0.0002 0 0 0 0 0 0 0 0 0 
0 0 0 0 0 0 
##$DATE= 1738757533
##$DBL= (0..7)
120 120 120 11 120 120 24 19 
##$DBP= (0..7)
150 150 150 150 150 150 150 150 
##$DBP07= 0
##$DBPNAM0= <>
##$DBPNAM1= <>
##$DBPNAM2= <>
##$DBPNAM3= <>
##$DBPNAM4= <>
##$DBPNAM5= <>
##$DBPNAM6= <>
##$DBPNAM7= <>
##$DBPOAL= (0..7)
0.5 0.5 0.5 0.5 0.5 0.5 0.5 0.5 
##$DBPOFFS= (0..7)
$$ [...]
##$SUBNAM2= <"">
##$SUBNAM3= <"">
##$SUBNAM4= <"">
##$SUBNAM5= <"">
##$SUBNAM6= <"">
##$SUBNAM7= <"">
##$SUBNAM8= <"">
##$SUBNAM9= <"">
##$SW= 400.765351723535
##$SWIBOX= (0..15)
0 1 3 0 0 0 0 0 0 0 0 0 0 0 0 0 
##$SW_h= 32467.5324675325
##$TD= 32768
##$TD0= 1
##$TE= 0
##$TE2= 300
##$TE3= 300
##$TEG= 300
##$TL= (0..7)
0 120 53 12 22 120 120 120 
##$TP= (0..7)
150 150 150 150 150 150 150 150 
##$TP07= 0
##$TPNAME0= <>
##$TPNAME1= <>
##$TPNAME2= <>
##$TPNAME3= <>
##$TPNAME4= <>
##$TPNAME5= <>
##$TPNAME6= <>
##$TPNAME7= <>
##$TPOAL= (0..7)
0.5 0.5 0.5 0.5 0.5 0.5 0.5 0.5 
##$TPOFFS= (0..7)
0 0 0 0 0 0 0 0 
##$TUNHIN= 0
##$TUNHOUT= 0
##$TUNXOUT= 0
##$USERA1= <user>
##$USERA2= <user>
##$USERA3= <user>
##$USERA4= <user>
##$USERA5= <user>
##$V9= 5
##$VALIST= <valist>
##$VCLIST= <CCCCCCCCCCCCCCC>
##$VD= 0
##$VDLIST= <DDDDDDDDDDDDDDD>
##$VPLIST= <PPPPPPPPPPPPPPP>
##$VTLIST= <TTTTTTTTTTTTTTT>
##$WBST= 1024
##$WBSW= 4
##$XGAIN= (0..3)
0 0 0 0 
##$XL= 0
##$YL= 0
##$YMAX_a= 2909
##$YMIN_a= -4845
##$ZGOPTNS= <>
##$ZL1= 120
##$ZL2= 120
##$ZL3= 120
##$ZL4= 120
##$ABSF1= 0
##$ABSF2= 0
##$ABSG= 0
##$ABSL= 0
##$ALPHA= 0
##$AQORDER= 0
##$ASSFAC= 0
##$ASSFACI= 0
##$ASSFACX= 0
##$ASSWID= 0
##$AUNMP= <proc_1d>
##$AZFE= 0.1
##$AZFW= 0.5
##$BCFW= 0
##$BC_mod= 2
##$BYTORDP= 0
##$COROFFS= 0
##$CY= -3
##$DATMOD= 1
##$DC= 0
##$DFILT= <>
##$DTYPP= 0
##$F1P= 0
##$F2P= 0
##$FCOR= 1
##$FTSIZE= 65536
##$FT_mod= 6
##$GAMMA= 0
##$GB= 0
##$INTBC= 1
##$INTSCL= 9.790993e-09
##$ISEN= 30
##$LB= 1.5
##$LEV0= 0
##$LPBIN= 0
##$MAXI= 10000
##$MC2= 0
##$MEAN= 0
##$ME_mod= 0
##$MI= 50
##$NCOEF= 0
##$NC_proc= -9
##$NLEV= 6
##$NOISF1= 182.463
##$NOISF2= 159.3651
##$NSP= 0
##$NTH_PI= 0
##$NZP= 0
##$OFFSET= 198.0616
##$PC= 4
##$PHC0= 1220.513
##$PHC1= 1369.295
##$PH_mod= 1
##$PKNL= yes
##$PPARMOD= 0
##$PSCAL= 0
##$PSIGN= 0
##$REVERSE= no
##$SF= 81.0140089999434
##$SI= 65536
##$SIGF1= 159.3651
##$SIGF2= -187.1042
##$SINO= 113.3802
##$SIOLD= 16384
##$SREGLST= <1H.CDCl3>
##$SSB= 0
##$STSI= 65536
##$STSR= 0
##$SW_p= 32467.5324675325
##$SYMM= 0
##$S_DEV= 0
##$TDeff= 32768
##$TDoff= 0
##$TI= <>
##$TILT= no
##$TM1= 0
##$TM2= 0
##$TOPLEV= 0
##$USERP1= <user>
##$USERP2= <user>
##$USERP3= <user>
##$USERP4= <user>
##$USERP5= <user>
##$WDW= 1
##$XDIM= 65536
##$YMAX_p= 393885869
##$YMIN_p= -334035354
$$ End of Bruker specific parameters
$$ ---------------------------------
##NTUPLES= NMR SPECTRUM
##VAR_NAME=  FREQUENCY,     SPECTRUM/REAL,   SPECTRUM/IMAG
##SYMBOL=    X,             R,               I
##VAR_TYPE=  INDEPENDENT,   DEPENDENT,       DEPENDENT
##VAR_FORM=  AFFN,          ASDF,            ASDF
##VAR_DIM=   65536,         65536,           65536
##UNITS=     HZ,            ARBITRARY UNITS, ARBITRARY UNITS
##FACTOR=    0.49542278885378, 1,            1
##FIRST=     16045.7642231865, 0,            0
##LAST=      -16421.768244346, 0,            0
##MIN=       -16421.768244346, -334035354,   0
##MAX=       16045.7642231865, 393885869,    0
$$ Real data points
##PAGE= N=1
##DATA TABLE= (X++(R..R)), XYDATA
$$ [...]
7358a7773302N863908Q092590P997049L778567j899560m381632k409857J149244
$$ -17773302 -11909394 -3816804 4180245 7958812 6059252 1677620 -732237 417007
7350D17007L214419K733127j77066m222931o074594k757770M054146Q598035P076789
$$ 417007 3631426 6364553 6187487 1964556 -4110038 -6867808 -2813662 5784373 12861162
7341A2861162J367873l993071o394534n851720l538097j222913l67211j76482
$$ 12861162 14229035 10235964 3841430 -2010290 -5548387 -6771300 -7138511 -7314993
7333g314993J885695O083455Q544951N483465j711151p597318q401077m994299
$$ -7314993 -5429298 654157 9199108 14682573 12971422 5374104 -3026973 -8021272
7325h021272o32865K536663M517104O134514P201935O113258J772228m177032
$$ -8021272 -8654137 -6117474 -1600370 4534144 11736079 17849337 19621565 15444533
7317A5444533q243316q643444o886965n432445n002505m683552l404806q59076
$$ 15444533 7201217 -1442227 -8329192 -13761637 -18764142 -23447694 -26852500 -27711576
7309b7711576J892021K822235J552166Q96163L041828M861509J434598n305182
$$ -27711576 -25819555 -22997320 -21445154 -20548991 -17507163 -12645654 -11211056 -16516238
7301a6516238p052078p23265O034532N245197l25995k171898J571869N268605
$$ -16516238 -23568316 -24291581 -18257049 -13011852 -13337847 -15509745 -13937876 -8669271
7293h669271N001399K010112j753001m975684m751843K69774M815778K138549
$$ -8669271 -3667872 -1657760 -3410761 -8386445 -13138288 -12868514 -8052736 -5914187
7285e914187n307919p628923j252459O382212Q013896N038880J748599j414541
$$ -5914187 -11222106 -18851029 -20103488 -13721276 -5707380 -668500 1080099 -334442
7277c34442m291943l435136K168710P012000O309924K788901R77285l47561l846445
$$ -334442 -4626385 -8061521 -5892811 1119189 7429113 10218014 11195299 10847738 7001293
7268G001293o461490m004503N42829J244812n04294J869893Q502912J1735388
$$ 7001293 539803 -3464700 -2921871 -1677059 -2181353 -311460 8191452 19926840
7260A9926840P218766o24170n883456q014177r351065j0471313j0173482p101950
$$ 19926840 27145606 26521436 20637980 12623803 3272738 -7198575 -17372057 -24474007
7252b4474007q60646N713478O715057Q3551p058614n879573K074682P095916N606417
$$ -24474007 -25334653 -19621175 -12906118 -12822567 -19881181 -25760754 -23686072 -16590156 -10983739
7243a0983739M050460O569382P622584J947185n343814n718576Q9144L564913
$$ -10983739 -6933279 -363897 7258687 9205872 3862058 -1856518 -1767374 1797539
7235A797539N70889m325229n286888j943962J906326L004661J422425L92590K853683
$$ 1797539 2368428 -1956801 -7243689 -9187651 -7281325 -4276664 -2854239 -2461649 392034
7226C92034O931232O833350N58290n533138l665102M725425R539941M162569o228583
$$ 392034 7323266 14156616 14714906 9181768 5516666 10242091 19782032 23944601 17716018
7217A7716018j0753816n658485J696263K178475m014540q234252m968850J248802
$$ 17716018 6962202 1303717 2999980 5178455 1163915 -7070337 -12039187 -10790385
7209a0790385K773084o54057k792274n98620K482495L204381L116678M640943
$$ -10790385 -8017301 -8671358 -11463632 -12062252 -9579757 -6375376 -3258698 1382245
7201A382245O861595P449195N391108L21389o938973j1777448q864411n10012
$$ 1382245 8243840 15693035 21084143 21405532 14466559 2689111 -6175300 -6685312
7193f685312L525624j257158o854651m007362L903446N974416K28353m099558
$$ -6685312 -3159688 -4416846 -11271497 -15278859 -11375413 -5400997 -5172644 -9272202
7185i272202j249649K819058N61334n476625o939703k062641K459602J481462
$$ -9272202 -10521851 -7702793 -7141459 -12618084 -19557787 -21620428 -19160826 -17679364
7177a7679364k008729k103506J806399N276592N747597N308687N786036M795146
$$ -17679364 -19688093 -21791599 -19985200 -14708608 -8961011 -3652324 2133712 6928858
7169F928858k87533o597326q120784l494517K180186L846637J684267q35542j003744
$$ 6928858 6641325 43999 -8076785 -11571302 -9391116 -5544479 -3860212 -4695754 -5699498
7160e699498J813929N947051P751173N088220P65035r54151j025018l799457q190832
$$ -5699498 -3885569 2061482 9812655 14900875 15665910 14711759 13686741 9887284 1696452
7151A696452p392714N5180N753480K585433n217044q435930m626696J890609P305220
$$ 1696452 -5696262 -5641082 112398 2697831 -2519213 -10955143 -15581839 -13691230 -6386010
7142f386010R513531O049504k404897r318053r483976o139788m819726l859565
$$ -6386010 3127521 9177025 6772128 -2545925 -12029901 -18169689 -22989415 -26848980
7134b6848980J233147P286615O940305J324881n96278M085306Q261406O386476
$$ -26848980 -25615833 -18329218 -11388913 -10064032 -10660310 -6575004 1686402 8072878
7126H072878J383080k411663n014937o353268l698360K369678N878350L560105
$$ 8072878 9455958 7044295 2029358 -4323910 -8022270 -5652592 225758 3785863
7118C785863l13126p68049J432596L495106N204102O082504L335036l083985q051633
$$ 3785863 3472737 2704688 4137284 7632390 12836492 18918996 22254032 19170047 11118414
7109A1118414q068911o028234n318777m097662q3586L678191L436505J436910
$$ 11118414 3049503 -2978731 -8297508 -12395170 -12478756 -8800565 -5364060 -3927150
7101c927150K242191N048642N233690J701042k422007n094258o682126o734667
$$ -3927150 -1684959 3363683 8597373 10298415 7876408 2782150 -3899976 -10634643
7093a0634643l652212K158814P337959Q035841K930232m641569p832533l158594
$$ -10634643 -14286855 -12128041 -4790082 3245759 6175991 1534422 -6298111 -9456705
7085i456705L595392L409424l173965n958248j47256O445484N992063K321736
$$ -9456705 -5861313 -2451889 -5625854 -11584102 -11731358 -5285874 706189 3027925
7077C027925K555460M187347M61924o017386o187794O49834N469442L404482l25094
$$ 3027925 5583385 9770732 10232656 4215270 -1972524 -1322690 4146752 7551234 7226140
7068G226140J2902L153288N081368M170461K00144n791889r290976n986510R54737
$$ 7226140 7239042 10392330 15473698 19644159 19844303 14052414 4761438 -1225072 -270335
7059b70335L458121j21938k696155N46064N528511O631548M253600J260900k349205
$$ -270335 3187786 3065848 369693 915757 6444268 13075816 17329416 18590316 16241111
7050A6241111o750474q980173o967972l270606r10191Q88887L171165L556047
$$ 16241111 9490637 510464 -6457508 -9728114 -10638305 -9749418 -6578253 -3022206
7042c022206M85483k514829j744069N41494K5294k259000k035110N02670J097446
$$ -3022206 -2536723 -5051552 -6795621 -6254127 -6228833 -8487833 -10522943 -10020273 -8922827
7033h922827j028806j933889J15029J838891P27710r80165o09614L01932j056083
$$ -8922827 -9951633 -11885522 -11770493 -9931602 -9203892 -10184057 -10793671 -10491739 -11547822
7024a1547822l387343k364954L379260R979040J2430775R321316L073167k969378
$$ -11547822 -14935165 -17300119 -13920859 -3941819 8488956 17810272 20883439 17914061
7016A7914061o575919o739937l728755L07594K093601J64165l051903l431199
$$ 17914061 11338142 4598205 869450 1177044 3270645 3434810 382907 -3048292
7008c048292j2300L312368K146081k531409m473760L48545P319662P447308p34813
$$ -3048292 -3060592 251776 2397857 -133552 -4607312 -4258767 3060895 10508203 9773390
6999I773390p430808l925148M395111M645266m278568q536201L45417J1230562
$$ 9773390 2342582 -1582566 2812545 7457811 3179243 -5356958 -5011541 6219021
6991F219021Q322699n842363j3919794p997725J963515N181611L450194K690876
$$ 6219021 14541720 8699357 -5220437 -13218162 -11254647 -6073036 -2622842 68034
6983F8034J765203k249197n164031j545752M702958M819421j500997n597873k597724
$$ 68034 1833237 -415960 -5579991 -7125743 -2422785 2396636 895639 -4702234 -7299958
6974g299958K773532M486593K886973J372602L66298j595965l560112k803139
$$ -7299958 -4526426 -39833 2847140 4219742 4586040 2990075 -570037 -3373176
6966c373176Q23949L984694L961894K105195J680366K643914R61251n097614j0110603
$$ -3373176 -2549227 1435467 5397361 7502556 9182922 11826836 12788087 7690473 -2420130
6957b420130o959355L025165R897416O671082k812149r556201q892995j706928
$$ -2420130 -9379485 -6354320 3543096 10214178 7402029 -2154172 -11047167 -12754095
6949a2754095R025107J8183909J8727385Q295679n579265j2291380r826318n056637
$$ -12754095 -3728988 14454921 33182306 41477985 35898720 23607340 13781022 8724385
6941H724385l220415k689020p52832J031494j56548l662838o244156n800929k786989
$$ 8724385 5503970 2814950 2062118 3093612 2937064 -725774 -6969930 -12770859 -15557848
6932a5557848O25432K242767K105579K626627M705486N182315J339437l608134
$$ -15557848 -14932416 -12689649 -10584070 -7957443 -3251957 1930358 3269795 -338339
6924c38339m256385j609905k052380o730245q317845j621221P961920J1410349
$$ -338339 -4594724 -6204629 -8257009 -14987254 -23305099 -24926320 -16964400 -5554051
6916e554051P878746M084555L786194L567205l92762n806063o871984j695061
$$ -5554051 2324695 6409250 10195444 13762649 13369887 7563824 691840 -1003221
6908a003221M844339O064931J047751l901143k737795K386297L723883j413614
$$ -1003221 3841118 9906049 10953800 7052657 4314862 6701159 10425042 9011428
6900I011428o662547n303215P41574M137903J907770k149541l624271k041514
$$ 9011428 2348881 -2954334 -2212760 1925143 3832913 1683372 -1940899 -3982413
6892c982413O36248K484018J995696j107080m458908m631865j243200K010201
$$ -3982413 -3346165 -862147 1133549 26469 -4432439 -9064304 -10307504 -8297303
6884h297303J450326k206511m187350l50365P980262J3789814J0611328O8342
$$ -8297303 -6846977 -9053488 -13240838 -13591203 -5610941 8178873 18790201 18858543
6876A8858543q574127q088105p83161N549271O728743M100773l2757l867718m241980
$$ 18858543 10284416 2196311 1413150 6962421 13691164 17791937 17759180 13891462 9649482
6867I649482O15658N888389L744408n824477j3258982j1547446m901692j340920
$$ 9649482 10265140 16153529 19897937 14073460 814478 -10732968 -15634660 -16975580
6859a6975580j592785j017761J153605J418582p26359j771305m67035O06399K76542
$$ -16975580 -18568365 -19586126 -18432521 -17013939 -17740298 -19511603 -19978638 -19372239 -19095697
6850a9095697M09080J604431K322392L134774O417008J0342474R026051J391339
$$ -19095697 -18686617 -17082186 -14759794 -11625020 -5208012 5134462 14160513 15551852
6842A5551852n540501n834973k219982l39133k81841P17678J236506j812714n843383
$$ 15551852 10011351 4176378 1956396 1617263 1335422 2053100 3289606 1476892 -4366491
6833d366491m975797N23634L728221J020361l064504k989747K66406J586821j114015
$$ -4366491 -9342288 -8818654 -5090433 -4070072 -7134576 -10124323 -9857917 -8271096 -9385111
6824i385111m532359l804687K106440Q341752Q468254K066830m203678n250128
$$ -9385111 -13917470 -17722157 -15615717 -7273965 1194289 3261119 -942559 -6192687
6816f192687l826864m260427m070875J204419P631622O452356k170024q434529
$$ -6192687 -10019551 -14279978 -18350853 -17146434 -9514812 -3062456 -5232480 -13667009
6808a3667009p463039m804481m279792r65469P480398J2356531O088689m326920
$$ -13667009 -21130048 -25934529 -30214321 -31179790 -23699392 -11342861 -5254172 -9581092
6800i581092o547137p61132K547328j31575j676957K271193O896556P215542M732617
$$ -9581092 -16128229 -16889361 -14342033 -14473608 -16150565 -13879372 -6982816 232726 4965343
6791D965343K273536n08870l394369l634852r34078Q30449l56002j685404j002975
$$ 4965343 7238879 6730009 3335640 -299212 -1233290 -402841 -758843 -2444247 -3447222
6782c447222k81159r34625n73805K218622M088978J595714l354450n888123l676904
$$ -3447222 -3728381 -4663006 -5236811 -3018189 1070789 2666503 -687947 -6576070 -10252974
6773a0252974J865188P171667P998486K864060l516313m237655P18535L915755
$$ -10252974 -8387786 -1216119 6782367 9646427 6130114 1892459 2610994 6526749
6765F526749R13188l920819m929280k996118j656076m35268K536675N112640M079031
$$ 6526749 7439937 3519118 -1410162 -4406280 -6062356 -6497624 -3960949 1151691 5230722
6756E230722R56129l39701M80486J043638J035786J286450M13263k812289n907754
$$ 5230722 6186851 5847150 6327636 7371274 8407060 9693510 10106773 7294484 1386730
6747A386730o206498n452044n866915m712159R98678P185184P533549L612946
$$ 1386730 -4819768 -10271812 -16138727 -20850886 -19852208 -12667024 -5133475 -1520529
6739a520529J903005K120150j721934q248863p721346K352720J0722026P547805
$$ -1520529 382476 2502626 780692 -7468171 -15189517 -12836797 -2114771 5433034
6731E433034k114878p135594n883211m620111n091470l014646K723666P455504
$$ 5433034 3318156 -3817438 -9700649 -14320760 -19412230 -22426876 -19703210 -12247706
6723a2247706P495127L653087j725725n954276n070079K278957J0042521R952080
$$ -12247706 -4752579 -1099492 -2825217 -8779493 -13849572 -11570615 -1528094 8423986
6715H423986K385417l638312k582977J335117K135914L57088m50257n49926k296753
$$ 8423986 10809403 7171091 4588114 5923231 8059145 8416233 7965976 7416050 5119297
6706E119297m712737m867220k959786j520967p12639J219789L466728L058686
$$ 5119297 406560 -4460660 -7420446 -8941413 -9654052 -8434263 -4967535 -1908849
6698a908849n5311k415990k288504j709619k145328j838846N29738K752312K205788
$$ -1908849 -1964160 -4380150 -6668654 -8378273 -10523601 -12362447 -11832709 -9080397 -6874609
6689f874609m19762l026679n308019p000285n308271J541744R094039R842579
$$ -6874609 -7294371 -10321050 -15629069 -22629354 -27937625 -26395881 -17301842 -7459263
6681g459263K635982m918583n314144L69974M910659L795087o81265l102400p88485
$$ -7459263 -4823281 -9741864 -15056008 -14686034 -9775375 -5980288 -6661553 -9763953 -10552438
6672a0552438L758361N407756J898032l133418l973802K35105M535430M642126
$$ -10552438 -6794077 -1386321 511711 -2621707 -6595509 -6360404 -1824974 2817152
6664B817152J681410q18213j698908j755507j269583p32971j618510l419012k566693
$$ 2817152 4498562 3680349 1981441 225934 -1043649 -1776620 -3395130 -6814142 -9380835
6655i380835J947397M790014J300082m239859m184452Q8523K9074n189100n789652
$$ -9380835 -7433438 -2643424 -1343342 -5583201 -9767653 -9679130 -9650056 -14839156 -20628808
6646b0628808K334155Q469190K479631q305991q711645J990898R782356P185225
$$ -20628808 -18294653 -9825463 -7345832 -15651823 -24363468 -22372570 -12590214 -5404989
6638e404989K110995K408700L609927q64281o537534m603220L378820P273885
$$ -5404989 -3293994 -885294 2724633 1860352 -4677182 -9280402 -5901582 1372303
6630A372303K855512l946776o759252n252026j566538K813746N307088L472046
$$ 1372303 4227815 281039 -6478213 -11730239 -13296777 -10483031 -5175943 -1703897
6622a703897j73498J9709M372171O655075L430939j127802k691266l033577m471757
$$ -1703897 -1877395 -1857686 2514485 9169560 12600499 11472697 8781431 5747854 1276097
6613A276097l766634K153786Q480184P775548R27539m070155l505424j518865
$$ 1276097 -2490537 -336751 8143433 15918981 16846520 12776365 9270941 7752076
6605G752076k046089l486456k961453p67885J400397K782341K659758O68645j094776
$$ 7752076 5705987 2219531 -741922 -1509807 -109410 2672931 5332689 6001334 4906558
6596D906558J4121K562024K487227l16061j843726j285086k460332n904122o226244
$$ 4906558 4920679 7482703 9969930 9653869 7810143 6525057 4064725 -1839397 -8065641
6587h065641j329387K239393q80403n016831j121229Q949771J4177062R572674
$$ -8065641 -9395028 -7155635 -8036038 -13052869 -14174098 -5224327 8952735 18525409
6579A8525409J689181k072868k422402l537071n204484m122966j60084K908112
$$ 18525409 20214590 18141722 15719320 12182249 6977765 2854799 2694715 5602827
6571E602827K418474N3287m33690K081974M298299K198779l407021o978043n102881
$$ 5602827 8021301 8074588 7640898 9722872 14021171 16219950 12812929 5834886 732005
6562G32005j063818k44766k950153m905521l527649k60756K504540L442165J795563
$$ 732005 -331813 -576579 -3526732 -8432253 -11959902 -12220658 -9716118 -6273953 -4478390
6553d478390j775400m252928l317534p39216M06144O34442K184432L688150K006020
$$ -4478390 -6253790 -10506718 -13824252 -14563468 -14157324 -13522882 -11338450 -7650300 -5644280
6544e644280j233855j030143K597489M080393J648890L29348K673959L490818
$$ -5644280 -6878135 -7908278 -5310789 -1230396 418494 747842 3421801 6912619
6536F912619j157769n642633k336270O086942R238172K842162o239604r147248
$$ 6912619 5754850 112217 -2224053 3862889 13101061 15943223 9703619 556371
6528E56371m398224K614149N731526K694040l532948p248305n572458j515717
$$ 556371 -3841853 -1227704 4503822 7197862 3664914 -3583391 -9155849 -10671566
6520a0671566K7848j525977k501671m50987L165279N798244O777153O708842N637581
$$ -10671566 -10643718 -12169695 -14671366 -15122353 -11957074 -6158830 618323 7327165 12964746
6511A2964746K961437j087362m349793l995418j5714L323907J902346k673563
$$ 12964746 15926183 14838821 10489028 6493610 6477896 9801803 11704149 9030586
6503I030586n105892m054170l251372l937656k042725L748249P043993K618255
$$ 9030586 3924694 -129476 -3380848 -7318504 -9361229 -5612980 1431013 4049268
6495D049268m376510n223831n06860J902696j15880j006303J191938J282944k659292
$$ 4049268 -327242 -5551073 -6057933 -4155237 -4271117 -5277420 -4085482 -2802538 -5461830
6486e461830m386598n1887M031798J106061m429441l438498L391807O423617J845941
$$ -5461830 -9848428 -9900315 -5868517 -4762456 -9191897 -12630395 -9238588 -2814971 -969030
6477i69030l098925j766243K333734K098338j893043k460353L339582R519067
$$ -969030 -4067955 -5834198 -3500464 -1402126 -3295169 -5755522 -2415940 7103127
6469G103127Q333908o58356j0136242j2384462o312236K020370N203438J292730
$$ 7103127 15437035 14778679 4642437 -7742025 -14054261 -12033891 -6830453 -5537723
6461e537723m809843p043069m695133j850794q32760P18257M771472Q279280P345122
$$ -5537723 -10347566 -17390635 -22085768 -23936562 -24769322 -24051065 -19279593 -11000313 -3655191
6452c655191L869099K908806M060677J718923m638227p244346j452394N374867
$$ -3655191 213908 3122714 7183391 8902314 4264087 -2980259 -4432653 942214
6444I42214L059689o659784j2094484p200227K148536Q044125R588051R642652
$$ 942214 4001903 -2657881 -14752365 -21952592 -19804056 -11759931 -2171880 7470772
6436G470772Q669988N889012K730992J229038J137010J233148J305533Q53460
$$ 7470772 16140760 22029772 24760764 25989802 27126812 28359960 29665493 30518953
6428C0518953j532542n286317p049514n160935k362254j496781j300063M18903
$$ 30518953 28986411 23700094 16650580 11489645 9127391 7630610 6330547 6749450
6420F749450K064509O23805l077136n495005n513295m533759k551803J279119
$$ 6749450 8813959 9437764 6360628 865623 -4647672 -9181431 -11733234 -10454115
6412a0454115M458868K618374l511914p142380l886734K387245N210396M109584
$$ -10454115 -5995247 -3376873 -6888787 -14031167 -17917901 -15530656 -10320260 -6210676
6404f210676L608799N344253N858821K522465k562208o158539p864893q018868
$$ -6210676 -2601877 2742376 8601197 11123662 8561454 2402915 -5461978 -13480846
6396a3480846m879128K068497P982135O983266M92033l827636k385406L52577
$$ -13480846 -18359974 -16291477 -8309342 -1326076 -834043 -4661679 -7047085 -6694508
6388f694508R3423j067256m71757q49530m231597n097030J907593J0693090J0279524
$$ -6694508 -6601085 -7668341 -8140098 -8989628 -13221225 -18318255 -16410662 -5717572 4561952
6379D561952J743896k366064K686699O486382L88331q580053q770646j051379
$$ 4561952 6305848 3939784 6626483 13112865 13501196 4921143 -3849503 -4900882
6371d900882M640956M739879M036553M891523M237013J139752r87141q01045r61185
$$ -4900882 -259926 4479953 8516506 13408029 17645042 18784794 17797653 16996608 16035423
6362A6035423k458160k871449j571784j286929k858894l210588n38867K277257
$$ 16035423 13577263 10705814 9134030 7847101 4988207 1777619 1238752 3516009
6354C516009J475224k963095p625578q651421m472898K184644N771511L833820
$$ 3516009 4991233 2028138 -5597440 -14248861 -18721759 -16537115 -10765604 -6931784
6346f931784P2958j135727o09536q64927k39701L509107O687450M390029j21645
$$ -6931784 -6858826 -7994553 -8604089 -9469016 -9708717 -6199610 487840 4877869 4756224
6337D756224M07094M325444K380486o771651j2831468r155243j911025J034894
$$ 4756224 5163318 9488762 11869248 5097597 -7733871 -16889114 -18800139 -17765245
6329a7765245R90346J795672J205445k811747m585834Q68842P502827O293419
$$ -17765245 -16774899 -14979227 -13773782 -16585529 -21171363 -20302521 -12799694 -6506275
6321f506275k53942j975114K818772N455149J028863m928435n397997j66315O302307
$$ -6506275 -6760217 -8735331 -5916559 -461410 567453 -4360982 -9758979 -9925294 -3622987
6312c622987R384586O128037j819009p253367n149851l53169p79561m504065k753111
$$ -3622987 5761599 11889636 10070627 2817260 -2332591 -2685760 -3465321 -7969386 -10722497
6303a0722497M410780O488543m69614o441486l030787L327651K325372l603980
$$ -10722497 -6311717 176826 -292788 -6734274 -9765061 -6437410 -4112038 -7716018
6295g716018l981312K820288Q086936O781214L144350J380655n29418m748815
$$ -7716018 -11697330 -8877042 -790106 5991108 9135458 10516113 9986695 5237880
6287E237880q073931o635893j819416K179584L636109L062237O34001k542425
$$ 5237880 -2836051 -9471944 -11291360 -9111776 -5475667 -2413430 -1779429 -4321854
6279d321854k846651J809673P151309O286462r04200o276712l615719L064397
$$ -4321854 -7168505 -5358832 1792477 8078939 7174739 898027 -2717692 346705
6271C46705N001249J68429n403105o869985n589942l987122j289852K560164L972385
$$ 346705 5347954 5516383 113278 -6756707 -12346649 -16333771 -17623623 -15063459 -11091074
6262a1091074J328254o35441K344879O230935M271943k039595n185955l504203
$$ -11091074 -9762820 -10398261 -8053382 -1822447 2449496 409901 -4776054 -8280257
6254h280257k342936l178679j029078M761238O612433O69870n447696l561183
$$ -8280257 -10623193 -13801872 -14830950 -10069712 -3457279 -2787409 -8235105 -11796288
6246a1796288K936703N427758L256830K030884K459911L14144l915821m612525
$$ -11796288 -8859585 -3431827 -174997 1855887 4315798 4629942 714121 -3898404
6238c898404j006077P69771k149765m333988q04948M842878N633220Q96212l855177
$$ -3898404 -4904481 -4134710 -6284475 -10618463 -11423411 -6580533 -947313 -51101 -3906278
6229c906278m880369l663562k455288j78737M837654R604906P770248j860897
$$ -3906278 -8786647 -12450209 -14905497 -15084234 -10246580 -641674 7128574 5267677
6221E267677j0901916r862793k77265O828446N132925l42774k739001k468399
$$ 5267677 -5634239 -15497032 -15774297 -8945851 -3812926 -4155700 -6894701 -9363100
6213i363100k511933j488267J994937L753006O10680k118639J502535O682482
$$ -9363100 -11875033 -13363300 -11368363 -7615357 -7004677 -9123316 -7620781 -938299
6205i38299M425533l444127o847322l504448n16907j34100L026631Q726259Q733322
$$ -938299 3487234 43107 -6804215 -10308663 -10825570 -10959670 -7933039 793220 9526542
6196I526542K005390j112498L756070O393499p24877q649305o383833J336512
$$ 9526542 11531932 10419434 14175504 20569003 19844126 11194821 4810988 6147500
6188F147500L359026P16318J879605N646671L799246k557969m131468J95580K042581
$$ 6147500 9506526 10222844 12102449 17749120 21548366 18990397 14858929 15054509 17097090
6179A7097090j155749k811022n91860l43476l939864n364482k484258j138262
$$ 17097090 15941341 13130319 12538459 12194983 8255119 2890637 406379 -731883
6171g31883l251315k450217L063685M821085j545236p072133l685000J855744
$$ -731883 -3983198 -6433415 -3369730 1451355 -93881 -7166014 -10851014 -8995270
6163h995270q15763p777631o574874L984957J1850143Q853850j90425o319552
$$ -8995270 -9811033 -17588664 -24163538 -20178581 -8328438 525412 334987 -5984565
6155e984565o319394k367568K037703M242496M466008N559717P674022N828472
$$ -5984565 -12303959 -14671527 -12633824 -8391328 -3925320 1634397 9308419 15136891
6147A5136891k358522r900616q531322j253135J690705j443096j819236M703250
$$ 15136891 12778369 2877753 -5653569 -6906704 -5215999 -6659095 -8478331 -3775081
6139c775081R939593N695976l978396r066555o814324k269705Q11196K954592
$$ -3775081 6164512 11860488 7882092 -1184463 -7998787 -10268492 -9457296 -6502704
6131f502704M372644L425648K36874k257155j942778J66324J771704J676347P6456
$$ -6502704 -2130060 1295588 1532462 -724693 -2667471 -2501147 -729443 946904 1023360
6122A023360k158211m150582n431742n505866l347429J070136M720324L716732
$$ 1023360 -1134851 -5285433 -10717175 -16223041 -19570470 -18500334 -13780010 -10063278
6114a0063278j202045m280542k145463J237395O01823j946656L29838P640105
$$ -10063278 -11265323 -15545865 -17691328 -16453933 -15852110 -17798766 -17468928 -9828823
6106i828823J1357537N635224l455875n208134J812740Q690528Q674165N054109
$$ -9828823 1528714 7163938 3708063 -1500071 312669 9003197 17677362 22731471
6098B2731471M345025O313321N196796j342815r073548j2645821j0477054m183061
$$ 22731471 27076496 33389817 38586613 37243798 28170250 15524429 5047375 864314
6090H64314L092301P112081N174671n0680k604598r18396Q8356l098483o630784
$$ 864314 3956615 11068696 16243367 16192687 13588089 12669693 12758049 9659566 3028782
6081C028782n194077m42537J863619J084864J765102M821566N339655R63938l416709
$$ 3028782 -2165295 -2607832 -744213 340651 2105753 6927319 12266974 13230912 9814203
6072I814203k835414L64608O35176k249196l530853j070238J885960J845123m66429
$$ 9814203 6978789 7343397 7978573 5729377 2198524 1128286 3014246 4859369 4392940
6063D392940j919415j018357J183286K845711K719846L84638l605395p461853
$$ 4392940 2473525 1455168 2638454 5484165 8204011 8588649 4983254 -2478599
6055b478599q741124o108261p34011M724613Q736418J1437445J2173805Q569233
$$ -2478599 -11219723 -17327984 -18061995 -13337382 -4600964 6836481 19010286 27579519
6047B7579519J34481q621099j1796281q698012m031529j429096m1550J623771
$$ 27579519 27714000 19092901 7296620 -1401392 -5432921 -6862017 -6903567 -5279796
6039e279796K103211l89455m106588n246204k221967L266049Q189298R759547
$$ -5279796 -3176585 -3566040 -7672628 -12918832 -15140799 -11874750 -3685452 6074095
6031F074095O693381R11198l203186l126253q30472M14873M28744J201790K824794
$$ 6074095 12767476 13678674 10475488 7349235 6518763 6933636 7362380 8564170 11388964
6022A1388964L062597Q78188j843031k632850j326833k36896j699943n038443
$$ 11388964 14451561 15329749 13486718 10853868 9527035 9290139 7590196 2551753
6014B551753o185464k046719M489537O574274J882213l712557l468744J637143
$$ 2551753 -3633711 -5680430 -1190893 5383381 7265594 3553037 84293 1721436
6006A721436N024725L468680r372j498768n14968J281261K360384J742688j97583
$$ 1721436 6746161 10214841 10205469 8706701 8191733 9472994 11833378 13576066 13378483
5997A3378483j036729J052828L909711L442045p40721m675272n327619l494522
$$ 13378483 12341754 13394582 17304293 20746338 20005617 15330345 10002726 6508204
5989F508204j041052J395447L107887L089407K237252K527303K949723J51937
$$ 6508204 5467152 6862599 9970486 13059893 15297145 17824448 20774171 20926108
5981B0926108n204171p147312k517933L496850L949650p62768m784870n324843
$$ 20926108 15721937 8574625 6056692 9553542 13503192 12740424 7955554 2630711
5973B630711m224194k597663K96609K748194Q31925n125871q685381m787334L471425
$$ 2630711 -1593483 -4191146 -3894537 -1146343 -314418 -5440289 -14125670 -18913004 -15441579
5964a5441579Q179225N365837j350250m877024j339930O287049J0613111P207490
$$ -15441579 -7262354 -1896517 -3246767 -8123791 -9463721 -3176672 7436439 14643929
5956A4643929j10860l240288M52050M952765L663499k050766n289348l016243
$$ 14643929 14533069 11292781 11744831 16697596 20361095 18310329 13020981 10004738
5948A0004738O94149J079833j032306j481260N02453R29840k942150p668412p334883
$$ 10004738 10698887 11778720 10746414 9265154 9767607 10697447 7755297 86885 -7247998
5939g247998j736057K545508Q90187k656000j164528M613513O960268K853040
$$ -7247998 -8984055 -6438547 -5548360 -8204360 -9368888 -4755375 2204893 5057933
5931E057933j196463Q90829N253376M077197k159689n215203j146805M790283
$$ 5057933 3861470 4752299 10005675 14082872 11923183 6707980 5561175 10351458
5923A0351458O561667M714029K573831K05738l539835o320390m612822M68608
$$ 10351458 16913125 21627154 24200985 24406723 20866888 14546498 9933676 10402284
5915A0402284L801204K662702m13437j323995J139744M454415M590505j72305
$$ 10402284 14203488 16866190 16452753 15128758 16268502 20722917 25313422 25141117
5907B5141117o381879q004662l774423K22696j715210o710282p063672r39259
$$ 25141117 18759238 10754576 6980153 7202849 5487639 -1222643 -8286315 -9225574
5899i225574N610734P063342L826943j141487n597266o538935j440921O081725
$$ -9225574 -3614840 3448502 7275445 6133958 536692 -6002243 -7443164 -1361439
5891a361439P359191k87939q194900p118799N21824N118358L591863J565248K918476
$$ -1361439 5997752 5709813 -2485087 -9603886 -9082062 -3963704 -371841 1193407 4111883
5882D111883M483320K421582j891385m490766l283914J502006P542337J0144445
$$ 4111883 8595203 11016785 9125400 4634634 1350720 2852726 10395063 20539508
5874B0539508O010672j406258m643765j911452O48558j404744m124986k039897
$$ 20539508 26550180 25143922 20500157 18588705 19237263 17832519 13707533 11667636
5866A1667636K755105L730770m42976m845640n768463m265272k394212l68229
$$ 11667636 14422741 18153511 17710535 12864895 7096432 2831160 436948 68719
5858F8719J679219K409664R70410j930133m879588o007177l119954L663703R685042
$$ 68719 1747938 4157602 5128012 3197879 -1681709 -7688886 -10808840 -7145137 2539905
5849B539905R369333K859650l555875m605588j378126J476726J530560j78444
$$ 2539905 11909238 14768888 11213013 6607425 5229299 6706025 8236585 8058141
5841H058141j944910l087901l228538j885974M35718J741607M01702k334890k952072
$$ 8058141 6113231 3025330 -203208 -2089182 -1653464 88143 489845 -1845045 -4797117
5832d797117O0815L570107L495946N43593q44638N21694P78538j977994l405671
$$ -4797117 -4736302 -1166195 2329751 2873344 2028706 2550400 3328938 1350944 -2054727
5823b054727M27344N811729O255637K145421p55860j176375l367297p772491q589137
$$ -2054727 -1627383 4184346 10439983 12585404 11829544 10653169 7285872 -486619 -9075756
5814i075756l626671N94376j462263n391151l844527J820152M162061J504964
$$ -9075756 -12702427 -12108051 -13570314 -18961465 -22805992 -20985840 -16823779 -15318815
5806a5318815n02855J289096L603297L891712M489897O656694O417756R20117
$$ -15318815 -15821670 -14532574 -10929277 -7037565 -2547668 4109026 10526782 11446899
5798A1446899n250761n400283r5567L835024K542897j437250m665889o539700
$$ 11446899 6196138 795855 700288 4535312 7078209 5640959 975070 -5564630
5790e564630o538583k833117L507550O914149L903008j411979k802553r35127
$$ -5564630 -12103213 -14936330 -11428780 -4514631 -611623 -2023602 -4826155 -5761282
5782e761282j434604m667361m200702K571202Q754232P427431J737318o76392
$$ -5761282 -7195886 -11863247 -16063949 -13492747 -4738515 2688916 4426234 3749842
5774C749842J61062k124629p757967q504572n84514P628882O319257k092759o404047
$$ 3749842 3910904 1786275 -5971692 -14476264 -15060778 -7431896 -1112639 -3205398 -9609445
5765i609445j769760M756592M282618k972781q782754o683558J219393O918524
$$ -9609445 -11379205 -6622613 -2339995 -5312776 -14095530 -20779088 -19559695 -12641171
5757a2641171N469798O23678K8940N051803Q632661M970387k206106m806825j453112
$$ -12641171 -7171373 -6547695 -6518755 -1466952 7165709 12136096 9929990 5123165 3670053
5748C670053J562907j88054l837312m489904j771300J091850J847255N16819j918622
$$ 3670053 5232960 5044906 1207594 -3282310 -5053610 -3961760 -2114505 -1597686 -3516308
5739c516308l859696l296912L16756M832353P245581O407477L408978K45045j269711
$$ -3516308 -7376004 -10672916 -10356160 -5523807 1721774 8129251 11538229 11783274 10513563
5730A0513563n59642N77343r70285n782512r746956p835855n09888N540580M669338
$$ 10513563 9953921 10531264 9560979 3778467 -5968489 -13804344 -14314232 -8773652 -4104314
5721d104314p62202l162660M15752M379406K659966k396450l640046k1631K284408
$$ -4104314 -4866516 -8029176 -7613424 -3234018 -574052 -2970502 -6610548 -6632179 -4347771
5712d347771M10485n76697K751071M675488q07863q308522p178707K279874Q193295
$$ -4347771 -3937286 -4513983 -1762912 2912576 2104713 -6203809 -13382516 -11102642 -2909347
5703b909347L962426l100353l540430J503543M781721M214197K922651J656729
$$ -2909347 1053079 -2047274 -5587704 -4084161 697560 4911757 7834408 9491137
5695I491137j655285o017132p262501m191518j14255K283505L562380M242783
$$ 9491137 7835852 1818720 -5443781 -9635299 -9749554 -7466049 -3903669 339114
5687C39114K805692j175248m639090m093018M3770L723281L506770k48868m051251
$$ 339114 3144806 1969558 -2669532 -6762550 -6718780 -2995499 511271 262403 -3788848
5678c788848m438774n48431N658459J0606572J0500494L713351o067354j0749498
$$ -3788848 -8227622 -8776053 -3117594 7488978 17989472 21702823 15635469 4885971
5670D885971n722243L277330N499456j455043q177277n943625J803054M914503
$$ 4885971 -836272 2441058 7940514 6485471 -1691806 -7635431 -5832377 -917874
5662i17874L77603m891308m181448J328696N938836O621244M994721M009259M212696
$$ -917874 -540271 -5431579 -9613027 -8284331 -2345495 4275749 9270470 13279729 17492425
5653A7492425L290833n00534m979467o304653m796586m822864p279549o846717
$$ 17492425 20783258 20282724 15303257 8998604 4202018 -620846 -7900395 -14747112
5645a4747112m89105N794158M636306j329523k939489J897319N740428L513906
$$ -14747112 -15236217 -9442059 -4805753 -6135276 -9074765 -7177446 -1437018 2076888
5637B076888n29046m26477L008093N194647M967502M647763N387598N649926L165713
$$ 2076888 1547842 1121365 4129458 9324105 14291607 18939370 24326968 29976894 33142607
5628C3142607k893937j0121102j3293608r632906l623175k487301o413075q216894
$$ 33142607 30248670 20127568 6833960 -2798946 -6422121 -8909422 -15322497 -23539391
5620b3539391l962824J700836L309918K025817J443492J006986j370418l828276
$$ -23539391 -27502215 -25801379 -22491461 -20465644 -19022152 -18015166 -19385584 -23213860
5612b3213860k922702J008165N218162Q668668J0532883P817654j21578p252430
$$ -23213860 -26136562 -25128397 -19910235 -11241567 -708684 7108970 6987392 -265038
5604b65038p112323j872624P88691j285223l187650j894789K49557J799204M848621
$$ -265038 -7377361 -9249985 -8461294 -9746517 -12934167 -14828956 -14579399 -12780195 -7931574
5595g931574R030626R403415M066757j617192k954413l287705p705267j2985217
$$ -7931574 1099052 10502467 14569224 12952032 9997619 6709914 -995353 -13980570
5587a3980570j1102034j900880N016228K923668l461250n611527k780951o99446
$$ -13980570 -25082604 -26983484 -21967256 -19043588 -22504838 -28116365 -30897316 -31596762
5579c1596762j269676j71172M703285Q643905P194286L186474J992345K901451
$$ -31596762 -32866438 -33037610 -28334325 -19690420 -12496134 -9309660 -7317315 -4415864
5571d415864J110005l171754m378247j122266O09337l239222p845728o293632
$$ -4415864 -3305859 -6477613 -10855860 -11978126 -11368789 -14608011 -22453739 -28747371
5563b8747371O09117O154862O849044M941218L371875K685812K416780J850698
$$ -28747371 -28138254 -21983392 -15134348 -10193130 -6821255 -4135443 -1718663 132035
5555A32035l19933m157124o801379n304923n65104L807844N577804M870243K749534
$$ 132035 -187898 -4345022 -11146401 -16451324 -17016428 -13208584 -7630780 -2760537 -11003
5546a1003J020745J398779K642949J376349j693124o31145O399552J1429219O804060
$$ -11003 1009742 2408521 5051470 6427819 4734695 4103550 10503102 21932321 28736381
5537B8736381k906435p244427n193487m385922o292844l806846M415604Q829104
$$ 28736381 25829946 18585519 13392032 9006110 2713266 -1093580 3322024 12151128
5529A2151128L572093l587453l160174J838117J944386l848087q006451o310376
$$ 12151128 15723221 12135768 8975594 10813711 12758097 8910010 903559 -5406817
5521e406817j845307J454349K516677J018580k825600o629404q234321q680354
$$ -5406817 -7252124 -5797775 -3281098 -2262518 -5088118 -11717522 -19951843 -28632197
5513b8632197q955519o104211K313276J1871590J5370807J2256863P978097M717985
$$ -28632197 -37587716 -43691927 -41378651 -29507061 -14136254 -1879391 6098706 10816691
5505A0816691l24432o853884r119347m591852J008924J483629j464782k103081
$$ 10816691 10492259 3638375 -5480972 -10072824 -9063900 -7580271 -9045053 -11148134
5497a1148134L74167J954039J392776K271507O389915R235212N250256l719279
$$ -11148134 -10773967 -8819928 -7427152 -5155645 1234270 10469482 15719738 12000459
5489A2000459q731044l856523O187871J1248352P721521J704645m05424k8587
$$ 12000459 3269415 -587108 5600763 16849115 24570636 26275281 25869857 25841270
5481B5841270k168371o710203q782043o263048k088120P08725J895113J726676
$$ 25841270 23672899 16962696 8180653 1917605 -170515 538210 2433323 4159999
5473D159999R528j654673p79721J491848Q14000l486818o068890l168192J144296
$$ 4159999 4169527 2514854 1735133 3226981 4040981 554163 -5514727 -8682919 -7538623
5464g538623O84564l352988m090029M05430M033881K099056j289397M72274N899087
$$ -7538623 -6854059 -10207047 -14297076 -13891646 -9857765 -7758709 -9048106 -8575832 -2676745
5455b676745O980813J010004n109705m637243M4242K383164J450839Q38577M55864
$$ -2676745 4304068 5314072 204367 -4432876 -4388634 -2005470 -554631 283946 739810
5446G39810k913050p213365n774292J343601M946413K60633m712767j135338O778141
$$ 739810 -2173240 -9386605 -15160897 -13817296 -8870883 -8610250 -13323017 -14458355 -7680214
5437g680214Q426358K783973k132804k984128l440975l512821J628433R741550
$$ -7680214 746144 3530117 1397313 -1586815 -5027790 -8540611 -6912178 2829372
5429B829372R900154j544339j2719915j1404556j428911M268679J783027j612814
$$ 2829372 12729526 11185187 -1534728 -12939284 -14368195 -10099516 -8316489 -9929303
5421i929303p51011J138410k00103l571551n281610m115004j639314j70087j013970
$$ -9929303 -10680314 -9541904 -9742007 -13313558 -18595168 -22710172 -24349486 -24519573 -25533543
5412b5533543k843602k420241J171379M574375M796091L514666L566972L855743
$$ -25533543 -28377145 -30797386 -29626007 -25051632 -20255541 -16740875 -13173903 -9318160
5404i318160K271783J212859M164374Q026112N824486k310430p782186n401636
$$ -9318160 -7046377 -5833518 -1669144 6356968 12181454 9871024 2088838 -3312798
5396c312798l98426l204l307345m293631j303231J800249K171571J078034R14837
$$ -3312798 -3711224 -3714428 -7021773 -11315404 -12618635 -10818386 -8646815 -7568781 -6653944
5387f653944K427795M642293N316881K392877k875116n714535l376556P14163
$$ -6653944 -4226149 416144 5733025 8125902 5250786 -463749 -3840305 -3126142
5379c126142J630428L15952J929686P120361R905780N940841j089385m160828
$$ -3126142 -1495714 -1179762 749924 7870285 17776065 23716906 22627521 18466693
5371A8466693j525662K213278K248445j733059o345804q054971o196485l587788
$$ 18466693 16941031 19154309 21402754 19669695 13323891 5268920 -927565 -4515353
5363d515353l522567n523396n666199k240827J290360J415733K86255K213963
$$ -4515353 -8037920 -13561316 -19227515 -21468342 -20177982 -18762249 -18475994 -16262031
5355a6262031N751706M784140j482119n230574k11080Q916292J2179277O833308
$$ -16262031 -10510325 -5726185 -7208304 -12438878 -12649958 -3733666 8445611 15278919
5347A5278919q53433n172341o537635o805194m882720j78229L688960K957975
$$ 15278919 14425486 9253145 2715510 -4089684 -8972404 -9150633 -5461673 -2503698
5339b503698m79885j408660J375059L783867K674861r048o03715J123811J983843
$$ -2503698 -2983583 -4392243 -3017184 766683 3441544 3432496 2828781 3952592 5936435
5330E936435m63413n011101p800614n876597k64610M560158N131987K650419Q54695
$$ 5936435 5473022 461921 -7338693 -13215290 -13479900 -8919742 -3787755 -1137336 -282641
5321b82641O97677l71723l280201m632901j516940L285235M360546J039365j929977
$$ -282641 415036 43313 -3236888 -7869789 -9386729 -6101494 -1740948 -701583 -2631560
5312b631560j142860J751045M068458N913946P616885O854744K212081k615927
$$ -2631560 -3774420 -2023375 2045083 7959029 15575914 22430658 24642739 22026812
5304B2026812k902805m25293j778600q212337j2235743p411340K230804O916688
$$ 22026812 19124007 18698714 16920114 8707777 -3527966 -10939306 -8708502 -1791814
5296a791814L391404k139370l076463P4287K779437L331448L397591L515819J942939
$$ -1791814 1599590 -539780 -3616243 -3541956 -762519 2568929 5966520 9482339 11425278
5287A1425278j407998k997806R219M867735N699932J080486l711572l705011j123429
$$ 11425278 10017280 7019474 7028693 11896428 17596360 18676846 14965274 11260263 10136834
5278A0136834k169728p916459j2124174r025665m12867O724272P794825M209662
$$ 10136834 7967106 50647 -12073527 -21099192 -21512059 -14787787 -6992962 -2783300
5270b783300O70697M07887K546973L452688J169095j836984j977201p3494n86681
$$ -2783300 -2112603 -1704716 842257 4294945 5464040 3627056 1649855 1576361 989680
5261I89680m803112q309172o970319k195670K042347M295324M822862K735245
$$ 989680 -3813432 -12122604 -19092923 -21288593 -19246246 -14950922 -10128060 -7392815
5253g392815k077477o163046n775582j875577J546915K864598L138594K692221
$$ -7392815 -9470292 -15633338 -21408920 -23284497 -21737582 -18872984 -15734390 -13042169
5245a3042169J359889P47323J912952K149428j018051l883943o46220O782565
$$ -13042169 -11682280 -10934957 -9022005 -6872577 -7890628 -11774571 -12420791 -5638226
5237e638226R700520M586940k276205m318204k526427o82615R47756K521421P84726
$$ -5638226 4062294 8649234 6373029 2054825 -471602 -1154217 -206461 2314960 3099686
5228C099686n433908r774731n434303M146621Q686201N081192J334924M555098
$$ 3099686 -2334222 -12108953 -17543256 -13396635 -4710434 370758 1705682 6260780
5220F260780J0705113J0347705J384844q637190j2282574j0033610o933071m822012
$$ 6260780 16965893 27313598 28698442 20061252 7778678 -2254932 -9188003 -14010015
5212a4010015j570606L133118N886002M924485L338460L909944M118845O06903
$$ -14010015 -15580621 -12447503 -6561501 -1637016 1701444 5611388 9730233 10337136
5204A0337136l968887m121904l96651J045723k106929n342023n015618k997382
$$ 10337136 6368249 2246345 1849694 2895417 788488 -4553535 -9569153 -12566535
5196a2566535j422841J308892N801851P961647M493650j288524l346028m86304
$$ -12566535 -13989376 -12680484 -6878633 1083014 5576664 4288140 942112 455808
5188D55808L034959K770521j832690o521215m995970L851675J1629224R025993
$$ 455808 3490767 6261288 4428598 -2092617 -7088587 -3236912 8392312 17418305
5180A7418305q71600n463837o65336L388600r39352o739866n109401k22820r70801
$$ 17418305 16546705 11082868 10417532 13806132 12866780 6126914 1017513 794693 -176108
5171a76108n027789m083544L00441J87535k543542J046905Q414667O148595p477150
$$ -176108 -5203897 -9287441 -8987000 -8799465 -11343007 -10296102 -1881435 4267160 -3209990
5162c209990j6296631r466841K874238O330023K725945K399753N366568L745956
$$ -3209990 -19506621 -28973462 -26099224 -19769201 -17043256 -14643503 -9276935 -5530979
5154e530979k337662m880542k196779p20369k345478j275528M184213O922496
$$ -5530979 -7868641 -12749183 -14945962 -15666331 -18011809 -19287337 -15103124 -8180628
5146h180628K632720k163207J22459O186141O714288J53877n427679l914597J300602
$$ -8180628 -5547908 -7711115 -7588656 -1402515 5311773 5465650 37971 -3876626 -2576024
5137b576024L036782m01193m362379m250946j63792M273767N580801K642719l151421
$$ -2576024 460758 59565 -4302814 -8553760 -8717552 -4443785 1137016 3779735 628314
5128F28314q867877j1457369r196846k676818M939534R100300P134806J366380
$$ 628314 -8239563 -19696932 -28893778 -31570596 -26631062 -17530762 -10395956 -9029576
5120i029576k540404j940559m13454k311337n813580n315013n1365M610555N328098
$$ -9029576 -11569980 -13510539 -13923993 -16235330 -22048910 -27363923 -27415288 -22804733 -17476635
5111a7476635M920315N967040N551758P28342m769183m720632P89852N760859
$$ -17476635 -12556320 -6589280 -1037522 -309180 -5078363 -9798995 -9009143 -3248284
5103c248284O128147K737154k200020o646075p331251k092741N468993P980628
$$ -3248284 2879863 5617017 3416997 -3229078 -10560329 -12653070 -7184077 796551
5095G96551K636106n236266q211074m377377J813537M660197K535269j191369
$$ 796551 3432657 -1803609 -10014683 -14392060 -12578523 -7918326 -5383057 -6574426
5087f574426k600932k156323l125999n288124m296979J169161O247320O712207
$$ -6574426 -9175358 -11331681 -14457680 -19745804 -24042783 -22873622 -16626302 -9914095
5079i914095M411988K469059J69411k785930k424707K843702O665012L267037
$$ -9914095 -5502107 -3033048 -2863637 -5649567 -8074274 -5230572 1434440 4701477
5071D701477k642838k722851J880014L354705L55767j602440j213950k572722
$$ 4701477 2058639 -664212 1215802 4570507 4926274 3323834 2109884 -462838
5063d62838n742469o114584l391791j672990n66678L781798Q732593P181202M53528
$$ -462838 -6205307 -12319891 -15711682 -17384672 -17951350 -14169552 -5436959 1744243 2197771
5054B197771k192829J429846L633658J089606o80374K1572k602357q423472q366302
$$ 2197771 4942 1434788 5068446 6158052 5477678 5499250 2896893 -5526579 -13892881
5045a3892881r15962K778443j751911k756735P098533J4913618O743608q943446
$$ -13892881 -14808843 -12030400 -13782311 -16539046 -9440513 5473105 12216713 3273267
5037C273267j3308132m492953L570387M099957K692512K579282N14618k819757
$$ 3273267 -10034865 -14527818 -10957431 -6857474 -4164962 -1585680 -1071062 -3890819
5029c890819j979675K714887N132078M191698M271972M863059O74601p096657
$$ -3890819 -5870494 -3155607 1976471 6168169 10440141 15303200 15977801 8881144
5021H881144r999346m803662J967250L784884R40586l367468o741412o869127
$$ 8881144 -1118202 -5921864 -3954614 -169730 770856 -2596612 -9338024 -16207151
5013a6207151l619750j523058l846200n870355j396582O288602Q667914N279013
$$ -16207151 -19826901 -21349959 -25196159 -31066514 -32463096 -26174494 -17506580 -12227567
5005a2227567K942739L063943P42225l407616k400343M011015O806037K154413
$$ -12227567 -9284828 -6220885 -5478660 -8886276 -11286619 -7275604 -469567 1684846
4997A684846k063104O72031N385210N061919K280761L460236O783796M386774
$$ 1684846 -378258 293773 5678983 10740902 13021663 16481899 23265695 27652469
4989B7652469m982404j2375389r173915K165964J0092534O471150m526225j1994723
$$ 27652469 22670065 10294676 1120761 3286725 13379259 19850409 15324184 3329461
4981C329461j1414992p524650m229513N71724O834651P911873J215329m450561
$$ 3329461 -8085531 -15610181 -19839694 -19267970 -12433319 -4521446 -3306117 -7756678
4973g756678j219020N008772M531466L23308J989750Q069416Q470616J916396
$$ -7756678 -8975698 -3966926 564540 887848 2877598 10947014 19417630 21334026
4965B1334026l379422n050372p932696j0650630o485733J288022J166181o547597
$$ 21334026 17954604 12904232 4971536 -5679094 -12164827 -10876805 -9710624 -16258221
4957a6258221p833806K050551R919362O024745j391257j924374Q23648l23818
$$ -16258221 -24092027 -22041476 -12122114 -6097369 -7488626 -9413000 -8589352 -8913170
4949h913170j962922J461690N121341K189852l094336k831632N00503o90177m797723
$$ -8913170 -10876092 -9414402 -4293061 -2103209 -5197545 -8029177 -7528674 -8218851 -13016574
4940a3016574l800056K600718O538297M594021J624512J881980L571795L045015
$$ -13016574 -16816630 -14215912 -7677615 -3083594 -1459082 422898 3994693 7039708
4932G039708n06428m959891o948436m415034N86763L294146J607170k170276m982555
$$ 7039708 6533280 1573389 -5375047 -9790081 -9203318 -5909172 -4302002 -6472278 -11454833
4923a1454833n035126r76626O025244J0292903P629896K216844Q37107K097762
$$ -11454833 -16489959 -17466585 -11441341 -1148438 6481458 8698302 9535409 11633171
4915A1633171j75937m866604n419551k549807l115138o457381m861655J468796
$$ 11633171 11457234 6590630 1171079 -1378728 -4493866 -10951247 -15812902 -14344106
4907a4344106L581162l19696k232420J47957J20318l098802j807403M345817O072043
$$ -14344106 -10762944 -11082640 -13315060 -13167103 -13046785 -16145587 -17952990 -13607173 -7535130
4898g535130J669286k07339J870491L68118k533792L631367J3475085Q305514
$$ -7535130 -5865844 -6073183 -4202692 -3834574 -6368366 -2736999 10738086 19043600
4890A9043600j0371944j7574599m953689N278719p33772p287889k921952j350203
$$ 19043600 8671656 -8902943 -13856632 -8577913 -9311685 -16599574 -19521526 -20871729
4882b0871729q339863m286135J4693426J7652295p272321k2384880m342835Q832745
$$ -20871729 -29211592 -33497727 -18804301 -1152006 -8424327 -30809207 -35152042 -26319297
4874b6319297r158330j790333Q5516230J81855666J56261583P520350j14869929
$$ -26319297 -35477627 -37267960 48248270 230103936 386365519 393885869 279015940
4867B79015940j06719234l1817753k810442k5907128l4443332j2931748k362241
$$ 279015940 172296706 140478953 137668511 111761383 77318051 64386303 62024062
4860F2024062j3858425j6524123j884945M369539n198844q504607J551584N746478
$$ 62024062 48165637 31641514 29756569 34126108 28927264 20422657 21974241 27720719
4852B7720719l140710q545899k470616K829505P38976n76951J173868j344489
$$ 27720719 24580009 16034110 13563494 16392999 17131975 16555024 17728892 16384403
4844A6384403n665993j300979P468671N408474n750828q567469r45105L40592
$$ 16384403 10718410 9417431 16886102 22294576 16543748 7976279 7031174 7371766
4836G371766q962833j2210505j815957P468286M598048j105873q4671J202704
$$ 7371766 -1591067 -13801572 -15617529 -8149243 -3551195 -4657068 -4741739 -3539035
4828c539035l796968p381320j895347O178721Q113085O375598N955463M133974
$$ -3539035 -7336003 -14717323 -16612670 -10433949 -2320864 4054734 10010197 14144171
4820A4144171j338804m850731k876688j014708k705625j520090O369317J2185490
$$ 14144171 12805367 7954636 5077948 4063240 1357615 -162475 6206842 18392332
4812A8392332P004786l972547r142726n847371K88863N087103P042848M423511
$$ 18392332 25397118 21424571 12281845 6434474 6723337 11810440 18853288 23276799
4804B3276799j565187n266514l878861j424711j061621K00719M153516N712208
$$ 23276799 21711612 16445098 12566237 11141526 10079905 10280624 14434140 20146348
4796B0146348Q27063n826734p384668m119378p11932R02792P66348j962820n779953
$$ 20146348 20973411 15146677 7762009 3642631 2930699 3833491 4599839 2637019 -3142934
4787c142934n637168l05151L804000J515924l086076l137156R05571L609196L287663
$$ -3142934 -8780102 -9085253 -5281253 -3765329 -6851405 -9988561 -9082990 -5473794 -2186131
4778b186131K319044J643464O81312N05060J948960K550983N4538l057924l076500
$$ -2186131 132913 1776377 2457689 2962749 4911709 7462692 7517230 4459306 1382806
4769A382806j089339o90737j309484P96878N141232N835541m16459q606409j0509455
$$ 1382806 293467 -397270 -1706754 -909876 4231356 10066897 9650438 1044029 -9465426
4760i465426m487710K290063K453400k337563l511559L089242J1767830J4603912
$$ -9465426 -13953136 -11663073 -9209673 -11547236 -15058795 -11969553 -201723 14402189
4752A4402189J0507661L552071l313920p959290o736524N04858N854292J752434
$$ 14402189 24909850 28461921 25148001 17188711 10452187 10957045 16811337 18563771
4744A8563771p475129j0729590n993546j985354l524602n117907j820698K712163
$$ 18563771 11088642 359052 -5634494 -7619848 -11144450 -16262357 -18083055 -15370892
4736a5370892L444258J727357J093410J327564J018022P69002M73920j290216
$$ -15370892 -11926634 -10199277 -9105867 -7778303 -6760281 -5991279 -5517359 -6807575
4728f807575k510397J229742P884480Q328739q25576j0412015j0145215j428175
$$ -6807575 -9317972 -8088230 -203750 8124989 7299413 -3112602 -13257817 -14685992
4720a4685992O478819Q087853M428046j047248m142377j671169L882125N445810
$$ -14685992 -8207173 -119320 4308726 3261478 -880899 -2552068 1330057 6775867
4712F775867P50002m260608m759938l390320k995559o30804M783054O423365j47473
$$ 6775867 7525869 3265261 -1494677 -4884997 -7880556 -8511360 -3728306 2695059 2547586
4703B547586o936548l962911M743247O754544M33171l290804J342480O750411
$$ 2547586 -4388962 -8351873 -3608626 3145918 3579089 288285 1630765 8381176
4695H381176M913603q28600k360619Q94656K207587k503628r408808j1135442
$$ 8381176 13294779 12466179 10105560 11000216 13207803 10704175 1295367 -9840075
4687i840075m573439N548514J0852308P747225P63249l562190l949921l082581
$$ -9840075 -14413514 -8865000 1987308 9734533 10497782 6935592 2985671 -96910
4679i6910j555745K193545O367526N396256k484784j0252972q502289K904482
$$ -96910 -1652655 540890 6908416 12304672 9819888 -433084 -8935373 -6030891
4671f030891J2485518R235484l761151j2044851p573884J459953L116018j380530
$$ -6030891 6454627 15690111 11928960 -115891 -7689775 -6229822 -3113804 -4494334
4663d494334j662463M020513O470270J733324k289293K46617L459496P40618l856782
$$ -4494334 -6156797 -2136284 4333986 6067310 3778017 4024634 7484130 8224748 4367966
4654D367966l482996j33522N16711m28363Q40312J732647j842110n841244l678107
$$ 4367966 884970 751448 1268159 839796 1680108 3412755 1570645 -4270599 -7948706
4645g948706J799875K307370k360614n337603n290394o726113q445580l812085
$$ -7948706 -6148831 -3841461 -6202075 -11539678 -16830072 -23556185 -32001765 -35813850
4637c5813850N877770R901359L635616m367844n225632r18971K155214K893721
$$ -35813850 -29936080 -20034721 -16399105 -20766949 -25992581 -26911552 -24756338 -21862617
4629b1862617L135200K182282l28031r96078K431440O552884P270759N651611
$$ -21862617 -18727417 -16545135 -16873166 -17869244 -15437804 -8884920 -1614161 4037450
4621D037450M712198M013208J796296o99274j535605k189678n007128q256294
$$ 4037450 8749648 12762856 14559152 13859878 12324273 10134595 5127467 -3128827
4613c128827p732509k509970L846809P184638N949178J657100k072432k259244
$$ -3128827 -10861336 -13371306 -9524497 -2339859 3609319 5266419 3193987 934743
4605I34743K11699J580218M58402k03587K000842M653039L787088k51139l356824
$$ 934743 1146442 2726660 3185062 2981475 4982317 9635356 13422444 13171305 9814481
4596I814481l695812m312557q526193j4129909j4298614n421848O968065J2702993
$$ 9814481 6118669 1806112 -6720081 -20849990 -35148604 -40570452 -33602387 -20899394
4588b0899394Q235948O85081j341980J906475L650978R45172k346050k539011
$$ -20899394 -12663446 -11978365 -13320345 -11413870 -7762892 -6817720 -9163770 -11702781
4580a1702781r82124m96414q45209N5737K585551M729711M008233l3330m308444
$$ -11702781 -12684905 -13181319 -14026528 -13970791 -11385240 -6655529 -2647296 -2680626 -6989070
4571f989070m435747l89977K087376j164747o197330o353777k388717r50224l225646
$$ -6989070 -11424817 -11814794 -9727418 -10892165 -17089495 -23443272 -25831989 -26782213 -30007859
4562c0007859k415807N057537J2390964J1154028L035229k428117p3170N526824
$$ -30007859 -32423666 -27366129 -14975165 -3821137 -785908 -3214025 -3287195 2239629
4554B239629O926390K697006j980345k351888K04745P79787j785817l568555k518793
$$ 2239629 9166019 11863025 9882680 7530792 7735537 8515324 6729507 3160952 642159
4545F42159k370763n995754q781215m478536M548115R535927P155783K657763
$$ 642159 -1728604 -7724358 -16505573 -20984109 -16435994 -6900067 255716 2913479
4537B913479J067186J840629L246561N351022O540519L214053m209753j0027718
$$ 2913479 3980665 5821294 9067855 14418877 20959396 24173449 19963696 9935978
4529I935978j0444604p369060l450982R62094L960898J844327l864335n561324
$$ 9935978 -508626 -7877686 -11328668 -10366574 -6405676 -4561349 -8425684 -13987008
4521a3987008j930O256515O469284K899006R84312J10853k907041n724762l687218
$$ -13987008 -13988938 -7732423 -1263139 1635867 2620179 2731032 -176009 -5900771 -9587989
4512i587989J479109L565773J108913j678298k124077j345785j80665J517809
$$ -9587989 -8108880 -4543107 -3434194 -5112492 -7236569 -8582354 -8763019 -7245210
4504g245210K231639P02545l44622K291661O069898N817416K311284J211234L312294
$$ -7245210 -5013571 -4311026 -4655648 -2363987 3705911 9523327 11834611 13045845 16358139
4495A6358139K971641k062209o099968m057165J173031M073628M608321N887457
$$ 16358139 19329780 17267571 11167603 7110438 8283469 12357097 16965418 22852875
4487B2852875O818706K940809n822437j2998677j2596743n792272P69266K079411
$$ 22852875 29671581 32612390 26789953 13791276 1194533 -4597739 -3828473 -1749062
4479a749062q12886k851603o36035M061186O353633L772103o82911j725979J881272
$$ -1749062 -2561948 -5413551 -6049586 -1988400 4365233 8137336 7454425 5728446 7609718
4470G609718N352179L596683j797303m050789m84221L105982M09163n912654p773410
$$ 7609718 12961897 16558580 14761277 10710488 10226267 13332249 13741412 7828758 55348
4461E5348l497060J61718j224502l465014j371792K976189M313724K258630p9891
$$ 55348 -3441712 -3279994 -4504496 -7969510 -9341302 -6365113 -2051389 207241 127350
4452A27350k300958n544429p299824l918892K246302M433169Q37702l090399k852178
$$ 127350 -2173608 -7718037 -15017861 -18936753 -16690451 -12257282 -11419580 -14509979 -17362157
4443a7362157j75682J683119K841813M159361M107784K071095J428746M860735
$$ -17362157 -17537839 -15854720 -13012907 -8853546 -4745762 -2674667 -1245921 3614814
4435C614814Q606155O327978j632782p551417o128235j060926Q12723j027554
$$ 3614814 12220969 18548947 16916165 9364748 3236513 2175587 2988310 1960756
4427A960756j304346K181081N189841M046358J477382J741747L120171O57836
$$ 1960756 656410 2837491 8027332 12073690 13551072 15292819 18412990 19070826
4419A9070826m805471o594886k329222J871280M10856l559089l523058M24869
$$ 19070826 14265355 7670469 5341247 7212527 7623383 4064294 541236 966105
4411I66105K570568P76425r97172M85953L105522K949778n32066m286025m878128
$$ 966105 3536673 4313098 3315926 3801879 6907401 9857179 9325113 5039088 160960
4402A60960j565178K594993L297450J47700k137517N9543L667111L013526j857396
$$ 160960 -1404218 1190775 4488225 4635925 2498408 2557951 6225062 9238588 7381192
4393G381192n350694m421141j824665p29273p64870q23623j273381j274077J769226
$$ 7381192 2030498 -2390643 -4215308 -4944581 -5709451 -6533074 -7806455 -9080532 -7311306
4384g311306P135000R103347M143394l301634o323805m266356j450772M18592
$$ -7311306 -176306 8927041 13070435 9768801 3444996 -821360 -2272132 -1853540
4376a853540K887239M996641L480811o00267j897825M38510M23596m573902p601812
$$ -1853540 1033699 6030340 9511151 8910884 7013059 7451569 7875165 3301263 -4300549
4367d300549k251459N874594O063586j580564o371308l390954j9577k951416p418716
$$ -4300549 -6552008 -677414 5386172 3805608 -2565700 -5956654 -5976231 -8927647 -16346363
4358a6346363n287836K503206Q519438R465306P424279L912473j96139j391443
$$ -16346363 -21634199 -19130993 -10611555 -1146249 6278030 10190503 9994364 8602921
4350H602921K345630N826337K802074l238148l013955L534205N597336k395115
$$ 8602921 10948551 16774888 19576962 16338814 13324859 16859064 22456400 20061285
4342B0061285j1820507j2044792m678507M61666j054033m864960n344304j337721
$$ 20061285 8240778 -3804014 -8482521 -8020855 -9074888 -13939848 -19284152 -20621873
4334b0621873M370460P899357P628340O308954P587564R705948O864420j618358
$$ -20621873 -16251413 -8352056 -723716 5585238 13172802 22878750 29743170 28124812
4326B8124812q847305r922092q277638q227388p015342o82238O621132P088534
$$ 28124812 19277507 9355415 1077777 -7149611 -14164953 -14847191 -8226059 -1137525
4318a137525J130667k727364J98699N278898N986598J466024m818757r530743
$$ -1137525 -6858 -2734222 -2535523 2743375 8729973 10195997 5377240 -4153503
4310d153503j0386388o033544K005411Q576341Q710162K928833k323967j120671
$$ -4153503 -14539891 -20573435 -18568024 -9991683 -1281521 1647312 -676655 -1797326
4302a797326M836178P665986L282622l042970m406246k300046l044328o364088
$$ -1797326 3038852 10704838 13987460 10944490 6538244 4238198 1193870 -5170218
4294e170218n554068Q49872O174971O326750M903135M635285K625293j450104
$$ -5170218 -10724286 -9874414 -3699443 2627307 7530442 12165727 14791020 13340916
4286A3340916j482573M412396P748663J874053o887269q595418l808564K91440
$$ 13340916 11858343 16270739 24019402 25893455 19006186 10410768 6602204 6893644
4278F893644J775173K475838J73531p030055j2480027q062229K736909Q827880
$$ 6893644 8668817 11144655 11318186 4288131 -8191896 -16254125 -13517216 -4689336
4270d689336O661300K008305j152400l614315m399051j196593L301482M383423
$$ -4689336 1971964 3980269 2827869 -786446 -5185497 -6382090 -3080608 1302815
4262A302815L441605M578064N459455J281397m604888n033938k156515m292426
$$ 1302815 4744420 9322484 14781939 16063336 11458448 6424510 4267995 -24431
4254b4431j0532789j1046813l178274N136207Q969184J0934240J0909995M665255
$$ -24431 -10557220 -21604033 -24782307 -19646100 -10676916 257324 11167319 15832574
4246A5832574m585030o736740r17110J914679k916385o264352j674182L540998
$$ 15832574 11247544 4510804 3593694 5508373 2591988 -3672364 -5346546 -1805548
4238a805548J483018l556875m080061j351070j7821N27584J573181J34265m045044
$$ -1805548 -322530 -3879405 -7959466 -9310536 -9328357 -8800773 -7227592 -7093327 -11138371
4229a1138371m789033N0912L013521o72798m140040n04401N312813N570366K426887
$$ -11138371 -15927404 -15876492 -12862971 -13535769 -17675809 -18180210 -12867397 -7297031 -4870144
4220d870144J920999K621468N76254q88778K991261Q006534O813659R54042k682303
$$ -4870144 -2949145 -327677 248577 -640201 2351060 10357594 17171253 18125295 15442992
4211A5442992l377762m961491o328040l426104J761465L426951J548167J295216
$$ 15442992 12065230 7103739 775699 -2650405 -888940 2538011 4086178 5381394
4203E381394M223247P003211P470333O008191K754391j583646m594422n741074
$$ 5381394 9604641 16607852 24078185 30086376 32840767 31257121 26662699 20921625
4195B0921625p214826p986922l184192O295372J1082293O120943j631027m904980
$$ 20921625 13706799 5719877 2535685 8831057 19913350 26034293 24403266 19498286
4187A9498286o732344j0953897j1391490j864095J0228150J2835627O846105K772654
$$ 19498286 12765942 1812045 -9579445 -11443540 -1215390 11620237 18466342 21238996
4179B1238996L684847L115288k462891r488783j3720391j2349603l169033J0089076
$$ 21238996 24923843 28039131 25576240 16087457 2367066 -9982537 -13151570 -3062494
4171c062494J6300559R896452K13422j436543J952044M23762n398821o638278
$$ -3062494 13238065 23134517 23347939 21911396 23863440 24287202 18888381 12250103
4163A2250103j734910K619677L121710J654089j080178m034178k786780K670840
$$ 12250103 10515193 13134870 16256580 17910669 16830491 12796313 10009533 12680373
4155A2680373L939297k257728n739302M33418O110538J304704m832467N92Q163863
$$ 12680373 16619670 14361942 8622640 9056058 15166596 16471300 11638833 11639425 19803288
4146A9803288N598306k595148k907984Q42973k396798n682045L048430J3305297
$$ 19803288 25401594 22806446 19898462 20741435 18344637 12662592 15711022 29016319
4138B9016319Q710991M99925P985112J7192996M109149j1168000P307714K9820813
$$ 29016319 37727310 38227235 46212347 63405343 67514492 56346492 63654206 93475019
4130I3475019j7649061j27351012j81500209j01010091L8046876J01610501O6638317
$$ 93475019 75825958 -51525054 -233025263 -334035354 -295988478 -194377977 -127739660
4123a27739660J9424527J5126258K3610450J1723026j797103M624430J3305919
$$ -127739660 -108315133 -93188875 -69578425 -57855399 -59652502 -55028072 -41722153
4116d1722153M804482o412366k709972M387007o65553p902373k750274O393633
$$ -41722153 -36917671 -43330037 -46040009 -41653002 -42318555 -50220928 -52971202 -46577569
4108d6577569N049340j703749j884523J338128j42169j764214K650781N758941
$$ -46577569 -41528229 -43231978 -45116501 -43778373 -43920542 -45684756 -43033975 -37275034
4100c7275034M20569m063696K695716J2109065J0180614J181284j020843K761603
$$ -37275034 -36854465 -40918161 -38222445 -26113380 -15932766 -14751482 -15772325 -13010722
4092a3010722Q12227o653416p677917Q6858N555555K686930j687029o15191M114759
$$ -13010722 -12198495 -18851911 -26529828 -26442970 -20887415 -18200485 -19887514 -20502705 -16387946
4083a6387946Q047646R461774P169428J104618m112448l632088l34975q61567
$$ -16387946 -8340300 1121474 8290902 9395520 5283072 1650984 1316009 454442
4075D54442m233750k868085M515882R559706O103329j824082o812805p045943
$$ 454442 -3779308 -6647393 -2131511 7428195 13531524 11707442 4894637 -2151306
4067b151306n224292l139346r50211P72241J101086k30500k707058m583706k941795
$$ -2151306 -7375598 -10514944 -11465155 -10692914 -9591828 -9822328 -12529386 -17113092 -20054887
4058b0054887L257019J0137574J1857058P401172J915564K5945P1650k810135
$$ -20054887 -16797868 -6660294 5196764 12597936 14513500 14539445 14611095 11800960
4050A1800960q868224j1922113o873768K610077P139064K916440l481688m108676
$$ 11800960 2932736 -8989377 -15863145 -13253068 -6114004 -3197564 -6679252 -10787928
4042a0787928j6021J946501K77752K34463M139128P221780N474364J693029M6476
$$ -10787928 -10803949 -8857448 -8579696 -8345233 -4206105 3015675 8490039 10183068 10229544
4033A0229544n04729k854647n439018m333763J37931L280413J906959k646395
$$ 10229544 9724815 6870168 1431150 -2902613 -2764682 515731 2422690 -223705
4025b23705o696071p127749l207208K294712M727200K279572j747662k930598
$$ -223705 -6919776 -14047525 -17254733 -14960021 -10232821 -7953249 -9700911 -12631509
4017a2631509r34741P75887m73451l632708n064988k054827M121155Q778702Q677832
$$ -12631509 -13566250 -12790363 -13263814 -16896522 -21961510 -24016337 -19895182 -11116480 -2438648
4008b438648N586210L133613J445697j764323n705215o660158l908695q97639
$$ -2438648 3147562 6281175 7726872 5962549 257334 -6402824 -10311519 -11209158
4000a1209158L77232J488028K871297K138969q39876k291431p72353m9286k290836
$$ -11209158 -10831926 -9343898 -6472601 -4333632 -5173508 -7464939 -8237292 -8286578 -10577414
3991a0577414l397999K66325M866986M431884P1480k103129l97928J092313r5174
$$ -10577414 -13975413 -13709088 -8842102 -4410218 -4338738 -6441867 -6839795 -5747482 -5842656
3982e842656j592366j064275L66160J033897J633011L262803M592790K920865
$$ -5842656 -7435022 -8499297 -8133137 -7099240 -5466229 -2203426 2389364 5310229
3974E310229k235473p412468p707835j895428N166269O870943J970016m321994
$$ 5310229 3074756 -4337712 -12045547 -13940975 -8774706 -1903763 66253 -4255741
3966d255741o555900m208602k60294K578809L112444J770065R15443K820546O172060
$$ -4255741 -10811641 -15020243 -15280537 -12701728 -9589284 -7819219 -6903776 -4083230 2088830
3957B088830O853301L154478k118603n290544m987211j763164J909909J637511
$$ 2088830 8942131 12096609 9978006 4687462 -299749 -2062913 -153004 1484507
3949A484507m052831q862467m981811M788650Q627780K069125n236039l721581
$$ 1484507 -2568324 -11430791 -16412602 -11623952 -2996172 -927047 -6163086 -9884667
3941i884667L049441O014993M004281J318527j828705o675666q384700k187237
$$ -9884667 -6835226 -820233 3184048 4502575 2673870 -4001796 -12386496 -14573733
3933a4573733N440440L226714p561547j3442902p895889O22174L179952K525051
$$ -14573733 -9133293 -5906579 -13468126 -26911028 -34806917 -34184743 -31004791 -28479740
3925b8479740M843834P941562N805872r3137k394108J007604M240667K269748
$$ -28479740 -23635906 -15694344 -9888472 -9981609 -12375717 -11368113 -7127446 -4857698
3917d857698k442504l765634Q0739M226356K820492l707538q367266n508017K397418
$$ -4857698 -7300202 -11065836 -10985097 -6758741 -3938249 -7645787 -16013053 -21521070 -19123652
3908a9123652P742048O292779L63042n049990o117253j482574O209198J0586539
$$ -19123652 -11381604 -5088825 -4725783 -9775773 -15893026 -17375600 -11166402 -579863
3900e79863P471665M18030l531251k923582j922908j980334r0578L506432L018370
$$ -579863 6891802 7309832 3778581 854999 -1067909 -3048243 -3138821 367611 3385981
3891C385981l922188j0631357r265616m12261R139103J4458697J4347468R094891
$$ 3385981 -536207 -11167564 -20433180 -20845441 -11706338 2752359 17099827 26194718
3883B6194718J414069l285102k801128k188229o715103j2808836j2249978m594143
$$ 26194718 27608787 24323685 21522557 19334328 12619225 -189611 -12439589 -17033732
3875a7033732J597520J253940k67368L513021R306511Q483610J51854o664450
$$ -17033732 -15436212 -14182272 -14449640 -10936619 -1630108 6853502 7005356 340906
3867C40906n025193Q42091J857293l474310p686646n153825N30856K368098l00759
$$ 340906 -4684287 -3842196 -1984903 -5459213 -13145859 -18299684 -17768828 -15400730 -15701489
3858a5701489j951234N73539M131244M518811J960165l51656o37618M46157J435511
$$ -15701489 -17652723 -17079184 -12947940 -8429129 -6468964 -6820620 -7458238 -7012081 -5576570
3849e576570J083943q21935k387305r65774K984628N178204K620141j975267l323223
$$ -5576570 -4492627 -5314562 -7701867 -8667641 -5683013 -504809 2115332 140065 -3183158
3840c183158m46249K101649J78304m683765o879751k841639N055573J0628947
$$ -3183158 -3629407 -1527758 -1349454 -6033219 -12912970 -15754609 -10699036 -70089
3832g0089R956580N171726J625054J540378K008404k83685m362011o742090o459597
$$ -70089 9886491 15058217 16683271 18223649 20232053 19948368 15586357 8844267 2384670
3823B384670n664453n335267l266166K124893P823313Q714400M098307p03681
$$ 2384670 -3279783 -8615050 -11881216 -9756323 -1933010 6781390 10879697 10176016
3815A0176016p28169K289900K436968k164841o979547p774591o204357o026281
$$ 10176016 9447847 11737747 14174715 12009874 5030327 -2744264 -8948621 -14974902
3807a4974902o530161l879027K127597P013685P603531N258005K560997N29402
$$ -14974902 -21505063 -25384090 -23256493 -16242808 -8639277 -3381272 -820275 -290873
3799b90873J9548J787561L437591N66817o324864j0173830o420860r5806J140564
$$ -290873 -271325 1516236 4953827 5520644 -804220 -10978050 -17398910 -17494716 -16354152
3790a6354152j816045j570571L774034P802571O047050K281458J434538J960611
$$ -16354152 -18170197 -19740768 -15966734 -8164163 -2117113 164345 1598883 3559494
3782C559494J39255k113263J44604O112180R103964N638152k07651k962884k279884
$$ 3559494 3698749 1585486 1730090 7842270 16946234 22584386 22376735 19413851 17133967
3773A7133967j151833q78148p40358p12124j424137k186523j590075K29M41916
$$ 17133967 15982134 15103986 14363628 13651504 12227367 10040844 8450769 8450998 8892914
3764H892914j482751m524350o165887m763832j079546J723530P69995k852495
$$ 8892914 7410163 2885813 -3280074 -8043906 -9123452 -7399922 -6629927 -9482422
3756i482422m532147j597478L315584O060248N988372M628273J910926k185628
$$ -9482422 -14014569 -15612047 -12296463 -6236215 -247843 4380430 6291356 4105728
3748D105728m243830j185902L315767K538440k658395l961936J396444N240161
$$ 4105728 -138102 -1324004 1991763 4530203 1871808 -2090128 -693684 4546477
3740D546477O48569p113535q455983l164608J484400K769673L999468N506461
$$ 4546477 5195046 -1918489 -10374472 -13539080 -12054680 -9285007 -5285539 220922
3732B20922L269135k539303n659587k847394J535108K550569O40550j832672m243338
$$ 220922 3490057 950754 -4708833 -7556227 -6021119 -3470550 -2830000 -4662672 -8906010
3723h906010n045636j273738N544561Q385800M119592j079588q48031J654085
$$ -8906010 -13951646 -15225384 -9680823 -1295023 2824569 1744981 896950 2551035
3715B551035k67787m893242m257346K924676Q479317O034816j405303p034326
$$ 2551035 2283248 -2609994 -6867340 -3942664 4536653 10571469 9166166 2131840
3707B131840p947369n024684n3153M018839L895996K70216j740846M37938K419280
$$ 2131840 -5815529 -10840213 -10893366 -6874527 -2978531 -2708315 -4449161 -4011223 -1591943
3698a591943r49089p386933r534711m475189L090622P005701N646201J725812
$$ -1591943 -2541032 -9927965 -19462676 -23937865 -20847243 -13841542 -8195341 -6469529
3690f469529q54683J95967L243366L458500j194107n485272k763542M897738Q084942
$$ -6469529 -7324212 -7128245 -3884879 -426379 -1620486 -7105758 -9869300 -4971562 3113380
3681C113380L080963k714345j848562K786962M016984J449284p53157k970943
$$ 3113380 6194343 3479998 1631436 4418398 8435382 9884666 9131509 6160566
3673F160566q024606j2261962q882015k06417L765234R77993O96823P059476J0317653
$$ 6160566 -1864040 -14126002 -23008017 -23214434 -19449200 -18471207 -17774384 -10714908 -397255
3664c97255K202827r274162j0764689l009949K095508L63534n90903M190475R221055
$$ -397255 1805572 -7468590 -18233279 -21243228 -19147720 -18784186 -19375089 -15184614 -5963559
3655e963559P696483M68285o903620j0229488p931285j455583M058617M249342
$$ -5963559 1732924 2201209 -4702411 -14931899 -22863184 -24318767 -20260150 -16010808
3647a6010808J530334J962970O016603P967158M935802N24545j682667k387929
$$ -16010808 -14480474 -12517504 -6500901 1466257 6402059 6926604 5243937 2856008
3639B856008k869707k607310k182632l136915l595803J35700O091412P121817
$$ 2856008 -13699 -2621009 -4803641 -7940556 -11536359 -11400659 -5309247 1812570
3631A812570J208973m859733n001442j231064J485995K149654K199968K251566
$$ 1812570 3021543 -1838190 -6839632 -8070696 -6584701 -4435047 -2235079 16487
3623A6487L394976O734578R248348N961460j358830m599698j475865N34916l193972
$$ 16487 3411463 10146041 19394389 25355849 23997019 19397321 17921456 18456372 15262400
3614A5262400o318117k460976L447979K884656l231265p582170p672657n799922
$$ 15262400 8944283 6483307 9931286 12815942 9584677 2002507 -5670150 -11470072
3606a1470072k186846L462914P219053N864147L096020L031518J996379m072317
$$ -11470072 -13656918 -10194004 -2974951 2889196 5985216 9016734 11013113 6940796
3598F940796q699330k911059Q468596J1187220K032989p357953q530027n800421
$$ 6940796 -1758534 -4669593 3799003 14986223 17019212 9661259 1131232 -4669189
3590d669189m575517k109304L988384P981483M641376j259438j927378J646341
$$ -4669189 -9244706 -11354010 -7365626 615857 5257233 3997795 2070417 3716758
3582C716758K170144k560319p405156p865189m906269j583489J274664M637008
$$ 3716758 5886902 3326583 -4078573 -11943762 -16850031 -18433520 -17158856 -12521848
3574a2521848Q145857R056543N372250j86428j906307J714676N464366M732367
$$ -12521848 -4375991 4680552 10052802 9866374 7960067 9674743 15139109 19871476
3566A9871476J765758O10737k45083m263913r151922r877019p035209m679462
$$ 19871476 21637234 22247971 22002888 17738975 8587053 -1289966 -8325175 -13004637
3558a3004637k181539K991911O595467K491753m524096l112752O042978R331172
$$ -13004637 -15186176 -12194265 -5598798 -3107045 -7631141 -10743893 -4700915 4630257
3550D630257J665061m906102q25169N998092M772760k31820Q77461M950147J274943
$$ 4630257 6295318 1389216 564047 6562139 11334899 11103079 11980540 16930687 18205630
3541A8205630q919797j3002772o057184L005513N352582J930160k116734l773896
$$ 18205630 9285833 -3716939 -9774123 -6768610 -1416028 514132 -1602602 -5376498
3533e376498j391616M404035P626654K373159p251626j0345021m173555J952051
$$ -5376498 -6768114 -2364079 5262575 7635734 384108 -9960913 -14134468 -12182417
3525a2182417N68783m064640m399152q53382J445011K011865M011037O492987
$$ -12182417 -11613634 -15678274 -20077426 -20930808 -19485797 -17473932 -13462895 -6969908
3517f969908M613298k163373p337035m815529L590143J0019316R006482K794670
$$ -6969908 -2356610 -4519983 -11857018 -16672547 -13082404 -3063088 5943394 8738064
3509H738064j901376j590287Q69159J146540n80368p17695J739554L341872Q23271
$$ 8738064 6836688 5246401 6115560 7262100 6681732 5964037 7703591 11045463 11868734
3500A1868734m681416q937147q612963l611883K824985N801442K533994m255933
$$ 11868734 7187318 -1749829 -10362792 -13974675 -11149690 -5348248 -2814254 -7070187
3492g070187p952678m441062L542385R227748Q504500L105810k332358n035754
$$ -7070187 -15022865 -19463927 -15921542 -6693794 1810706 4916516 2584158 -2451596
3484b451596n313703m082179j229574K677700M807627K512987k923065p098830
$$ -2451596 -7765299 -11847478 -13077052 -10399352 -5591725 -3078738 -6001803 -13100633
3476a3100633p233702m328549p12694K261388L852851L835800L506852M515081
$$ -13100633 -20334335 -24662884 -25375578 -23114190 -19261339 -15425539 -11918687 -7403606
3468g403606O091237N788901L291443O42813j460800l882875n152378k247719
$$ -7403606 -1312369 4476532 7767975 8410788 6949988 3067113 -2085265 -4332984
3460d332984L130373M425341o46865n944124n808636l173529l619310n690492
$$ -4332984 -1202611 3222730 2575865 -3368259 -9176895 -12350424 -15969734 -21660226
3452b1660226l610727L008762Q614743R473084O454330J475131l493521n349465
$$ -21660226 -25270953 -22262191 -13647448 -4174364 2279966 3755097 261576 -5087889
3444e087889l210289j240170k629440l196545J968917P876870N102096m382304
$$ -5087889 -8298178 -9538348 -12167788 -15364333 -13395416 -5518546 -416450 -4798754
3436d798754p537021P65042R358972O945711k120719n883687k135243J293239
$$ -4798754 -12335775 -11570733 -2211761 4733950 2613231 -3270456 -5405699 -4112460
3428d112460p2988k866317l940018m637075n542648l511534L087845J0310928
$$ -4112460 -4185448 -7051765 -10991783 -15628858 -21171506 -24683040 -21595195 -11284267
3420a1284267J2814676R747159M371761j52693k492652k281520k40386J151507
$$ -11284267 1530409 11277568 15649329 15496636 13003984 10722464 10482078 11633585
3412A1633585n26481m499192p168408o490072m256681k609621m17327L875961
$$ 11633585 11107104 6607912 -560496 -7050568 -11307249 -13916870 -14334197 -10458236
3404a0458236P414391N671073N9603k696722m47278J196793j004372j251244N397525
$$ -10458236 -3043845 2627228 2686831 -9891 -457169 739624 -264748 -1515992 3881533
3395C881533J2083838Q391856l312019j0169765p317649l452557n518091q255421
$$ 3881533 15965371 24357227 21045208 10875443 3557794 105237 -5412854 -13668275
3387a3668275m491828K720701N716035M091261L121922L962491L020684o24966
$$ -13668275 -18160103 -15439402 -9723367 -5632106 -2510184 1452307 4472991 3848025
3379C848025l783010m553281l919832k423450J09154J922919Q32710j641436j501307
$$ 3848025 65015 -4488266 -8408098 -10831548 -10722394 -8799475 -7966765 -9608201 -11109508
3370a1109508K184842O136878P083667M192649j924951q911448j1708441o279384
$$ -11109508 -8924666 -2787788 4295879 8488528 6563577 -2347871 -14056312 -20335696
3362b0335696M459586J1732669R757202J665983m482316m007192Q61093M237532
$$ -20335696 -15876110 -4143441 5613761 7279744 2797428 -1209764 -348671 3888861
3354C888861K416281k772500o002515m216673P7711J991338q8220l254203l853848
$$ 3888861 6305142 3532642 -2469873 -6686546 -6608835 -4617497 -4705717 -7959920 -11813768
3345a1813768j144111K402194L300994J20300m537244n780130j404819N352689
$$ -11813768 -12957879 -10555685 -7254691 -7134391 -11671635 -17451765 -18856584 -13503895
3337a3503895R042336P406498K792740q98255j635274l31436O32447K69787J17633
$$ -13503895 -4461559 2944939 5737679 4839424 3204150 2872714 3505161 3774948 3892581
3328C892581J413568K211369J16742k772058j962761J869377K585676k178087
$$ 3892581 5306149 7517518 7634260 4862202 2899441 4768818 7354494 5176407
3320E176407o953554o932696m820013m277478k298115M466220J0135608N905340
$$ 5176407 -1777147 -8709843 -13529856 -17807334 -20105449 -15639229 -5503621 401719
3312D01719n506521j1406814o148885K209236M660235K340500Q76911J026195
$$ 401719 -5104802 -16511616 -22660501 -20451265 -15791030 -13450530 -12573619 -11547424
3304a1547424O12853M25430K052843L319825J545881r70315J40128M397708O949338
$$ -11547424 -10934571 -10509141 -8456298 -5136473 -3590592 -4560907 -4420779 -23071 6926267
3295F926267N078266N73897l575000n648188n100850k725530k47640J899022M542806
$$ 6926267 12004533 12578430 9003430 3355242 -1745608 -4471138 -4718778 -2819756 1723050
3286A723050N988333J966361p136184j2859238q163005K021955O341931K296063
$$ 1723050 7711383 9677744 2541560 -10317678 -18480683 -16458728 -10116797 -7820734
3278g820734j140304K804654R375625R894953L365794l805020o421474m914504
$$ -7820734 -8961038 -6156384 3219241 13114194 16479988 12674968 6253494 1338990
3270A338990k992379l711793o543136o947270j264866O809623Q459564R29789
$$ 1338990 -1653389 -5365182 -11908318 -18855588 -20120454 -13310831 -4851267 -3921478
3262c921478p542911p728822o71859N790023Q381540R786992J0473634O780639
$$ -3921478 -11464389 -19193211 -19865070 -14075047 -5693507 4093485 14567119 21347758
3254B1347758j660691r036810j0539306p816142m820085k407345K17529K319566
$$ 21347758 19687067 10650257 110951 -7705191 -12525276 -14932621 -14715092 -12395526
3246a2395526K882367K389357J230082q31813k044571O01966N958801Q507186
$$ -12395526 -9513159 -7123802 -5893720 -6725533 -8770104 -8168138 -2209337 6297849
3238F297849O279610L832971L670974J032473o608024j1122174m269621P248453
$$ 6297849 12577459 16410430 20081404 21113877 14505853 3383679 -885942 6362511
3230F362511Q626733j884402j0249596o978195J135833L929631J869274L15537
$$ 6362511 14989244 13104842 2855246 -4122949 -2987116 942515 2811789 3127326
3222C127326r84108l681283l132872M655947J2775965J0922153J189377m201929
$$ 3127326 2143218 -1538065 -4670937 -14990 12760975 23683128 24872505 20670576
3214B0670576q89407K349129j532040p407850p155703j740566K003639J787311
$$ 20670576 19781169 22130298 20598258 13190408 6034705 4294139 6297778 8085089
3206H085089Q60942J285563J754426J195553K87268n97902k074752m138442n505361
$$ 8085089 8946031 10231594 11986020 13181573 13468841 12870939 10796187 6657745 1152384
3197A152384m588804p89212M041535N471207N23626p233863r970966n094594Q37521
$$ 1152384 -3436420 -4225632 -184097 5287110 5810736 -1423127 -11394093 -16488687 -15651166
3188a5651166R33147k404988j473606M893844R413723O797840N39766l159470
$$ -15651166 -14718019 -17123007 -18596613 -13702769 -4289046 2508794 3048560 -110910
3180a10910l735986m619894o059852m433925J455484P208054P358367J396061
$$ -110910 -3846896 -8466790 -14526642 -18960567 -17505083 -10297029 -2938662 -1542601
3172a542601n596689p526246k698672M199885O133104J416790l427347j154356
$$ -1542601 -7139290 -14665536 -17364208 -13164323 -7031219 -5614429 -9041776 -10196132
3164a0196132O433940J0101364N235277k339581n034580l322319k472532l293718
$$ -10196132 -3762192 6339172 11574449 9234868 4200288 877969 -1594563 -4888281
3156d888281k435812p1311k39162l340259m977584l607262k772707l360334m52635
$$ -4888281 -7324093 -7395404 -7634566 -10974825 -15952409 -19559671 -22332378 -25692712 -26145347
3147b6145347P823762J4220450J0925954K52600q721184j0911055p443807q55617
$$ -26145347 -18321585 -4101135 6824819 7077419 -1643765 -12554820 -19998627 -20854244
3139b0854244N501352O311503O0563n703355k526219O362850R677221M291134
$$ -20854244 -15352892 -9041389 -8980826 -14684181 -17210400 -10847550 -1170329 3120805
3131C120805j125545m58177J320961j545931n224302l219492K193662L453404
$$ 3120805 1995260 1537083 2858044 1312113 -3912189 -7131681 -4938019 -1484615
3123a484615m30387k942779k6408N150904P550077N722284J513026k145331k892533
$$ -1484615 -1915002 -4857781 -4884189 266715 7816792 13539076 15052102 12906771 10014238
3114A0014238j103109j12696j969005m065294k851931M30996J426797o04188j748588
$$ 10014238 8911129 8798433 6829428 2764134 -87797 343199 1769996 1165808 -582780
3105e82780N26845L870420M498670J411495l553072p366574p045919k070535L553096
$$ -582780 -55935 3814485 8313155 9724650 6171578 -1194996 -8240915 -10311450 -6758354
3096f758354M434810L69174k767213m24737M627467O132390K534145j672270k372400
$$ -6758354 -2323544 -1954370 -4721583 -5146320 -518853 5613537 8147682 6475412 4103012
3087D103012n33315O11317O48898J702238L815706L799623Q0933l752945l177643
$$ 4103012 3569697 4181014 4829912 6532150 10347856 14147479 14228412 10475467 7297824
3078G297824O99165K538685Q00509q3796K591435M479191O32803n957049p806250
$$ 7297824 7996989 10535674 11336183 11252387 13843822 18323013 18955816 12998767 5192517
3069E192517l635046K06396o16005l036220k751928o56608J56609j77163R4123
$$ 5192517 1557471 1763867 1147862 -1888358 -4640286 -5296894 -5140285 -5317448 -5223325
3060e223325J02536j873657m029091k771169J660087N029808M502875J111543
$$ -5223325 -5120789 -6994446 -11023537 -13794706 -12134619 -7104811 -2601936 -1490393
3052a490393k812622n373072m653996m60914L233382J805390l097657m527462
$$ -1490393 -4303015 -9676087 -14330083 -14790997 -11557615 -9752225 -12849882 -17377344
3044a7377344J93519N454391N626685K766411J936044K792173J348202k326286
$$ -17377344 -17183825 -11729434 -6102749 -3336338 -1400294 1391879 2740081 413795
3036D13795m160888k891962j172136m1144K258869N450142O464845M628750K739516
$$ 413795 -3747093 -6639055 -7811191 -7852335 -5593466 -143324 6321521 10950271 13689787
3027A3689787J715933q90927n349189p666358n437262j431667R16700J401986
$$ 13689787 15405720 14514793 9165604 1499246 -3938016 -5369683 -4452983 -3050997
3019c050997N71959j768245l524448j333098K923493K992735j258113j883994
$$ -3050997 -2479038 -4247283 -7771731 -9104829 -6181336 -3188601 -4446714 -6330708
3011f330708L861217O932650O31548p044907n469373J151087J050449m986750
$$ -6330708 -2469491 4463159 5094707 -1950200 -7419573 -6268486 -5218037 -10204787
3003a0204787n165638L142514R330935O985015J689501j485821m986188q687731
$$ -10204787 -15370425 -12227911 -2896976 4088039 5777540 4291719 -694469 -9382200
2995i382200n796403M344858J0754742O163256j919476l770979j792055k898302
$$ -9382200 -15178603 -10833745 -79003 6084253 4164777 393798 -1398257 -4296559
2987d296559n063020k452453K315866K412597r65692j397508P98509r2428l687111
$$ -4296559 -9359579 -11812032 -9496166 -7083569 -8049261 -9446769 -8648260 -8740688 -12427799
2978a2427799l426781K251150P240258O707981K108597k379796k990796K069232
$$ -12427799 -15854580 -13603430 -6363172 344809 2453406 73610 -2917186 -847954
2970h47954Q594936P400527l732210j3242369r541345K318450P987574M633087
$$ -847954 7746982 15147509 11415299 -1827070 -11368415 -9049965 -1062391 3570696
2962C570696K208634N200718O671007K426430j752414j380092o42642l088126
$$ 3570696 5779330 10980048 17651055 20077485 18325071 16944979 16302337 13214211
2954A3214211m495667j085652L014388K398998j909380o068160q454788p381348
$$ 13214211 8718544 7632892 10647280 13046278 11136898 5068738 -3386050 -10767398
2946a0767398j052196O192570N724744k245260n908542J275023R338428N901963
$$ -10767398 -11819594 -5627024 97720 -2147540 -8056082 -6781059 2557369 8459332
2938H459332n484054j0961211n671840K445127N586519L818187J010400N34794
$$ 8459332 2975278 -7985933 -13657773 -11212646 -5626127 -1807940 -797540 -262746
2930b62746M297656R991537J0645884K581271q015978j2062513q780777m025952
$$ -262746 4034910 14026447 24672331 27253602 19237624 7175111 -1605666 -5631618
2922e631618m08796L466023N993056L292515l109885o916167o009343m020010
$$ -5631618 -6040414 -2574391 3418665 6711180 3601295 -3314872 -9324215 -13344225
2914a3344225k549683Q92443N805167O832164J937215l466962m018525j427750
$$ -13344225 -15893908 -15001465 -9196298 -2364134 -426919 -3893881 -7912406 -9340156
2906i340156n52597k008464k174287J328900O496481Q462222M025698l791801
$$ -9340156 -9892753 -11901217 -14075504 -12746604 -6250123 2212099 6237797 2445996
2898B445996o951629j255989P333658R452090M202505j094297k252532k399131
$$ 2445996 -4505633 -5761622 1572036 11024126 15226631 14132334 11879802 9480671
2890I480671l828408l264754J240596N071176L648027l18701j249224J090883
$$ 9480671 5652263 2387509 3628105 8699281 12347308 12028607 10779383 11870266
2882A1870266K781339K407550J357064p22322n415825j0820963j1914077o528839
$$ 11870266 14651605 17059155 18416219 17693897 12278072 1457109 -10456968 -16985807
2874a6985807J769956P157304O114297n39738p623252q547325j546628P246431
$$ -16985807 -15215851 -8058547 -1944250 -2483988 -10107240 -18654565 -20201193 -12954762
2866a2954762J0085215O879874M508903O272707O676538j56942j0392473j3996575
$$ -12954762 -2869547 4010327 8519230 14791937 21468475 21311533 10919060 -3077515
2858c077515p678496Q52068L120809j12512k491980k194976k947243n972351p064490
$$ -3077515 -10756011 -9903943 -6783134 -6895646 -9387626 -11582602 -14529845 -20502196 -27566686
2849b7566686l346605K147141N511729P205229Q462474O568328p64853q732517
$$ -27566686 -30913291 -28766150 -23254421 -16049192 -7586718 -1018390 -1783243 -10515760
2841a0515760r438096k237414N324324P180000M297610J50562l740872o004002
$$ -10515760 -19953856 -22191270 -16866946 -9686946 -5389336 -5238774 -8979646 -14983648
2833a4983648m440497J33921L045388J751322n96072k29578J944982L044954K869045
$$ -14983648 -19424145 -19290224 -16244836 -14493514 -15089586 -15319164 -13374182 -10329228 -7460183
2824g460183K479557J189620j211709j957956O57896L032177R12380l292448l318324
$$ -7460183 -4980626 -3791006 -5002715 -6960671 -6302775 -3270598 -2358218 -5650666 -8968990
2815h968990J332568M291865J739913k495064l421449j671052m05934P65695M164486
$$ -8968990 -7636422 -3344557 -1604644 -4099708 -7521157 -9192209 -9598143 -8832448 -4667962
2806d667962Q257039Q420224L641584j558399l144760k301042k115348k167560
$$ -4667962 3589077 12009301 15650885 14092486 10947726 8646684 6531336 4363776
2798D363776K30886M373316N570940J360048m577619o918141n344528l974164
$$ 4363776 4594662 8967978 14538918 15898966 11321347 4403206 -941322 -4915486
2790d915486m945502n716129l416706P27535L099114K441519J021258J320204
$$ -4915486 -9860988 -15577117 -18993823 -18266288 -15167174 -12725655 -11704397 -10384193
2782a0384193K959822L304332N64340m072003p340767o716649k247695L849826
$$ -10384193 -7424371 -4120039 -3555699 -7627702 -14968469 -21685118 -23932813 -20082987
2774b0082987Q494380Q995176M969874j46479j418335K119077N841776N267769
$$ -20082987 -11588607 -2593431 2376443 2229964 811629 2930706 8772482 14040251
2766A4040251J700296m73736m91590j412563m128924n453005l198421L19459J498789
$$ 14040251 15740547 15266811 14775221 13362658 9233734 3780729 582308 901767 2400556
2757B400556l31058l267859n274666n147318k947612k21993J887129M476643Q275242
$$ 2400556 2069498 -1198361 -6473027 -11620345 -14567957 -14789950 -12902821 -8426178 -150936
2748a50936J0009885N659620k426894o690790m120366R0761P22392q46381j168392
$$ -150936 9858949 15518569 13091675 6400885 2280519 2371280 3093672 2247291 1078899
2739A078899n80708m54412M72592K240283R61030m352600p007447j824091M950034
$$ 1078899 498191 43779 516371 2756654 3717684 -634916 -7642363 -9466454 -4516420
2730d516420L658130l449347n019467J604408O122212J474496n573421n319985
$$ -4516420 -858290 -4307637 -9327104 -7722696 -1600484 -125988 -5699409 -11019394
2722a1019394J141375N720706N471598L874091L095729J694841q61893k649545
$$ -11019394 -9878019 -4157313 1314285 5188376 8284105 9978946 9117053 6467508
2714F467508k544701j693959j515052k227148k979571k221233Q81564M467445
$$ 6467508 3922807 2228848 713796 -1513352 -4492923 -6714156 -5832592 -1365147
2706a365147N340462L238876J160434L84350j324584m739378o506236m483776
$$ -1365147 3975315 7214191 8374625 8758975 7434391 2695013 -3811223 -8294999
2698h294999j821161j801054k308728k62417J827398j59685l693554k394525L415877
$$ -8294999 -10116160 -11917214 -14225942 -14488359 -12660961 -12820646 -16514200 -18908725 -15492848
2689a5492848O138880K112158l154197l552149n64385Q41225K03765R20717L941685
$$ -15492848 -9353968 -7241810 -10396007 -13948156 -14512541 -13671316 -13467551 -12546834 -8605149
2680h605149O364770N832292L486638K259613L392404M732575K743029k848868
$$ -8605149 -2240379 3591913 7078551 9338164 12730568 17463143 20206172 17357304
2672A7357304p442709o987015l944898l926964o740954o235896m85802L923964
$$ 17357304 9914595 2927580 -1017318 -4944282 -11685236 -17921132 -18406934 -14482970
2664a4482970J504654l514418l568667J098724L938199K241009r22082l571894
$$ -14482970 -12978316 -16492734 -20061401 -18962677 -15024478 -12783469 -13705551 -17277445
2656a7277445o406555p375628k188546P568335J3461281J0790332M568845J101825
$$ -17277445 -23684000 -31059628 -33248174 -25679839 -12218558 -1428226 3140619 4242444
2648D242444p56359m446891o793816k156629O549630R391606K994660m587332
$$ 4242444 3486085 -960806 -7754622 -9911251 -3361621 6029985 9024645 4437313
2640D437313n301481j367127K6978k439210m228732l140097j476026n69771J225188
$$ 4437313 -864168 -2231295 -2204317 -4643527 -8872259 -12012356 -13488382 -14058153 -12832965
2631a2832965L990709M572683J674005j455037k310016l322279o676719q234657
$$ -12832965 -8842256 -4269573 -2595568 -4050605 -6360621 -9682900 -16359619 -24594276
2623b4594276k552298P448036J2618126J0049111O396225O216189M415740l946068
$$ -24594276 -27146574 -19698538 -7080412 2968699 9364924 15581113 19996853 16050785
2615A6050785j2406960j0377664Q64757Q624133N679118j575241m101407j656534
$$ 16050785 3643825 -6733839 -5869082 2755051 8434169 6858928 2757521 1100987
2607A100987Q64197K106249L493506L902304J135453l173015m981018l193077
$$ 1100987 1965184 4071433 7564939 11467243 12602696 9429681 4448663 1255586
2599A255586j83161J626919Q57738k967564p442820p695523k611259J865106Q1606
$$ 1255586 1072425 2699344 3557082 589518 -6853302 -14548825 -17160084 -15294978 -15213372
2590a5213372m970434n758858q96356L876362M417577K228818J27155n87737J343222
$$ -15213372 -20183806 -25942664 -26839020 -22962658 -18545081 -16316263 -16189108 -16776845 -15433623
2581a5433623N924253Q946326N801891j224048n080954l921756k802358m361539
$$ -15433623 -9509370 -563044 5238847 4014799 -1066155 -4987911 -7790269 -12151808
2573a2151808m556624j26458N796884Q482544O807048J519382n844883j0227303
$$ -12151808 -16708432 -16834890 -11038006 -2555462 4251586 5770968 -73915 -10301218
2565a0301218o268564K543357N430580p56303o152845k989317K483070J266891
$$ -10301218 -16569782 -14026425 -8595845 -9352148 -15504993 -18494310 -16011240 -14744349
2557a4744349l037259r43600O284201Q799643M439436R18748K080198L109014
$$ -14744349 -17781608 -18725208 -12441007 -3641364 798072 1716820 3797018 6906032
2549F906032Q38882j296492j136928j694416m114577m706894k297942j179300
$$ 6906032 7744914 6448422 5311494 3617078 -497499 -5204393 -7502335 -8681635
2541h681635l206780m028106j174091R16877j126302k668806J912968R515360
$$ -8681635 -11888415 -15916521 -17090612 -16173735 -17300037 -19968843 -18055875 -8540515
2533h540515J1621655N145968m551186r951429p609185J9767O410117O404109
$$ -8540515 3081140 8227108 3675922 -6275507 -13884692 -13864925 -7454808 -1050699
2525a050699J541574j997559j327741N05896K72002j483108l333802n068167n433188
$$ -1050699 490875 -1506684 -2834425 -2328529 -2056527 -3539635 -6873437 -11941604 -17374792
2516a7374792k837854K12842q51054m502320l885346J633614L718436j604615
$$ -17374792 -20212646 -19999804 -20850858 -25353178 -29238524 -27604910 -23886474 -25491089
2508b5491089o095482j480884P755867J1816618R693309O911573M475366K26643
$$ -25491089 -31586571 -33067455 -25311588 -13494970 -3801661 3109912 7585278 7811921
2500G811921k557301J042275O948140O029438j647039o811348n656635m023631
$$ 7811921 5254620 6296895 13245035 19274473 17627434 10816086 5159451 1135820
2492A135820n275398m700865K42786L902558K136347j4837L285466Q843887R486004
$$ 1135820 -4139578 -8840443 -8597657 -4695099 -2558752 -2573589 711877 9555764 19041768
2483A9041768M299212k164304p121815j0162304r598770m149175L096367P084038
$$ 19041768 23340980 21176676 14054861 3892557 -5706213 -9855388 -6759021 325017
2475C25017O442762L530040K98835k761615n033957o111656o561747o208209l589371
$$ 325017 6767779 10297819 10596654 7835039 2801082 -3310574 -9872321 -16080530 -19669901
2466a9669901O56818K514575j53020l416987k091941K990037O491520O219555
$$ -19669901 -19013083 -16498508 -16651528 -20068515 -22160456 -19170419 -12678899 -6459344
2458f459344M963570M764194L623168m65397n076567n500421q01276M024031L064882
$$ -6459344 -1495774 3268420 6891588 6426191 1349624 -4150797 -4952073 -928042 2136840
2449B136840l378144q216205n559826K057888O997880N928478K089458j267920
$$ 2136840 -1241304 -9457509 -15017335 -12959447 -5961567 -33089 2056369 788449
2441G88449m200221n664345k255763M848810P534370J269148o375490m997750
$$ 788449 -3411772 -9076117 -11331880 -6483070 1051300 2320448 -4055042 -9052792
2433i052792L579056P876689L699661o10033J953115O615614N592295P28892j83959
$$ -9052792 -5473736 2402953 6102614 5492581 7445696 14061310 19653605 20382497 20198538
2424B0198538L551990M333731j783099q932586r795317m963651k21136J874679
$$ 20198538 23750528 28084259 26301160 17368574 7573257 2609606 2388470 4263149
2416D263149K832272K546479j339712p419727r054891k311377P569958J1345117
$$ 4263149 7095421 9641900 8302188 882461 -8172430 -10483807 -2913849 8431268
2408H431268N976949l393178j0160293j1297834o878452P03974O523723O422824
$$ 8431268 14408217 11015039 854746 -10443088 -17321540 -16617566 -10093843 -3671019
2400c671019K006530r25293J637J282435k4170j641326m74833J930343J735343
$$ -3671019 -1664489 -2589782 -2588145 -1305710 -1329880 -2971206 -3446039 -1515696 219647
2391B19647j676872n367754o220692k834023L369770P293767M135314l416959
$$ 219647 -1457225 -6824979 -13045671 -15879694 -12509924 -5216157 -1080843 -4497802
$$ [...]
##END NTUPLES=NMR SPECTRUM
##END=
