##TITLE=31Pdec_DE-78_old_TFA
DMSO-d6, 64 sc
 22.8.2025
##JCAMPDX= 6.0         $$ Bruker NMR JCAMP-DX V2.0
##DATA TYPE= NMR SPECTRUM
##DATA CLASS= NTUPLES
##ORIGIN= UXNMR, Bruker Analytische Messtechnik GmbH
##OWNER= root
$$ XWIN-NMR		Version 3.5
$$ Fri Aug 22 13:42:51 2025 Russian Standard Time (UT+4h)  she@DPX200
##.OBSERVE FREQUENCY= 81.013821
##.OBSERVE NUCLEUS= ^31P
##.ACQUISITION MODE= SIMULTANEOUS
##.ACQUISITION SCHEME= undefined
##.AVERAGES= 64
##.DIGITISER RES= 17
##SPECTROMETER/DATA SYSTEM= spect
##.PULSE SEQUENCE= zgpg30
##.SOLVENT NAME= DMSO
##.SHIFT REFERENCE= (INTERNAL, DMSO, 0, 198.062)
##AUDIT TRAIL= $$ (NUMBER, WHEN, WHO, WHERE, WHAT)
$$ ##TITLE= Audit trail, XWIN-NMR		Version 3.5
$$ ##JCAMPDX= 5.01
$$ ##ORIGIN= Bruker BioSpin GmbH
$$ ##OWNER= she
$$ F:/spectra/data/she/nmr/P31/2/pdata/1/auditp.txt
$$ ##AUDIT TRAIL=  $$ (NUMBER, WHEN, WHO, WHERE, WHAT)
(   1,<2025-08-22 13:41:25.00 +0400>,<she>,<DPX200>,
      <created by zg, POWCHK disabled, PULCHK disabled
       configuration hash MD5:
       00 E9 B6 7A A2 85 ED C7 34 08 36 98 17 FE 4E 26
       data hash MD5: 32K
       98 83 EC 61 94 81 52 FF 1F 30 0B 8D C6 F1 02 D2>)
(   2,<2025-08-22 13:41:27.18 +0400>,<she>,<DPX200>,
      <Start of raw data processing
       efp BC_mod = 2 LB = 1.5 FT_mod = 6 PKNL = 1 PHC0 = 1587.094 PHC1 = -437.5005 SI = 64K 
       data hash MD5: 64K
       04 83 13 64 FA 4C B4 B6 D7 6F AA 1A 36 5C 2A AE>)
(   3,<2025-08-22 13:41:46.79 +0400>,<she>,<DPX200>,
      <pk PHC0 = -14.2734 PHC1 = 0 
       data hash MD5: 64K
       AD 34 D4 40 A0 70 61 92 3F D5 AA E7 DB F7 66 4C>)
(   4,<2025-08-22 13:41:51.31 +0400>,<she>,<DPX200>,
      <abs ABSG = 5 
       data hash MD5: 64K
       94 49 D1 B7 01 41 3E 14 26 BB 06 9A A5 30 94 BD>)
$$ ##END=
$$ 
$$ hash MD5
$$ A7 A3 1D C1 BC 13 F4 9F C3 06 09 34 1A E3 DB A6
##$RELAX= 
##$RELAX= 
##$RELAX= 
##$RELAX= 
##$RELAX= 
##$RELAX= 
##$RELAX= 
##$RELAX= 
$$ Bruker specific parameters
$$ --------------------------
##$DU= <F:/spectra>
##$EXPNO= 2
##$NAME= <P31>
##$PROCNO= 1
##$TYPE= <nmr>
##$USER= <she>
##$AMP= (0..31)
100 100 100 100 100 100 100 100 100 100 100 100 100 100 100 100 100 100 
100 100 100 100 100 100 100 100 100 100 100 100 100 100 
##$AQSEQ= 0
##$AQ_mod= 1
##$AUNM= <au_zg>
##$AUTOPOS= <>
##$BF1= 81.014009
##$BF2= 200.13
##$BF3= 200.13
##$BF4= 200.13
##$BF5= 200.13
##$BF6= 200.13
##$BF7= 200.13
##$BF8= 200.13
##$BYTORDA= 1
##$CFDGTYP= 0
##$CFRGTYP= 5
##$CHEMSTR= <none>
##$CNST= (0..31)
1 1 145 1 1 1 1 1 1 1 1 1 1 1 1 1 1 1 1 1 1 1 1 1 1 1 1 1 1 1 1 1 
##$CPDPRG= <waltz16>
##$CPDPRG1= <>
##$CPDPRG2= <waltz16>
##$CPDPRG3= <>
##$CPDPRG4= <mlev>
##$CPDPRG5= <mlev>
##$CPDPRG6= <mlev>
##$CPDPRG7= <mlev>
##$CPDPRG8= <mlev>
##$CPDPRGB= <>
##$CPDPRGT= <>
##$D= (0..31)
0 1 0 0 0 0 0 0 0 0.06 0 0.03 2e-05 3e-06 0 0 0.0002 0 0 0 0 0 0 0 0 0 
0 0 0 0 0 0 
##$DATE= 1755855684
##$DBL= (0..7)
120 120 120 11 120 120 24 19 
##$DBP= (0..7)
150 150 150 150 150 150 150 150 
##$DBP07= 0
##$DBPNAM0= <>
##$DBPNAM1= <>
$$ [...]
##$SUBNAM3= <"">
##$SUBNAM4= <"">
##$SUBNAM5= <"">
##$SUBNAM6= <"">
##$SUBNAM7= <"">
##$SUBNAM8= <"">
##$SUBNAM9= <"">
##$SW= 400.765351723535
##$SWIBOX= (0..15)
0 1 3 0 0 0 0 0 0 0 0 0 0 0 0 0 
##$SW_h= 32467.5324675325
##$TD= 32768
##$TD0= 1
##$TE= 0
##$TE2= 300
##$TE3= 300
##$TEG= 300
##$TL= (0..7)
0 120 53 12 22 120 120 120 
##$TP= (0..7)
150 150 150 150 150 150 150 150 
##$TP07= 0
##$TPNAME0= <>
##$TPNAME1= <>
##$TPNAME2= <>
##$TPNAME3= <>
##$TPNAME4= <>
##$TPNAME5= <>
##$TPNAME6= <>
##$TPNAME7= <>
##$TPOAL= (0..7)
0.5 0.5 0.5 0.5 0.5 0.5 0.5 0.5 
##$TPOFFS= (0..7)
0 0 0 0 0 0 0 0 
##$TUNHIN= 0
##$TUNHOUT= 0
##$TUNXOUT= 0
##$USERA1= <user>
##$USERA2= <user>
##$USERA3= <user>
##$USERA4= <user>
##$USERA5= <user>
##$V9= 5
##$VALIST= <valist>
##$VCLIST= <CCCCCCCCCCCCCCC>
##$VD= 0
##$VDLIST= <DDDDDDDDDDDDDDD>
##$VPLIST= <PPPPPPPPPPPPPPP>
##$VTLIST= <TTTTTTTTTTTTTTT>
##$WBST= 1024
##$WBSW= 4
##$XGAIN= (0..3)
0 0 0 0 
##$XL= 0
##$YL= 0
##$YMAX_a= 10791
##$YMIN_a= -21976
##$ZGOPTNS= <>
##$ZL1= 120
##$ZL2= 120
##$ZL3= 120
##$ZL4= 120
##$ABSF1= 198.0616
##$ABSF2= -202.7028
##$ABSG= 5
##$ABSL= 3
##$ALPHA= 0
##$AQORDER= 0
##$ASSFAC= 0
##$ASSFACI= 0
##$ASSFACX= 0
##$ASSWID= 0
##$AUNMP= <proc_1d>
##$AZFE= 0.1
##$AZFW= 0.5
##$BCFW= 0
##$BC_mod= 2
##$BYTORDP= 0
##$COROFFS= 0
##$CY= -3
##$DATMOD= 1
##$DC= 0
##$DFILT= <>
##$DTYPP= 0
##$F1P= 0
##$F2P= 0
##$FCOR= 1
##$FTSIZE= 65536
##$FT_mod= 6
##$GAMMA= 0
##$GB= 0
##$INTBC= 1
##$INTSCL= 9.790993e-09
##$ISEN= 30
##$LB= 1.5
##$LEV0= 0
##$LPBIN= 0
##$MAXI= 10000
##$MC2= 0
##$MEAN= 0
##$ME_mod= 0
##$MI= 50
##$NCOEF= 0
##$NC_proc= -9
##$NLEV= 6
##$NOISF1= 182.463
##$NOISF2= 159.3651
##$NSP= 0
##$NTH_PI= 0
##$NZP= 0
##$OFFSET= 198.0616
##$PC= 4
##$PHC0= 1572.821
##$PHC1= -437.5005
##$PH_mod= 1
##$PKNL= yes
##$PPARMOD= 0
##$PSCAL= 0
##$PSIGN= 0
##$REVERSE= no
##$SF= 81.0140089999434
##$SI= 65536
##$SIGF1= 159.3651
##$SIGF2= -187.1042
##$SINO= 113.3802
##$SIOLD= 16384
##$SREGLST= <1H.CDCl3>
##$SSB= 0
##$STSI= 65536
##$STSR= 0
##$SW_p= 32467.5324675325
##$SYMM= 0
##$S_DEV= 0
##$TDeff= 32768
##$TDoff= 0
##$TI= <>
##$TILT= no
##$TM1= 0
##$TM2= 0
##$TOPLEV= 0
##$USERP1= <user>
##$USERP2= <user>
##$USERP3= <user>
##$USERP4= <user>
##$USERP5= <user>
##$WDW= 1
##$XDIM= 65536
##$YMAX_p= 540676392
##$YMIN_p= -70047089
$$ End of Bruker specific parameters
$$ ---------------------------------
##NTUPLES= NMR SPECTRUM
##VAR_NAME=  FREQUENCY,     SPECTRUM/REAL,   SPECTRUM/IMAG
##SYMBOL=    X,             R,               I
##VAR_TYPE=  INDEPENDENT,   DEPENDENT,       DEPENDENT
##VAR_FORM=  AFFN,          ASDF,            ASDF
##VAR_DIM=   65536,         65536,           65536
##UNITS=     HZ,            ARBITRARY UNITS, ARBITRARY UNITS
##FACTOR=    0.49542278885378, 1,            1
##FIRST=     16045.7642231865, 0,            0
##LAST=      -16421.768244346, 0,            0
##MIN=       -16421.768244346, -70047089,    0
##MAX=       16045.7642231865, 540676392,    0
$$ Real data points
##PAGE= N=1
##DATA TABLE= (X++(R..R)), XYDATA
$$ [...]
42982c156756K533799L974971p42733m737385k437166K603954L005576j183614
42974a39354l048106l98153R88935k281623n355694l456758P05165K558617K666953
42965g760018K900341J307534l130069n578749j941565L534557M135354R56675
42957e575940J46788K361131K666127j2768q13190K963208P561071P881835K915576
42948B0093838m263814q738222o802677p1936M882892M069827N78373j930353
42940G817928n633447j2354105j5582080p816170O222882J3534953R933885L698790
42932a77364J341901j8571l198742m068646K67126M524356L119545j027673k046059
42923a284127n40842r28561l157638l596443j687483O8307R87853K159791L219570
$$ plain form
42982 -3156756 -622957 3352014 2609281 -2128104 -4565270 -1961316 1044260 -139354
42974 -139354 -3187460 -3585613 -2596678 -4878301 -10233995 -13690753 -12985588 -10426971 -7760018
42965 -7760018 -4859677 -3552143 -6682212 -12260961 -14202526 -10667969 -6532615 -5575940
42957 -5575940 -5429152 -3068021 -401894 -414662 -1227852 1735356 9296427 17178262 20093838
42948 20093838 15830024 7091802 289125 217189 5100081 9169908 9748281 7817928
42940 7817928 2184481 -10169624 -25751704 -33567874 -27344992 -13810039 -3876154 -177364
42932 -177364 1164537 1145966 -2052776 -6121422 -5854296 -1329940 1789605 761932 -1284127
42923 -1284127 -1824969 -2753530 -5911168 -9507611 -11195094 -11126787 -10138934 -7979143 -4759573
42914d759573L445576M052112N326367M184140o51658l988361p92901M650977
42906A1466679L386607n020243j1431296j0198712n701559l224773q72564M199806
42898a7396055P604933L442656m728762o877080o48150M947339K507274l566022
42890a4713867m542822k22031K321589O57184J79912M477957R244377R018242
42882F420541M953529J720642M58825n26483r59962K13129O12842l015348q574374
42873A303341j0269130o703821k287073O3279K306040N720242P163532M062422
42865A358832o33555k120159j45086J338823l71362l930380n843983l867994P17834
42856a3497030L848972K881491k38170j804211j388268j083146p61219J564999
$$ plain form
42914 -4759573 -1313997 2738115 8064482 12248622 11596964 7608603 6815702 11466679
42906 11466679 14853286 9833043 -1598253 -11796965 -17498524 -20723297 -21595861 -17396055
42898 -17396055 -9791122 -6348466 -11077228 -17954308 -18602458 -13655119 -11147845 -14713867
42890 -14713867 -19256689 -19478720 -17157131 -16499947 -16320035 -11842078 -2597701 6420541
42882 6420541 11374070 13094712 13553537 13027054 12067092 12280221 12893063 9877715 1303341
42873 1303341 -8965789 -15669610 -17956683 -17893404 -15587364 -9867122 -2703590 1358832
42865 1358832 725277 -1394882 -1539968 -201145 -572507 -4502887 -10346870 -14214864 -13497030
42856 -13497030 -9648058 -6766567 -7004737 -8808948 -10197216 -11280362 -12041581 -10476582
42848a0476582M876852N670264L893178K991453L085681M30715m307841m543813
42840A619907J343996M797720q72484r173393r224709j734159K983529R84226
42832i275367j092026J429373L852757J113418l007028j579987M453532P168869
42824C063541K860668k734482k264880L244703N832146J763344l010072j567284
42816G187684L199375K513002m525704q773835m828923P90277L11213l168357
42808g295268j600250M685014Q093210N707980J688796j128519l738032n137786
42800A275145k239579L136389M690777J000570k350179j933491q62526j615104
42792A102002j666107K38922M39716k422606l022887K060799O881866M022196
$$ plain form
42848 -10476582 -5599730 70534 3963712 6955165 10040846 10471561 6163720 1619907
42840 1619907 2963903 7761623 6889139 -2284254 -11508963 -13243122 -10259593 -9275367
42832 -9275367 -10367393 -8938020 -5085263 -3971845 -6978873 -8558860 -4105328 3063541
42824 3063541 5924209 3189727 924847 4169550 10001696 11765040 8754968 7187684
42816 7187684 10387059 12900061 8374357 -399478 -5228401 -4438124 -4126911 -7295268
42808 -7295268 -8895518 -4210504 3882706 9590686 11279482 10150963 6412931 1275145
42800 1275145 -964434 2171955 6862732 7863302 5513123 3579632 2717106 1102002
42792 1102002 -564105 -325183 114533 -2308073 -5330960 -3270161 3611705 7633901
42784G633901l997684q282143o040024k489528j446791q59415J661138M496227
42776i324319M978961L042888N35267o28575Q13015M135537N925107L327033j807494
42767A0997420m597699l256683r49189r53719k587662l221753k233262j074083
42759g876630n23510J35333J242303J718364P81588l16649J45290J354298P45736
42750b593877j539398j750091J829807N057289L302423j437077l425979j898589
42742b455492j293362l056574l563715j303014M59475L89813J661638M513237
42734d647994L373788l566759q729775n666754Q30962K820988J764126L597230
42726a0224188O001409K246606m539232l836829M748310R185993L637135k742661
$$ plain form
42784 7633901 3636217 -4645926 -10685950 -13175478 -14622269 -15481684 -13820546 -9324319
42776 -9324319 -4345358 -1302470 -767203 -1395778 -582763 3552774 9477881 12804914 10997420
42767 10997420 6399721 3143038 2193849 1240130 -1347532 -4569285 -6802547 -7876630
42759 -7876630 -8400140 -8264807 -7022504 -5304140 -4522552 -4839201 -4693911 -3339613 -2593877
42750 -2593877 -4133275 -5883366 -4053559 1003730 4306153 2869076 -556903 -2455492
42742 -2455492 -3748854 -6805428 -10369143 -11672157 -11212682 -10822869 -9161231 -4647994
42734 -4647994 -1274206 -4840965 -13570740 -19237494 -18406532 -15585544 -13821418 -10224188
42726 -10224188 -4222779 -1976173 -6515405 -10352234 -5603924 3582069 7219204 4476543
42718D476543j442810K059285r23536p051444o939303p71795K690162l1032l880713
42709a1814643m797955l825994j624733L171254Q674827R462124L884186l082006
42701D7060o090879m690444j246262K474578N239714N997404M765617J906269
42693H403057k862106q022873q674400k082607O311907Q106520K907452j942955
42685B143995k633378k604014l699994k009725L505274N975481L83833p448008
42677f386536q445828k622009K813635M055777K533387p02524m846773n738710
42669a9339581k89422O555891P031025K091713l62295J439957J217146k804573
42661d460139l672774J677031N083523o88277r762031j1211260m335138K287952
$$ plain form
42718 4476543 3033733 5093018 4169482 -2881962 -9821265 -10593060 -7902898 -7933930 -11814643
42709 -11814643 -16612598 -20438592 -22063325 -18892071 -10217244 -755120 3129066 47060
42701 47060 -6043819 -10734263 -11980525 -9505947 -4266233 1731171 6496788 8403057
42693 8403057 5540951 -2481922 -11156322 -13238929 -6927022 1179498 4086950 2143995
42685 2143995 -489383 -3093397 -6793391 -8803116 -5297842 677639 1061472 -6386536
42677 -6386536 -14832364 -17454373 -14640738 -10584961 -8051574 -8754098 -13600871 -19339581
42669 -19339581 -19629003 -13073112 -6042087 -3950374 -4312669 -2872712 -1655566 -4460139
42661 -4460139 -8132913 -6455882 -1372359 -2060636 -11822667 -23033927 -27369065 -25081113
42653b5081113L716068K532158J547315K95506j225464j466013l51091J164737
42645a8867897L766887P399371Q042990K832719l179126k601487K555092K912996
42637B861545l646050q242718m761991J375317L160170K749566N210579P834052
42629F540470M509522k816856o121732l596305j578172l616928n272457k244528
42621a4196986K426045K935424j317124n700705o147633k654662J591821L227391
42613a9836429J853379K85576M27899L17548j767159k084474M225358J3650131
42605b928171J5818623O969022m118435p558758m342211j815297k169635k385695
42597b530557k276795m308588o390893l228155M027110P232387K986405k151250
$$ plain form
42653 -25081113 -21365045 -18832887 -17285572 -16990066 -18215530 -19681543 -20032634 -18867897
42645 -18867897 -15101010 -7701639 341351 3174070 -5056 -2606543 -51451 2861545
42637 2861545 -784505 -9027223 -13789214 -12413897 -9253727 -6504161 -1293582 6540470
42629 6540470 11049992 8233136 2111404 -1484901 -3063073 -6680001 -11952458 -14196986
42621 -14196986 -11770941 -8835517 -10152641 -15853346 -22000979 -24655641 -23063820 -19836429
42613 -19836429 -17983050 -17697474 -17269575 -16952027 -18719186 -20803660 -16578302 -2928171
42605 -2928171 12890452 19859474 15741039 8182281 3840070 2024773 -144862 -2530557
42597 -2530557 -4807352 -9115940 -15506833 -18734988 -14707878 -7475491 -4489086 -6640336
42589f640336k044487p6933k245791o300189n086315J614768N869089K526457
42581a2383737m162111o297771j111698P183960J1900944R728768L880192R99818
42573I738365L335386N697151K791517k833585m481389j194116J529026M47223
42565A5029578j773568k321511k019367j820622q19975K51639j299733m548630
42557F77811m201808J507870P102891P545942M815549K771230L90915m607653
42549A6002747r506456r948598o722568l521709m80191M179812Q200006P332020
42541E535063K323063j880416l228621l688459m236211l988556l354802k862543
42533a5381482l00324N182066P979795K317675p343476j0384696m844676L97195
$$ plain form
42589 -6640336 -8684823 -8761756 -11007547 -17307736 -22394051 -20779283 -14910194 -12383737
42581 -12383737 -16545848 -22843619 -23955317 -16771357 -4870413 4858355 8738547 9738365
42573 9738365 13073751 18770902 21562419 18728834 14247445 13053329 14582355 15029578
42565 15029578 13256010 10934499 8915132 7094510 6274535 6526174 5226441 677811
42557 677811 -3523997 -2016127 5086764 12632706 17448255 20219485 20610400 16002747
42549 16002747 6496291 -3452307 -10174875 -13696584 -14176775 -9996963 -1796957 5535063
42541 5535063 7858126 5977710 2749089 -939370 -5175581 -9164137 -12518939 -15381482
42533 -15381482 -15681806 -10499740 -2519945 -202270 -7545746 -17930442 -22775118 -22377923
42525b2377923j24211q68287M328144J1925114J3886463P990766j351152q409417
42517D999497r309305m358107N24083l36772l585551n06663Q657861J2674302
42509H759345N752975l068040l678156K72792p26636n797552n945709Q92497P400170
42500C861686Q354126N709652K443431r20963l276428l088230k099993l312785
42492G670496n344976m193031l05026J517372p76520m299634n785560m072885
42484a5589764O13723N326425M637643k170536o787213j766964P417908Q542387
42476B23609j23812p781290o803356j242751K372625L764636M697012L811780
42468a081547N30809j719193p78047L36025j352697l767380l488713r38608J020954
$$ plain form
42525 -22377923 -22502134 -23370421 -19042277 -7117163 6769300 14760066 13408914 4999497
42517 4999497 -4309808 -8667915 -8143832 -8480604 -12066155 -12572818 -3914957 8759345
42509 8759345 14512320 11444280 7766124 8038916 7312280 1514728 -4430981 -3538484 3861686
42500 3861686 12215812 17925464 20368895 19447932 16171504 13083274 10983281 7670496
42492 7670496 2325520 -1867511 -2172537 -655165 -1431685 -5731319 -11516879 -15589764
42484 -15589764 -14976041 -9649616 -5011973 -7182509 -13969722 -15736686 -8318778 223609
42476 223609 99797 -7681493 -14484849 -15727600 -13354975 -9590339 -4893327 -1081547
42468 -1081547 -550738 -2269931 -3047978 -2711953 -4064650 -7832030 -11320743 -12259351 -11238397
42459a1238397N92415k610011p219131r061970m720524K898896P289495P262041
42451a6807186P466599R328804Q532485L554912o04599m41480J019000N95375
42443A2643910k66297n49979k543044n787086n459233j168162L81564l382510
42435f130837n305830m49009M953983M322619K011889M110249N855637k0201q550478
42426G98022r122736k662372J046993L64408K099277O040098M068563l778257
42418a146004o824166j167555L695880J063365k418989N92208N757140N701727
42410E253606K165927O40287J24235k720762n142739l162450p5058j009564l074015
42401g000533n14976L447033O39624p190261q598765M92453R842950R309156K289083
$$ plain form
42459 -11238397 -10645982 -13255993 -20475124 -29537094 -34257618 -31358722 -24069227 -16807186
42451 -16807186 -9340587 -11783 8520702 12075614 11471015 11029535 12048535 12643910
42443 12643910 12377613 11827634 9284590 3497504 -1961729 -3129891 -2748327 -6130837
42435 -6130837 -11436667 -11885676 -6931693 -2609074 -597185 3513064 9368701 9348500 798022
42426 798022 -8324714 -10987086 -9940093 -9575685 -7476408 -1436310 2632253 -1146004
42418 -1146004 -7970170 -9137725 -5441845 -4378480 -6797469 -6205261 -448121 5253606
42410 5253606 7419533 8059820 8184055 5463293 320554 -2841896 -2916954 -3926518 -7000533
42401 -7000533 -7515509 -4068476 -3428852 -10619113 -19217878 -18725425 -8882475 426681 2715764
42392B715764j097568J464498L788610K113200m02336k81374Q65675k08186l051876
42383E906407m576908l762548k395637j567988k43809K023623L414747K437918
42375A235805L29956j092486k349718m504929n734173l090201K506707O490766
42367f208273O499335M832022M008929L065311J98531l499999n477357n330077
42359a911578m700539m481605m014515k582342l52302J841803K937642K440193
42351a0823243J156912L17443p6515p46630j133759J04617K347657L105179J607394
42342d140945m9545l84560o94958k197106l320319j976897J078856L211682L136154
42333e337638J615122O6861j48943J660690M158410M369164Q43349m430441q088734
$$ plain form
42392 2715764 1618196 3082694 6871304 8984504 8582168 8300794 9166469 8958283 5906407
42383 5906407 1329499 -2433049 -4828686 -6396674 -6640483 -4616860 -1202113 1235805
42375 1235805 1565761 473275 -1876443 -6381372 -12115545 -15205746 -12699039 -6208273
42367 -6208273 291062 5123084 9132013 12197324 12395855 8895856 3418499 -1911578
42359 -1911578 -6612117 -11093722 -15108237 -17690579 -18042881 -16201078 -13263436 -10823243
42351 -10823243 -9666331 -9348888 -9425403 -10172033 -11305792 -11201175 -8853518 -5748339 -4140945
42342 -4140945 -4190490 -4575050 -5270008 -7467114 -10787433 -12764330 -11685474 -8473792 -5337638
42333 -5337638 -3722516 -3655655 -3804598 -2143908 2014502 6383666 7227015 2796574 -5292160
42324e292160q213721m836037J80077L109045J211320k752829j951693N898853
42316a2647145J3910813J3383933M204828n305949p824056l395270K498098M177748
42308I003000j46226o593614q517536l812158J788527J888456j449420m06222
42300h245193O789650J2169839Q554047m42157n017113j892424J975369r90133
42292A2901885q924104j2746236p701692M51355K779048j294122l778264L31733
42284a7980397O053792N853087K11354l979950l433502j388831r91293j237870
42276a6893610n64957L22329R93357K483791L907173K025374l067242n835300
42268a6629085k602411K413119K901905l06792j266232J239453K184225o58547
$$ plain form
42324 -5292160 -13505881 -18341918 -18161841 -15052796 -13841476 -16594305 -18545998 -12647145
42316 -12647145 1263668 14647601 18852429 13546480 5722424 2327154 4825252 9003000
42308 9003000 8856774 2263160 -6254376 -10066534 -8278007 -6389551 -7838971 -8245193
42300 -8245193 -1455543 10714296 19268343 18826186 13809073 11916649 13892018 12901885
42292 12901885 3977781 -8768455 -16470147 -16018792 -13239744 -14533866 -18312130 -17980397
42284 -17980397 -11926605 -6073518 -5862164 -9842114 -13275616 -14664447 -15655740 -16893610
42276 -16893610 -17458567 -17136238 -16142881 -13659090 -9751917 -7726543 -10793785 -16629085
42268 -16629085 -19231496 -16818377 -13916472 -14223264 -15489496 -14250043 -12065818 -12724365
42260a2724365k344374J535898P437651Q557251M290728L34502L59322K105779
42252I552392K194648P73027l29002r30842j498494r84085J320814K911690L56858
42243A3367006n461582r431372q522677n406929m106403m309125k674966J464527
42235b5081521M917743N246902L655349K228890Q39572j239839k491915o93930
42227a2618749L307139O076123O052487M994905M293333K593103j235431n214722
42219H248188o821950o478926n553112k794945L107478Q597591Q171580K609263
42211I085167j251055m77373J56006k752475m733832j284976L306315K154024
42203D201801l031405n049469l071788k424029l452908o00216N852493O993669
$$ plain form
42260 -12724365 -15068739 -13532841 -6095190 2462061 6752789 7087291 7446613 9552392
42252 9552392 11747040 12520067 12191065 11260223 9761729 8777644 10098458 13010148 13367006
42243 13367006 7905424 -1525948 -10048625 -15455554 -19561957 -23871082 -26546048 -25081521
42235 -25081521 -20163778 -14916876 -11261527 -9032637 -8193065 -9432904 -11924819 -12618749
42227 -12618749 -9311610 -3235487 2817000 7811905 12105238 14698341 13462910 8248188
42219 8248188 1426238 -5052688 -10605800 -13400745 -10293267 -1695676 6475904 9085167
42211 9085167 7834112 7356739 7512745 4760270 26438 -1258538 2047777 4201801
42203 4201801 1170396 -3879073 -6950861 -9374890 -12827798 -13428014 -7575521 -581852
42195e81852j511464j1406492j2301360m088429N786517J1711193J1873458O606340
42187F087911J6368j842324Q11147P55006m120297n575542J259722P247276K436626
42178G075893p064679q025206j094200J537566k689056l664569J879780L782370
42170h262101l280827r156049m130271N932543R934746P947581O969265P204412
42162A3159299L497286l563615p874895p089325l807351L46310M753998O328694
42154E750401L084881j011911j505069j016822l959724o738498k482745O013372
42146a866115Q361148K235495l076438j229154K572080J750538j290623r96443
42138F460488J555344J502512j219218k568363j407658l63865q38896j459566
$$ plain form
42195 -581852 -2093316 -13499808 -25801168 -29889597 -24103080 -12391887 -518429 6087911
42187 6087911 6104279 4261955 5073102 5828108 1707811 -3867731 -2608009 4639267 7075893
42178 7075893 11214 -8013992 -9108192 -7570626 -10259682 -13924251 -12044471 -8262101
42170 -8262101 -11542928 -20698977 -24829248 -18896705 -8961959 -1014378 5954887 13159299
42162 13159299 16656585 13092970 5218075 -1871250 -5678601 -5332291 -578293 5750401
42154 5750401 8835282 7823371 6318302 5301480 1341756 -5396742 -7879487 -1866115
42146 -1866115 6495033 8730528 5654090 4424936 6997016 8747554 7456931 6460488
42138 6460488 8015832 9518344 8299126 5730763 4323105 3959240 3120344 1660778
42130A660778q81161Q81730K992526L460743J19837n605141q205092m532685J309284
42121h799181L152146J123773O22049L834800O860759N800634J857654r73076
42113A3479558o20858J847226L755596K853381m28192k626347j266181J050797
42105A8044980k44601m284783m829162L29735M564426J201441o120599p653186
42097A008251j087256N232833L820682k808310p385919p587582o038998l838341
42089a8684640L03217N256991P039930M240804K31713j287379j98173J452067
42081a645470K039132O29635k542115m735271k640714K881670O574973M841945
42073E403785l22135m657278o045475m244550K28506M693993N266298J997966
$$ plain form
42130 1660778 779617 1661347 4653873 8114616 8234453 2629312 -5575780 -10108465 -8799181
42121 -8799181 -5647035 -4523262 -3901213 -66413 6794346 12594980 14452634 13479558
42113 13479558 12858700 14705926 18461522 21314903 20886711 18260364 16994183 18044980
42105 18044980 17800379 13515596 8686434 9016169 13580595 14782036 8661437 1008251
42097 1008251 -79005 5153828 8974510 6166200 -1219719 -8807301 -14846299 -18684640
42089 -18684640 -18381423 -13124432 -6084502 -1843698 -1611985 -2899364 -3097537 -1645470
42081 -1645470 393662 1023297 -1518818 -6254089 -8894803 -6013133 561840 5403785
42073 5403785 5081650 424372 -5621103 -9865653 -9637147 -4943154 323144 2321110
42065B321110k76706Q85209J561862j481402m312464k070555K248876K399574
42057A275504n50048n19740K236343J336734l876258o286433k955660K12431o88422
42048i815549j273493J535015K714384j013760k944779K819773R249780O097871
42040G369242k981248n309571R50052M657206Q2889n191138m176514p04698n0592
42031e354372N50111M347489O285603J066296n711833m501530L257505P061412
42023G000681L125902j465315j484344j160901n221508r719341p799094m64372
42015a7188292M521850L095639p05960r97537K917756O819394O559732J490643
42007F513225n626795j0516475r710823k914828N881423J0676225Q643321L147300
$$ plain form
42065 2321110 2044404 2929613 4491475 3010073 -1302391 -3372946 -1124070 1275504
42057 1275504 725456 205716 2442059 3778793 -97465 -6383898 -9339558 -9127127 -9815549
42048 -9815549 -11089042 -9554027 -6839643 -7853403 -10798182 -7978409 1271371 7369242
42040 7369242 4387994 -921577 28475 4685681 4768570 -422568 -4599082 -5303780 -5354372
42031 -5354372 -4804261 -456772 5828831 6895127 1183294 -3318236 -60731 7000681
42023 7000681 10126583 8661268 7176924 6016023 794515 -8924826 -16723920 -17188292
42015 -17188292 -12666442 -9570803 -10276763 -11274300 -8356544 -1537150 5022582 6513225
42007 6513225 886430 -9630045 -19340868 -22255696 -16374273 -5698048 2945273 6092573
41999F092573K3356O49366Q33695k540854o426840n571209J84827N534605N927741
41990D707260J568429m194782p721994o614164j265624M736566P807235P758134
41982F781060O140037K688767l053055p714972o683247j143091K381257P79318
41974A76074k127324k391082j008433K88790K759891O348053O796544J997921
41966A2840434l126281l510530j716053k682178m416798j468191M566751O204648
41958F691802J405314l742809m235857j429606J487827K909719J200265l745371
41950E41284o815755k613460N224275P356584K431582j295114J45264J045974
41942F020634j753661k191635K986356N845210j38174p754311o736547J66292
$$ plain form
41999 6092573 6115929 6765295 7598990 5058136 -1368704 -6939913 -6755086 -1220481 4707260
41990 4707260 6275689 2080907 -5641087 -12255251 -13520875 -8784309 -977074 6781060
41982 6781060 12921097 15609864 12556809 4841837 -1841410 -2984501 -603244 176074
41974 176074 -1951250 -4342332 -5350765 -5061975 -2302084 4045969 10842513 12840434
41966 12840434 9714153 6203623 4487570 1805392 -2611406 -4079597 487154 6691802
41958 6691802 8097116 4354307 118450 -1311156 176671 3086390 4286655 541284
41950 541284 -6274471 -8887931 -3663656 3692928 6124510 4829396 4974660 6020634
41942 6020634 4266973 2075338 5061694 10906904 10768730 3014419 -3722128 -3555836
41934c555836K888216J82737j701806j961567m198943n569176m33583O560378
41926g789580N041752l138840n027957K026170N105085k778377j0286786n555083
41918b2403616N566515R765805N777582K204671K060828R75737k471675m745046
41910c269199m267955k502764M03647M374597N880596K281480k441700k899158
41902b440456r30252j901106m478628k299808M740156R101759O601874J703047
41894A0096586j8530J325037K751251K896859J479450j515383m111907l336072
41886I567291M08206K937861J454285k520514n911650p026919n463383k045331
41878h600154P39648Q69949m55849m02564J665231M124241N608649N101847J591962
$$ plain form
41934 -3555836 -667620 -484883 -2186689 -4148256 -8347199 -13916375 -14349958 -7789580
41926 -7789580 -2747828 -5886668 -10914625 -8888455 -3783370 -6561747 -16848533 -22403616
41918 -22403616 -16837101 -7071296 -1293714 910957 2971785 3947522 1475847 -3269199
41910 -3269199 -7537154 -10039918 -9636271 -5261674 618922 2900402 458702 -2440456
41902 -2440456 -3370708 -5271814 -9750442 -12050250 -7310094 1791665 8393539 10096586
41894 10096586 10078056 11403093 14154344 17051203 18530653 17015270 12903363 9567291
41886 9567291 9975497 12913358 14367643 11847129 5935479 -1091440 -6554823 -8600154
41878 -8600154 -7860506 -6990557 -7446406 -7848970 -6183739 -2059498 3549151 8650998 10242960
41869A0242960l104612l787236J489902O792267N556569k0202k971683k481089
41861A1716876l232449n450125m426062j21311J687808p28354k536939j518723
41853d609279j116830k005624J27724M924496N057358j453250n907156k144164
41845g126725L672434L777330R25845J176454K200792j089020n371274m271914
41837f106078l16326m33106l020040j035907M274948M764073j43727k252190J281469
41828b986884M150600L246045L396254O166743M889999l464716j0790920r123452
41820d516331k217944J164938r3155n34750K242695N593683O954291N738939K052159
41811A6384525k565488n178610n155153n065218n560052l465188J890690N181773
$$ plain form
41869 10242960 7138348 3351112 4841014 11633281 17189850 17169648 14197965 11716876
41861 11716876 8484427 3034302 -1391760 -1513071 174737 -553617 -3090556 -4609279
41853 -4609279 -5726109 -7731733 -7604009 -2679513 2377845 924595 -4982561 -7126725
41845 -7126725 -3454291 323039 1248884 2425338 4626130 3537110 -1834164 -6106078
41837 -6106078 -6422404 -6855510 -9875550 -10911457 -6636509 -1872436 -2016163 -4268353 -2986884
41828 -2986884 1163716 4409761 7806015 13972758 18862757 15398041 4607121 -4516331
41820 -4516331 -6734275 -5569337 -5662492 -6197242 -3954547 1639136 8593427 14332366 16384525
41811 16384525 13819037 8640427 3485274 -1579944 -7139996 -10605184 -8714494 -3532721
41803c532721K471795k000761j756715K352157M127212J429735j952932k799781
41795a662011j976359j787442l367244o116367p198582l329757M265035R171099
41787a2001628P238208J917549j311629k272293l241150k648213J897332O928312
41779c493512O807496K870511J451112L086302J554429n084010j0127017p865966
41771a0800655j384241K722601K400037m26462l931278o313148n399980j846417
41763b4979543L54940m37710n52352L001501O695735M732516k568480q231344
41755b1984737n986972L631886J3442846J5005589O301110m790398p730237j434856
41747c545769M735389M048903J176379L501272Q540127P196599k314419j1148175
$$ plain form
41803 -3532721 -1060926 -3061687 -4818402 -2466245 1660967 3090702 1137770 -1662011
41795 -1662011 -3638370 -5425812 -8793056 -14909423 -22108005 -25437762 -21172727 -12001628
41787 -12001628 -4763420 -2845871 -4157500 -6429793 -9670943 -12319156 -10421824 -3493512
41779 -3493512 3313984 6184495 7635607 10721909 12276338 7192328 -2934689 -10800655
41771 -10800655 -12184896 -9462295 -7062258 -7488720 -11419998 -17733146 -23133126 -24979543
41763 -24979543 -24624603 -25062313 -25614665 -22613164 -15917429 -11184913 -13753393 -21984737
41755 -21984737 -27971709 -24339823 -10896977 4108612 10409722 5619324 -2110913 -3545769
41747 -3545769 1189620 5238523 6414902 9916174 18456301 25652900 23338481 12190306
41739A2190306j1240782m282374K500375N008842M238504K621010J114961r85762
41731A1165080m393563p537930o811306r62406N734995P506325L791089j077226
41723G415058m349722o985645q959272p280468j093348N087071O656139M869626
41715d640561L848713L503788j1731o873867j1173171q043537k47818N287242
41707a8350942N854938M454345L508060J581395j889533k958289J345955O505295
41699E1224N383242r33895l734448M59855M595070K340380k116431j758862J349847
41690E635982L94876l351490k187004L928339N514553j342730p565980m270604
41682c244058L936900N821821j049741q829264j0691839p139750k138253J469102
$$ plain form
41739 12190306 949524 -3332850 -832475 4176367 8414871 11035881 12150842 11165080
41731 11165080 6771517 -766413 -7577719 -8540125 -2805130 4701195 8492284 7415058
41723 7415058 3065336 -3920309 -12879581 -20160049 -21253397 -16166326 -9510187 -4640561
41715 -4640561 -791848 2711940 2700209 -4173658 -15346829 -23390366 -23638184 -18350942
41707 -18350942 -12496004 -8041659 -4533599 -2952204 -4841737 -7800026 -6454071 51224
41699 51224 5434466 4500571 766123 1225978 5821048 8161428 6044997 4286135 5635982
41690 5635982 6030858 2679368 492364 4420703 9935256 8592526 1026546 -3244058
41682 -3244058 692842 6514663 5464922 -3364342 -14056181 -21195931 -23334184 -21865082
41674b1865082K637774K271034K872036N372281P024573M933047M35246k636407
41666A044502k689522r28627J014857J472565j003150m962273o221281l665184
41658a5938113j470494j901314n44512N496824R509809L984185n526963o031894
41650a2422472L692230J0728694P078787j67854k457272k581965n962605q407265
41642a0499722l416276M126189L493574m815914q807758k347987P104237J0475904
41634d687753Q218498N584178L791030J208541j230882j305700L3907j23109j988402
41625I500308k911099j533470Q7736j419627p126891j3431738j3505143l774902
41617c4114826J0091828J6849961J1662663J877097k077774Q37415L051119J98412
$$ plain form
41674 -21865082 -19227308 -16956274 -14084238 -8711957 -1687384 3245663 3680909 1044502
41666 1044502 -1645020 -2573647 -1558790 -86225 -1089375 -6051648 -12272929 -15938113
41658 -15938113 -17408607 -19309921 -19854433 -14357609 -4847800 -863615 -6390578 -12422472
41650 -12422472 -8730242 1998452 9077239 8909385 6452113 3870148 -2092457 -10499722
41642 -10499722 -13915998 -9789809 -6296235 -11112149 -19919907 -22267894 -15163657 -4687753
41634 -4687753 3530745 9114923 12905953 14114494 12883612 11577912 11611819 11488710 9500308
41625 9500308 6589209 5055739 5143475 3723848 -3403043 -16834781 -30339924 -34114826
41617 -34114826 -24022998 -7173037 4489626 6366723 4288949 5126364 8177483 8375895
41609H375895l425028k525727J034923J381215k836965p097694p110961k656074
41601a4860416M013515R561022R420928J448090q319558q869756K367262J3329208
41593H090295J0611320l368367j3403036j0822084j925473L862997N444379N577519
41585D067550L129557l037231p871675n895015j13622K319540J005268J117916
41577e277712L093095K242285j481709k420476M98953J249824k471953m461141
41569i028834o64909L331178J793795j057754J588871O749797N797658j517863
41561F991939o396443m117081N88268K770309M195255P564625R762479N987670
41553B7347021k242007p839121o393578q14773K468390L54245m324492o333557
$$ plain form
41609 8375895 4950867 2425140 3460063 4841278 2004313 -5093381 -12204342 -14860416
41601 -14860416 -10846901 -1285879 8135049 9583139 1263581 -7606175 -5238913 8090295
41593 8090295 18701615 15333248 1930212 -8891872 -10817345 -6954348 -1509969 4067550
41585 4067550 7197107 4159876 -3711799 -9606814 -9720436 -7400896 -6395628 -5277712
41577 -5277712 -2184617 57668 -1424041 -3844517 -3345564 -2095740 -4567693 -9028834
41569 -9028834 -9693743 -6362565 -4568770 -5626524 -4037653 2712144 8509802 6991939
41561 6991939 595496 -3521585 -2933317 -163008 4032247 11596872 21359351 27347021
41553 27347021 25105014 17265893 10872315 10057542 12525932 12880177 8555685 2222128
41545B222128l450519J994228O208701O962745L754111k289338p539800p735915
41537A26341k886808J977683L102147K338191K553241K172908j353370n511217
41529B519116n783924l183318k728433n019322n573491k890392p83951j283997
41521b4727712j406249O90940K151898J124851P39398L645233P096280P434527
41513c250834N504623L662891J304851k252078m095478j909862J131861Q11455
41505I07429j313032q93686J518796J661544p50683j549062O90322K433211R35368
41496C640207k277469m448025m383504j996108J368557K531969L43734j029526
41488f250165K340941O369643L488168m740648p465371K49944R580148J0062055
$$ plain form
41545 2222128 -1228391 765837 6974538 13937283 17691394 15402056 7862256 126341
41537 126341 -2760467 -782784 2319363 4657554 7210795 9383703 8030333 2519116
41529 2519116 -3264808 -6448126 -9176559 -14195881 -19769372 -22659764 -23443715 -24727712
41521 -24727712 -26133961 -25443021 -23291123 -22166272 -21426874 -17781641 -10685361 -3250834
41513 -3250834 2253789 5916680 7221531 4969453 873975 -1035887 95974 907429
41505 907429 -405603 -1299289 219507 1881051 1130368 -418694 271628 2704839 3640207
41496 3640207 1362738 -3085287 -7468791 -9464899 -8096342 -5564373 -5220639 -6250165
41488 -6250165 -3909224 2460419 5948587 1207939 -6257432 -6007488 3572660 13634715
41480A3634715L276562j701883j718499j233315l316453o152951p874917q695064
41472a3781805p781654l133071M296387J0118773J1104745P576208J535741m243836
41464E691488n797013j043584O073220Q614953M892889j06600k449158l681492
41456A2194703n422354m784238J84221M245193N31585q626138j2800198o854122
41448b1331348K188391M973085K245738K044439O340541P440521j8867r276633
41440e394133r345612k16399O630055L643111l320875m341063J061553N436774
41432e846589N217115L992420M504555M418721J963689l00034p88680k913095
41424A0248102r027071j4147739j1738323l960739L25488j849406l216524K902599
$$ plain form
41480 13634715 16911277 15209394 13490895 12257580 8941127 2788176 -5086741 -13781805
41472 -13781805 -21563459 -24696530 -20400143 -10281370 823375 8399583 9935324 5691488
41464 5691488 -105525 -1149109 4924111 13539064 18431953 18325353 15876195 12194703
41456 12194703 6772349 1988111 2172332 6417525 6949110 -1677028 -14477226 -21331348
41448 -21331348 -19142957 -14169872 -11924134 -9879695 -3539154 3901367 3882500 -5394133
41440 -5394133 -14739745 -14956144 -8326089 -4682978 -8003853 -12344916 -11283363 -5846589
41432 -5846589 -629474 3362946 7867501 12286222 14249911 13949877 13161197 10248102
41424 10248102 1221031 -12926708 -24665031 -28625770 -28300282 -30149688 -33366212 -30463613
41416c0463613J2432179J5709943J0176294K898608P46892K550211K656913r07367
41408A5800060m728844n182477k548970J10812J35118l111650p890892j0472434
41400a7889277p641445l91545O042172P422727M771663J811522k95817k851570
41392i021570n261614m683336o49884L503330N194769N366748N109967L138872
41384B697282p04774k897017j019376J584164M38429k804106k961537L2928J167471
41375d466536p70652r22086K931111N588654K377901l038119m011954p88782P33980
41366b366483j434166k801802L48226N815123Q886346P660419L774020J72883
41358B0054566j074274o69270j894059o338973j0220457q237853j435596K603149
$$ plain form
41416 -30463613 -18031434 -2321491 7854803 10753411 11500303 14050514 16707427 15800060
41408 15800060 11071216 5888739 3339769 3450581 3585699 474049 -7416843 -17889277
41400 -17889277 -25530722 -25922267 -19880095 -12457368 -7685705 -5874183 -6170000 -9021570
41392 -9021570 -14283184 -18966520 -19616404 -16113074 -10918305 -5551557 -441590 2697282
41384 2697282 1992508 -904509 -1923885 -339721 98708 -2705398 -5666935 -5634007 -4466536
41375 -4466536 -5237188 -6159274 -3228163 2360491 4738392 1700273 -2311681 -3100463 -2366483
41366 -2366483 -3800649 -6602451 -6254225 -439102 8447244 16107663 19881683 20054566
41358 20054566 18980292 18311022 16416963 10077990 -142467 -8380320 -9815916 -7212767
41350g212767r39947p905241j0588550o719908k13691M908089P768376Q559870
41342a2343769O741792K311171k922174o375713o655617m568002k445550j815512
41334b8073374j570425J78958K266855J279539k187054j524144P478903J8180498
41326c970244J8698054O582231p307519j1749707p408198k750710j855170j814083
41318a1575346m67137l11971l327678o658861o235083j961781L080211O452881
41310b1004765P112817M515113n3838k717291r45689K402085K348825j155339
41302i498082l301692k011592q95141k421758k600659L032266J0797195J1948749
41294E049286M325965m121824n075318O94961N877403N709951J654658k267276
$$ plain form
41350 -7212767 -8152714 -16057955 -26646505 -33366413 -33580104 -28672015 -20903639 -12343769
41342 -12343769 -5601977 -3290806 -6212980 -12588693 -19244310 -23812312 -26257862 -28073374
41334 -28073374 -29643799 -29464841 -27197986 -25918447 -28105501 -29629645 -22150742 -3970244
41326 -3970244 14727810 21310041 14002522 2252815 -5155383 -7906093 -9761263 -11575346
41318 -11575346 -12042483 -12354454 -15682132 -22340993 -28576076 -30537857 -27457646 -21004765
41310 -21004765 -13891948 -9376835 -9430673 -12147964 -13093653 -10691568 -8342743 -9498082
41302 -9498082 -12799774 -14811366 -15706507 -18128265 -20728924 -17696658 -6899463 5049286
41294 5049286 9375251 5253427 178109 873070 6750473 12460424 14115082 11847806
41286A1847806l766913l205014k355997k571184l243116k310278J059573M894618
41278C49495O259922M067661m47298n036443p491894o592558l201458K44723K119450
41269i728400K730183K771613K229485J493306J518742J607801p30819n682956
41261c791045q971046o575514k98923M153152L729236J60999l311651m460407
41253a9365199k320022J842064M364518L064012N89601P21787K423318J735663
41245f944258j156044j866821Q96107L310501K858975J491579O88586j074204
41237a795579l364351k049568L597772P279713M067144j959123l882149j920093
41229b6234j045773j694681N4742M395569O810617N188824J994078r04994l953458
$$ plain form
41286 11847806 8080893 4875879 2519882 -51302 -3294418 -5604696 -4545123 349495
41278 349495 6609417 10677078 10229780 5193337 -2298557 -8891115 -12092573 -11847850 -9728400
41269 -9728400 -6998217 -4226604 -1997119 -503813 1014929 2622730 1891911 -3791045
41261 -3791045 -12762091 -19337605 -19636528 -15483376 -11754140 -11593141 -14904792 -19365199
41253 -19365199 -21685221 -19843157 -15478639 -12414627 -11825026 -11103239 -8679921 -6944258
41245 -6944258 -8100302 -9967123 -9071016 -5760515 -2901540 -1409961 -721375 -1795579
41237 -1795579 -5159930 -7209498 -3611726 3667987 7735131 5776008 1893859 -26234
41229 -26234 -1072007 -2766688 -2711946 1683623 8494240 13683064 15677142 14772148 10818690
41220A0818690o020087m456167j94003K319302J563265N14724O56375l24407l009956
41211A867736l691829k33883L806498M037468Q32040k578571m411720m269298
41203d641559j861421J722657M022703M191536L287785R96570l687538p646305
41195c615572n315169K429251P133619M106081j129357k097357o44408j037587
41187a70499j206842K139218M849285J221033m924870n124049j82692J308640
41179b090776k333803l814296n41885J046252j898392k695540K766539P776931
41171a784970N695418Q84534O63558L057226J577794k685093l217685N74315L183604
41162G948701K636803J883927J251941k148553o919275p233343k183856J616733
$$ plain form
41220 10818690 4798603 342436 148433 2467735 4031000 4545724 5202099 4877692 1867736
41211 1867736 -1824093 -2057976 1748522 5785990 6618030 4039459 -372261 -4641559
41203 -4641559 -6502980 -4780323 -757620 3433916 6721701 7718271 4030733 -3615572
41195 -3615572 -8930741 -6501490 632129 4738210 3608853 1511496 867088 -170499
41187 -170499 -1377341 761877 5611162 6832195 1907325 -3216724 -3399416 -2090776
41179 -2090776 -4424579 -8238875 -8780760 -7734508 -9632900 -12328440 -9561901 -1784970
41171 -1784970 3910448 4794982 5458540 8515766 10093560 7408467 4190782 4765097 7948701
41162 7948701 10585504 12469431 13721372 11572819 4653544 -2579799 -4763655 -3146922
41154c146922l06057l753115k572955K395708N104684K635654j570926k100789
41146c314718K403577P368746O798524N49951m663442l730686K1881M34245j829423
41137D038655j448450J357687Q00829l737629n470227j424191K362816J323107
41129b197403J67734L819377P374005L472598m905843q027543l389842K344529
41121a342388M132461L116760Q87138k618613m801918j793499M329912O915047
41113H824900M913458M167937O397870N355223j894613q010809n902695L52829
41105A4204100K171346j226984m595053o195656p261562n439785J860338R218054
41097B734798P904514r60019p018699n645222l211163m913361o614327l528528
$$ plain form
41154 -3146922 -3452979 -7206094 -9779049 -7383341 -2278657 356997 -1213929 -3314718
41146 -3314718 -911141 6457605 13256129 13806080 9142638 5411952 5433833 5868078 4038655
41137 4038655 2590205 3947892 4748721 1011092 -4459135 -5883326 -3520510 -2197403
41129 -2197403 -2029669 1789708 9163713 12636311 7730468 -297075 -3686917 -1342388
41121 -1342388 2790073 5906833 6793971 4175358 -626560 -2420059 1909853 8824900
41113 8824900 13738358 17906295 24304165 29659388 27764775 19753966 13851271 14204100
41105 14204100 16375446 15148462 10553409 4357753 -2903809 -8343594 -6483256 2734798
41097 2734798 10639312 9679293 2660594 -2984628 -6195791 -11109152 -17723479 -21252007
41089b1252007J141750K543843K457687M081026M068797j875581r151813q970670
41081b6956968j453561M384712L646689O30852L1284Q72429J539819L597538O822591
41072f884615O614707J179554l579831j808323L210904L558313j826885o061657
41064e597833m243030Q25611L628021K515568j25832j401855k18744K097468K752587
41055B31961M77841k488983l131316j821502j269636j680835l32907L297128N419821
41046a298428K936531j853559l870610j203761L436362O179606N333563K128952
41038A1788656n06245n64804Q12959O64189j724449l623922k478829J191722N361923
41029A0921200Q363516P799522J225823q791091j3560197p367392L822062Q311655
$$ plain form
41089 -21252007 -20110257 -17566414 -15108727 -11027701 -6958904 -8834485 -17986298 -26956968
41081 -26956968 -28410529 -24025817 -20379128 -19748276 -19716992 -18844563 -17304744 -13707206 -6884615
41072 -6884615 -269908 909646 -2670185 -4478508 -1267604 2290709 463824 -5597833
41064 -5597833 -9840863 -9015252 -5387231 -2871663 -2997495 -4399350 -4618094 -2520626 231961
41055 231961 709802 -1779181 -4910497 -6731999 -8001635 -9682470 -10015377 -6718249 -1298428
41046 -1298428 1638103 -215456 -4086066 -5289827 -1853465 4326141 9659704 11788656
41038 11788656 11282411 10717607 11530566 12194755 10470306 6846384 4367555 5559277 10921200
41029 10921200 19284716 27084238 28310061 19518970 5958773 -1408619 2413443 10725098
41021A0725098L049194l654354m380700j135200Q59128J444916K653332K450136
41013A2011550k013364p377209p215788j914248R51964k487147o555393m003553
41005a8603188L926585R088789O558867J57213k313614K015340P686814P132682
40997A5649488L15682m205587o0421P560546P892479r35873r250951q967797l498401
40988D499165j043487k892922l720311o91372L536566O105297P027457O497345
40980A9317738L618283o56280k762437j001950J220761r20161p153024j1154812
40972E08118p320207J764928O598418J507551p344585q648810n09434P230757
40964f213264P184976M226366N793988Q651849M443369m778722p754531j538027
$$ plain form
41021 10725098 13774292 10119938 5739238 4604038 5463166 6908082 9561414 12011550
41013 12011550 9998186 2620977 -4594811 -6509059 -5557095 -8044242 -14599635 -18603188
41005 -18603188 -14676603 -5587814 971053 1128266 -1185348 829992 8516806 15649488
40997 15649488 15965170 11759583 11699162 19259708 27152187 26216314 16965363 7997566 4499165
40988 4499165 3455678 562756 -3157555 -3848927 -312361 5792936 12820393 19317738
40980 19317738 22936021 22279741 19517304 18515354 19736115 18815954 11662930 508118
40972 508118 -6812089 -5047161 1551257 3058808 -4285777 -12934587 -13444021 -6213264
40964 -6213264 971712 5198078 10992066 19643915 24087284 19308562 11554031 10016004
40956A0016004L190202j430641q319250o776453J395352N855499L299784k51466
40948F979031r07804j536042m131481n359333k448915K039562M349318M341660
40940C325996L487367J632516j202605k608399p66302J998643J880429q87379
40932F860266k200202j34589J797963p28378o179436p868911k454602M564848
40924f343041N056277p32462l876861Q82028P253546O146386j142252m739998
40916B503623j92036O057025O505108J899751k274562l670872l305636j525422
40908E996979J408651K730360j3239m200812m447367J35313M587848M594529J138682
40899A1930944k211133l631925l148643r86300K008215L890134L650797K692133
$$ plain form
40956 10016004 13206206 11775565 3456315 -3320138 -1924786 3930713 7230497 6979031
40948 6979031 6071227 4535185 403704 -4955629 -7404544 -5364982 -1015664 3325996
40940 3325996 6813363 8445879 7243274 4634875 3868573 5867216 7747645 6860266
40932 6860266 4660064 4525475 6323438 5595060 -584376 -8453287 -10907889 -6343041
40924 -6343041 -1286764 -2019226 -5896087 -5014059 2239487 8385873 7243621 2503623
40916 2503623 2311587 8368612 14873720 16773471 14498909 10828037 7522401 5996979
40908 5996979 7405630 10135990 10122751 5921939 1474572 1609885 6197733 10792262 11930944
40899 11930944 9719811 6087886 2939243 1952943 3961158 7851292 11502089 14194222
40891A4194222K402995J375491k393933o937885p211635j802380M054127M768406
40883H449408J842290J261749L933853L662416l039266r585601o988395L012898
40875B549352Q909516M558141k834727l543943R95719J647174l871856p713317
40867F96059m219853J693985K459605j231014l184411k050661j966453l728535
40859a1531278k653576K861595P037938M875711j79598j616223N90093J415071
40851G99733m33841j381715J7270J058497L63932l96741j245951m195954o921391
40842a2336161l008678P516444J4301503R198286k202890q240359o424357l310774
40834d506986k038777O64726N208766O279156J935665k101011j170322J344944
$$ plain form
40891 14194222 16597217 17972708 15578775 8640890 1429255 -373125 3681002 8449408
40883 8449408 10291698 11553447 15487300 19149716 16110450 6524849 -463546 2549352
40875 2549352 11458868 16017009 13182282 9638339 10634058 12281232 8409376 696059
40867 696059 -3523794 -1829809 629796 -601218 -3785629 -5836290 -7802743 -11531278
40859 -11531278 -14184854 -11323259 -4285321 590390 410792 -1205431 -615338 799733
40851 799733 365892 -1015823 -998553 59944 423876 27135 -1218816 -5414770 -12336161
40842 -12336161 -15344839 -7828395 6473108 15671394 13468504 5228145 -1196212 -4506986
40834 -4506986 -6545763 -5881037 -672271 5606885 7542550 5441539 4271217 5616161
40826E616161L9063m353269p251044o898210m497110p64788L614914O570051P146883
40817g77349P081040P045280M572035q77686m460737k206387K310993K792513
40809A5479702o42667k713301j561592l1604N96465J739507K454147k35395m996060
40800A0089202o457151l520737j263118k203400k115973J739271M587847K013530
40792B869471j433758R70081N991036M039334n208825r764556j443301J1759423
40784G778905J5219829N982734m740217o461555r78033K542357m32683o279074
40776A2632263r710008r662222p978597n187074r2266P009461J2800185J3500846
40768A3312588Q366421K62398o641760r324358o901306o65515O257355J0169030
$$ plain form
40826 5616161 5655224 1301955 -5949089 -12847299 -17344409 -18109197 -14494283 -7924232 -777349
40817 -777349 6303691 13348971 17921006 17043320 12582583 10376196 12687189 15479702
40809 15479702 14837035 12123734 10562142 10530538 11127003 12866510 15320657 15085262 10089202
40800 10089202 3632051 111314 -1151804 -3355204 -5471177 -3731906 855941 2869471
40792 2869471 1435713 2405794 8396830 12436164 7227339 -2537217 -3980518 7778905
40784 7778905 22998734 28981468 24241251 17779696 16801663 19344020 18911337 12632263
40776 12632263 2922255 -6739967 -14718564 -19905638 -19997904 -12988443 -188258 13312588
40768 13312588 21679009 21941407 15299647 5975289 -926017 -1591532 4665823 14834853
40760A4834853R085858M319705n99765k921377k512727r85378J11419l3681j434243
40751A9864664k894391k541824k19167J241200r54487n220991o422822k028963
40743H23219M195167O167465K340082k882783m343314j475337K007343L120923
40735I952765L193640N488512R659036J0773467N354851l350181q748981q696610
40727B3626499o925237o976320q190308q357798o779016l176100L044363J0039596
40719c694321J2786979Q164572n60281o606592o117547n79340N257737O511539
40711A5162746J748240m521746n339923M57329O051896N299521P25612o82196
40703A8901479K709710N896178M587162j63671m296871m613702p82170M087570
$$ plain form
40760 14834853 23920711 28240416 27640651 24719274 22206547 21221169 21332588 21298907 19864664
40751 19864664 16970273 14428449 14209282 15450482 14495995 9275004 2852182 823219
40743 823219 5018386 11185851 13525933 10643150 6299836 4824499 6831842 9952765
40735 9952765 13146405 18634917 28293953 39067420 44422271 41072090 32323109 23626499
40727 23626499 16701262 9724942 1534634 -6823164 -13602180 -16778280 -13733917 -3694321
40719 -3694321 9092658 17257230 16696949 10090357 3972810 3393470 8651207 15162746
40711 15162746 16910986 12389240 7049317 7506646 13558542 18858063 19583675 18901479
40703 18901479 21611189 27507367 32094529 31930858 27633987 23020285 22238115 26325685
40695B6325685N808548L933203K223927K497890J643555k042588m124902r70694
40687C5294624K767910P71192l961245l311762K319036M151553n84481m028861
40679C3417966l37740N547226O161997J810643k159086l178471k199564p16772
40671C8346199m71879k423713l775623m00011O086696R036042O244112K361275
40663E5003098q396l579328p521254m781221N563460J2152603O175466m684389
40655E8320039o898922k55011M268766K151391l93386J343535M554094O013294
40647F9103800O463316O370967M480194K063653K598306O143538R039703R109823
40639A15373300O401198M95197o764632q176299R55008J2983901J5168066P017477
$$ plain form
40695 26325685 32134233 36067436 38291363 40789253 42432808 40390220 36265318 35294624
40687 35294624 38062534 38833726 34872481 31560719 33879755 38031308 37446827 33417966
40679 33417966 33080226 38627452 44789449 46600092 44441006 41262535 39062971 38346199
40671 38346199 37874320 35450607 31674984 31274973 37361669 46397711 52641823 55003098
40663 55003098 54994702 51415374 43894120 39112899 44676359 56828962 63004428 58320039
40655 58320039 51421117 51166106 55434872 57586263 57192877 58536412 63090506 69103800
40647 69103800 75567116 81938083 86418277 88481930 91080236 97223774 106263477 115373300
40639 115373300 121774498 122269695 115505063 107328764 108283772 121267673 136435739 143453216
40631A43453216Q52929L583376Q064583O254864J434030J403124O697390J1970219
40623A83713731J4307275J4865386J5801136J9144406K4996870K8735252K5228597
40616C26792653J7842566J6368743K2811496K7050860K1547042J2253933P876743
40609D52544036N910296r50880r922186j1166218m166006l94798q107995k2467337
40601D01278912l2987779l4599796k9129489k1099651j4989510j3357764j5158390
40594B39956533j7090121j6894498j4222501r825500o266112p369329j3375404
40587A54913068j8183004j5353222n817425L892916R357950J0115726O158803
40580A45084812j431265p339163o181092n46996J252286l015649n938351j331740
$$ plain form
40631 143453216 144306145 147889521 155954104 162208968 163642998 165046122 171743512 183713731
40623 183713731 198021006 212886392 228687528 247831934 272828804 301564056 326792653
40616 326792653 344635219 361003962 383815458 410866318 432413360 444667293 452544036
40609 452544036 458454332 457503452 447581266 436415048 432249042 431854244 423746249 401278912
40601 401278912 368291133 333691337 304561848 283462197 268472687 255114923 239956533
40594 239956533 222866412 205971914 191749413 181923913 175657801 168288472 154913068
40587 154913068 136730064 121376842 115559417 119452333 128810283 138926009 145084812
40580 145084812 143653547 136314384 130133292 129586296 130838582 127822933 121884582 120552842
40572A20552842O730234R737701N874541J128788J275560O125732J0809271J0744083
40564A72978752O254087L114464O667473J4766087J9462586J7083905J3265473
40557B53592827J5349026K2668124K8091867K7632974K4500237K3595297K5364913
40550D20795265K6418570K4342511K0262629J6897906J4917086J1863267N179158
40543E40676392m022068j1358142j3720668j2434475j1371616j2917038j6587162
40536D58265223k0731091k4231462k6468704k6708308k4619889k1612864k0518735
40529B93374170k2399813k4088136k1370745j5242765j1813913j3869256j5947285
40522A68642257j1966986n104140l939344r458771j3169794j0084259o159799
$$ plain form
40572 120552842 127283076 137020777 142895318 144024106 145299666 151425398 162234669 172978752
40564 172978752 179232839 182347303 189014776 203780863 223243449 240327354 253592827
40557 253592827 268941853 291609977 319701844 347334818 371835055 395430352 420795265
40550 420795265 447213835 471556346 491818975 508716881 523633967 535497234 540676392
40543 540676392 536654324 525296182 511575514 499141039 487769423 474852385 458265223
40536 458265223 437534132 413302670 386833966 360125658 335505769 313892905 293374170
40529 293374170 270974357 246886221 225515476 210272711 198458798 184589542 168642257
40522 168642257 156675271 151571131 147631787 138173016 125003222 114918963 108759164
40515A08759164p881416j0642854n426422N913850J1110320M118360o576317r768837
40507H9605848n613957k692949m882810p560334o112890k414328j064819k920768
40499E6342993m889686m370815j919003k68780j630643m992073n825607n08093
40491C1938293Q022460J1581100N930865l395864p421233m304985N2103J032635
40483D3435374K46116P40781J970889K055197J627770K318208L655623M465134
40475F0515092N560748P955436R656668P511745J907436l073823m266019k247590
40467H3519693K57724J114880K38887l00835J580978M451005L620964k800804
40459I1682492r785651j0568402n075098L71261J448358k1530r94500k124046
$$ plain form
40515 108759164 100877748 90234894 84808472 90722322 101832642 105951002 99374685 89605848
40507 89605848 83991891 81298942 76416132 68855798 62742908 60328580 59263761 56342993
40499 56342993 51453307 47082492 45163489 44894709 43264066 38271993 32446386 31938293
40491 31938293 39960753 51541853 57472718 54076854 46655621 42350636 42402739 43435374
40483 43435374 43681490 44422271 46393160 48448357 50076127 52394335 56049958 60515092
40475 60515092 66075840 74031276 83687944 91199689 93107125 90033302 85767283 83519693
40467 83519693 83777417 84892297 85131184 84830349 86411327 90862332 94483296 91682492
40459 91682492 81896841 71328439 66253341 66624602 68072960 68051430 67056930 64932884
40451F4932884n261493q698334q259334k895463K988207L765349j260765o836942
40443C8474109p624027m313048j861484j904666o71902L833390O870474L401471
40435C6204317l492349o088777k499550J934506L126527K192096O87164j718496
40427C0345438l335448o38877M844458N796059q54413q355808r179742n039906
40419A3581761k585429l037555k375191P16477L562419M878785N400650L970829
40411B4112746p87938n082211k888794M585480Q853140N767946Q99962j28054
40403C5332277m00517n137582j1165166j0561940l027642K964379J986843j978766
40395H011886l000086j093481P47082K421952M831950N621899K383598j831743
$$ plain form
40451 64932884 59671391 50973057 42713723 39818260 42806467 46571816 45311051 38474109
40443 38474109 30850082 26537034 24675550 22770884 22098982 25932372 32802846 36204317
40435 36204317 32711968 26623191 24123641 26058147 29184674 31376770 32063934 30345438
40427 30345438 27009990 26371113 31215571 37011630 36157217 27801409 18621667 13581761
40419 13581761 10996332 7958777 5583586 6300063 9862482 14741267 20141917 24112746
40411 24112746 23324808 18242597 15353803 19939283 28792423 34560369 35460331 35332277
40403 35332277 34931760 29794178 18629012 8067072 5039430 8003809 9990652 8011886
40395 8011886 5011800 3918319 4665401 7087353 11919303 17541202 19924800 18093057
40387A8093057j980080P15908k4505n423925q732276m711944L040771P376312
40379H353318O051863J663524k947309n455311l824393L77056J529412k701422
40371C046738o641144m175516K114487N366787N087520N956893P770153N274796
40363B3800714j577998n881938m462623k480177m179258o288946m793593j807107
40355g670926p56642j97582K243086M332844L128516O92915N90801J824378J419313
40346E606703J94121O76479J642298O1977l201749m637711l741961k830215k293480
40337h523538m37855K598973M551221M159653J883062j188355k733236L1420N926296
40328F267641Q934047N296411j351638n507452o795927p037006m704538J332844
$$ plain form
40387 18093057 16112977 16828885 16804380 11380455 2648179 -2063765 977006 8353318
40379 8353318 14405181 16068705 13121396 7666085 3841692 4218748 5748160 3046738
40371 3046738 -3594406 -7769922 -5655435 -288648 4798872 10755765 18525918 23800714
40363 23800714 22222716 16340778 11878155 9397978 5218720 -1070226 -5863819 -7670926
40355 -7670926 -8427568 -8625150 -6382064 -2049220 1079296 1772211 2363012 4187390 5606703
40346 5606703 5800824 6477303 8119601 8181578 4979829 342118 -3399843 -6230058 -8523538
40337 -8523538 -8961393 -6362420 -1811199 2348454 4231516 3043161 309925 341345 6267641
40328 6267641 15201688 20498099 19146461 13639009 6843082 -193924 -4898462 -3565618
40320c565618O017057L582089l071213n822542k915315R5002q7736j534680l100975
40311a0403931n502203o388003k477737K885892K887775r73150L05704Q080685
40303a1584968J1700119M236642o460771r237557m742080j184174p89320N20393
40295a7541716L215930L066935l99871j901122J606214O206802O484623K492818
40287C230613r18859m51979J728285J172198k207754l171108J109931N262660
40279E753987K523028m402551o064376n5918N578584M899646K148231K965552
40271A3346183M768461K117761l727234p378715p606569o694646m667848l76138
40263a0218745M104101N867761N793972N761809M217469n1945l136368j422399
$$ plain form
40320 -3565618 2451439 6033528 2962315 -2860227 -5775542 -5680540 -5768276 -7302956 -10403931
40311 -10403931 -15906134 -22294137 -24771874 -21885982 -18998207 -19971357 -19665653 -11584968
40303 -11584968 115151 4351793 -2108978 -11346535 -16088615 -17272789 -18062109 -17541716
40295 -17541716 -14325786 -11258851 -11658722 -13559844 -11953630 -5746828 737795 3230613
40287 3230613 2311754 1859775 3588060 4760258 2552504 -618604 491327 5753987
40279 5753987 8277015 3874464 -2189912 -2245830 3332754 8232400 10380631 13346183
40271 13346183 18114644 20232405 16505171 9126456 1519887 -5174759 -9842607 -10218745
40263 -10218745 -6114644 -246883 5547089 11308898 15526367 15474422 12338054 10915655
40255A0915655J391523m8108k987750r31539M199287L954990k627203o773281
40247G093574l678586P78183N10845j826025j085552J953785L652235L640589
40239A1039048K888619L36755l550764m177086P81506N831148M252673k201739
40231A5200160n858143l810766n01656j25936j646302k064110n98273J573050
40223B168024K951520K292672k86991k425909j754929R00554K588976K357299
40215H791216J826221J444774q77446n931495j0231941r227113k854757L961084
40207a3099457O555918N066092L202646L365558M215605L276695O57352j161965
40199A2078444q29088K28360J08j672100l489380m184331k812275Q84143M995276
$$ plain form
40255 10915655 12307178 12259070 9271320 8339781 12539068 16494058 13866855 7093574
40247 7093574 3414988 4193171 4704016 2877991 1792439 3746224 7398459 11039048
40239 11039048 13927667 14264422 10713658 6536572 7318078 13149226 17401899 15200160
40231 15200160 9342017 5531251 5029595 4903659 3257357 1193247 594974 2168024
40223 2168024 5119544 7412216 7125225 4699316 2944387 3844941 6433917 8791216
40215 8791216 10617437 12062211 11184765 5253270 -4978671 -14205784 -17060541 -13099457
40207 -13099457 -6543539 -1477447 1725199 5090757 9306362 12583057 13240409 12078444
40199 12078444 11249356 11477716 11477824 9805724 6316344 2132013 -680262 203881 5199157
40190E199157N816761J907105l045930l945305o37146K232537J984117J133789
40182A0645085K301522L350155Q73350l850472o514415o003478m281934q85143
40174d365330O291764J3577921J2047068j60750j1843759j1444831j802200M949540
40166G249423M192653J784781J411157o40046n720234p666469k804370K587849
40158C94744J532139k806576k877460J174012L263533K341506L087182O411440
40150A2520520P269824K999808k691389n708202o223451n801989m626767l245359
40142e507005k920859k760550l29115L704716N506554L839943J727743R95895
40134D257322l17421l086684m264219j947948P47412N00825r54042m57110O26923
$$ plain form
40190 5199157 11015918 12923023 9877093 5931788 5294642 7527179 9511296 10645085
40182 10645085 12946607 16296762 17170112 13319640 6805225 801747 -3480187 -4365330
40174 -4365330 1926434 15504355 27551423 27390673 15546914 4102083 2299883 7249423
40166 7249423 11442076 13226857 14638014 13997968 8277734 611265 -2193105 394744
40158 394744 1926883 -879693 -3757153 -2583141 680392 3021898 6109080 12520520
40150 12520520 19790344 22790152 20098763 14390561 8167110 2365121 -2261646 -5507005
40142 -5507005 -8427864 -11188414 -11517529 -7812813 -2306259 1533684 3261427 4257322
40134 4257322 3939901 853217 -3411002 -5358950 -4611538 -4110713 -5064755 -5521865 -4894942
40125d894942r10842l223131r86265N637109R000871L727744n105444p558266
40117d313166j274966N838551N945627L08090m389550n251021m210579j914254
40109i261268L077014Q298011P318918q26468p575412n217430K504158N618968
40101C936491J004449n290471o808461k451954M735931R267512N620151n236598
40093D777050j3480314j0823280j520977L768655K934222K550063M397078K647202
40085d750301l900827p577019l992360R01228J101584l79467J322612M073695
40077a3200855L702626J726885J457845J518687m35598k243502j521353p70658
40069i765923k224910k421037J673892N859738N012558J867472K110054M562428
$$ plain form
40125 -4894942 -5805784 -9028915 -10015180 -4378071 4622800 8350544 3245100 -4313166
40117 -4313166 -5588132 250419 6196046 6504136 2114586 -3136435 -7347014 -9261268
40109 -9261268 -6184254 2113757 9432675 8606207 1030795 -4186635 -1682477 3936491
40101 3936491 4940940 -349531 -7157992 -9609946 -4874015 4393497 10013648 4777050
40093 4777050 -8703264 -19526544 -21047521 -17278866 -14344644 -11794581 -7397503 -4750301
40085 -4750301 -8651128 -16228147 -20220507 -19319279 -18217695 -18597162 -17274550 -13200855
40077 -13200855 -9498229 -7771344 -6313499 -4794812 -5230410 -7473912 -8995265 -9765923
40069 -9765923 -11990833 -14411870 -12737978 -6878240 -1865682 1790 2111844 6674272
40061F674272M061264R35343l48933M44609J6118j471272j468256j068997k695663
40052E078485l999111j602424J423484j12957l954916l750338M3149J773134J254251
40043c847243K682062M201642n1270p342879p804190m35404M182706M74602m348322
40034a2288296l563684p12203j50624J544615P193141J1077366P611527O50956
40026A1362798l472150n296878p179589o122937j33918M808961L289882J52950
40018b590881K118746N265347J824071m774977l863109N181207J1493087Q905581
40010B3559072K825043m93620j669569k809748l217709l474698o154963r564064
40002a000256p952701r79366M000154K412368j461297k481442j955278k489784
$$ plain form
40061 6674272 10735536 11670879 11321946 11766555 11782673 10311401 8843145 7774148 5078485
40052 5078485 1079374 -523050 900434 787477 -3167439 -6917777 -6874628 -5101494 -3847243
40043 -3847243 -1165181 3036461 2985191 -4357688 -12161878 -12597282 -8414576 -7939974 -12288296
40034 -12288296 -15851980 -16564183 -16714807 -15170192 -7977051 3100315 10711842 11362798
40026 11362798 7890648 2593770 -4585819 -10708756 -10842674 -6033713 -2743831 -2590881
40018 -2590881 -472135 4793212 6617283 1842306 -2020803 3160404 14653491 23559072
40010 23559072 26384115 25890495 24220926 21411178 18193469 14718771 8563808 -1000256
40002 -1000256 -8952957 -9932323 -5932169 -3519801 -4981098 -7462540 -9417818 -11907602
39994a1907602k016189J433157M404272L608963K232173L999745M917204j073310
39986E598413j0212149j1352672j192739J0250297J2167263N508813n78860r90113
39978I198253J093814O89958k353697m218047k703181k34058p64854m265142n897492
39969i454446j740574N935111J1012382J0473420O727611L291033J106831k4194
39961B7327174N16437K383353K712640o03159n120008o412019m094715k066638
39953A4643065k441282k817198j068488O33420n68518l230421l970915l182698
39945b003035l975616n820190m157635K156179P316878N581307q29019m299016
39937f030147j136875M749644P273554M748810N32432j271724J62509K301061
$$ plain form
39994 -11907602 -13923791 -12490634 -8086362 -4477399 -2245226 1754519 6671723 5598413
39986 5598413 -4613736 -15966408 -17159147 -6908850 5258413 10767226 10188366 9198253
39978 9198253 10292067 10982025 8628328 4410281 1707100 1473042 708188 -3556954 -9454446
39969 -9454446 -11195020 -5259909 5752473 16225893 22953504 26244537 27351368 27327174
39961 27327174 27843611 30226964 32939604 32336445 27216437 20804418 16709703 14643065
39953 14643065 12201783 9384585 8316097 8949517 8380999 5150578 1179663 -2003035
39945 -2003035 -5978651 -11798841 -15956476 -13800297 -6483419 -902112 -1731131 -6030147
39937 -6030147 -7167022 -2417378 4856176 9604986 10137418 8865694 9028203 11329264
39929A1329264K760237K124881K167605K015459j073399o302385q019413k570316
39921B431933N729354R030608N370897M9576k133697k005889k275521k396050
39913A3801211p7358L845786N182992J345771n047395q295994n218720J455436
39905F991729N649163M375440R35910L69124K440278J991127k978412o973329
39897A2801030l805324M331813Q940393O238890J495543O81204K246292J022128
39889C3951969k866998m411927k003379M22236L22778K03111K178869L956954
39881C1753613L649648M058000P485889R919906O119454j715455o365356n541369
39873D9364330l471834l076488k825334j843398j857722k632974j346237J610768
$$ plain form
39929 11329264 14089501 16214382 18381987 20397446 19324047 13021662 5002249 2431933
39921 2431933 8161287 17191895 22562792 22612368 20478671 18472782 16197261 13801211
39913 13801211 13723853 17569639 22752631 24098402 19051007 10755013 5536293 6991729
39905 6991729 12640892 17016332 17952242 18321366 20761644 22752771 19774359 12801030
39897 12801030 8995706 13327519 22267912 28506802 30002345 30683549 32929841 33951969
39889 33951969 31084971 26673044 24669665 25091901 25414679 25617790 27796659 31753613
39881 31753613 35403261 39461261 46947150 56867056 62986510 61271055 54905699 49364330
39873 49364330 45892496 42816008 39990674 38147276 36289554 33656580 32310343 33921111
39865C3921111J953599j061375k281117J321856N811957O827836N484627M070689
39857E6049183J692734j220134j54384N731553Q717732K801631n760799o716165
39849F1141351j262059L08187n038175r061373n666533O42076K634841m06326
39841D3291989m744077p874577q654597o020648q73862L561396N323917N379043
39833B9388584N052528M590490M247408L550303J91907o197773j0334046o955737
39825B3533664L40097K568441j983350n823220m299959j663010k174816l028144
39817G469703p94001J802779J044387j353823k380035l147725m622250l168067
39809e149032K982640P344938L036678n835519q496170j904701O342820R037081
$$ plain form
39865 33921111 35874710 34813335 32532218 33854074 39666031 46493867 51978494 56049183
39857 56049183 57741917 56521783 56367399 62098952 70816684 73618315 67857516 61141351
39849 61141351 59879292 60187479 55149304 46087931 40421398 41063474 43698315 43291989
39841 43291989 38547912 30673335 22018738 15998090 15124228 18685624 24009541 29388584
39833 29388584 34441112 39031602 43279010 46829313 47021220 40823447 30489401 23533664
39825 23533664 23873761 26442202 24458852 18635632 14335673 12672663 10497847 7469703
39817 7469703 6675702 8478481 9522868 8169045 5789010 2641285 -1980965 -5149032
39809 -5149032 -2166392 5178546 8215224 2379705 -6116465 -8021166 -1678346 7358735
39801G358735O571970K797086k28484k028629k929595m653630q135628j0526227
39793a1774402q018304j614449L631109M935354L631782J282318j620631l212860
39785a2760083j353062K112454K644729l23383k190679o7470L051361K849119
39777f037014p71438m476580n193191j771784M249202Q358384O490000J49419
39769I96998m572077m268637j459714O46609K630105N375887N854725R64038o098289
39760F9645q138925l024462L444960N198315L377271L493324O832593Q424094
39752A9676815M238404k859726o909448o636209n872006o819599p074816m387114
39744a6643699n01655J904869K955501L767247L801934K730041K095455K174537
$$ plain form
39801 7358735 13930705 16727791 16499307 14470678 11541083 6887453 -1248175 -11774402
39793 -11774402 -19792706 -21407155 -17776046 -12840692 -9208910 -7926592 -9547223 -12760083
39785 -12760083 -14113145 -12000691 -9355962 -9679345 -11870024 -11937494 -8886133 -6037014
39777 -6037014 -6808452 -11285032 -16478223 -18250007 -14000805 -5642421 847579 996998
39769 996998 -3575079 -7843716 -9303430 -8656821 -6026716 -650829 5203896 6167934 69645
39760 69645 -8069280 -11093742 -7648782 -2450467 926804 4420128 11252721 19676815
39752 19676815 23915219 21055493 14146045 7509836 1637830 -5181769 -12256585 -16643699
39744 -16643699 -17145354 -15240485 -12284984 -8517737 -4715803 -1985762 109693 2284230
39736B284230L75808l512540m014059K729310J0931829J0970074K338829n671189
39728A6432292o534425l446619k343998l857019m940598m047903j569994J961855
39720h346409N540214P314818O044882J937166l518571o981980m648294K402415
39712b55759O660549K949157l503208m020629N96073K240243n97103j260757J720252
39703D528818R92368o025910j0812671p195795j287924l73865j078125K081361
39695a9171743M656823J75079o191056m450993L548098P048239L954189K583561
39687g847803N978058P368871L483848M01558K092722L589077O14259l082291
39679A2598299l534743l500344n513760n481416k70929M516077K176292m222034
$$ plain form
39736 2284230 2660038 -852502 -4866561 -2137251 8794578 19764652 22103481 16432292
39728 16432292 9897867 6451248 4107250 250231 -4690367 -8738270 -10308264 -8346409
39720 -8346409 -2806195 4508623 10553505 12490671 8972100 1990120 -2658174 -255759
39712 -255759 6404790 9353947 5850739 1830110 2426183 4666426 4069323 2808566 4528818
39703 4528818 5521186 -504724 -11317395 -18513190 -19801114 -20174979 -21253104 -19171743
39695 -19171743 -14514920 -14339841 -20530897 -24981890 -21433792 -14385553 -10431364 -7847803
39687 -7847803 -1869745 5499126 8982974 9384532 11477254 15066331 15680590 12598299
39679 12598299 9063556 5563212 49452 -5431964 -5702893 -1186816 989476 -3232558
39671c232558o523569l925483k656063m613170m320571J663140Q591918R527047
39663e489309L897908k490031m362515k071888m1939j022871k978547k571192
39655a7130384k96419P02972K84397J534180M549149M768635Q3383m603407l725758
39646a3833252J045442L432354J206600j846322j776901J185587M083998M653126
39638a849368L185227K069181K888666L804976J791791k280592l997227j885234
39630C727420K19929q07906k948115l210245k243145j505997K22185L602169N704385
39621B760680M483530K614052K246722R5640o250594j0900214o138835N584338
39613e504681J3567692J1831417L496463o244874j3645936j3874083m397268P646743
$$ plain form
39671 -3232558 -9756127 -13681610 -16337673 -20950843 -25271414 -23608274 -15016356 -5489309
39663 -5489309 -1591401 -4081432 -8443947 -10515835 -10557774 -11580645 -14559192 -17130384
39655 -17130384 -17426803 -16723831 -16439434 -14905254 -10356105 -5587470 -5504087 -10107494 -13833252
39646 -13833252 -12787810 -9355456 -8148856 -9995178 -11772079 -10586492 -6502494 -1849368
39638 -1849368 1335859 3405040 6293706 10098682 11890473 9609881 5612654 3727420
39630 3727420 3947349 3139443 191328 -3018917 -5262062 -6768059 -6545874 -2943705 2760680
39621 2760680 7244210 9858262 12104984 12200624 5950030 -4950184 -11089019 -5504681
39613 -5504681 8063011 19894428 23390891 17146017 3500081 -10374002 -14771270 -7124527
39605g124527J0299639J862927o559291o385650j308413J956336L844864O681240
39597C267125O897814Q32249o634978p647948k682521J336751K034856K884551
39589B87899M444687K415458m034393q604958n656262K363181Q078118P383319
39581F677049K535487j271598r45959K055534L689514K006883q34099j998351
39573A1914460j928927l003373n291425o013212l216426J569597M559874L166561
39565A757129j145718l480706o79216L999901M023185j812928p190145o390000
39557a0918498j241349K596669L122762K393694J845175Q68947j174209m083713
39549f590522o669680o218279j054741M917347M846345j094070l848298J844350
$$ plain form
39605 -7124527 3175112 5038039 -1521252 -7906902 -9215315 -7258979 -3414115 3267125
39597 3267125 10164939 10997188 4362210 -3285738 -5968259 -4631508 -2596652 287899
39589 287899 4732586 7148044 3113651 -5491307 -11147569 -8784388 -706270 6677049
39581 6677049 9212536 7940938 6994979 9050513 12740027 14746910 13912811 11914460
39573 11914460 9985533 6982160 1690735 -4322477 -7538903 -5969306 -1409432 1757129
39565 1757129 611411 -2869295 -3548511 451390 4474575 2661647 -4528498 -10918498
39557 -10918498 -12159847 -9563178 -6440416 -4046722 -2201547 -1332600 -2506809 -6590522
39549 -6590522 -13260202 -19478481 -20533222 -15615875 -10769530 -11863600 -15711898 -13867548
39541a3867548Q646724P077834l93110m157829k411090j234925j942819L26950
39533g955813M903397L875473m610650j1155183p918943J333964Q656463J1861386
39525a009906J1861439P327193j328965q054780p966787m212148k402908k189969
39517g976831j76587K624311K787997J222530J450227K845490J639159k193082
39509B223214m448009k907058K80704K258402K169738Q21318K59459K269407N024565
39500G951740L835673j994472o552967n285327j663547r78040j554161J150861
39492e090240M850846L084220l463965o696382l155461J198944N48155k936389
39484a1660272m075136k423584j186252j591287j736269M50340M855000Q667515
$$ plain form
39541 -13867548 -5220824 1857010 1463900 -2693929 -5105019 -6339944 -8282763 -7955813
39533 -7955813 -3052416 823057 -3787593 -14942776 -22861719 -21527755 -12871292 -1009906
39525 -1009906 10851533 18178726 16849761 8794981 828194 -3383954 -5786862 -7976831
39517 -7976831 -8153418 -5529107 -2741110 -1518580 -68353 2777137 4416296 2223214
39509 2223214 -2224795 -5131853 -4851149 -2592747 -423009 398309 657768 2927175 7951740
39500 7951740 11787413 9792941 3239974 -2045353 -3708900 -4686940 -6241101 -5090240
39492 -5090240 -239394 2844826 -619139 -7315521 -10470982 -9272038 -8723883 -11660272
39484 -11660272 -15735408 -18158992 -19345244 -20936531 -22672800 -22222460 -17367460 -8699945
39476h699945Q067961K347375l961374n527873k381852R52715J583411L84066
39468g235516r48468j321488L25814L216325L631847o6877l027703m5135N340201
39459a31000M746078k358349p399483n178850m0293K571224L265641M141294L958372
39450C574634K060418J181728J993235K95243n790436j0873167r373203l203993
39442b0135541K097772M608352N062907L333179O26272O02139L332782L018789
39434B546651k807438p204366l808260K238069J786391l887012n785010j986097
39426a8907072N58678j256395k342879M10048K726749J024286j593971j312569
39418b0693125M92061J228484J882733L858597N065031K996875j084149l995915
$$ plain form
39476 -8699945 -631984 1715391 -2245983 -7773856 -10155708 -9202993 -7619582 -7235516
39468 -7235516 -8183984 -9505472 -9179658 -5963333 -2331486 -2398363 -5426066 -5471201 -131000
39459 -131000 4615078 2256729 -5142754 -10321604 -10361897 -7790673 -4525032 -383738 3574634
39450 3574634 5635052 6816780 8810015 9105258 3314822 -7558345 -16931548 -20135541
39442 -20135541 -18037769 -13429417 -8366510 -5033331 -4407059 -3804920 -472138 2546651
39434 2546651 -260787 -7465153 -11273413 -9035344 -7248953 -11135965 -16920975 -18907072
39426 -18907072 -18348394 -19604789 -21947668 -21537620 -18810871 -17786585 -19380556 -20693125
39418 -20693125 -20201064 -18972580 -17089847 -13231250 -8166219 -5169344 -6253493 -10249408
39410a0249408m523556l740015l644470o000722r498994q439015Q79402J2239413
39402c2977365J4391567N744138k667530k364377J523513J19923m672508m029527
39394b4932166K855349P199348M088417r25342j260462J282520Q21147l157403
39386a4028592n668071l955274q80809j02283j054096n65522K106526M323935
39378a9824186M248623L612977M700074O208348M841541N94515k565264k013875
39370a97247K13373P76647o31911k168177l134888l989936m118872k168022J286675
39361a4132358L314656J836668j356128j819561K522728P894893Q073052K242487
39353H576437k947156j733705K709717K946074j493801l647813l69677K815935
$$ plain form
39410 -10249408 -14772964 -18512979 -22157449 -28158171 -37657165 -46096180 -45216778 -32977365
39402 -32977365 -18585798 -12841660 -15509190 -17873567 -16350054 -16230131 -20902639 -24932166
39394 -24932166 -22076817 -14877469 -10789052 -11714394 -12974856 -11692336 -10871189 -14028592
39386 -14028592 -19696663 -23651937 -24532746 -24635029 -25689125 -26254647 -24148121 -19824186
39378 -19824186 -15575563 -11962586 -7262512 -1054164 3787377 4381892 1816628 -197247
39370 -197247 16126 792773 160862 -2007315 -5142203 -9132139 -13251011 -15419033 -14132358
39361 -14132358 -10817702 -8981034 -10337162 -12156723 -9633995 -1739102 6333950 8576437
39353 8576437 5629281 3895576 6605293 9551367 8057566 4409753 4040076 6856011
39345F856011R67970k539740k285747N01413J474965J145961K301247K584580
39337A1006660k070036p915316o462135J661804M896055l177342j3375528j2630882
39329b8066720j196315Q764159R285808M453122K242008M413878O624574N022861
39321A1543375J14153m628443o257241m631524j860556K48073J622389K685889
39313a163885K944598J835492K2833j429489k505874l644766m360378l761826
39305a2063295j926742M08235K808282M514519L920984O68782k486412k405000
39297f560647R586Q61002r05392j879680J71158K225740N64648k724634j939615
39288a0177834L720085P928027N272935j388157m431705r43216M357563N701077
$$ plain form
39345 6856011 7823981 5284241 2998494 3499907 4974872 6120833 8422080 11006660
39337 11006660 8936624 1021308 -5440827 -3779023 1117032 -2060310 -15435838 -28066720
39329 -28066720 -29263035 -20498876 -11213068 -6759946 -4517938 -104060 6520514 11543375
39321 11543375 11657528 7029085 771844 -3859680 -5720236 -5472163 -3849774 -1163885
39313 -1163885 1780713 3616205 3639038 2209549 -296325 -3941091 -8301469 -12063295
39305 -12063295 -13990037 -13581802 -10773520 -6259001 -2338017 -1669235 -4155647 -6560647
39297 -6560647 -6551061 -5690059 -6595451 -8475131 -8303973 -6078233 -5513585 -8238219 -10177834
39288 -10177834 -6457749 1470278 6743213 5355056 923351 -19865 4337698 10038775
39280A0038775L028451Q52063K123640N166204O154498L001505l145677q779736
39272A8439723j0186926o297053j46857L707913L979601L450029M103262L700382
39264B0750074l48706n577627o955601m377723k922655m439726m025817J767812
39256f129969P807882O943919Q65297k243276N124J498783j535935m275617j634287
39247A301921L163740L877978R57323m33530K90795j283644n930553q224946m403292
39238a0684208K179630N950163N765769M023203K166935L01734n83181N98081
39230I718126K427283J941676j190086l327867j078787L753023N114646l95342
39222A6962672q526671j1273838n922280J980276N454007L405461k83969k110482
$$ plain form
39280 10038775 13067226 13919289 16042929 21209133 27363631 30365136 27219459 18439723
39272 18439723 8252797 1955744 1808887 5516800 9496401 12946430 17049692 20750074
39264 20750074 20401368 14823741 7868140 3490417 567762 -3871964 -7897781 -6129969
39256 -6129969 1677913 8621832 9487129 7243853 7248977 8747760 7211825 2936208 1301921
39247 1301921 4465661 8343639 9300962 8867432 9158227 7874583 1944030 -6280916 -10684208
39238 -10684208 -8504578 -2554415 3211354 7234557 9401492 9703226 9120045 9718126
39230 9718126 12145409 14087085 12896999 9569132 8490345 12243368 17358014 16962672
39222 16962672 8436001 -2837837 -8760117 -6779841 -1325834 2079627 1795658 -314824
39214c14824r40234K598973N461711L452904l014013p065964m042866P83293m21887
39205c502907n315740m650873K108044M624236k161373r704837q975750k984485
39197c0563685Q64783K955383O979064R719163O063131J86039L83630M719477
39189A306985L423128m543619r227147o015981k467254m352615n846111n43466
39181b8266080O950736R037422P437101P763135P366432l819j0021914j0534717
39173a0271704Q3526Q263998L552568o868678q601920N47357R217636Q332599
39165D255382J004157m151976l835259j253313J71628M29519P75290R46790j89556
39156a847338k388687l785627k887948j27848K607546L496530J951543r04949
$$ plain form
39214 -314824 -1255058 1343915 6805626 10258530 7244517 178553 -3864313 -3081020 -3502907
39205 -3502907 -8818647 -13469520 -11361476 -6737240 -8898613 -18603450 -27579200 -30563685
39197 -30563685 -29698902 -26743519 -19764455 -10045292 -3982161 -3796122 -3412492 1306985
39189 1306985 4730113 186494 -9040653 -15056634 -17523888 -21876503 -27722614 -28266080
39181 -28266080 -21315344 -12277922 -4840821 2922314 10288746 10284927 263013 -10271704
39173 -10271704 -10188178 -1924180 1628388 -5240290 -13842210 -13294853 -4077217 4255382
39165 4255382 5259539 1107563 -2727696 -3981009 -3809381 -3379862 -2604572 -1657782 -1847338
39156 -1847338 -4236025 -8021652 -10909600 -11037448 -8429902 -4933372 -2981829 -3886778
39148c886778k704168j681170J219111K725612P75333k568788l014960P38134
39140h397674M935383N089102J478900j604364j884576j557482k582808k885230
39132g408749o12817N93290l657635r257233o548956N017485J2754062P081860
39124b038693m114659n938063K555023Q238624M009972k336221k228808J382706
39116d70119K049912J318709L599558N781374J905691n139988o570482j186603
39108A288052L549285M015224M309649N786699K758186o496511j3050743q880713
39100f720872R37173N459881L062924Q91045J753635J154155k359164l282958
39092H95819J214610N505188M261257R70038J612046M291727K447082l834788
$$ plain form
39148 -3886778 -6590946 -8272116 -7053005 -4327393 -3552060 -6120848 -9135808 -8397674
39140 -8397674 -3462291 1626811 3105711 1501347 -383229 -1940711 -4523519 -7408749
39132 -7408749 -8021566 -7428276 -11085911 -20343144 -26892100 -21874615 -9120553 -2038693
39124 -2038693 -6153352 -12091415 -9536392 -1297768 2712204 375983 -1852825 -470119
39116 -470119 1579793 2898502 6498060 12279434 14185125 9045137 2474655 1288052
39108 1288052 4837337 8852561 13162210 18948909 21707095 15210584 2159841 -6720872
39100 -6720872 -5783699 -323818 2739106 3630151 5383786 6537941 4178777 895819
39092 895819 2110429 7615617 11876874 12846912 14458958 18750685 21197767 17362979
39084A7362979p389503m964598j515982j653496l116489k146668j40886l95017
39076c959660j930537j524575N34157J559654J585343K497728L354760J762955
39068C879825p65083l99771K034472J703055j582433j828934L291530P157357
39060A3490018L165301n702593j1219062j0225594n641858m34006L718001M117769
39052h732024j99000m259265j767919N811065J0152661O744165k88103m969081
39044B492499o117865n431625l440399j44883L162881M929691M453888J491891
39036A396078k674377m010172L94193O767036P667233J814363m002126m640886
39028B711342k765478k395003k140125L59572K203153m16727m907247n659504
$$ plain form
39084 17362979 9973476 5008878 3492896 1839400 -1277089 -3423757 -3564643 -3959660
39076 -3959660 -5890197 -7414772 -6880615 -5320961 -3735618 -1237890 2116870 3879825
39068 3879825 3114742 2714971 4749443 6452498 4870065 3041131 6332661 13490018
39060 13490018 16655319 10952726 -266336 -10491930 -16133788 -16567794 -12849793 -8732024
39052 -8732024 -8931024 -13190289 -14958208 -9147143 1005518 7749683 7461580 2492499
39044 2492499 -3625366 -9056991 -12497390 -12642273 -9479392 -4549701 -95813 1396078
39036 1396078 -1278299 -5288471 -4894278 1872758 9539991 11354354 7352228 2711342
39028 2711342 -54136 -2449139 -4589264 -4229692 -2026539 -2443266 -7350513 -13010017
39020a3010017k679826p33903j324575j744406j338328k173080l145344M8003
39012b6101476P282230J1905079Q830553N69609o903534j0300836q978962l065560
39004b6762897N095685J0639772J0644670P264018M371386L035363K112401J139999
38996A7540397N16389K85742K07945j58808j636449l662611l097716J443741M822025
38987A6260655Q68445o724178o656787L686434J2317086Q860801q46169m647670
38979B3118617k054403j442867l615079j421966M748800M877399l953558j1111093
38971I145850q558460k622512j945642l270059Q00864P205780P218014J512921
38963I486756j368753L65826L99086k539581k089907K766303L726516k646547
$$ plain form
39020 -13010017 -15689843 -16423746 -17748321 -19492727 -20831055 -23004135 -26149479 -26101476
39012 -26101476 -18819246 -6914167 1916386 2485995 -4417539 -14718375 -23697337 -26762897
39004 -26762897 -21667212 -11027440 -382770 6881248 11252634 14287997 16400398 17540397
38996 17540397 18056786 18342528 18550473 18391665 16755216 13092605 9994889 11438630 16260655
38987 16260655 17129100 10404922 3748135 7434569 19751655 28612456 27766287 23118617
38979 23118617 21064214 19621347 16006268 14584302 19333102 24210501 20256943 9145850
38971 9145850 587390 -2035122 -3980764 -7250823 -6449959 755821 7973835 9486756
38963 9486756 8118003 8483829 8882915 6343334 4253427 7019730 10746246 8099699
38955H099699p032907j417898P021026N853850l862734r529290n852680r90524
38947g711458k301564n566232l198640L651427P704292O643271M978470N646980
38939I846546N653886J766610l522146m903322j589432J286124r93467p006854
38931E37945j1201741j0644722p735756n859822m511216q02539N124121R020287
38923b6073443P703234L265345N42240J529361L956042M739075L094301L34543
38915i09302j725419j709842O05669L654016M893392L097685l79888k999297l451737
38906A075277k517835j836334k009205j894356j39299K332518K368837j594882
38898d215279o471879p309489l188297J821443M067803M187265M349297M254574
$$ plain form
38955 8099699 1066792 -351106 6669920 12523770 8661036 -868254 -6720934 -7711458
38947 -7711458 -10013022 -15579254 -18777894 -15126467 -7422175 -778904 4199566 9846546
38939 9846546 15500432 17267042 13744896 8841574 7252142 8538266 7544799 537945
38931 537945 -10663796 -21308518 -29044274 -34904096 -39415312 -40217851 -35093730 -26073443
38923 -26073443 -18370209 -15104864 -14562624 -13033263 -9077221 -4338146 -1243845 -909302
38915 -909302 -2634721 -4344563 -3738894 -84878 4808514 7906199 7526311 4527014 1075277
38906 1075277 -1442558 -3278892 -5288097 -7182453 -7321752 -4989234 -2620397 -4215279
38898 -4215279 -10687158 -17996647 -21184944 -19363501 -15295698 -11108433 -6759136 -2504562
38890b504562K274940j152383l915755m958811m258908j279441L722213P700016
38882d372691P350023L506066J60426p06628l72297J64504J288571K188565J233981
38873A0440520k80194R78459M377338M753160J08653m709812n261503l961966
38865F444655m837898n846960k499306L199304M337946l38984l760530l53322
38857c655095O213850Q059046L064290l130936m209040k45255K818566N36567
38849I451993m229664m861713k33172L262762O97732m546768o508443n177953
38841a2145226l920299j741595M529283J1766017J2411991N638879r07257k318031
38833A3313762j928194k817518j671194L783849P918407M651454k668242n834991
$$ plain form
38890 -2504562 -229622 -1382005 -5297760 -10256571 -14515479 -15794920 -12072707 -4372691
38882 -4372691 2977332 6483398 6643824 5937196 5564899 5729403 7017974 9206539 10440520
38873 10440520 10160326 11138785 15516123 20269283 20377936 15668124 10406621 6444655
38865 6444655 1606757 -4240203 -6739509 -3540205 797741 458757 -3301773 -3655095
38857 -3655095 2558755 10617801 13682091 10551155 6342115 6096860 8915426 9451993
38849 9451993 5222329 360616 127444 3390206 4087938 -458830 -6967273 -12145226
38841 -12145226 -16065525 -17807120 -13277837 -1511820 10900171 16539050 15631793 13313762
38833 13313762 11385568 8568050 6896856 10680705 18599112 23250566 20582324 14747333
38825A4747333l340875n45950k58526k29415M50640n98482l412286m090276j197450
38816A524713J028332j042483m550557m261183l69446J915835J90919j697150
38808g261020L48310M145353M133350j72862l038170j176586R92515j378520m811164
38799h218794k379233M312281N856375j030904q010141p059210j079434K567810
38791a5041250L141121M216226M670278M27066o241480p381633n64750O901849
38783i872573P282857J475769l638744l804719r36876N13079q90234j918008P46949
38774a1042500M662064L565331l334099q177850m309415M299525Q520677O108297
38766B92030K277933L18740j351440l257412l139766j167750n57837j497507l52624
$$ plain form
38825 14747333 11406458 10860508 10601982 10372567 10823207 10224725 6812439 2722163 1524713
38816 1524713 2553045 1510562 -3039995 -7301178 -7670624 -5754789 -5563870 -7261020
38808 -7261020 -6912710 -2767357 1365993 1193131 -1845039 -3021625 -2029110 -3407630 -8218794
38799 -8218794 -10598027 -6285746 -429371 -1460275 -9470416 -16529626 -17609060 -15041250
38791 -15041250 -11900129 -7683903 -3013625 -2586559 -8828039 -16209672 -16774422 -9872573
38783 -9872573 -2589716 -1113947 -4752691 -8557410 -9494286 -8981207 -9871441 -11789449 -11042500
38774 -11042500 -6380436 -2815105 -6149204 -14327054 -18636469 -14336944 -5816267 292030
38766 292030 2569963 2888703 1537263 -1720149 -4859915 -6027665 -6585502 -8083009 -8435633
38757h435633L284147M612391J136035l238161m396656l289622k073049l6136
38749a2436684L028422M092154J771367n8995J960116M755885L535577m60957
38741F186885k241132j182336j265775l737699m915086k334070J176724J621609
38733f690880o11359j598680Q15260M445589N618673L432009K34787j649722j928217
38724B067460o74414K700534O767061P024140J299243n464615o409268k012588
38716E297553P88541j476086n240938o749221o390030m645304p2555N790425P494395
38707e203220L438483p95446q81818n1603k160131m007661q90702M653922O735861
38698H37685N440275M902407M470611k43281q197326j2326358q870040j327399
$$ plain form
38757 -8435633 -5151486 -539095 596940 -2641221 -7037877 -10327499 -12400548 -12436684
38749 -12436684 -9408262 -5316108 -3544741 -3603736 -1643620 3112265 6647842 6186885
38741 6186885 3945753 2763417 1497642 -2240057 -7155143 -9489213 -8312489 -6690880
38733 -6690880 -7302239 -8900919 -8085659 -3640070 1978603 5410612 5645399 3995677 2067460
38724 2067460 1393046 4093580 10860641 17884781 19184024 13719409 7310141 5297553
38716 5297553 6086094 4610008 -630930 -7380151 -13770181 -18415485 -18488040 -12697615 -5203220
38707 -5203220 -1764737 -2560183 -3442001 -3493604 -5653735 -9661396 -10552098 -5898176 837685
38698 837685 6277960 11180367 15650978 15407697 7210371 -5115987 -13986027 -15313426
38690a5313426N387820R136832Q664674L646238k121728l090208P75775L763923
38682A0849900K681609M32820j63665r00288l929319p356563q059518n641030
38674a2086054j255524M181025Q304165P338767R16429n699275p153817l943322
38666i397606n58659K87880p75005k119242k432371r02915J651747K660724N88012
38657a0997435k827612m441789l062383N6730L073286M792162M806678L411560
38649e188803J230689r88134j787007N23023M945686O741291K665059l248657
38641D893147l523117K299303N849649J126820o961630r499379n739486k755857
38633a4310550m118580n150298j191176M440280M793593o93185n017324k769869
$$ plain form
38690 -15313426 -9925606 -788774 7875900 11522138 9400410 6310202 7085977 10849900
38682 10849900 13531509 13964329 13800664 12900376 8971057 1614494 -6445024 -12086054
38674 -12086054 -13341578 -9160553 -856388 6482379 7398808 1699533 -5454284 -9397606
38666 -9397606 -9956265 -9668385 -10443390 -12562632 -14995003 -15897918 -14246171 -11585447 -10997435
38657 -10997435 -13825047 -18266836 -21329219 -21272489 -18199203 -13407041 -8600363 -5188803
38649 -5188803 -3958114 -4946248 -6733255 -6210232 -1264546 5476745 8141804 4893147
38641 4893147 1370030 3669333 9518982 10645802 3684172 -5815207 -11554693 -14310550
38633 -14310550 -18429130 -23579428 -24770604 -20330324 -15536731 -16229916 -21247240 -24017109
38625b4017109L162500O069812M151028J522283J368863J986600O61304k025364
38617g120083m048807n228114n606183k990439L777751J0490668J1181516N958038
38609F414347P90926r83090k209297n413691p538809m588480J617995N277814
38601f632285L831805J53069j906584j539454n08311n17845j558504k150167j026159
38592a1854435J499803M171147O158804O753655M697743k2191m316181m777821
38584B310524k388868j416527l252385m765817l630168j420618K39062K490714
38576a1834083N435660N455494M31831n257803n740606j914424K42934j219504
38568a4400501k179118q6847J669513m40833l984112l989865l09628K454098J981159
$$ plain form
38625 -24017109 -20854609 -14784797 -10633769 -9111486 -7742623 -5756023 -5094719 -7120083
38617 -7120083 -11168890 -16397004 -22003187 -24993626 -21215875 -10725207 456309 6414347
38609 6414347 7205273 6222183 4012886 -1400805 -8939614 -13528094 -11910099 -6632285
38601 -6632285 -2800480 -2647411 -4553995 -6093449 -6601760 -7119605 -8678109 -10828276 -11854435
38592 -11854435 -10354632 -6183485 -24681 6728974 11426717 11404526 7088345 2310524
38584 2310524 -78344 -1494871 -4747256 -9513073 -13143241 -14563859 -14324797 -11834083
38576 -11834083 -6398423 -942929 -511098 -5768901 -11509507 -13423931 -13180997 -14400501
38568 -14400501 -16579619 -16666466 -14996953 -15437786 -19421898 -23411763 -23721391 -21267293 -19286134
38559a9286134J524352M777131R838245J0817031N129035k827546o123711k497229
38551A351174L684667O067776K140892n125665j0461475j0854371p247905k130703
38543b2575610L438641R131428J2628620J0638774L611791l289117n729796m430997
38535C423734k100859P70093M027136M817455R89427m197883n395986k119256
38527B13861J928262M838011O529481M516311l230159j1308609j0689014j337726
38519h539582O372115N677511J575726J196921L421583L611216K249777K084017
38511A7649284J582780j620593m512293l034283L06085J82908k656955l447842
38503D449091k353956l616784o670558o055366p84858L389909K530685p91869
$$ plain form
38559 -19286134 -17761782 -12984651 -3146406 7670625 12799660 9972114 3848403 1351174
38551 1351174 5035841 11103617 13244509 8118844 -2342631 -13197002 -20444907 -22575610
38543 -22575610 -19136969 -10005541 2623079 13261853 16873644 13584527 7854731 3423734
38535 3423734 1322875 2092968 6120104 10937559 11926986 7729103 2333117 213861
38527 213861 2142123 6980134 13509615 18025926 14795767 3487158 -7201856 -8539582
38519 -8539582 -2167467 3510044 5085770 6282691 9704274 13315490 15565267 17649284
38511 17649284 19232064 17611471 13099178 10064895 10370980 10553888 7896933 4449091
38503 4449091 2095135 -1521649 -8192207 -14247573 -15032431 -11642522 -9111837 -9903706
38495i903706k811840k967602j580521J420702L887860K757326m69550o79353
38487a0346684K919270N265517L613047J281979P26477p79247m534271n523936
38479g377848J30590P256192P640912J440302l605327l104559l64341J37919j540772
38470F13068k809045k462475j013911N83046J396877J115660N59176M79371K22101
38461a316132j006309k203422j767590k04418L41532q44543k231666k299798j065111
38452a2597457N65513J551673J148577O5332N70633L503398N896022M316563L37218
38443E357472q15500K116498L928984K91079n767574q065297n454321j714303
38435a0122962R05555K987711L501793L4038n345390o357326j493177K652403
$$ plain form
38495 -9903706 -12715546 -15683148 -17263669 -15842967 -11955107 -9197781 -9667331 -10346684
38487 -10346684 -7427414 -2161897 1451150 2733129 3459606 2680359 -1853912 -7377848
38479 -7377848 -7247258 8934 7649846 9090148 5484821 2380262 2015921 2153840 613068
38470 613068 -2195977 -4658452 -5672363 -5089317 -3692440 -2576780 -2017604 -1538233 -1316132
38461 -1316132 -2322441 -4525863 -6293453 -6497871 -6156339 -7000882 -9232548 -11532346 -12597457
38452 -12597457 -12031944 -10480271 -9331694 -9266362 -8695729 -5192331 703691 5020254 5357472
38443 5357472 4541972 6658470 10587454 10878533 5110959 -2954338 -8408659 -10122962
38435 -10122962 -9217407 -6229696 -2727903 -2693865 -8039255 -14396581 -15889758 -13237355
38427a3237355R91287k231851o42079L806190M716258K328907K198352M271319
38419B201028K626052l339184o887070n291860l884500n278653m211736J469733
38411b2596190M329389l70054m664456j54611P125431O232792L07747J790277
38403g999675J0763100J3379587L997985n457399l875899L279221M439058j020726
38395A7505252n197963m906745l482871k909717k163348j722039l184855n163179
38387a1225465m658826j944799K4103L05173M43651J004460R24722q3922r82315
38378a6193218p73897J062048M075285N505542K025744m999810q782453m761589
38370b2842348L132163P167902N103853J434314O19871K565008M418878L905551
$$ plain form
38427 -13237355 -12246068 -14477919 -15119998 -11313808 -6597550 -4268643 -2070291 2201028
38419 2201028 4827080 1487896 -5399174 -10691034 -14575534 -19854187 -24065923 -22596190
38411 -22596190 -18266801 -18636855 -23301311 -23455922 -16330491 -10097699 -9789952 -7999675
38403 -7999675 2763425 16143012 20140997 14683598 10807699 14086920 18525978 17505252
38395 17505252 12307289 7400544 3917673 1007956 -1155392 -2877431 -6062286 -11225465
38387 -11225465 -15884291 -17829090 -17804987 -17499814 -17056163 -16051703 -15126981 -15210903 -16193218
38378 -16193218 -16967115 -15905067 -11829782 -6324240 -4298496 -9298306 -18080759 -22842348
38370 -22842348 -19710185 -12542283 -7438430 -6004116 -5384245 -2819237 1599641 5505192
38362E505192P25950l326928n614076n249166l969338l606537l868061l481466
38354b2884430j923969R31049M862679P871064P159043L185925K48598R91798
38346D41757K758228J773537j310887k877579j709842j17504n15513k764352m223684
38337h545839j776866M511589R532233P877969R78405m418532n713222p007700
38329d561963j0057407r388626j517136O785629O684519K3941l934669k384775
38321a8350487j323864m250059o616291l690379K344090O194215O130935M246974
38313a5314866L072353L857180N970041O993928N412780L137005K788619L097107
38305A9014147O53773l868121n486112j821832L563910O104426N129075K300786
$$ plain form
38362 5505192 6231142 2904214 -2709862 -7959028 -11928366 -15534903 -19402964 -22884430
38354 -22884430 -24808399 -23877350 -19014671 -11143607 -3984564 -798639 -550041 441757
38346 441757 3199985 4973522 3662635 785056 -924786 -1042290 -1557803 -4322155 -8545839
38337 -8545839 -10322705 -5811116 3721117 11599086 12577491 8158959 2445737 -4561963
38329 -4561963 -14619370 -24007996 -25525132 -18739503 -12054984 -12031043 -15965712 -18350487
38321 -18350487 -19674351 -23924410 -30540701 -34231080 -31886990 -25692775 -19561840 -15314866
38313 -15314866 -12242513 -8385333 -2415292 4578636 9991416 13128421 15917040 19014147
38305 19014147 19667920 15799799 10313687 8491855 12055765 18160191 23289266 25590052
38297B5590052j619859o155105r419523r477877o676978l222305o45503J694233
38289i932865N269362R125936Q947380K036304o840661r101631l778074p716m022376
38280h304341r224974o127619K394267N420882J573407R90906Q044977J3195754
38272G963259P500762l645581q777176o134483k840442k198984q23276K438364
38264f517557L219800n10130l673798j193195L915589M374284o59372l718657
38256d763036N47883P180517P342131Q41275l747536j935685O15816j648890m611330
38247a78855j827104L596328L455508j603711k643969K518734M699436k814302
38239E202065j3846739j7528515j1047997J69689R878687J4121018J1380063M470340
$$ plain form
38297 25590052 23970193 17815088 8395565 -1082312 -7759290 -10981595 -11627098 -9932865
38289 -9932865 -4663503 4462433 13409813 15446117 8605456 -496175 -4274249 -4281965 -8304341
38280 -8304341 -17529315 -23656934 -21262667 -15841785 -14268378 -13277472 -5232495 7963259
38272 7963259 15464021 11818440 3041264 -3093219 -5933661 -8132645 -8955921 -6517557
38264 -6517557 -3297757 -3807887 -7481685 -8674880 -4759291 -385007 -1044379 -4763036
38256 -4763036 -4215153 2965364 10307495 11148770 7401234 5465549 6081365 4432475 -178855
38247 -178855 -2005959 1590369 5045877 3442166 798197 3316931 8016367 5202065
38239 5202065 -8644674 -26173189 -37221186 -37051497 -27172810 -13051792 -1671729 2798611
38231B798611n50322q55622L58120m22155k482574m224997o183474p713360n727026
38222b5002799l81966K982979J681611L29763K952307N667399L118555k256962
38214a0909113l921635q47569K869941N096046O152405M905376O68785l166765
38206H47471l320386k089074k870742l361426n2319L585175J599889l749279m513891
38197a3924582N99444N078107N547629M954218M348817Q72344m227031m696355
38189a447409N86021M866723M173933K507422K645440M12096o551299j2272115
38181e079188j1231034o797345l976048l85320P215128J3143275R681914N01564
38173C072946l250552P07164L527474K61001k823450L22638N059643L131313m839372
$$ plain form
38231 2798611 2248289 1392667 1750787 1328632 -1153942 -5378939 -11562413 -19275773 -25002799
38222 -25002799 -25384765 -22401786 -20720175 -20390412 -17438105 -11770706 -8652151 -10909113
38214 -10909113 -14830748 -15678317 -12808376 -7712330 -1559925 3345451 4014236 847471
38206 847471 -2472915 -4561989 -7432731 -10794157 -10846476 -7261301 -5661412 -9410691 -13924582
38197 -13924582 -13325138 -8247031 -2699402 2254816 6603633 7475977 3248946 -1447409
38189 -1447409 -861388 4005335 8179268 10686690 13332130 13744226 7192927 -5079188
38181 -5079188 -16310222 -23107567 -27083615 -27468935 -20253807 -7110532 2571382 3072946
38173 3072946 -177606 529558 4057032 4318033 1494583 1817221 6876864 10008177 5168805
38164E168805j0347135q321783k037155K762445M139713L492472K137923M62688
38156b542027r10309j133638l51035L42158N46801J175202K705937L761017K701633
38147F295739J61865j423250p05567J306540K559913J489739j851940m746200
38139C086839l494011J295376L053254k798398j0503455r581338O87879R115235
38131i138619P453769O69560k042906j43709J019369R95592L732861Q347387Q944089
38122A9837393M080382p87841j678304p41467q79769j420659j394378k089121
38114A4926236l820611m493680l643049l611476m539901k971567J712773M434425
38106b006850J882132j688755q75046K511302L006801N27972j92282K377319M906826
$$ plain form
38164 5168805 -5178330 -13500113 -15537268 -12774823 -8635110 -5142638 -3004715 -2542027
38156 -2542027 -3452336 -4585974 -4937009 -4594851 -4048050 -2872848 -166911 3594106 6295739
38147 6295739 6457604 5034354 4328787 5635327 8195240 9684979 7833039 3086839
38139 3086839 -407172 888204 3941458 1143060 -9360395 -18941733 -18253854 -9138619
38131 -9138619 -1684850 -1015290 -3058196 -3201905 -2182536 -1186944 2545917 10893304 19837393
38122 19837393 23917775 23129934 21451630 20710163 19830394 18409735 17015357 14926236
38114 14926236 11105625 6611945 2968896 -642580 -5182481 -8154048 -6441275 -2006850
38106 -2006850 -124718 -1813473 -2688519 -177217 2829584 3357556 3165274 5542593 10449419
38097A0449419M869499K630607j474968o678864q736860l549292N197141Q071641
38089A0778323J795864o217484p942430m309661j183826n18788l99773m93310
$$ plain form
38097 10449419 15318918 17949525 16474557 9795693 1058833 -2490459 2706682 10778323
38089 10778323 12574187 6356703 -1585727 -5895388 -7079214 -7598002 -7997775 -8491085
$$ [...]
##END NTUPLES=NMR SPECTRUM
##END=
