##TITLE=31Pdec_DE-78_oil5_TFA
 CDCl3, 64 sc
 24.12.2024
##JCAMPDX= 6.0         $$ Bruker NMR JCAMP-DX V2.0
##DATA TYPE= NMR SPECTRUM
##DATA CLASS= NTUPLES
##ORIGIN= UXNMR, Bruker Analytische Messtechnik GmbH
##OWNER= root
$$ XWIN-NMR		Version 3.5
$$ Tue Dec 24 14:01:02 2024 Russian Standard Time (UT+4h)  she@DPX200
##.OBSERVE FREQUENCY= 81.013821
##.OBSERVE NUCLEUS= ^31P
##.ACQUISITION MODE= SIMULTANEOUS
##.ACQUISITION SCHEME= undefined
##.AVERAGES= 64
##.DIGITISER RES= 17
##SPECTROMETER/DATA SYSTEM= spect
##.PULSE SEQUENCE= zgpg30
##.SOLVENT NAME= CDCl3
##.SHIFT REFERENCE= (INTERNAL, CDCl3, 0, 198.062)
##AUDIT TRAIL= $$ (NUMBER, WHEN, WHO, WHERE, WHAT)
$$ ##TITLE= Audit trail, XWIN-NMR		Version 3.5
$$ ##JCAMPDX= 5.01
$$ ##ORIGIN= Bruker BioSpin GmbH
$$ ##OWNER= she
$$ F:/spectra/data/she/nmr/P31/2/pdata/1/auditp.txt
$$ ##AUDIT TRAIL=  $$ (NUMBER, WHEN, WHO, WHERE, WHAT)
(   1,<2024-12-24 13:59:23.29 +0400>,<she>,<DPX200>,
      <continue with go, POWCHK disabled, PULCHK disabled
       configuration hash MD5:
       00 E9 B6 7A A2 85 ED C7 34 08 36 98 17 FE 4E 26
       data hash MD5: 32K
       B5 9D 2F 1D AF 0D 6E E1 79 EE A6 13 80 7D 04 9A>)
(   2,<2024-12-24 13:59:25.10 +0400>,<she>,<DPX200>,
      <Start of raw data processing
       efp BC_mod = 2 LB = 1.5 FT_mod = 6 PKNL = 1 PHC0 = 1973.143 PHC1 = 364.686 SI = 64K 
       data hash MD5: 64K
       A2 A6 09 D7 30 BB 89 43 8B ED E2 CD A9 F5 97 B2>)
(   3,<2024-12-24 14:00:25.50 +0400>,<she>,<DPX200>,
      <pk PHC0 = 195.955 PHC1 = -404.6001 
       data hash MD5: 64K
       79 E3 E0 0B A8 A2 DE 37 CC 8A BD 3D 1A A9 ED 4D>)
(   4,<2024-12-24 14:00:29.57 +0400>,<she>,<DPX200>,
      <abs ABSG = 5 
       data hash MD5: 64K
       47 D4 81 32 E9 B6 67 CC 01 40 8F 46 D1 89 51 A1>)
$$ ##END=
$$ 
$$ hash MD5
$$ C5 82 37 CD 48 9E 0E 94 8E 6B 05 28 5B 99 D1 F9
##$RELAX= 
##$RELAX= 
##$RELAX= 
##$RELAX= 
##$RELAX= 
##$RELAX= 
##$RELAX= 
##$RELAX= 
$$ Bruker specific parameters
$$ --------------------------
##$DU= <F:/spectra>
##$EXPNO= 2
##$NAME= <P31>
##$PROCNO= 1
##$TYPE= <nmr>
##$USER= <she>
##$AMP= (0..31)
100 100 100 100 100 100 100 100 100 100 100 100 100 100 100 100 100 100 
100 100 100 100 100 100 100 100 100 100 100 100 100 100 
##$AQSEQ= 0
##$AQ_mod= 1
##$AUNM= <au_zg>
##$AUTOPOS= <>
##$BF1= 81.014009
##$BF2= 200.13
##$BF3= 200.13
##$BF4= 200.13
##$BF5= 200.13
##$BF6= 200.13
##$BF7= 200.13
##$BF8= 200.13
##$BYTORDA= 1
##$CFDGTYP= 0
##$CFRGTYP= 5
##$CHEMSTR= <none>
##$CNST= (0..31)
1 1 145 1 1 1 1 1 1 1 1 1 1 1 1 1 1 1 1 1 1 1 1 1 1 1 1 1 1 1 1 1 
##$CPDPRG= <waltz16>
##$CPDPRG1= <>
##$CPDPRG2= <waltz16>
##$CPDPRG3= <>
##$CPDPRG4= <mlev>
##$CPDPRG5= <mlev>
##$CPDPRG6= <mlev>
##$CPDPRG7= <mlev>
##$CPDPRG8= <mlev>
##$CPDPRGB= <>
##$CPDPRGT= <>
##$D= (0..31)
0 1 0 0 0 0 0 0 0 0.06 0 0.03 2e-05 3e-06 0 0 0.0002 0 0 0 0 0 0 0 0 0 
0 0 0 0 0 0 
##$DATE= 1735034278
##$DBL= (0..7)
120 120 120 11 120 120 24 19 
##$DBP= (0..7)
150 150 150 150 150 150 150 150 
##$DBP07= 0
##$DBPNAM0= <>
$$ [...]
##$SUBNAM4= <"">
##$SUBNAM5= <"">
##$SUBNAM6= <"">
##$SUBNAM7= <"">
##$SUBNAM8= <"">
##$SUBNAM9= <"">
##$SW= 400.765351723535
##$SWIBOX= (0..15)
0 1 3 0 0 0 0 0 0 0 0 0 0 0 0 0 
##$SW_h= 32467.5324675325
##$TD= 32768
##$TD0= 1
##$TE= 0
##$TE2= 300
##$TE3= 300
##$TEG= 300
##$TL= (0..7)
0 120 53 12 22 120 120 120 
##$TP= (0..7)
150 150 150 150 150 150 150 150 
##$TP07= 0
##$TPNAME0= <>
##$TPNAME1= <>
##$TPNAME2= <>
##$TPNAME3= <>
##$TPNAME4= <>
##$TPNAME5= <>
##$TPNAME6= <>
##$TPNAME7= <>
##$TPOAL= (0..7)
0.5 0.5 0.5 0.5 0.5 0.5 0.5 0.5 
##$TPOFFS= (0..7)
0 0 0 0 0 0 0 0 
##$TUNHIN= 0
##$TUNHOUT= 0
##$TUNXOUT= 0
##$USERA1= <user>
##$USERA2= <user>
##$USERA3= <user>
##$USERA4= <user>
##$USERA5= <user>
##$V9= 5
##$VALIST= <valist>
##$VCLIST= <CCCCCCCCCCCCCCC>
##$VD= 0
##$VDLIST= <DDDDDDDDDDDDDDD>
##$VPLIST= <PPPPPPPPPPPPPPP>
##$VTLIST= <TTTTTTTTTTTTTTT>
##$WBST= 1024
##$WBSW= 4
##$XGAIN= (0..3)
0 0 0 0 
##$XL= 0
##$YL= 0
##$YMAX_a= 10668
##$YMIN_a= -30394
##$ZGOPTNS= <>
##$ZL1= 120
##$ZL2= 120
##$ZL3= 120
##$ZL4= 120
##$ABSF1= 198.0616
##$ABSF2= -202.7028
##$ABSG= 5
##$ABSL= 3
##$ALPHA= 0
##$AQORDER= 0
##$ASSFAC= 0
##$ASSFACI= 0
##$ASSFACX= 0
##$ASSWID= 0
##$AUNMP= <proc_1d>
##$AZFE= 0.1
##$AZFW= 0.5
##$BCFW= 0
##$BC_mod= 2
##$BYTORDP= 0
##$COROFFS= 0
##$CY= -3
##$DATMOD= 1
##$DC= 0
##$DFILT= <>
##$DTYPP= 0
##$F1P= 0
##$F2P= 0
##$FCOR= 1
##$FTSIZE= 65536
##$FT_mod= 6
##$GAMMA= 0
##$GB= 0
##$INTBC= 1
##$INTSCL= 9.790993e-09
##$ISEN= 30
##$LB= 1.5
##$LEV0= 0
##$LPBIN= 0
##$MAXI= 10000
##$MC2= 0
##$MEAN= 0
##$ME_mod= 0
##$MI= 50
##$NCOEF= 0
##$NC_proc= -9
##$NLEV= 6
##$NOISF1= 182.463
##$NOISF2= 159.3651
##$NSP= 0
##$NTH_PI= 0
##$NZP= 0
##$OFFSET= 198.0616
##$PC= 4
##$PHC0= 2169.098
##$PHC1= -39.91409
##$PH_mod= 1
##$PKNL= yes
##$PPARMOD= 0
##$PSCAL= 0
##$PSIGN= 0
##$REVERSE= no
##$SF= 81.0140089999434
##$SI= 65536
##$SIGF1= 159.3651
##$SIGF2= -187.1042
##$SINO= 113.3802
##$SIOLD= 16384
##$SREGLST= <1H.CDCl3>
##$SSB= 0
##$STSI= 65536
##$STSR= 0
##$SW_p= 32467.5324675325
##$SYMM= 0
##$S_DEV= 0
##$TDeff= 32768
##$TDoff= 0
##$TI= <>
##$TILT= no
##$TM1= 0
##$TM2= 0
##$TOPLEV= 0
##$USERP1= <user>
##$USERP2= <user>
##$USERP3= <user>
##$USERP4= <user>
##$USERP5= <user>
##$WDW= 1
##$XDIM= 65536
##$YMAX_p= 202651681
##$YMIN_p= -243043517
$$ End of Bruker specific parameters
$$ ---------------------------------
##NTUPLES= NMR SPECTRUM
##VAR_NAME=  FREQUENCY,     SPECTRUM/REAL,   SPECTRUM/IMAG
##SYMBOL=    X,             R,               I
##VAR_TYPE=  INDEPENDENT,   DEPENDENT,       DEPENDENT
##VAR_FORM=  AFFN,          ASDF,            ASDF
##VAR_DIM=   65536,         65536,           65536
##UNITS=     HZ,            ARBITRARY UNITS, ARBITRARY UNITS
##FACTOR=    0.49542278885378, 1,            1
##FIRST=     16045.7642231865, 0,            0
##LAST=      -16421.768244346, 0,            0
##MIN=       -16421.768244346, -243043517,   0
##MAX=       16045.7642231865, 202651681,    0
$$ Real data points
##PAGE= N=1
##DATA TABLE= (X++(R..R)), XYDATA
$$ [...]
##PAGE= N=2
##DATA TABLE= (X++(I..I)), XYDATA
$$ plain form
6606 -13537118 -5145471 -1685506 -2604478 -6080665 -11493875 -16580966 -16990630 -11978653
6598 -11978653 -7145542 -7849848 -12258305 -14512820 -12816445 -10242966 -8551267 -5799564
6590 -5799564 -845579 3586422 4267723 1528086 -2082823 -5675857 -10317721 -15956549
6582 -15956549 -20262594 -21311177 -20148558 -19442000 -20052576 -20429887 -19665767 -19371750 -20977337
6573 -20977337 -22398376 -20024678 -14071958 -9070514 -7740235 -7116040 -3396007 1323382
6565 1323382 1029243 -5695604 -13057487 -15287634 -13189511 -11086382 -9947819 -7248846
6557 -7248846 -2538754 998390 1325655 674671 2268086 6119744 9681542 10761145 8155151
6548 8155151 1491792 -7032756 -12263228 -10524777 -4100212 1215394 2634288 2001478
$$ packed form
6606a3537118Q391647L459965r18972l476187n413210n087091m09664N011977
6598a1978653M833111p04306m408457k254515J696375K573479J691699K751703
6590e799564M953985M432001O81301k739637l610909l593034m641864n638828
6582a5956549m306045j048583J162619P06558o10576l77311P64120K94017j605587
6573b0977337j421039K373698N952720N001444J330279O24195L720033M719389
6565A323382k94139o724847p361883k230147K098123K103129J138563K698973
6557g248846M710092L537144L27265o50984J593415L851658L561798J079603k605994
6548H155151o663359q524548n230472J738451O424565N315606J418894o32810
$$ plain form
6540 2001478 1702893 2430710 4903961 9587397 13582690 12129843 5528289 513604 1362930
6531 1362930 3316624 -509269 -8573953 -13284491 -12591993 -12280778 -15676715 -17960247 -14376385
6522 -14376385 -8751370 -8375243 -13302419 -16515477 -13954538 -9099359 -6801331 -7155316
6514 -7155316 -7764625 -8812707 -12543280 -18812687 -24007609 -24810105 -21637021 -17816861 -15889923
6505 -15889923 -15047356 -12368630 -6872938 -1972871 -2767657 -10596321 -21317408 -29291341
6497 -29291341 -31674298 -28409193 -20588153 -11167639 -5419294 -6882177 -12668082 -15822736
6489 -15822736 -13073515 -7699255 -4271387 -3854994 -5660328 -9585680 -14202850 -15327894
6481 -15327894 -10582095 -3607928 95348 128729 -49875 43362 -2455949 -7285736 -9697002
$$ packed form
6540B001478k98585P27817K473251M683436L995293j452847o601554n014685Q49326
6531A362930J953694l825893q064684m710538O92498L11215l395937k283532L583862
6522a4376385N625015L76127m927176l213058K560939M855179K298028l53985
6514g155316o09309j048082l730573o269407n194922q02496L173084L820160J926938
6505a5889923Q42567K678726N495692M900067p94786p828664j0721087p973933
6497b9291341k382957L265105P821040R420514N748345j462883n785905l154654
6489a5822736K749221N374260L427868M16393j805334l925352m617170j125044
6481a5327894M745799O974167L703276L3381j78604R3237k499311m829787k411266
$$ plain form
6472 -9697002 -7209454 -3136752 -1271485 -1249411 -1612355 -3158460 -5834590 -6220068 -2581786
6463 -2581786 463009 -2626766 -9914960 -14022692 -11750966 -6759333 -2781251 690905
6455 690905 4772607 7861497 8300449 7086552 5547192 3011112 -616572 -2262080 937653
6446 937653 6538010 8394643 3976245 -2318210 -4534695 -2392196 -1109445 -4216095
6438 -4216095 -8907944 -10213955 -8250736 -8196454 -12704152 -17723951 -18212878 -15614084 -15946404
6429 -15946404 -20919389 -24706418 -21056256 -11344327 -3530646 -3981706 -11943864 -21754695
6421 -21754695 -28637132 -31343469 -30513077 -27133159 -23432285 -22654729 -25184492 -26285447
6413 -26285447 -21208972 -12132156 -6007280 -5064925 -4015712 1612906 8986370 12697347
$$ packed form
6472i697002K487548M072702J865267K2074l62944j546105k676130l85478L638282
6463b581786L044795l089775p288194m107732K271726M991633L978082L472156
6455F90905M081702L088890M38952j213897j539360k536080l627684j645508L199733
6446I37653N600357J856633m418398o294455k216485K142499J282751l106650
6438d216095m691849j306011J963219N4282m507698n019799m88927K598794l32320
6429a5946404m972985l787029L650162R711929P813681m51060p962158r810831
6421b1754695o882437k706337Q30392L379918L700874P77556k529763j100955
6413b6285447N076475R076816O124876R42355J049213N628618P373464L710977
$$ plain form
6405 12697347 11766309 8261203 2952963 -3002571 -5547153 -2473335 1772155 1739988 -683778
6396 -683778 251682 4187876 5305686 2214055 -391611 -341283 -572986 -1832025 -767278
6387 -767278 2138657 717924 -6712997 -12573982 -10668757 -5475498 -4954144 -9212044 -12485227
6378 -12485227 -12142203 -9469793 -5097945 63379 2332944 -164289 -3149092 -2282288
6370 -2282288 -436709 -2412937 -5948878 -6070570 -5533954 -11152757 -20718719 -24192713 -19203666
6361 -19203666 -14869052 -16908158 -18944916 -13834561 -4682931 2100263 6718782 10634928
6353 10634928 8112014 -6165061 -24467692 -32128279 -26154986 -18108794 -17069251 -18886575
6345 -18886575 -15785142 -8619234 -3990105 -4608502 -8439970 -13799428 -19329957 -21111416
$$ packed form
6405A2697347r31038l505106n308240n955534k544582L073818M245490l2167k423766
6396f83778R35460L936194J117810l091631k605666N0328k31703j259039J064747
6387g67278K905935j420733p430921n860985J905225N193259N21354m257900l273183
6378a2485227L43024K672410M371848N161324K269565k497233k984803Q66804
6370b282288J845579j976228l535941j21692N36616n618803r565962l473994M989047
6361a9203666M334614k039106k036758N110355R151630O783194M618519L916146
6353A0634928k522914j4277075j8302631p660587N973293Q046192J039543j817324
6345a8886575L101433P165908M629129o18397l831468n359458n530529j781459
$$ plain form
6337 -21111416 -15939497 -7285176 -2850055 -5329520 -9631846 -10305116 -7886491 -6047579
6329 -6047579 -5774304 -5240195 -3495173 -1293561 1041879 4075988 7434798 9230154 7905774
6320 7905774 4063467 258553 -1122203 -475982 -1459954 -7508628 -17492417 -26461335 -31234287
6311 -31234287 -32953596 -32959719 -29355236 -20804965 -11349073 -6923930 -7698226 -8231118 -5667202
6302 -5667202 -3631124 -6596165 -13844514 -20821166 -23714088 -21104592 -14054250 -6817097
6294 -6817097 -4969728 -10049898 -17321362 -20686505 -18342594 -12239899 -4531676 2749275
6286 2749275 6506428 4678908 -756057 -5417428 -7130758 -7178985 -7467560 -8422320 -9616080
6277 -9616080 -10799010 -11921790 -12794471 -12672925 -10293410 -5453978 -582499 1164489 -161855
$$ packed form
6337b1111416N171919Q654321M435121k479465m302326o73270K418625J838912
6329f047579K73275N34109J745022K201612K335440L034109L358810J795356j324380
6320G905774l842307l804914j380756O46221r83972o048674r983789q968918m772952
6311c1234287j719309o123L604483Q550271R455892M425143p74296n32892K563916
6302e667202K036078k965041p248349o976652k892922K609496P050342P237153
6294f817097J847369n080170p271464l365143K343911O102695P708223P280951
6286B749275L757153j827520n434965m661371j713330m8227k88575r54760j193760
6277i616080j182930j122780q72681J21546K379515M839432M871479J746988j326344
$$ plain form
6268 -161855 -1453514 -1224736 -1310410 -2809578 -3854963 -3649671 -5209584 -10707954 -16859158
6259 -16859158 -18719913 -15930230 -11478911 -6614321 -1407228 1743841 636594 -1733440
6251 -1733440 -542740 2378164 -502486 -11216710 -21356541 -21516334 -12212322 -2305348
6243 -2305348 1112456 -1554783 -5263421 -6265169 -5284365 -5918310 -10003876 -14990392 -16820656
6234 -16820656 -14767003 -11964147 -11815118 -15406192 -21273655 -25475924 -23216112 -13613862
6226 -13613862 -2451726 2731255 14407 -6645101 -12822306 -15699761 -12661324 -3474962
6218 -3474962 6030920 8005220 1704926 -5775294 -8803015 -8454877 -7440228 -5550753
6210 -5550753 -2867218 -2338693 -5372041 -8648805 -8915345 -7706686 -7977480 -9187812 -9247764
$$ packed form
6268a61855j291659K28778q5674j499168j045385K05292j559913n498370o151204
6259a6859158j860755K789683M451319M864590N207093L151069j107247k370034
6251a733440J190700K920904k880650j0714224j0139831j59793R304012R906974
6243b305348L417804k667239l708638j001748R80804o33945m085566m986516j830264
6234a6820656K053653K802856J49029l591074n867463m202269K259812R602250
6226a3613862J1162136N182981k716848o659508o177205k877455L038437R186362
6218c474962R505882J974300o300294p480220l027721L48138J014649J889475
6210e550753K683535N28525l033348l276764k66540J208659k70794j210332n9952
$$ plain form
6201 -9247764 -8524829 -8328149 -7854729 -6139310 -4781855 -5233941 -5452395 -2858751 1089511
6192 1089511 2773486 1369806 -1370802 -4771291 -9069436 -12682421 -13271286 -11283426
6184 -11283426 -9563695 -9597049 -10352453 -10391617 -9160165 -6821699 -4456832 -3470429 -3473664
6175 -3473664 -2417769 -303171 -293595 -3763061 -6771513 -4857118 432071 3463631 2008457
6166 2008457 -627121 -509417 2901276 7489230 10714106 11078912 9166973 6969674 5139460
6157 5139460 2214689 -2169399 -5387674 -5223065 -3221927 -2320887 -2977407 -4079640 -5715641
6148 -5715641 -8269155 -10544229 -11570593 -12544112 -14317970 -15046375 -13341352 -11655990 -13066532
6139 -13066532 -16321146 -17287031 -13810788 -6660691 1790958 6951452 3557851 -7970181
$$ packed form
6201i247764P22935J96680M73420J715419J357455m52086k18454K593644L948262
6192A089511J683975j403680k740608l400489m298145l612985n88865J987860
6184a1283426J719731l3354p55404l9164J231452K338466K364867R86403l235
6175c473664J055895K114598R576l469466l008452J914395N289189L031560j455174
6166B008457k635578J17704L410693M587954L224876L64806j911939k197299j830214
6157E139460k924771m384088l218275J64609K001138R01040o56520j102233j636001
6148e715641k553514k275074j026364r73519j773858p28405J705023J685362j410542
6139a3066532l254614r65885L476243P150097Q451649N160494l393601j1528032
$$ plain form
6131 -7970181 -19719011 -25101113 -26175057 -27618642 -27982422 -23783205 -18370674 -17953555
6123 -17953555 -20818786 -19702531 -14301765 -12052666 -15593172 -18466754 -15330541 -8352314
6115 -8352314 -1427765 3824810 4129152 -4355623 -17262492 -23043247 -17824988 -11472237
6107 -11472237 -13335743 -19622442 -21658612 -19616163 -19598476 -22138433 -22446672 -19237836 -15425990
6098 -15425990 -11915156 -7730268 -4879512 -6476255 -10797795 -12912483 -11429213 -8613663
6090 -8613663 -5273423 -1078082 1300794 -1551997 -7646824 -11216958 -10559633 -9206770
6082 -9206770 -9346361 -9406576 -8727122 -9402982 -12059342 -14109357 -13776245 -12344235 -11173883
6073 -11173883 -9655116 -7212228 -4533498 -2003396 556035 2260242 1906477 362691
$$ packed form
6131g970181j1748830n382102j073944j443585l63780M199217N412531M17119
6123a7953555k865231J116255N400766K249099l540506k873582L136213O978227
6115h352314O924549N252575L04342q484775j2906869n780755N218259O352751
6107a1472237j863506o286699k036170K042449J7687k539957l08239L208836L811846
6098a5425990L510834M184888K850756j596743m321540k114688J483270K815550
6090h613663L340240M195341K378876k852791o094827l570134O57325J352863
6082i206770j39591o0215O79454o75860k656360k050015L33112J432010J170352
6073a1173883J518767K442888K678730K530102K559431J704207l53765j543786
$$ plain form
6065 362691 -605387 -1686555 -4980945 -9733703 -12695186 -12957137 -12746499 -12895188 -11288340
6056 -11288340 -6760759 -1012468 4392981 9492893 13337924 13622107 10456178 7101068
6048 7101068 5282509 3212968 125452 -1046240 1612399 4946236 5104171 3635810
6040 3635810 5242398 10667423 15538060 15853935 11449568 4254334 -3552658 -9093925
6032 -9093925 -9694406 -6069240 -2726966 -3090419 -5011474 -3237369 3352201 8718791 5445505
6023 5445505 -6711565 -19490831 -23994670 -19051233 -11007416 -6161495 -4996838 -3870373
6015 -3870373 -555997 3447855 5788389 6616427 7529509 7741092 4043796 -3711479 -9469845
6006 -9469845 -7065901 1159808 6296691 4366172 1209448 3390649 8810544 10727894
$$ packed form
6065C62691r68078j081168l294390m752758k961483k61951K10638j48689J606848
6056a1288340M527581N748291N405449N099912L845031K84183l165929l355110
6048G101068j818559k069541l087516j171692K658639L333837J57935j468361
6040C635810J606588N425025M870637L15875m404367p195234p806992n541267
6032i093925o00481L625166L342274l63453j921055J774105O589570N366590l273286
6023E445505j2157070j2779266m503839M943437Q043817M845921J164657J126465
6015c870373L314376M003852K340534Q28038R13082K11583l697296p755275n758366
6006i469845K403944Q225709N136883j930519l156724K181201N419895J917350
$$ plain form
5998 10727894 7607346 3397855 179401 -3105332 -5216148 -2792012 2478712 2960228
5990 2960228 -5408843 -17042652 -23559398 -23236587 -20087088 -16572777 -11782221 -5503501
5982 -5503501 277969 4247200 7069032 9199410 9632509 7665231 4380431 1477489
5974 1477489 -528709 -2231351 -3910053 -4953771 -5021140 -5411860 -8248386 -13585314 -18123586
5965 -18123586 -18154760 -13688342 -8564597 -6611869 -8766133 -13547579 -18616179 -21633097
5957 -21633097 -21265016 -18214887 -14634709 -12426673 -12650355 -15713878 -20539551 -24117505
5949 -24117505 -23956077 -20946033 -18019777 -16329364 -14946589 -13888243 -14333536 -15443478
5941 -15443478 -14269516 -10150023 -6290026 -5126687 -4611585 -1403293 4062756 8178701
$$ packed form
5998A0727894l120548m209491l218454l284733k110816K424136N270724M81516
5990B960228q369071j1633809o516746L22811L149499L514311M790556O278720
5982e503501N781470L969231K821832K130378M33099j967278l284800k902942
5974A477489k006198j702642j678702j043718o7369l90720k836526n336928m538272
5965a8123586l1174M466418N123745J952728k154264m781446n068600l016918
5957b1633097L68081L050129L580178K208036k23682l063523m825673l577954
5949b4117505J61428L010044K926256J690413J382775J058346m45293j109942
5941a5443478J173962M119493L859997J163339N15102L208292N466049M115945
$$ plain form
5933 8178701 8857815 7446517 6237717 5582366 3619139 -1460448 -8516084 -13298695 -12733876
5924 -12733876 -9085125 -7477493 -9083202 -9874696 -7354588 -5179711 -8418679 -16449616
5916 -16449616 -23561851 -25369264 -22067320 -16471815 -11655336 -10094181 -12505636 -17025965
5908 -17025965 -20813951 -22270836 -20835570 -16024327 -8808286 -3005218 -2498821 -6784789
5900 -6784789 -11391518 -13148969 -13133033 -13807351 -15292126 -15916200 -15127284 -13937381 -12864594
5891 -12864594 -11393018 -9974641 -10617530 -13716500 -15533626 -11667254 -3168132 3843184
5883 3843184 5829317 5873894 7758095 9439891 6731816 1229176 -989182 1797344 4875599
5874 4875599 4576952 2448800 347218 -3115444 -8130658 -10533388 -7428164 -2696963
$$ packed form
5933H178701O79114j411298j208800o55351j963227n079587p055636m782611N64819
5924a2733876L648751J607632j605709p91494K520108K174877l238968q030937
5916a6449616p112235j807413L301944N595505M816479J561155k411455m520329
5908a7025965l787986j456885J435266M811243P216041N803068N06397m285968
5900f784789m606729j757451J5936o74318j484775o24074P88916J189903J072787
5891a2864594J471576J418377o42889l098970j817126L866372Q499122P011316
5883C843184J986133M4577J884201J681796k708075n502640k218358K786526L078255
5874D875599k98647k128152k101582l462662n015214k402730L105224M731201
$$ plain form
5866 -2696963 -2469403 -7210786 -12233101 -14364012 -14404455 -14350147 -15786628 -20152644 -27364117
5857 -27364117 -34618502 -38774939 -38875280 -34758113 -26006652 -15306985 -9607267 -12820400
5849 -12820400 -19103191 -19146771 -12856504 -9797152 -15639438 -23806111 -24122024 -16070893 -8891655
5840 -8891655 -9546059 -14607684 -15277485 -8074551 1851567 7559084 7538460 4565369 206424
5831 206424 -5460585 -9782171 -8573648 -2417176 2922341 4270579 4267163 4397203 890895
5822 890895 -7717247 -14529097 -12507019 -4975349 -863855 -2353020 -4633514 -5485363 -6574882
5813 -6574882 -6430622 -1548321 4656775 3209677 -7392372 -17515431 -19219995 -15487968
5805 -15487968 -12574269 -10173650 -4914480 1560057 4237612 1581962 -4055465 -10467063
$$ packed form
5866b696963K27560m741383n022315k130911m0443N4308j436481m366016p211473
5857b7364117p254385m156437j00341M117167Q751461J0699667N699718l213133
5849a2820400o282791m3580O290267L059352n842286q166673l15913Q051131P179238
5840h891655o54404n061625o69801P202934R926118N707517k0624k973091m358945
5831B06424n667009m321586J208523O156472N339517J348238l416J30040l506308
5822H90895q608142o811850K022078P531670M111494j489165k280494q51849j089519
5813f574882J44260M882301O205096j447098j0602049j0123059j704564L732027
5805a5487968K913699K400619N259170O474537K677555k655650n637427o411598
$$ plain form
5797 -10467063 -16090838 -18827492 -18038811 -16019784 -14993132 -14848528 -15604855 -18558614 -22421831
5788 -22421831 -22114775 -14874512 -4617731 2821624 5804526 5538740 2331935 -3348270
5780 -3348270 -9300090 -14220586 -18506033 -19933536 -13807903 -1530174 6784509 4453547
5772 4453547 -1916481 -2044041 2827810 3253067 -2636685 -6947753 -5686854 -4658412 -9070177
5763 -9070177 -15462994 -17953379 -16361779 -14173830 -13176301 -13608375 -15635445 -17685842 -16977801
5754 -16977801 -14119200 -13224550 -15080357 -14746526 -9214164 -2971354 -1634382 -3829381
5746 -3829381 -4603119 -4185165 -7326126 -14661755 -20472389 -20286888 -16619026 -15267879 -18605162
5737 -18605162 -24378297 -29309011 -31804465 -31750471 -29402761 -25135293 -19853609 -14977240
$$ packed form
5797a0467063n623775k736654P88681K019027J026652J44604p56327k953759l863217
5788b2421831L07056P240263J0256781P439355K982902k65786l206805n680205
5780c348270n951820m920496m285447j427503O125633J2277729Q314683k330962
5772D453547o370028j27560M871851M25257n889752m311068J260899J028442m411765
5763i070177o392817k490385J591600K187949R97529m32074k027070k050397P08041
5754a6977801K858601Q94650j855807L33831N532362O242810J336972k194999
5746c829381p73738M17954l140961p335629n810634J85501L667862J351147l337283
5737a8605162n773135m930714k495454N3994K347710M267468N281684M876369
$$ plain form
5729 -14977240 -11450534 -8687225 -4929900 1039449 8590260 15461039 18972386 17412060
5721 17412060 11125677 2599486 -4795399 -8404542 -7220017 -2304379 3483137 7438196
5713 7438196 9364446 10887829 12107601 10974461 6988784 2875869 494971 -2265093
5705 -2265093 -7432491 -12265234 -12814649 -10439441 -9786098 -11144000 -10439363 -7049299 -5459318
5696 -5459318 -7326484 -7813576 -3189275 2761439 3959577 -150416 -6031330 -11603966
5688 -11603966 -15589240 -14642321 -7399076 57314 -748834 -9612269 -17099906 -16478186 -11311793
5679 -11311793 -8913117 -10695288 -12873848 -13885890 -16218926 -21023135 -24953123 -24157075
5671 -24157075 -19226246 -13953322 -10134312 -6250922 -1745943 303851 -2591641 -6944854
$$ packed form
5729a4977240L526706K763309L757325N969349P550811O870779L511347j560326
5721A7412060o286383q526191p394885l609143J184525M915638N787516L955059
5713G438196J926250J523383J219772j133140l985677m112915k380898k760064
5705b265093n167398m832743n49415K375208O53343j357902P04637L390064J589981
5696e459318j867166m87092M624301N950714J198138m109993n880914n572636
5688a1603966l985274R46919P243245P456390q06148q863435p487637O21720N166393
5679a1311793K398676j782171k178560j012042k333036m804209l929988P96048
5671b4157075M930829N272924L819010L883390M504979K049794k895492m353213
$$ plain form
5663 -6944854 -5969835 1622195 8841428 8456336 1424897 -5165169 -6689985 -4412155 -1383639
5654 -1383639 1308223 3510879 4215634 2646776 -195876 -2577597 -4084163 -5653745
5646 -5653745 -7735748 -9130654 -8092217 -4758680 -2067512 -3102664 -7122644 -9622063
5638 -9622063 -7624696 -3766054 -3058093 -6052116 -7844747 -4742194 429608 1830195
5630 1830195 -1740999 -5534019 -5652115 -4375248 -6372683 -11293432 -13904722 -11951582
5622 -11951582 -9718874 -11229008 -13487442 -11125402 -5791746 -4908662 -10641858 -16178342
5614 -16178342 -15595625 -12143356 -12298306 -15428790 -15093997 -9091936 -2647901 -1165749 -4090337
5605 -4090337 -7200597 -7931204 -7009763 -6810430 -9212759 -13932756 -18482588 -20383571 -18897689
$$ packed form
5663f944854R75019P592030P219233l85092p031439o590066j524816K277830L028516
5654a383639K691862K202656P04755j568858k842652k381721j506566j569582
5646e653745k082003j394906J038437L333537K691168j035152m019980k499419
5638i622063J997367L858642P07961k994023j792631L102553N171802J400587
5630A830195l571194l793020j18096J276867j997435m920749k611290J953140
5622a1951582K232708j510134k258434K362040N333656Q83084n733196n536484
5614a6178342N82717L452269j54950l130484L34793O002061O444035J482152k924588
5605d090337l110260p30607R21441J99333k402329m719997m549832j900983J485882
$$ plain form
5596 -18897689 -14070634 -6110729 2426335 6303045 2964914 -3243396 -6057899 -5256756
5588 -5256756 -5173669 -6332160 -4625319 381610 2763440 -1185641 -6965159 -8444355 -6243099
5579 -6243099 -4992508 -5469450 -4634778 -1777226 241191 -739824 -4466927 -9990197 -15336564
5570 -15336564 -16466432 -11015175 -2971016 783339 -825237 -1970056 1520919 6844866
5562 6844866 9352410 8956478 8371340 7875970 5384131 198847 -6375179 -13178126 -19161662
5553 -19161662 -21869972 -18858126 -11024526 -2687281 1967278 1447551 -3260612 -9417864
5545 -9417864 -13296729 -12678124 -9362812 -7445608 -8238648 -8450148 -4514476 2499712 7702719
5536 7702719 7541486 2996760 -2117609 -5018885 -5855356 -6231523 -6526829 -5637669 -3846199
$$ packed form
5596a8897689M827055P959905Q537064L876710l338131o208310k814503Q01143
5588e256756Q3087j158491J706841N006929K381830l949081n779518j479196K201256
5579f243099J250591m76942Q34672K857552K018417r81015l727103n523270n346367
5570a5336564j129868N451257Q044159L754355j608576j144819L490975N323947
5562F844866K507544l95932n85138m95370k491839n185284o574026o802947n983536
5553a9161662k708310L011846P833600Q337245M654559n19727m708163o157252
5545i417864l878865O18605L315312J917204p93040k11500L935672P014188N203007
5536G702719j61233m544726n114369k901276q36471l76167k95306Q89160J791470
$$ plain form
5527 -3846199 -4468267 -10284537 -18466229 -21990272 -17491392 -9314317 -3821335 -2049544
5519 -2049544 -919403 470722 298141 -905475 92839 3154580 3314635 -1540531 -5594141
5510 -5594141 -2229498 6104520 10220743 5894054 -1358389 -3995155 -1246654 1354965
5502 1354965 -1300565 -9182020 -17511918 -20951614 -18614828 -14935614 -13982391 -13839494 -9818889
5493 -9818889 -2738220 847199 -1876594 -5242410 -3111315 2631415 6207760 7255431
5485 7255431 9954854 14275917 14764707 9150453 2540009 473685 1896865 1943691 -1403246
5476 -1403246 -6496945 -11451991 -15048815 -15677798 -12706607 -8530754 -6638546 -7577096 -8829290
5467 -8829290 -8743171 -8710582 -10947514 -15401452 -19559480 -20919583 -19436582 -17453405 -16796235
$$ packed form
5527c846199o22068n816270q181692l524043M498880Q177075N492982J771791
5519b049544J130141J390125j72581j203616R98314L061741J60055m855166m053610
5510e594141L364643Q334018M116223m326689p252443k636766K748501K601619
5502A354965k655530p881455q329898l439696K336786L679214R53223J42897M020605
5493i818889P080669L585419k723793l365816K131095N742730L576345J047671
5485G255431K699423M321063M88790n614254o610444k066324J423180M6826l346937
5476a403246n093699m955046l596824o28983K971191M175853J892208r38550j252194
5467h829290Q6119L2589k236932m453938m158028j360103J483001J983177O57170
$$ plain form
5458 -16796235 -16263742 -13319110 -8200049 -4129182 -2695444 -1783468 -23582 -476929 -6372391
5449 -6372391 -14823390 -18989702 -16369758 -11345551 -9271556 -11477302 -16420147 -21810564
5441 -21810564 -24418041 -21753291 -16068863 -13264512 -15365988 -17362944 -14497764 -9499985
5433 -9499985 -8529414 -12182533 -15078406 -13268419 -7714451 -965027 5266795 9154137
5425 9154137 9665855 9104106 10796533 13423687 11845219 5114693 -627091 41031 4690631
5416 4690631 7051193 5332333 2700712 1340364 255968 -1527927 -3323589 -4712828
5408 -4712828 -6170886 -7066697 -5496693 -1217015 2978468 4037469 1934309 -654261
5400 -654261 -1476008 -954622 -1386573 -3993177 -7018363 -7412994 -4428147 -531692 1449510
$$ packed form
5458a6796235N32493K944632N119061M070867J433738R11976J759886m53347n895462
5449f372391q450999m166312K619944N024207K073995k205746m942845n390417
5441b1810564k607477K664750N684428K804351k101476j996956K865180M997779
5433i499985R70571l653119k895873J809987N553968O749424O231822L887342
5425I154137N11718n61749J692427K627154j578468o730526n741784O68122M649600
5416D690631K360562j718860k631621j360348j084396j783895j795662j389239
5408d712828j458058q95811J570004M279678M195483J059001k103160k588570
5400f54261q21747N21386m31951k606604l025186l94631K984847L896455J981202
$$ plain form
5391 1449510 772907 -1966799 -6055244 -9916448 -11018538 -8466183 -4554567 -2024657
5383 -2024657 -908748 206634 1274868 1506366 1788044 3503602 5383953 4365972 -130938
5374 -130938 -4915485 -6292341 -3234005 2085845 5237763 2281525 -5785052 -12340601
5366 -12340601 -12056034 -7678313 -6226349 -9088261 -10692637 -7542267 -3290279 -2670551
5358 -2670551 -5086689 -7566549 -10380540 -15625248 -22414647 -27265315 -28168550 -25648050
5350 -25648050 -21196599 -17023364 -15485562 -16076126 -14920819 -10307893 -6583969 -8538568
5342 -8538568 -13490326 -13954742 -8129120 -2719972 -3826126 -9156887 -11910179 -9529459
5334 -9529459 -5484275 -3679735 -4097422 -4229427 -2823577 -938680 220269 1090856 2346224
$$ packed form
5391A449510o76603k739706m088445l861204j102090K552355L911616K529910
5383b024657J115909J115382J068234K31498K81678J715558J880351j017981m496910
5374a30938m784547j376856L058336N319850L151918k956238q066577o555549
5366a2340601K84567M377721J451964k861912j604376L150370M251988O19728
5358b670551k416138k479860k813991n244708o789399m850668r03235K520500
5350b5648050M451451M173235J537802n90564J155307M612926L723924j954599
5342h538568m951758m64416N825622N409148j106154n330761k753292K380720
5334i529459M045184J804540m17687j32005J405850J884897J158949Q70587J255368
$$ plain form
5325 2346224 2417359 -1448743 -8915284 -15359557 -16715625 -14202261 -12253652 -12753763 -13665646
5316 -13665646 -12968665 -11461606 -11056851 -11893447 -11951401 -9053842 -3301721 2215766 3936606
5307 3936606 1545741 -1917420 -3965125 -4664807 -4186707 -1695986 1221640 -245712 -7518040
5298 -7518040 -14028875 -12389765 -4561961 687005 -143454 -1721354 1039726 6284083
5290 6284083 9391493 8516672 3614707 -4913101 -13377048 -15287441 -8948943 -1233044
5282 -1233044 416576 -2891883 -4453563 -1737035 1390575 1164864 -1480225 -2842531
5274 -2842531 -259483 5725467 11077951 11275348 6655212 3269213 6116064 13266015
5266 13266015 19259873 22142346 23553723 23634354 20314217 13262566 4663833 -3807046
$$ packed form
5325B346224P1135l866102p466541o444273j356068K513364J948609n00111r11883
5316a3665646O96981J507059M04755q36596n7954K897559N752121N517487J720840
5307C936606k390865l463161k047705o99682M78100K490721K917626j467352p272328
5298g518040o510835J639110P827804N248966q30459j577900K761080N244357
5290F284083L107410q74821m901965q527808q463947j910393O338498P715899
5282a233044J649620l308459j561680K716528L127610k25711k645089j362306
5274b842531K583048N984950N352484J97397m620136l385999K846851P149951
5266A3266015N993858K882473J411377Q0631l320137p051651q598733q470879
$$ plain form
5258 -3807046 -11210445 -14878381 -12039161 -4820008 116271 -1315624 -6213773 -8450006
5250 -8450006 -4696728 3958596 13908804 21217332 23598475 21442732 16404896 9449004
5242 9449004 1427557 -5723285 -10659568 -14351039 -17441010 -17441085 -12481369 -6665176 -6380767
5233 -6380767 -10940681 -12429386 -6580014 1365851 4330530 2315056 229254 692760
5225 692760 2891352 5564489 7110573 5015068 -991333 -6993381 -9420795 -9477006 -9736171
5216 -9736171 -8947920 -4662564 1094607 4076525 4701021 7167250 11765468 13720633 10895521
5207 10895521 7439403 7504126 9656437 10367822 9517599 9074449 8769394 6558327 2207503
5198 2207503 -2270519 -5011492 -5286019 -3316900 -1100495 -2013595 -6952311 -11690766 -11190578
$$ packed form
5258c807046p403399l667936K839220P219153M936279j431895m898149k236233
5250h450006L753278Q655324R950208P308528K381143k155743n037836o955892
5242I449004q021447p150842m936283l691471l089971p5M959716N816193K84409
5233f380767m559914j488705N849372P945865K964679k015474k085802M63506
5225F92760K198592K673137J546084k095505o006401o002048k427414n6211k59165
5216i736171P88251M285356N757171K981918O24496K466229M598218J955165k825112
5207A0895521l456118O4723K152311P11385q50223m43150l05055k211067m350824
5198B207503m478022k740973k74527J969119K216405r13100m938716m738455N00188
$$ plain form
5189 -11190578 -6790369 -6054683 -13816669 -25387526 -31203337 -27781319 -21487856 -20378008
5181 -20378008 -24511025 -27191005 -25013849 -22381050 -23963321 -26535124 -23125947 -13762619
5173 -13762619 -6200495 -5000509 -5705430 -3162129 -567435 -4469099 -13416609 -18386911
5165 -18386911 -14754157 -7796383 -4309372 -3946943 -2386803 963913 3326508 4482742
5157 4482742 7004626 10640738 11364588 7566715 3298798 2770231 4346049 3132003 -2045948
5148 -2045948 -7434168 -9440561 -7836358 -3876023 1560805 6745731 8584781 5494533
5140 5494533 -175257 -4125826 -4129678 -1491089 533340 -827634 -5594818 -10128451 -9809834
5131 -9809834 -3986205 2923310 6569532 7378784 8259768 9408601 8587499 5816603 4046920
$$ packed form
5189a1190578M400209P35686p761986j1570857n815811L422018O293463J109848
5181b0378008m133017k679980K177156K632799j582271k571803L409177R363328
5173a3762619P562124J199986p04921K543301K594694l901664q947510m970302
5165a8386911L632754O957774L487011L62429J560140L350716K362595J156234
5157D482742K521884L636112P23850l797873m267917n28567J575818j214046n177951
5148b045948n388220k006393J604203L960335N436828N184926J839050l090248
5140E494533n669790l950569l852K638589K024429j360974m767184m533633L18617
5131i809834N823629O909515L646222Q09252Q80984J148833q21102k770896j769683
$$ plain form
5122 4046920 4511051 4648871 2069670 -1952060 -4448670 -4019270 -660681 5203372 11407488
5113 11407488 14033606 11688748 8467586 9575394 14624952 18245924 17134757 13433745
5105 13433745 10697759 9539487 8590519 7454669 7004719 8109700 11110658 14988243
5097 14988243 16187572 10689134 -626550 -10594947 -12663538 -8204934 -3954319 -2861617
5089 -2861617 -1495922 2691681 5977066 3454195 -3293404 -7921609 -7894175 -7144562 -9718934
5080 -9718934 -14739572 -19389929 -23320160 -27033900 -28488164 -25388105 -19838630 -16513088
5072 -16513088 -16082047 -14697066 -11141525 -9898586 -13891481 -17790199 -13655614 -2124381
5064 -2124381 7190376 7377897 2054435 -572744 1891371 4694076 3108699 -2436893
$$ packed form
5122D046920M64131J37820k579201m021730k496610M29400L358589N864053O204116
5113A1407488K626118k344858l221162J107808N049558L620972j111167l701012
5105A3433745k735986j158272r48968j135850m49950J104981L000958L877585
5097A4988243J199329n498438j1315684r968397k068591M458604M250615J092702
5089b861617J365695M187603L285385k522871o747599m628205K7434P49613k574372
5080i718934n020638m650357l930231l713740j454264L100059N549475L325542
5072a6513088M31041J384981L555541J242939l992895l898718M134585J1531233
5064b124381R314757J87521n323462k627179K464115K802705j585377n545592
$$ plain form
5056 -2436893 -8005848 -10249100 -8602529 -5286194 -3370747 -3444207 -2418761 2666812 10028401
5047 10028401 14604477 14117019 10896430 7236590 2572058 -2814220 -5012656 -1273659
5039 -1273659 4805741 7564110 7601579 10525271 17132810 20751479 16922945 10590523 9120466
5030 9120466 11555563 10363742 2679619 -5620120 -7760145 -3690603 1661879 4434239
5022 4434239 4075615 1939006 -43501 -443479 156914 -534384 -3423953 -5872432 -3879793
5013 -3879793 3643167 13358509 20119332 20991411 17130893 11891740 7095340 1923602
5005 1923602 -4015234 -8168418 -7768124 -4327097 -2573357 -4553839 -7513731 -8676888
4997 -8676888 -9544538 -13452550 -20482059 -26962406 -29425734 -27533582 -23476958 -19703856
$$ packed form
5056b436893n568955k243252J646571L316335J915447p3460J025446N085573P361589
5047A0028401M576076m87458l220589l659840m664532n386278k198436L738997
5039a273659O079400K758369L7469K923692O607539L618669l828534o332422j470057
5030I120466K435097j191821p684123q299739k140025M069542N352482K772360
5022D434239l58624k136609j982507l99978O00393o91298k889569k448479J992639
5013c879793P522960R715342O760823Q72079l860518n239153m796400n171738
5005A923602n938836m153184M00294L441027J753740j980482k959892j163157
4997h676888q67650l908012p029509o480347k463328J892152M056624L773102
$$ plain form
4989 -19703856 -17194397 -15296141 -13036309 -10211632 -6800289 -2370747 2437249 4838301
4981 4838301 2694262 -2061008 -5452246 -6588439 -7527618 -8189842 -5735369 -62002 4599680
4972 4599680 5609378 5012768 4113746 -84519 -8669639 -15365982 -13240425 -4475171 2426547
4963 2426547 3847543 3723272 5608574 7958329 8101430 5995854 2726488 -812015 -2618404
4954 -2618404 -442322 5002339 10449678 14004002 15896227 15885801 13537443 10531714 8442185
4945 8442185 4720857 -3910138 -13939579 -16903587 -10164679 -177659 6870353 11594465
4937 11594465 15701562 16272536 11037294 4638773 3400130 6370554 7319504 4379525
4929 4379525 2387859 5515885 11877487 16711626 18221777 18461344 19113441 18074621 12240049
$$ packed form
4989a9703856K509459J898256K259832K824677L411343M429542M807996K401052
4981D838301k144039m755270l391238j136193r39179o62224K454473N673367M661682
4972D599680J009698n96610q99022m198265q585120o696343K125557Q765254O901718
4963B426547J420996j24271J885302K349755J43101k105576l269366l538503j806389
4954b618404K176082N444661N447339L554324J892225j0426k348358l005729k089529
4945H442185l721328q630995j0029441k964008O738908R987020P048012M724112
4937A1594465M107097N70974n235242o398521j238643K970424R48950k939979
4929D379525j991666L128026O361602M834139J510151K39567O52097j038820n834572
$$ plain form
4920 12240049 4042839 1485123 7864261 14648179 11142195 -195020 -6375298 -2334525
4912 -2334525 2897652 1764925 -183208 5020247 13953606 17879067 16874771 18096953
4904 18096953 23204971 26773784 25686540 22063137 17731246 12733656 8468711 6253093
4896 6253093 4129738 597456 -944389 2681971 8068621 10292552 10336421 10454809 7517166
4887 7517166 70055 -3643146 3915259 16275348 22883112 26738683 36326462 45393678
4879 45393678 41250382 30521892 32432163 46088768 53725810 62299621 105161459 181201437
4871 181201437 226317390 182642960 77602481 -5325371 -26107319 -18942064 -25309150
4864 -25309150 -40209529 -39925161 -26823794 -19709071 -20707571 -18160292 -11292376 -9499683
$$ packed form
4920A2240049q197210k557716O379138O783918l505984j1337215o180278M040773
4912b334525N232177j132727j948133N203455Q933359L925461j004296J222182
4904A8096953N108018L568813j087244l623403m331891m997590m264945k215618
4896F253093k123355l532282j541845L626360N386650K223931M3869J18388k937643
4887G517166p447111l713201P558405J2360089O607764L855571R587779R067216
4879D5393678m143296j0728490J910271J3656605P637042Q573811M2861838P6039978
4871A81201437M5115953m3674430j05040479q2927852k0781948P165255o367086
4864b5309150j4900379K84368J3101367P114723r98500K547279O867916J792693
$$ plain form
4856 -9499683 -13120040 -13947955 -11859583 -14797923 -23440475 -29675724 -30226874 -29910169 -30962794
4847 -30962794 -29975260 -26644202 -25671159 -27642990 -26594076 -19842433 -13254149 -12929149 -16793303
4838 -16793303 -18199460 -14454300 -8606412 -4905317 -4931989 -7250436 -9462588 -10616099
4830 -10616099 -11437371 -12349318 -12899767 -13437652 -14650611 -14652803 -10396785 -3801001 -1724416
4821 -1724416 -6471947 -11263901 -10045194 -6985574 -9528591 -15889899 -17783619 -13489014
4813 -13489014 -9241989 -8018836 -6216240 -2992982 -3833750 -11178724 -19133755 -22074096
4805 -22074096 -22138552 -23283461 -23799753 -20719374 -16895476 -16755098 -17912508 -14089860 -5398171
4796 -5398171 719801 -645397 -6273849 -10462378 -12133657 -14041313 -17273854 -18988247
$$ packed form
4856i499683l620357q27915K088372k938340q642552o235249n51150L16705j052625
4847c0962794R87534L331058R73043j971831J048914O751643O588284L25000l864154
4838a6793303j406157L745160N847888L701095k6672k318447k212152j153511
4830a0616099q21272r11947n50449n37885j212959k192M256018O595784K076585
4821a724416m747531m791954J218707L059620k543017o361308j893720M294605
4813a3489014M247025J223153J802596L223258q40768p344974p955031k940341
4805b2074096o4456j144909n16292L080379L823898J40378j157410L822648Q691689
4796e398171O117972j365198n628452m188529j671279j907656l232541j714393
$$ plain form
4788 -18988247 -15511974 -7019735 1353037 4103485 1319554 -1495948 -65520 4367792
4780 4367792 8198029 9706800 8091964 1918837 -7433962 -13461934 -10900953 -3288654
4772 -3288654 1213592 1308797 3803527 11875393 18357060 14968998 4074941 -4109042
4764 -4109042 -4197174 -458235 736749 -1471091 -3805260 -4241708 -3369346 -2207393 -1509224
4755 -1509224 -2965300 -8595653 -17671316 -25353035 -26172278 -19417237 -10268274 -4825133
4747 -4825133 -4330230 -5048904 -3530778 -635046 231116 -2266361 -5901044 -7824661 -7606071
4738 -7606071 -6607525 -5132776 -1586185 5006145 12417365 16351403 14581505 9473662
4730 9473662 5912835 6884899 11342436 15987464 18429444 18541926 17433521 15816288 13614635
$$ packed form
4788a8988247L476273Q492239Q372772K750448k783931k815502J430428M433312
4780D367792L830237J508771j614836o173127r352799o027972K560981P612299
4772c288654M502246R5205K494730Q071866O481667l388062j0894057q183983
4764d109042q8132L738939J194984k207840k334169m36448Q72362J161953O98169
4755a509224j456076n630353r075663p681719q19243O755041R148963N443141
4747d825133M94903p18674J518126K895732Q66162k497477l634683j923617K18590
4738g606071R98546J474749L546591O592330P411220L934038j769898n107843
4730I473662l560827R72064M457537M645028K441980J12482j108405j617233k201653
$$ plain form
4721 13614635 10860057 8244293 6281898 4451406 2202476 561902 1012360 2179906
4713 2179906 -231364 -8043446 -16348741 -17685713 -10803724 -2518411 405421 -1250973
4705 -1250973 -2001705 -147890 44302 -5097786 -12772466 -15967178 -10332396 2269746
4697 2269746 15794650 24177034 24658713 19457848 14561761 14881354 19162241 20568950
4689 20568950 13778949 1376357 -7903279 -7457956 1277275 10892857 14736072 11507406
4681 11507406 4876133 -98732 -859187 847528 819061 -3282154 -9426931 -13424631 -13247037
4672 -13247037 -10519198 -8264990 -8363905 -11085989 -15655429 -20600381 -24411777 -26555842
4664 -26555842 -27369102 -26577840 -22639442 -14382152 -3185860 7066094 12649664 13088367
$$ packed form
4721A3614635k754578k615764j962395j830492k248930j640574M50458J167546
4713B179906k411270p812082q305295j336972O881989Q285313K923832j656394
4705a250973p50732J853815J92192n142088p674680l194712N634782J2602142
4697B269746J3524904Q382384M81679n200865m896087L19593M280887J406709
4689B0568950o790001j2402592r279636M45323Q735231R615582L843215l228666
4681A1507406o631273m974865p60455J706715k8467m101215o144777l997700J77594
4672a3247037K727839K254208r8915k722084m569440m944952l811396k144065
4664b6555842q13260P91262L938398Q257290J1196292J0251954N583570M38703
$$ plain form
4656 13088367 11905630 13691962 19359418 24422870 23269450 15513661 6952327 3578346
4648 3578346 5708967 8815503 8910871 5641960 928700 -3225393 -5159070 -3745405 260643
4639 260643 3745910 3752572 768152 -1747025 -1886157 -2146330 -6034341 -12391697 -15746013
4630 -15746013 -13191670 -8288693 -6032319 -6307036 -5683913 -3986112 -4217184 -5959513 -4351006
4621 -4351006 2102479 7503846 6219911 1020587 -1170569 684592 1430641 -1259502
4613 -1259502 -3158035 27831 6958406 13558637 18171418 21213142 22054361 19238598
4605 19238598 13184633 6704895 2671165 1709509 1951029 1051230 -1053220 -1864279 450911
4596 450911 4560574 7899723 9496526 8865215 4300372 -4026124 -10961497 -11451583 -8230276
$$ packed form
4656A3088367j182737J786332N667456N063452j153420p755789q561334l373981
4648C578346K130621L106536R5368l268911m713260m154093j933677J413665M006048
4639B60643L485267O662k984420k515177j39132k60173l888011o357356l354316
4630a5746013K554343M902977K256374k74717O23123J697801k31072j742329J608507
4621d351006O453485N401367j283935n199324k191156J855161P46049k690143
4613a259502j898533L185866O930575O600231M612781L041724Q41219k815763
4605A9238598o053965o479738m033730r61656K41520q99799k104450q11059K315190
4596D50911M109663L339149J596803o31311m564843q326496o935373m90086L221307
$$ plain form
4587 -8230276 -8661663 -13342079 -14448525 -7719296 745879 3894085 3691383 5681099 8631513
4578 8631513 7218345 2153562 -293598 1917080 4299722 3284024 -427834 -5992262
4570 -5992262 -13244076 -18704092 -17764948 -12642547 -11252874 -15435897 -17221021 -10927527
4562 -10927527 -2457619 -830650 -5817091 -10868121 -14371157 -19882319 -26643288 -27906112
4554 -27906112 -19931073 -6802740 5195051 13222762 16678865 15331322 11030064 7418666
4546 7418666 5355425 1565717 -5934147 -13912629 -17756194 -16644247 -12585655 -7086963
4538 -7086963 -1784369 138445 -2919642 -7785084 -10114247 -10150221 -11153215 -13168124 -13093370
4529 -13093370 -10833225 -9892059 -10388029 -7142989 1791640 9460912 7987549 -570173
$$ packed form
4587h230276m31387m680416j106446O729229Q465175L148206k02702J989716K950414
4578H631513j413168n064783k447160K210678K382642j015698l711858n564428
4570e992262p251814n460016R39144N122401J389673m183023j785124O293494
4562a0927527Q469908J626969m986441n051030l503036n511162o760969j262824
4554b7906112P975039J3128333J1997791Q027711L456103j347543m301258l611398
4546G418666k063241l789708p499864p978482l843565J111947M058592N498692
4538g086963N302594J922814l058087m865442k329163l5974j002994k014909P4754
4529a3093370K260145R41166m95970L245040Q934629P669272j473363q557722
$$ plain form
4521 -570173 -6601800 -4599753 2623711 10089891 15072967 15252734 8792288 -1422515
4513 -1422515 -8444113 -8955672 -6728880 -6399950 -7987481 -10142053 -14132867 -20422441 -24923770
4504 -24923770 -23439791 -17387978 -10875041 -4728093 1853009 6395142 5843800 2651301
4496 2651301 1904562 2749793 -1007861 -10892607 -20105348 -21671727 -15699000 -7043771 -127990
4487 -127990 2413238 262707 -3453507 -5089579 -5614837 -8804093 -13561772 -13427481 -5876641
4478 -5876641 3084413 6646041 4965917 2093736 -275126 -2186659 -2728837 -2171412 -3332732
4469 -3332732 -6780446 -8142799 -4433567 492122 1596940 407745 1525923 4070936
4461 4070936 2897837 -2843249 -8243546 -9589038 -8064202 -6761159 -8040531 -12996027
$$ packed form
4521e70173o031627K002047P223464P466180M983076J79767o460446j0214803
4513a422515p021598n11559K226792L28930j587531k154572l990814o289574m501329
4504b4923770J483979O051813O512937O146948O581102M542133n51342l192499
4496B651301p46739Q45231l757654r884746r212741j566379N972727Q655229O915781
4487a27990K541228k150531l716214j636072n25258l189256m757679J34291P550840
4478e876641Q961054L561628j680124k872181k368862j911533n42178N57425j161320
4469c332732l447714j362353L709232M925689J104818j189195J118178K545013
4461D070936j173099n741086n400297j345492J524836J303043j279372m955496
$$ plain form
4453 -12996027 -19323970 -20992236 -14987741 -7478490 -7801234 -16521051 -24926744 -26565445
4445 -26565445 -23509120 -20240276 -17380959 -14014595 -11229594 -9967051 -8696427 -6177839
4437 -6177839 -4007370 -3964205 -4955084 -4876081 -4112460 -5462714 -11170141 -20215643 -27483284
4428 -27483284 -26589658 -16204497 -3221541 3340616 1696861 -2164581 -2957443 -1617325
4420 -1617325 -2046959 -5833987 -11164831 -14421901 -12536199 -6242779 -693254 -80673 -2602594
4411 -2602594 -4076544 -4691953 -7032368 -8867579 -4928391 3686445 9095718 7525050
4403 7525050 3818503 2546094 1665316 -1053199 -2019235 2252131 8378889 11040103 10592145
4394 10592145 10113935 8414916 2096354 -7670932 -16021728 -20630882 -22498232 -22096957
$$ packed form
4453a2996027o327943j668266O004495P509251l22744q719817q405693j638701
4445b6565445L056325L268844K859317L366364K785001J262543J270624K518588
4437f177839K170469M3165r90879P9003P63621j350254n707427r045502p267641
4428b7483284Q93626J0385161J2982956O562157j643755l861442p92862J340118
4420a617325m29634l787028n330844l257070J885702O293420N549525O12581k521921
4411b602594j473950o15409k340415j835211L939188Q614836N409273j570668
4403G525050l706547j272409q80778k718515r66036M271366O126758K661214m47958
4394A0592145m78210j699019o318562r767286q350796m609154j867350M01275
$$ plain form
4386 -22096957 -19105455 -14660429 -10233456 -5999553 -3451122 -6592426 -16277913 -26370889
4378 -26370889 -30514961 -29967835 -29316184 -27525175 -20443677 -10520969 -5848060 -8748984
4370 -8748984 -12422486 -10786386 -5644991 -1788988 -302401 366218 863243 1385195 2642224
4361 2642224 4205979 4580747 4365184 6266091 10454729 13146149 11650376 7820772 4546711
4352 4546711 1900632 -746341 -1554962 1530989 6756174 9692751 8016070 3296489
4344 3296489 -1425340 -4170037 -4475969 -2999856 -1212702 -887810 -3256595 -8184086 -14089772
4335 -14089772 -19298417 -23599596 -27345101 -28841518 -25022886 -16343985 -8642471 -7206967
4327 -7206967 -10402122 -12226265 -9944176 -5617899 -1086564 3972145 8682026 10334919
$$ packed form
4386b2096957K991502M445026M426973M233903K548431l141304r685487j0092976
4378b6370889m144072N47126O51651J791009P081498R922708M672909k900924
4370h748984l673502J636100N141395L856003J486587O68619M97025N21952J257029
4361B642224J563755L74768k15563J900907M188638K691420j495773l829604l274061
4352D546711k646079k646973q08621L085951N225185K936577j676681m719581
4344C296489m721829k744697l05932J476113J787154L24892k368785m927491n905686
4335a4089772n208645m301179l745505j496417L818632Q678901P701514J435504
4327g206967l195155j824143K282089M326277M531335N058709M709881J652893
$$ plain form
4319 10334919 8651096 6656382 5321776 1368865 -6385533 -12027323 -8888542 261677
4311 261677 4552932 -2101573 -13334710 -18350955 -15111003 -11313810 -12679964 -15506056
4303 -15506056 -13852042 -9893103 -10998402 -17581752 -20916725 -15311939 -6449874 -3227433
4295 -3227433 -5641357 -6279210 -1416551 4947077 7370721 4714493 -235925 -3378421
4287 -3378421 -2025931 1912028 2557216 -3029339 -10275734 -13024651 -11682704 -10559491
4279 -10559491 -9319231 -3817666 4933859 9761547 6951067 980429 -2662253 -4336630
4271 -4336630 -7155805 -11127620 -13482649 -12433924 -8743801 -5428014 -6199021 -11519060
4263 -11519060 -16543244 -16531143 -13588120 -13307502 -15313860 -13416181 -6002290 421757 424333
$$ packed form
4319A0334919j683823j994714j334606l952911p754398n641790L138781R150219
4311B61677M291255o654505j1233137n016245L239952L797193j366154k826092
4303a5506056J654014L958939j105299o583350l334973N604786Q862065L222441
4295c227433k413924o37853M862659O363628K423644k656228m950418l142496
4287c378421J352490L937959O45188n586555p246395k748917J341947J123213
4279a0559491J240260N501565Q751525M827688k810480n970638l642682j674377
4271d336630k819175l971815k355029J048725L690123L315787p71007n320039
4263a1519060n024184J2101K943023K80618k006358J897679P413891O424047K576
$$ plain form
4254 424333 -3701750 -7394835 -10032113 -11955360 -10774105 -5426170 41590 1163470
4246 1163470 -1613927 -5651122 -10275351 -14440663 -14378187 -8489746 -1594222 510987 -1497130
4237 -1497130 -2666766 -1142864 990041 2288729 2927530 2310345 -248504 -3103289 -3839760
4228 -3839760 -2788492 -2445514 -3983285 -6197191 -7040734 -5046288 -787331 2241141 464407
4219 464407 -5330749 -11141411 -15511624 -20089845 -24117963 -24035752 -20147890 -17275310 -16040395
4210 -16040395 -10660906 97612 7086290 2588258 -8038472 -14318031 -15350507 -17742301
4202 -17742301 -22440879 -23710014 -20436767 -18894616 -22522856 -26474711 -25075563 -19359287
4194 -19359287 -14554020 -13636675 -15212224 -15482982 -11773669 -5901605 -3233476 -6319430
$$ packed form
4254D24333m126083l693085k637278j923247J181255N347935N467760J121880
4246A163470k777397m037195m624229m165312O2476N888441O895524K105209k008117
4237a497130j169636J523902K132905J298688O38801o17185k558849k854785p36471
4228c839760J051268L42978j537771k213906q43543J994446M258957L028472j776734
4219D64407n795156n810662m370213m578221m028118Q2211L887862K872580J234915
4210a6040395N379489J0758518O988678m498032j0626730o279559j032476k391794
4202a7742301m698578j269135L273247J542151l628240l951855J399148N716276
4194a9359287M805267R17345j575549k70758L709313N872064K668129l085954
$$ plain form
4186 -6319430 -11149075 -12306751 -9684293 -6993560 -5992544 -5775880 -5664705 -5347628 -4363387
4177 -4363387 -4435699 -9189931 -18234756 -25329206 -26232776 -24058941 -22735726 -20686806 -16542975
4168 -16542975 -14993181 -19328496 -23542091 -20777391 -15210857 -15661287 -20763458 -21197676
4160 -21197676 -14855269 -9121431 -8521442 -9990254 -10486898 -10075620 -7388195 -1017130 4566225
4151 4566225 3364380 -1989196 -3265216 533613 2440177 -917989 -6362416 -11971751
4143 -11971751 -17975705 -20664958 -15730940 -7060504 -2355665 -2070187 -3143466 -9050141
4135 -9050141 -22171976 -31449052 -25646488 -14727311 -16796251 -27575627 -29054018 -25272795
4127 -25272795 -33045201 -31691603 31805757 160995465 272022334 278831564 194706639
$$ packed form
4186f319430m829645j157676K622458K690733J001016K16664J11175L17077R84241
4177d363387p2312m754232r044825p094450r03570K173835J323215K048920M143831
4168a6542975J549794m335315m213595K764700N566534m50430n102171m34218
4160b1197676O342407N733838N99989j468812m96644M11278K687425O371065N583355
4151D566225j201845n353576j276020L798829J906564l358166n444427n609335
4143a1971751o003954k689253M934018Q670436M704839K85478j073279n906675
4135i050141j3121835r277076N802564J0919177k068940j0779376j478391L781223
4127b5272795p772406J353598O3497360J29189708J11026869O809230q4124925
$$ plain form
4120 194706639 108308659 73870912 69846054 60154730 45754728 41678367 42729391 36451026
4112 36451026 26903009 23964374 24003735 18640334 11449288 11054145 15990960 18701627 17837202
4103 17837202 16609982 14956169 11857922 10207457 12400982 15791427 17420332 17787252
4095 17787252 16281214 9968551 973918 -2766774 1053028 4743394 2981475 1499451
4087 1499451 6847303 14699768 16143405 10593785 5246379 5033181 8776513 12479446
4079 12479446 12282703 7113550 1102600 -403491 1275463 -250549 -5614290 -7835773
4071 -7835773 -3799108 692632 1093451 637371 1741501 13371 -6409876 -10201616 -5900233
4062 -5900233 -136850 -1521750 -6782424 -7272479 -4138422 -5608070 -11957844 -14509707
$$ packed form
4120A94706639q6397980l4437747m024858r691324j4400002m076361J051024o278365
4112C6451026r548017k938635L9361n363401p191046l95143M936815K710667q64425
4103A7837202j227220j653813l098247j650465K193525L390445J628905L66920
4095A7787252j506038o312663q994633l740692L819802L690366j761919j482024
4087A499451N347852P852465J443637n549620n347406k13198L743332L702933
4079A2479446j96743n169153o010950j506091J678954j526012n363741k221483
4071g835773M036665M491740M00819m56080J104130j728130o423247l791740M301383
4062e900233N763383j384900n260674m90055L134057j469648o349774k551863
$$ plain form
4054 -14509707 -9404384 -2777316 -1235299 -4806170 -10184737 -14409956 -14709538 -10537388
4046 -10537388 -6157621 -6199397 -9190051 -10489499 -9968463 -10373291 -9515841 -2168066 9608021
4037 9608021 15983044 11904391 3712810 -200435 -149224 -2376408 -8961282 -14972008 -14806598
4028 -14806598 -8489995 -1284495 1969167 1427853 425038 -370097 -4063283 -11497853
4020 -11497853 -17587989 -16915170 -10429107 -2913636 3850504 10949247 17204223 19455826
4012 19455826 17639376 14904749 12456764 8444877 2481213 -2536686 -4008154 -2162663
4004 -2162663 1383688 4953570 6614504 5328853 2501269 347016 -847696 -2027049
3996 -2027049 -3325106 -5028404 -8571329 -13487748 -15663929 -12701697 -8898295 -9853630
$$ packed form
4054a4509707N105323O627068J542017l570871n378567m225219k99582M172150
4046a0537388M379767m1776k990654j299448N21036m04828Q57450P347775J1776087
4037I608021O375023m078653q191581l913245N1211k227184o584874o010726J65410
4028a4806598O316603P205500L253662n41314j002815p95135l693186p434570
4020a1497853o090136O72819O486063P515471O764140P098743O254976K251603
4012A9455826j816450k734627k447985m011887n963664n017899j471468J845491
4004b162663L546351L569882J660934j285651k827584k154253j194712j179353
3996b027049j298057j703298l542925m916419k176181K962232L803402r55335
$$ plain form
3988 -9853630 -13643686 -13156643 -6722833 -455952 420914 -3180697 -8553955 -14842651 -20352802
3979 -20352802 -21653916 -18304228 -14338653 -12541687 -11234851 -9161064 -9023138 -12478171
3971 -12478171 -15375136 -12624860 -5710187 -914346 -918776 -2025581 64323 4658453 7239258
3962 7239258 4748697 -1113405 -5520693 -5315272 -2095749 -146711 -1641703 -4839842
3954 -4839842 -6757280 -6293267 -4611915 -3594329 -4123386 -5204850 -5079682 -3800859 -3708111
3945 -3708111 -6315936 -10069167 -12667520 -14074910 -15252165 -15492187 -13460193 -9501638
3937 -9501638 -4448167 2173374 9828571 14824157 14226804 10430575 7891909 6936495 5306057
3928 5306057 4030761 5883607 8902136 8143835 4256794 3443926 7478331 10673415 9332352
$$ packed form
3988i853630l790056M87043O433810O266881Q76866l601611n373258o288696n510151
3979b0352802j301114L349688L965575J796966J306836K073787J37926l455033
3971a2478171k896965K750276O914673M795841m430j106805K089904M594130K580805
3962G239258k490561n862102m407288K05421L219523J949038j494992l198139
3954d839842j917438M64013J681352J017586n29057j081464J25168J278823R2748
3945c708111k607825l753231k598353j407390j177255k40022K031994L958555
3937i501638N053471O621541P655197M995586n97353l796229k538666r55414j630438
3928E306057j275296J852846L018529p58301l887041q12868M034405L195084j341063
$$ plain form
3919 9332352 7432959 9057389 11272054 9583541 5735316 4647367 6951611 9545374
3911 9545374 10866957 11124223 9896933 7991210 9103414 14723052 19433146 16584098
3903 16584098 7639978 930139 1442525 6289639 10168615 10847270 8596583 4341209
3895 4341209 160785 -1098872 1290662 4496006 4546161 -61007 -6883000 -11281647 -10705503
3886 -10705503 -7798713 -7524011 -10418156 -11467527 -7546845 -2696313 -2424451 -5325843
3878 -5325843 -5232271 -674609 3021087 1709477 -2189321 -4171898 -3793621 -3474854 -3486683
3869 -3486683 -1518860 2987554 6565515 4947360 -2059574 -9775651 -12924927 -10326263
3861 -10326263 -5120849 -1111284 234808 -101267 -56958 1521194 2617377 -1163715 -10738384
$$ packed form
3919I332352j899393J624430K214665j688513l848225j087949K304244K593763
3911I545374J321583K57266j227290j905723J112204N619638M710094k849048
3903A6584098q944120o709839N12386M847114L878976O78655k250687m255374
3895D341209m180424j259657K389534L205344N0155m607168o821993m398647N76144
3886a0705503K906790K74702k894145j049371L920682M850532K71862k901392
3878e325843R3572M557662L695696j311610l898798j982577L78277L18767j1829
3869c486683J967823M506414L577961j618155p006934p716077l149276K598664
3861a0326263N205414M009565J346092l36075M4309J578152J096183l781092r574669
$$ plain form
3852 -10738384 -19442666 -19203100 -11165105 -5050695 -6273797 -9389651 -7724997 -3608211
3844 -3608211 -3210742 -5889146 -6379879 -5157451 -8051533 -15359022 -19407778 -15437138 -8531743
3835 -8531743 -6328750 -9587453 -13413837 -13995821 -10660332 -4335471 2488262 6341667
3827 6341667 6254996 5019394 4923300 4568578 2323995 238983 1052952 3294350 3364666
3818 3364666 1469693 1297986 3834170 5643011 4453260 2749732 3410823 4326788 631853
3809 631853 -8402947 -17608039 -21749939 -21347353 -21495679 -25685375 -31885401 -34672584 -30560991
3800 -30560991 -21137786 -11453652 -5731990 -4617354 -6035035 -7618159 -7662458 -5019179
3792 -5019179 -383464 2310807 -1221402 -9688837 -15815967 -14604410 -9881269 -9005138
$$ packed form
3852a0738384q704282K39566Q037995O114410j223102l115854J664654M116786
3844c608211L97469k678404m90733J222428k894082p307489m048756L970640O905395
3835h531743K202993l258703l826384n81984L335489O324861O823733L853405
3827F341667q6671j235602r6094l54722k244583k085012Q13969K241398P0316
3818C364666j894973j71707K536184J808841j189751j703528O61091R15965l694935
3809F31853r034800r205092m141900M02586j48326m189696o200026k787183M111593
3800c0560991R423205R684134N721662J114636j417681j583124m4299K643279
3792e019179M635715K694271l532209q467435o127130J211557M723141Q76131
$$ plain form
3784 -9005138 -12791783 -15596839 -14708602 -13497806 -13866858 -11947483 -5044611 2230186 3710292
3775 3710292 47165 -3579593 -5065115 -5226204 -2593925 4986200 14156806 17769597
3767 17769597 13670578 6819451 2056980 -308474 -1073152 155193 2034687 1338094
3759 1338094 -1889564 -3542776 -2270850 -2269077 -5845900 -7853423 -2456091 7735111 14661939
3750 14661939 15119552 12726293 10435922 6830077 1183110 -2538614 -7877 7158812
3742 7158812 12352160 11017166 4934725 -973126 -4705494 -8339659 -13203274 -16463971
3734 -16463971 -14822981 -10027246 -7099364 -7285727 -6888656 -4061683 -2088042 -3157235
3726 -3157235 -3273434 1960049 9342721 11430278 6778842 1366383 -184644 770757 2173144
$$ packed form
3784i005138l786645k805056Q88237J210796l69052J919375O902872P274797J480106
3775C710292l663127l626758j485522j61089K632279P580125R170606L612791
3767A7769597m099019o851127m762471k365454p64678J228345J879494o96593
3759A338094l227658j653212J271926J773l576823k007523N397332J0191202O926828
3750A4661939M57613k393259k290371l605845n646967l721724K530737P166689
3742G158812N193348j334994o082441n907851l732368l634165m863615l260697
3734a6463971J640990M795735K927882j86363L97071K826973J973641j069193
3726c157235j16199N233483P382672K087557m651436n412459j551027R55401J402387
$$ plain form
3717 2173144 5301054 10304051 12528273 8412788 2519365 3157919 11311915 18727579
3709 18727579 18108996 11297339 5331122 3535475 3553252 2483799 517610 -633524 -423818
3700 -423818 249153 87621 -1852081 -5440915 -9116162 -10973458 -10253334 -7104687 -1694469
3691 -1694469 4773669 9024492 8771691 7074666 9815853 16895078 19678126 11056749
3683 11056749 -4295433 -14344403 -13438339 -6906926 -2097689 -472277 -581276 -3263965
3675 -3263965 -8867868 -12309210 -7118764 5159355 14440532 13155952 4826090 -969974
3667 -969974 -87341 2998406 2630803 -1341520 -5486434 -7940056 -8677517 -6691620 -879790
3658 -879790 6345611 9883941 7429202 1640229 -3820632 -7635694 -9434032 -8423968
$$ packed form
3717B173144L127910N002997K224222m115485n893423O38554Q153996P415664
3709A8727579o18583o811657n966217j795647J7777j069453j966189j151134K09706
3700d23818O72971j61532j939702l588834l675247j857296P20124L148647N410218
3691a694469O468138M250823k52801j697025K741187P079225K783048q621377
3683A1056749j5352182j0048970R06064O531413M809237J625412j08999k682689
3675c263965n603903l441342N190446J2278119R281177j284580q329862n796064
3667i69974Q82633L085747l67603l972323m144914k453622p37461J985897N811830
3658h79790P225401L538330k454739n788973n460861l815062j798338J010064
$$ plain form
3650 -8423968 -5155586 -1687249 1677182 6499839 11403269 11835290 7839288 6809226
3642 6809226 12994598 18658431 13001937 -2736272 -16909090 -22614471 -22757017 -20537835
3634 -20537835 -14787672 -7066403 -4035241 -8032586 -12557799 -11975438 -8968935 -7022564
3626 -7022564 -2453520 8558098 20089000 22168336 13922040 3533344 -3305851 -7620053
3618 -7620053 -10562755 -10136289 -6006526 -1854078 -571899 -730118 525359 3678440 6925670
3609 6925670 8124605 6562853 4410925 5422262 10054734 13427620 11058894 5276075
3601 5276075 2627290 5882488 11636235 14656260 11604297 2231421 -9317491 -15954553
3593 -15954553 -14595101 -10450058 -10426455 -14107198 -16056036 -14834765 -13255696 -11033222
$$ packed form
3650h423968L268382L468337L364431M822657M903430M32021l996002j030062
3642F809226O185372N663833n656494j5738209j4172818n705381j42546K219182
3634b0537835N750163P721269L031162l997345m525213N82361L006503J946371
3626g022564M569044J1011618J1530902K079336q246296j0388696o839195m314202
3618g620053k942702M26466M129763M152448J282179j58219J255477L153081L247230
3609F925670J198935j561752k151928J011337M632472L372886k368726n782819
3601E276075k648785L255198N753747L020025l051963r372876j1548912o637062
3593a5954553J359452M145043K3603l680743j948838J221271J579069K222474
$$ plain form
3585 -11033222 -5087112 2252884 3552827 -2533357 -7681650 -5434781 22597 1434149
3577 1434149 -693951 -797724 2120055 4147921 3939908 4432994 7072297 9025809 7134298
3568 7134298 1663193 -4595462 -8860789 -9563791 -6670407 -1504870 4122358 8474277
3560 8474277 9879397 7667483 3479004 -23023 -2252804 -4664730 -7211914 -7470649
3552 -7470649 -4598312 -1642463 -1833356 -4304016 -5587734 -4307588 -2599611 -3290234 -6545286
3543 -6545286 -9108921 -7406572 -2644427 -1509299 -8808092 -20125838 -25811811 -22425247
3535 -22425247 -15745265 -11693593 -9650781 -6953058 -4486480 -3923758 -3883288 -3319127 -4975378
3526 -4975378 -10568431 -15690361 -14880250 -9489938 -5172949 -3441656 -1367240 1633604
$$ packed form
3585a1033222N946110P339996J299943o086184n148293K246869N457378J411552
3577A434149k128100j03773K917779K027866k08013M93086K639303J953512j891511
3568G134298n471105o258655m265327p03002K893384N165537N627228M351919
3560H474277J405120k211914m188479l502027k229781k411926k547184k58735
3552g470649K872337K955849j90893k470660j283718J280146J707977o90623l255052
3543f545286k563635J702349M762145J135128p298793j1317746n685973L386564
3535b2425247O679982M051672K042812K697723K466578N62722M0470N64161j656251
3526d975378n593053n121930Q10111N390312M316989J731293K074416L000844
$$ plain form
3518 1633604 2805308 1697736 1077952 1611504 922234 -995132 -520111 3637280 7639004
3509 7639004 7861557 5404813 3199503 1963390 1205957 1151820 1235342 -615942 -4569643
3500 -4569643 -6994597 -4774011 63657 2719672 1601210 -570172 -976807 500291
3492 500291 2817334 5744865 8953439 10245371 6753523 -1159995 -8358442 -9431645
3484 -9431645 -5068056 -1707354 -3646135 -7879916 -9015401 -6963272 -6200747 -8883428
3476 -8883428 -13079428 -17498049 -23158232 -29274586 -31968867 -29378218 -24658618 -21478185
3468 -21478185 -19436272 -16502441 -13147777 -10712931 -7739014 -1829404 5439264 8858329
3460 8858329 5317327 -2871208 -10627059 -14519327 -14460238 -12413254 -9900753 -6528736 -1367261
$$ packed form
3518A633604J171704j107572o19784N33552o89270j917366M75021M157391M001724
3509G639004K22553k456744k205310j236113p57433n4137Q3522j851284l953701
3500d569643k424954K220586M837668K656015j118462k171382m06635J477098
3492E00291K317043K927531L208574J291932l491848p913518p198447j073203
3484i431645M363589L360702j938781m233781j135485K052129P62525k682681
3476h883428m196000m418621n660183o116354k694281K590649M719600L180433
3468b1478185K041913K933831L354664K434846K973917N909610P268668L419065
3460H858329l541002q188535p755851l892268N9089K046984K512501L372017N161475
$$ plain form
3451 -1367261 4350480 7638675 7658557 7257574 9137742 12367094 14578519 15513612 15514687
3442 15514687 12331473 3584936 -7913623 -15573623 -16822436 -15948764 -17611248 -20920737
3434 -20920737 -22504757 -22559508 -24070882 -27225350 -28431170 -25268995 -19568073 -14796874
3426 -14796874 -12750944 -13775033 -17756397 -22753400 -24224490 -18644613 -8297473 -393483
3418 -393483 -147485 -5553868 -10073117 -10071473 -8377885 -10133176 -16188637 -21974564 -22905124
3409 -22905124 -19318294 -14954605 -11874562 -9138537 -6129701 -4174663 -3726297 -2650782
3401 -2650782 478143 3453871 3585481 2228406 2891889 5786675 7919352 8180317 8200032
3392 8200032 7899411 4937146 171346 -959766 4576532 12685767 17585263 18737711
$$ packed form
3451a367261N717741L288195J9882m00983J880168L229352K211425R35093J075
3442A5514687l183214q746537j1498559p660000j248813Q73672j662484l309489
3434b0920737j584020n4751j511374l154468j205820L162175N700922M771199
3426a4796874K045930j024089l981364m997003j471090N579877J0347140P903990
3418c93483K45998n406383m519249J644J693588j755291o055461n785927r30560
3409b2905124L586830M363689L080043K736025L008836J955038M48366J075515
3401b650782L128925K975728J31610j357075O63483K894786K132677K60965J9715
3392H200032l00621k962265m765800j131112N536298Q109235M899496J152448
$$ plain form
3384 18737711 18961638 18924657 17892180 17312403 18535677 18574214 13511558 5590322 1714787
3375 1714787 4572361 9826933 12617978 12360297 10337300 7145175 4096083 3197713 4021123
3366 4021123 4022278 3335590 5494928 11574644 17172156 17487718 12693927 6619174 2848290
3357 2848290 3232418 6853333 9211288 6216768 282424 -1877767 1204223 3963898
3349 3963898 3665416 5083463 11005548 15285921 12418545 8037983 10745170 17492487
3341 17492487 17664074 10163025 5192689 7703818 10008257 5120942 -1991484 -3081384
3333 -3081384 404490 737602 -3896212 -8244992 -9113736 -8761673 -9347145 -9640955 -8252516
3324 -8252516 -5924411 -3304773 442343 5403670 9562791 11125387 10842409 10810681 11579811
$$ packed form
3384A8737711K23927l6981j032477n79777J223274L8537n062656p921236l875535
3375A714787K857574N254572K791045k57681k022997l192125l049092q98370Q23410
3366D021123J155o86688K159338O079716N597512L15562m793791o074753l770884
3357B848290L84128L620915K357955k994520n934344k160191L081990K759675
3349C963898k98482J418047N922085M280373k867376m380562K707187O747317
3341A7492487J71587p501049m970336K511129K304439m887315p112426j089900
3333c081384L485874L33112m633814m348780q68744L52063n85472k93810J388439
3324h252516K328105K619638L747116M961327M159121J562596k82978l1728P69130
$$ plain form
3315 11579811 11337641 8192648 3240552 703785 3737628 10091370 13724091 11413108
3307 11413108 5921372 1627482 -718396 -2993327 -5631311 -7559720 -9126326 -11835795
3299 -11835795 -15104476 -16012477 -12925682 -7417106 -2240495 680745 111775 -3973577
3291 -3973577 -8514397 -8328694 -1161463 9168029 16317115 17408842 14051710 8422558
3283 8422558 909858 -7821944 -14650783 -15936794 -11461723 -5134491 -1302298 -914979
3275 -914979 -1789314 -2263503 -3629298 -8249127 -15505501 -20827952 -20012173 -14534150 -11142465
3266 -11142465 -14892128 -23139895 -28063498 -25262211 -18085387 -12654686 -10625293 -8951518
3258 -8951518 -5453132 -1497254 926406 1699926 984097 -2101744 -7161691 -11121002 -11858560
$$ packed form
3315A1579811k42170l144993m952096k536767L033843O353742L632721k310983
3307A1413108n491736m293890k345878k274931k637984j928409j566606k709469
3299a1835795l268681r08001L086795N508576N176611K921240n68970m085352
3291c973577m540820J85703P167231J0329492P149086J091727l357132n629152
3283H422558p512700q731802o828839j286011M475071O327232L832193L87319
3275i14979q74335m74189j365795m619829p256374n322451Q15779N478023L391685
3266a1142465l749663q247767m923603K801287P176824N430701K029393J673775
3258h951518L498386L955878K423660P73520p15829l085841n059947l959311p37558
$$ plain form
3249 -11858560 -11576645 -13218508 -14681753 -11095775 -3351016 551546 -4604297 -13796133
3241 -13796133 -18138214 -16047956 -13169242 -12663495 -11759212 -8955494 -8520934 -14077355 -21888631
3232 -21888631 -25297274 -23469006 -20914424 -19695035 -17362208 -12764797 -8793980 -7635616
3224 -7635616 -7220409 -4607175 24896 4723829 8336043 9694011 7084167 1231863
3216 1231863 -3428826 -3334201 52802 3166279 5322861 7592972 8533803 5207688 -1808748
3207 -1808748 -7835178 -8830050 -4591399 2081324 7039908 6887306 2654892 325393 4050352
3198 4050352 9866176 10462988 5332162 774953 -107703 -879819 -3518477 -3573770 2255616
3189 2255616 9124795 9995268 4979033 -526521 -4155596 -7366584 -9828398 -9120516 -5922478
$$ packed form
3249a1858560K81915j641863j463245L585978P744759L902562n155843r191836
3241a3796133m342081K090258K878714N05747R04283K803718M34560n556421p811276
3232b1888631l408643J828268K554582J219389K332827M597411L970817J158364
3224g635616M15207K613234M632071M698933L612214J357968k609844n852304
3216A231863m660689R4625L387003L113477K156582K270111R40831l326115p016436
3207a808748o026430r94872M238651O672723M958584j52602m232414k329499L724959
3198D050352N815824N96812n130826m557209q82656p72116k638658n5293N829386
3189B255616O869179Q70473n016235n505554l629075l210988k461814P07882L198038
$$ plain form
3180 -5922478 -4360961 -6521725 -10596525 -14762012 -18867227 -21819424 -21562905 -18938189
3172 -18938189 -17755764 -19198662 -19268095 -13909202 -4483833 3571884 5848970 1839676
3164 1839676 -4994972 -8908809 -6027643 1641451 8187494 10614847 11134359 11726595 10225203
3155 10225203 4674758 -1474675 -2599824 2071809 8328718 12918141 15861766 17236337
3147 17236337 15753116 11419753 6190375 672216 -6628739 -14881720 -18786618 -14116647
3139 -14116647 -4025446 3406051 3856724 589260 -615212 1915408 5069746 5220385
3131 5220385 1816211 -2525428 -4415547 -2465002 1617792 4813023 5968310 6755403
3123 6755403 9018084 11717577 11441260 6101061 -2348173 -9140449 -10655609 -7297166
$$ packed form
3180e922478J561517k160764m074800m165487m105215k952197K56519K624716
3172a8938189J182425j442898o9433N358893R425369Q055717K277086m009294
3164A839676o834648l913837K881166P669094O546043K427353N19512N92236j501392
3155A0225203n550445o149433j125149M671633O256909M589423K943625J374571
3147A7236337j483221m333363n229378n518159p300955q252981l904898M669971
3139a4116647J0091201P431497M50673l267464j204472K530620L154338J50639
3131E220385l404174m341639j890119J950545M082794L195231J155287P87093
3123F755403K262681K699493k76317n340199q449234o792276j515160L358443
$$ plain form
3115 -7297166 -2634545 114298 372674 -958240 -3624327 -7524353 -10864688 -11244189 -9028734
3106 -9028734 -7306764 -7556673 -7989385 -7835282 -10115088 -16769262 -23438853 -23767591 -17957228
3097 -17957228 -12073062 -8805089 -4434379 3422774 10539549 12005090 9261539 6985695
3089 6985695 5867206 3049033 -1949696 -6159143 -7335315 -5595356 -1454560 4300941
3081 4300941 9013587 9663671 6251958 1417633 -2866459 -5893059 -6489514 -3694814 1342548
3072 1342548 6852502 12900304 19352407 22818087 19808841 12237698 5326888 551611
3064 551611 -4277742 -8173233 -6660783 114297 5381005 5034347 3363315 5515551 9390722
3055 9390722 10194720 8802288 9176764 9928146 5333661 -5286459 -14918737 -16907645 -11825192
$$ packed form
3115g297166M662621K748843K58376j330914k666087l900026l340335l79501K215455
3106i028734J721970k49909m32712J54103k279806o654174o669591l28738N810363
3097a7957228N884166L267973M370710P857153P116775J465541k743551k275844
3089F985695j118489k818173m998729m209447j176172J739959M140796N755501
3081D300941M712646O50084l411713m834325m284092l026600n96455K794700N037362
3072A342548N509954O047802O452103L465680l009246p571143o910810m775277
3064E51611m829353l895491J512450O775080N266708l46658j671032K152236L875171
3055I390722Q03998j392432L74476P51382m594485j0620120r632278j988908N082453
$$ plain form
3046 -11825192 -5108223 -780593 1217894 3305150 6794305 9637034 8408492 3268987
3038 3268987 -1222660 -2116163 -2208742 -5057377 -8606857 -8558648 -6299506 -7388996 -12033133
3029 -12033133 -13408716 -7736388 -648886 254237 -4516541 -7986845 -6216762 -1817476
3021 -1817476 1146536 1550039 -153562 -4127294 -9710755 -13592501 -12317154 -6862594
3013 -6862594 -2488450 -2698460 -5020228 -4977152 -2954487 -3513394 -7850199 -11476401 -11410583
3004 -11410583 -11206049 -14893315 -19518264 -19206037 -14654256 -12327458 -14397763 -15696310
2996 -15696310 -12120361 -6624409 -4340081 -6118556 -9750443 -13917622 -17838267 -19940285
2988 -19940285 -19989759 -20248803 -21841705 -22274828 -19265523 -14699344 -11738370 -10076595 -7458129
$$ packed form
3046a1825192O716969M327630J998487K087256L489155K842729j228542n139505
3038C268987m491647q93503r2579k848635l549480M8209K259142j089490m644137
3029a2033133j375583N672328P087502R03123m770778l470304J770083M399286
3021a817476K964012M03503j703601l973732n583461l881746J275347N454560
3013f862594M374144k10010k321768M3076K022665n58907m336805l626202O5818
3004a1410583K04534l687266m624949L12227M551781K326798k070305j298547
2996a5696310L575949N495952K284328j778475l631887m167179l920645k102018
2988a9940285m9474k59044j592902m33123L009305M566179K960974J661775K618466
$$ plain form
2979 -7458129 -4300052 -3125297 -4164030 -4890077 -3720109 -1411217 922790 2550368
2971 2550368 2253935 -384386 -2817688 -1660950 2327054 4107989 528504 -5482431
2963 -5482431 -8530634 -7054670 -4016822 -2089230 -642305 1686289 3485357 2051048
2955 2051048 -2040800 -4716188 -3917434 -2727222 -4747519 -8682812 -10754443 -10491978 -9749036
2946 -9749036 -7437803 -1050873 6662075 9192753 6008164 3884241 5537646 4348615
2938 4348615 -4231141 -12889624 -11922922 -3705682 1169726 -747834 -3708208 -4676734 -7089330
2929 -7089330 -11580066 -12796999 -8956744 -6217097 -8710249 -11099285 -6796606 1624139
2921 1624139 6325257 5049600 2422300 2560509 5079344 6908610 4440009 -4192090
$$ packed form
2979g458129L158077J174755j038733p26047J169968K308892K334007J627578
2971B550368k96433k638321k433302J156738L988004J780935l579485o010935
2963e482431l048203J475964L037848J927592J446925K328594J799068j434309
2955B051048m091848k675388P98754J190212k020297l935293k071631K62465P42942
2946i749036K311233O386930P712948K530678l184589k123923J653405j189031
2938D348615q579756q658483R66702Q217240M875408j917560k960374r68526k412596
2929g089330m490736j216933L840255K739647k493152k389036M302679Q420745
2921A624139M701118j275657k627300J38209K518835J829266k468601q632099
$$ plain form
2913 -4192090 -15427209 -20964582 -15953327 -4952313 3482465 6054226 5127184 2608646
2905 2608646 -1541541 -6040231 -8673927 -9884325 -11722497 -13305695 -11497042 -6388762
2897 -6388762 -2062032 -1111077 -1948215 -2377434 -2506845 -3090573 -3951767 -5032744 -6345618
2888 -6345618 -6325399 -3292117 818146 1723384 -1018607 -2824128 -975503 1112396 -432958
2879 -432958 -3207988 -1720794 4173676 8200284 5091818 -3898040 -13103257 -17459408
2871 -17459408 -15047705 -7348844 1512727 7198944 8328002 6926242 5354710 3685452
2863 3685452 804356 -2916116 -5625001 -6700467 -7922604 -10941029 -14497984 -15694377
2855 -15694377 -13730105 -10606708 -7978979 -5698031 -4610515 -7948944 -16790757 -25652075
$$ packed form
2913d192090j1235119n537373N011255J1001014Q434778K571761r27042k518538
2905B608646m150187m498690k633696j210398j838172j583198J808653N108280
2897f388762M326730R50955q37138m29219j29411n83728q61194j080977j312874
2888f345618K0219L033282M110263R05238k741991j805521J848625K087899j545354
2879d32958k775030J487194N894470M026608l108466q989858r205217m356151
2871a7459408K411703P698861Q861571N686217J129058j401760j571532j669258
2863C685452k881096l720472k708885j075466j222137l018425l556955j196393
2855a5694377J964272L123397K627729K280948J087516l338429q841813q861318
$$ plain form
2847 -25652075 -26654685 -18491610 -8052703 -2400060 -2176012 -3953440 -5559632 -6663130
2839 -6663130 -6838758 -6249923 -6853696 -10174316 -14774362 -18114675 -19704554 -20064349 -18099481
2830 -18099481 -12815082 -6895685 -4970920 -8032901 -12481167 -14831838 -14383233 -11324430
2822 -11324430 -6263847 -2631303 -5136537 -13247035 -19704561 -18740857 -13009306 -8926235
2814 -8926235 -7765349 -5829366 -1787341 1356435 1573427 381833 -639151 -1558553 -1078280
2805 -1078280 3722471 12146848 18034282 16303940 8845654 1228661 -3664012 -5484452
2797 -5484452 -2920738 4639014 13083158 16324063 13639094 10351592 10528468 12712769
2789 12712769 13874559 13826305 13954790 14748206 16529520 19687260 21966770 18532042 7877525
$$ packed form
2847b5652075j002610Q163075J0438907N652643K24048j777428j606192j103498
2839f663130j75628N88835o03773l320620m600046l340313j589879l59795J964868
2830a8099481N284399N919397J924765l061981m448266k350671M48605L058803
2822a1324430N060583L632544k505234q110498o457526R63704N731551M083071
2814h926235J160886J935983M042025L143776K16992j191594j020984r19402M80273
2805a078280M800751Q424377N887434j730342p458286p616993m892673j820440
2797e484452K563714P559752Q444144L240905k684969l287502J76876K184301
2789A2712769J161790m8254J28485P93416J781314L157740K279510l434728j0654517
$$ plain form
2780 7877525 -4392482 -10977597 -10742960 -8223971 -6823244 -6346270 -6676221 -9410860 -14498699
2771 -14498699 -18578552 -18851454 -16712769 -15549245 -16057984 -15647348 -12322904 -7984022 -7408855
2762 -7408855 -13734307 -24472607 -32402032 -31680976 -23399811 -14134175 -8938891 -7222079
2754 -7222079 -5954154 -4758170 -5542290 -7888950 -7818016 -2596525 4888050 8855685 7516285
2745 7516285 4909179 4982224 6071714 3594898 -2969789 -8846580 -9880610 -6979214 -3915359
2736 -3915359 -3278795 -5700829 -10295052 -13872149 -12200821 -4853517 2761973 4898995
2728 4898995 1800283 -1925991 -3710991 -4635497 -5807592 -6917791 -8187158 -10140889
2720 -10140889 -11191816 -8951280 -4578480 -2405482 -4155266 -6656212 -6533699 -4109100
$$ packed form
2780G877525j2270007o585115K34637K518989J400727M76974l29951k734639n087839
2771a4498699m079853k72902K138685J163524n08739M10636L324444M338882N75167
2762g408855o325452j0738300p929425P21056Q281165R265636N195284J716812
2754g222079J267925J195984p84120k346660P0934N221491P484575L967635j339400
2745G516285k607106P3045J089490k476816o564687n876791j034030K901396L063855
2736c915359O36564k422034m594223l577097J671328P347304P615490K137022
2728D898995l098712l726274j785000r24506j172095j110199j269367j953731
2720a0140889j050927K240536M372800K172998j749784k500946J22513K424599
$$ plain form
2712 -4109100 -1177712 1938592 5059881 6692722 6416852 6414531 7849568 7592653 1824800
2703 1824800 -7836047 -14825390 -14610139 -9251232 -4449162 -3235920 -3425979 -1236468 3281533
2694 3281533 5898043 4000108 641569 252755 1897612 770554 -4052162 -8062781
2686 -8062781 -8305570 -7057727 -6738394 -6008322 -3760884 -2398366 -3463032 -4176575 -2554404
2677 -2554404 -1939296 -5290561 -8463060 -5288418 2977938 9434829 10929414 9354918
2669 9354918 5368297 -1531551 -7069574 -4734883 4075190 10235202 10101228 11129106
2661 11129106 19875094 30890415 33668884 26402956 16740370 11549717 11578918 14554058
2653 14554058 18087124 19757878 18573574 16669900 16787588 18446888 19061591 17907943
$$ packed form
2712d109100K931388L116304L121289J632841k75870k321J435037k56915n767853
2703A824800r660847o989343K15251N358907M802070J213242j90059K189511M518001
2694C281533K616510j897935l358539l88814J644857j127058m822716m010619
2686h062781k42789J247843L19333P30072K247438J362518j064666p13543J622171
2677b554404O15108l351265l172499L174642Q266356O456891J494585j574496
2669I354918l986621o899848n538023K334691Q810073O160012j33974J027878
2661A1129106Q745988J1015321K778469p265928r662586n190653K9201K975140
2653A4554058L533066J670754j184304j903674J17688J659300O14703j153648
$$ plain form
2645 17907943 16254761 14387712 11352652 7269556 3583860 1500897 1919501 5552603
2637 5552603 10889529 13820197 12402525 10593871 13628190 20557766 25200671 24061253
2629 24061253 19325081 14043483 8797178 4115143 1809297 1632834 -52974 -5540821
2621 -5540821 -11869140 -14084400 -10926598 -5369912 -958544 536741 -890804 -3828910
2613 -3828910 -6406921 -8235455 -10656754 -14181651 -16984880 -17141442 -14921731 -11363687
2605 -11363687 -6092136 1296866 8696708 12803336 12851478 11185317 10230467 10559490 11630107
2596 11630107 12357134 10830560 5647154 -1669942 -7208309 -8531227 -6878263 -5049577
2588 -5049577 -4569812 -5583423 -7773795 -10048301 -10718432 -9636647 -9206236 -11650114 -15994454
$$ packed form
2645A7907943j653182j867049l035060m083096l685696k082963M18604L633102
2637E552603N336926K930668j417672j808654L034319O929576M642905j139418
2629B4061253m736172n281598n246305m682035k305846j76463j685808n487847
2621e540821o328319k215260L157802N556686M411368J495285j427545k938106
2613c828910k578011j828534k421299l524897k803229j56562K219711L558044
2605a1363687N271551P389002P399842M106628M8142j666161r54850L29023J070617
2596A1630107P27027j526574n183406p317096n538367j322918J652964J828686
2588e049577M79765j013611k190372k274506o70131J081785M30411k443878m344340
$$ plain form
2579 -15994454 -19278910 -19939664 -18275997 -14577795 -9327616 -4850439 -3799016 -5536994
2571 -5536994 -6783797 -6609343 -7789246 -11760828 -15304711 -14673249 -10621671 -6708732 -4870960
2562 -4870960 -5675901 -10398736 -18356278 -23687711 -20182682 -9577694 -234922 3183748
2554 3183748 3842761 5312443 5667095 2184570 -2901995 -5893068 -7442718 -9963381 -11644427
2545 -11644427 -8525968 -1710902 2523784 254113 -6103134 -11437759 -12273049 -7770628
2537 -7770628 -298931 4730460 3401787 -1631626 -4052671 -2336671 -1447109 -5303782
2529 -5303782 -11923456 -17725022 -22215744 -25649139 -26045695 -22311763 -17429785 -14639192
2521 -14639192 -12539824 -7749442 -694886 5058806 7884410 8629411 7169406 2559940
$$ packed form
2579a5994454l284456o60754J663667L698202N250179M477177J051423j737978
2571e536994j246803J74454j179903l971582l543883O31462M051578L912939J837772
2562d870960q04941m722835p957542n331433L505029J0604988R342772L418670
2554C183748O59013J469682L54652l482525n086565k991073j549650k520663j681046
2545a1644427L118459O815066M234686k269671o357247n334625q35290M502421
2537g770628P471697N029391j328673n033413k421045J716000Q89562l856673
2529e303782o619674n801566m490722l433395l96556L733932M881978K790593
2521a4639192K099368M790382P054556N753692K825604P45001j460005m609466
$$ plain form
2513 2559940 -3821445 -9263182 -13650076 -18402971 -21646590 -19247278 -11753537 -5670478
2505 -5670478 -5680171 -9408146 -12207547 -13408627 -14933657 -17187324 -20012026 -24984900 -32572559
2496 -32572559 -38728426 -38394551 -31451762 -22004693 -13547050 -8671377 -11023120 -21151765
2488 -21151765 -30937569 -29476658 -16735044 -5150687 -4359146 -10009137 -12217909 -9703303
2480 -9703303 -8708795 -11135709 -11804865 -7541599 -2026597 356720 277004 437938 648687
2471 648687 -1167236 -5278422 -9643249 -11802577 -10591685 -7838573 -8238176 -14306375 -21139483
2462 -21139483 -20480648 -11577561 -3504722 -3831470 -9100318 -10475544 -5412125 1054284
2454 1054284 4170702 3368985 -316413 -5336847 -8240935 -6021263 -548022 3066077
$$ packed form
2513B559940o381385n441737m386894m752895l243619K399312P493741O083059
2505e670478r693l727975k799401j201080j525030k253667k824702m972874p587659
2496c2572559o155867L33875O942789R447069Q457643M875673k351743j0128645
2488b1151765r785804J460911J2741614J1584357P91541n649991k208772K514606
2480i703303R94508k426914o69156M263266N515002K383317p9716J60934K10749
2471F48687j815923m111186m364827k159328J210892K753112l99603o068199o833108
2462b1139483O58835Q903087Q072839l26748n268848j375226N063419O466409
2454A054284L116418q01717l685398n020434k904088K219672N473241L614099
$$ plain form
2446 3066077 2742113 441364 -2661329 -7190424 -11470016 -12021014 -9919905 -11256988 -18322618
2437 -18322618 -25213087 -26001521 -22867046 -21269105 -20684340 -16228317 -7658530 -446849
2429 -446849 2192289 2941056 5099690 8279200 10775461 12105287 11232381 5961154 -3183652
2420 -3183652 -11103905 -12944627 -9066436 -3014733 3532259 10971175 18245860 22410664
2412 22410664 21956130 18503098 14959099 13313394 13775970 14425738 12288088 6823927 1894792
2403 1894792 1798824 5559101 8056023 6916497 4571803 2625449 -976353 -6193719 -7242892
2394 -7242892 -479035 7093457 4646017 -7516914 -17502297 -17977062 -14857910 -15738906
2386 -15738906 -17345356 -12216698 -2853481 651727 -3933767 -7286437 -2238231 6523931
$$ packed form
2446C066077l23964k300749l102693m529095m279592n50998K101109j337083p065630
2437a8322618o890469p88434L134475J597941N84765M456023Q569787P211681
2429d46849K639138P48767K158634L179510K496261J329826q72906n271227r144806
2420c183652p920253j840722L878191O051703O546992P438916P274685M164804
2412B2410664m54534l453032l543999j645705M62576O49768k137650n464161m929135
2403A894792r5968L760277K496922j139526k344694j946354l601802n217366j049173
2394g242892O763857P572492k447440j2162931r985383m74765L119152q80996
2386a5738906j606450N128658R363217L505208m585494l352670N048206Q762162
$$ plain form
2378 6523931 10043663 6475615 732691 -2694563 -2233823 1876680 6702020 7167427 1701203
2369 1701203 -4610277 -6223308 -4435946 -4549098 -7736636 -10324788 -9863188 -7119602 -2782222
2360 -2782222 2716764 6083490 3302694 -3734617 -7542585 -4161701 1928304 4181671
2352 4181671 1411916 -3814276 -10183763 -16754103 -19717961 -15358603 -6181233 10160
2344 10160 -1636610 -8028878 -12240844 -10894589 -6694025 -4854737 -7764127 -12742956 -15061254
2335 -15061254 -13356089 -11098741 -11844598 -14450687 -14993767 -12516952 -10115467 -10165770 -11237577
2326 -11237577 -10833937 -8899897 -6965559 -5583770 -4603748 -4693562 -6316671 -7908368 -7420793
2317 -7420793 -5425818 -4243676 -3847313 -1427905 3869807 8420393 8436430 5006410 2342800
$$ packed form
2378F523931L519732l568048n742924l427254M60740M110503M825340M65407n466224
2369A701203o311480j613031J787362j13152l187538k588152M61600K743586M337380
2360b782222N498986L366726k780796p037311l807968L380884O090005K253367
2352D181671k769755n226192o369487o570340k963858M359358R177370O191393
2344A0160j646770o392268m211966J346255M200564J839288k909390m978829k318298
2335a5061254J705165K257348p45857k606089n43080K476815K401485n0303j071807
2326a1237577M03640J934040J934338J381789R80022q9814j623109j591697M87575
2317g420793J994975J182142L96363K419408N297712M550586J6037l430020k663610
$$ plain form
2308 2342800 2139217 2369175 1210353 -680774 -2152834 -3344411 -4687367 -6054624 -7586919
2299 -7586919 -9502296 -10481566 -8439605 -3903480 -349673 258285 4727 1167239 2064025
2290 2064025 -340484 -4930482 -6731624 -2844266 3994410 7996067 5339486 -2733016
2282 -2733016 -10529716 -12663556 -9719755 -7794221 -10605648 -14177872 -12333010 -5395719
2274 -5395719 881544 3767626 5530500 6956856 5077501 -397433 -3861600 -955254
2266 -955254 4907451 7358624 5580474 3594211 3105067 1835847 -1706910 -6109408 -9840080
2257 -9840080 -12653380 -13941869 -12956414 -11267153 -12016305 -15685843 -18956460 -18773424 -15631533
2248 -15631533 -12081772 -9873504 -9358230 -9975554 -10542556 -10536758 -11428956 -14860155 -19163559
$$ packed form
2308B342800k03583K29958j158822j891127j472060j191577j342956j367257j532295
2299g586919j915377r79270K041961M536125L553807O07958k53558J162512Q96786
2290B064025k404509m589998j801142L887358O838676M001657k656581q072502
2282b733016p796700k133840K943801J925534k811427l572224J844862O937291
2274e395719O277263K886082J762874J426356j879355n474934l464167K906346
2266i55254N862705K451173j778150j986263m89144j269220l542757m402498l730672
2257i840080k813300j288489R85455J689261p49152l669538l270617J83036L141891
2248a5631533L549761K208268N15274o17324n67002N798q92198l431199m303404
$$ plain form
2239 -19163559 -20191805 -16662227 -12282179 -11069303 -12889492 -15553126 -18827472 -23218283
2231 -23218283 -26384261 -24742987 -18722404 -13028194 -10897912 -11050366 -11529397 -13464000
2223 -13464000 -18469008 -24434230 -27252453 -26153908 -24265650 -23629905 -22548515 -18948451
2215 -18948451 -13839810 -9515712 -6143128 -2505144 1007255 2781851 2884947 2806141 2218401
2206 2218401 -968807 -6412832 -10426928 -11412912 -13278163 -19766863 -27005779 -26376646 -15390535
2197 -15390535 -1602973 6219051 7523421 7754397 9448030 9992758 7733183 5561792
2189 5561792 6336592 7797178 5258299 -1770230 -8702029 -11673599 -11538200 -11091608 -10624506
2180 -10624506 -8326247 -3959833 302798 2726030 3523896 2761320 -1285226 -9717678
$$ packed form
2239a9163559j028246L529578M380048J212876j820189k663634l274346m390811
2231b3218283l165978J641274O020583N694210K130282j52454m79031j934603
2223a3464000n005008n965222k818223J098545J888258O35745J081390L600064
2215a8948451N108641M324098L372584L637984L512399J774596J03096p8806n87740
2206B218401l187208n444025m014096r85984j865251o488700p238916O29133J0986111
2197a5390535J3787562P822024J304370K30976J693633N44728k259575k171391
2189E561792P74800J460586k538879p028529o931799k971570J35399M46592M67102
2180a0624506K298259M366414M262631K423232P97866p62576m046546q432452
$$ plain form
2172 -9717678 -19649914 -25417012 -23944336 -17810346 -12001407 -8277714 -4082793 2897801
2164 2897801 10603139 14237109 11425721 4351864 -3065061 -8411288 -10850735 -10146133
2156 -10146133 -7359657 -5175346 -5321933 -6284584 -5690805 -4376139 -5307175 -8415456 -9841871
2147 -9841871 -7679504 -5446533 -7366548 -12209751 -14656525 -11761821 -5607533 -344507
2139 -344507 984646 -2548627 -9042518 -14122383 -14753385 -13036705 -13655615 -17106768 -18389356
2130 -18389356 -13693893 -5707575 -188847 819103 -2297 179189 1206481 1072158 -1681356
2121 -1681356 -6741284 -11888066 -14078508 -11650459 -5445835 2533421 10497637 16104665
2113 16104665 16228895 10058110 1753923 -2842323 -2610498 -1971794 -4783125 -9894324 -13841399
$$ packed form
2172i717678r932236n767098J472676O133990N808939L723693M194921O980594
2164B897801P705338L633970k811388p073857p416925n346227k439447P04602
2156a0146133K786476K184311j46587r62651N93779J314666r31036l108281j426415
2147i841871K162367K232971j920015m843203k446774K894704O154288N263026
2139c44507J329153l533273o493891n079865o31002J716680o18910l451153j282588
2130a8389356M695463P986318N518728J007950q21400J81486J027292j34323k753514
2121a681356n059928n146782k190442K428049O204624P979256P964216N607028
2113A6104665J24230o170785q304187m596246K31825O38704k811331n111199l947075
$$ plain form
2104 -13841399 -15234132 -14241586 -9932543 -1582686 7915552 13300012 12468434 8571753
2096 8571753 5760170 4877153 4505253 4210789 4606655 5198837 4471407 2253709 432317
2087 432317 801809 3013402 4909752 4440850 1465843 -1731314 -2177427 559481 3293256
2078 3293256 2707542 -316907 -1659345 383922 2402750 233399 -5322729 -9067601
2070 -9067601 -7410417 -2245154 1352530 147268 -4865472 -10111234 -12758225 -12643410
2062 -12643410 -11297964 -9319859 -5403930 1287792 8357361 11480428 9233131 5319830
2054 5319830 4528455 7138924 9277500 8918648 9171857 14007324 22275258 28346237 28246519
2045 28246519 22888206 15334014 7680153 1604577 -793902 1012143 4681797 7737093
$$ packed form
2104a3841399j392733R92546M309043Q349857R498238N384460q31578l896681
2096H571753k811583q83017l71900k94464L95866N92182p27430k217698j821392
2087D32317L69492K211593J896350m68902k975007l197157m46113K736908K733775
2078C293256n85714l024449j342438K043267K018828k169351n556128l744872
2070i067601J657184N165263L597684j205262n012740n245762k646991J14815
2062a2643410J345446J978105L915929O691722P069569L123067k247297l913301
2054E319830p91375K610469K138576l58852K53209M835467Q267934O070979r9718
2045B8246519n358313p554192p653861o075576k398479J806045L669654L055296
$$ plain form
2037 7737093 10283786 13040695 14328475 11988451 7392379 4258238 3601865 3021916 1277147
2028 1277147 384747 2319248 6442220 11116910 15119619 16637284 14180580 9971271
2020 9971271 8948686 12059700 13666701 8627543 -569546 -6930802 -7056578 -2849841
2012 -2849841 2581789 6498481 5559325 -1581412 -10358082 -13284843 -8156001 -246988
2004 -246988 4506842 5425564 4985444 3932288 947605 -4225586 -9448661 -12057635 -11667843
1995 -11667843 -11212470 -14305477 -20357374 -23425083 -18245742 -7004925 2453901 5220090
1987 5220090 3518422 1972016 1601977 113303 -3718299 -7811289 -8631161 -4822897 824732
1978 824732 3808865 3030850 1770148 1873205 -317888 -8231441 -17108876 -17574556 -7570474
$$ packed form
2037G737093K546693K756909J287780k340024m596072l134141o56373n79949j744769
2028A277147q92400J934501M122972M674690M002709J517665k456704m209309
2020I971271j022585L111014J607001n039158r197089o361256j25776M206737
2012b849841N431630L916692r39156p140737q776670k926761N128842P909013
2004b46988M753830R18722m40120j053156k984683n173191n223075k608974L89792
1995a1667843M55373l093007o051897l067709N179341J1240817R458826K766189
1987E220090j701668j546406l70039j488674l831602m092990q19872L808264N647629
1978H24732K984133p78015j260702J03057k191093p913553q877435m65680J0004082
$$ plain form
1969 -7570474 4848491 12095164 14698944 15747189 13907595 7449844 912109 685085
1961 685085 5197338 5993572 -539580 -7670753 -6581511 3501735 15906658 24721577
1953 24721577 29209313 30642622 27966401 18843906 4488169 -9058233 -16238764 -17496286
1945 -17496286 -17443175 -18390005 -18583235 -16677511 -14250353 -12678308 -10938729 -8483737 -7262055
1936 -7262055 -8445617 -9855013 -9487793 -9276290 -12089001 -16662988 -18775101 -16474989 -11536348
1927 -11536348 -6823661 -4575960 -5802334 -8770743 -9627101 -7189081 -5336537 -7634340
1919 -7634340 -11623335 -12197034 -8842497 -5193932 -2840751 -558751 1015997 -671909
1911 -671909 -5141488 -8846570 -10796528 -13264776 -15889290 -14482798 -8017632 -1965459
$$ packed form
1969g570474J2418965P246673K603780J048245j839594o457751o537735k27024
1961F85085M512253P96234o533152p131173J089242J0083246J2404923Q814919
1953B4721577M487736J433309k676221r122495j4355737j3546402p180531j257522
1945a7496286N3111r46830j93230J905724K427158J572045J739579K454992J221682
1936g262055j183562j409396L67220K11503k812711m573987k112113K300112M938641
1927a1536348M712687K247701j226374k968409q56358K438020J852544k297803
1919g634340l988995n73699L354537L648565K353181K282000J574748j687906
1911f71909m469579l705082j949958k468248k624514J406492O465166O052173
$$ plain form
1903 -1965459 -1525445 -5293024 -8703419 -10157262 -10175296 -7700181 -1772440 4738185 7340639
1894 7340639 5629897 3758636 5140568 8722793 10438000 7087131 -494379 -6997546
1886 -6997546 -6705958 306509 7104298 6652211 -1241290 -10886496 -16924108 -17713821 -14268815
1877 -14268815 -8773312 -3835250 -850690 1109050 3402013 5297266 5114983 3578380
1869 3578380 3952813 8185870 14053906 16813613 13414656 5142963 -3590912 -9235928
1861 -9235928 -11813272 -13156852 -13181096 -9965124 -3865698 978460 828551 -3737366 -9623217
1852 -9623217 -14973766 -19018354 -20062212 -16835247 -11272525 -7022625 -5013164 -2813615
1844 -2813615 1357441 6164582 9211820 9769626 8856279 8016543 8427908 9913894 10565385
$$ packed form
1903a965459M40014l767579l410395j453843j8034K475115N927741O510625K602454
1894G340639j710742j871261J381932L582225J715207l350869p581510o503167
1886f997546K91588P012467O797789m52087p893501r645206o037612p89713L445006
1877a4268815N495503M938062K984560J959740K292963J895253j82283j536603
1869C578380L74433M233057N868036K759707l398957q271693q733875n645016
1861i235928k577344j343580k4244L215972O099426M844158j49909m565917n885851
1852i623217n350549m044588j043858L226965N562722M249900K009461K199549
1844b813615M171056M807141L047238N57806r13347q39736M11365J485986O51491
$$ plain form
1835 10565385 8599131 4646468 717751 -3030594 -8392585 -15470314 -21228272 -23042518
1827 -23042518 -21896676 -20418361 -19336087 -17983815 -17024906 -17808378 -19280387 -18525002 -15087996
1818 -15087996 -11961516 -10751660 -8512004 -2032899 6588877 12115908 13078510 12658834
1810 12658834 12491922 9903171 3157052 -4337716 -8146605 -8482109 -8471708 -8936024 -8597631
1801 -8597631 -7779651 -7631325 -6620601 -2365154 3189814 5063401 2289714 -830500 -1532480
1792 -1532480 -1921184 -3736127 -4616120 -2516676 429089 2145529 4917095 10844711 15869719
1783 15869719 13915571 6125825 854729 3712836 11204278 15168010 10955520 644953
1775 644953 -9394975 -13151950 -8961523 -248389 7708633 11576087 10758066 6203919
$$ packed form
1835A0565385j966254l952663l928717l748345n361991p077729n757958j814246
1827b3042518J145842J478315J082274J352272R58909p83472j472009P55385L437006
1818a5087996L126480J209856K239656O479105Q621776N527031R62602m19676
1810A2658834j66912k588751o746119p494768l808889l35504J0401m64316L38393
1801h597631Q17980J48326J010724M255447N554968J873587k773687l120214p01980
1792a532480l88704j814943q79993K099444K945765J716440K771566N927616N025008
1783A5869719j954148p789746n271096K858107P491442L963732m212490j0310567
1775F44953j0039928l756975M190427Q713134P957022L867454q18021m554147
$$ plain form
1767 6203919 -302832 -6864348 -12583462 -16819288 -17099476 -10684384 226011 8150286
1759 8150286 8243842 4120944 2486029 4304822 5383796 3984175 3071596 5318327 10030682
1750 10030682 15238896 19360842 20692014 18510662 14851269 12352719 10589154 7229746
1742 7229746 1897417 -4281858 -11392690 -18638201 -21051095 -14292010 -2834424 2949452
1734 2949452 -421386 -5250590 -3532217 3027717 6889221 4132872 -3320960 -11097100
1726 -11097100 -14433406 -10301336 -1500966 3665860 -503327 -10752922 -19116967 -21578599
1718 -21578599 -20049414 -17946151 -16761416 -15602854 -11842038 -3663739 6354250 12259002
1710 12259002 11068501 5903923 1415787 -840410 -844702 1844792 5304828 4397955 -2980017
$$ packed form
1767F203919o506751o561516n719114m235826k80188O415092J0910395P924275
1759H150286R3556m122898j634915J818793J078974j399621r12579K246731M712355
1750A0030682N208214M121946J331172k181352l659393k498550j763565l359408
1742G229746n332329o179275p110832p245511k412894O759085J1457586N783876
1734B949452l370838m829204J718373O559934L861504k756349p453832p776140
1726a1097100l336306M132070Q800370N166826m169187j0249595q364045k461632
1718b1578599J529185K103263J184735J158562L760816Q178299J0017989N904752
1710A2259002j190501n164578m488136k256197m292K689494L460036r06873p377972
$$ plain form
1701 -2980017 -11487008 -14135843 -10048211 -2939587 4632009 10864045 12210884 7620527
1693 7620527 2987357 4615946 9466223 8805285 1104860 -5996724 -7275384 -6026484
1685 -6026484 -6468601 -7135722 -5744317 -5075676 -9120277 -16627948 -22481766 -23234910 -18536547
1676 -18536547 -9798517 -518798 4285638 2098394 -4576268 -11042259 -14009733 -11944959
1668 -11944959 -5494714 657443 195619 -7650499 -16282726 -19643799 -18558196 -16275139
1660 -16275139 -11982548 -3817350 4629301 6946451 2339571 -3560348 -6025279 -4966678
1652 -4966678 -1911920 1717491 2983643 -857384 -7662638 -11758252 -11580822 -11837126 -16056121
1643 -16056121 -21092367 -21967867 -18811555 -15516225 -13937008 -12966027 -11678269 -10034339
$$ packed form
1701b980017q506991k648835M087632P108624P571596O232036J346839m590357
1693G620527m633170J628589M850277o60938p700425p101584j278660J248900
1685f026484m42117o67121J391405O68641m044601p507671n853818p53144M698363
1676a8536547Q738030R279719M804436k187244o674662o465991k967474K064774
1668a1944959O450245O152157m61824p846118q632227l361073J085603K283057
1660a6275139M292591Q165198Q446651K317150m606880n899919k464931J058601
1652d966678L054758L629411J266152l841027o805254m095614J77430k56304m218995
1643a6056121n036246q75500L156312L295330J579217R70981J287758J643930
$$ plain form
1635 -10034339 -7755489 -5735959 -7269557 -14018252 -21351491 -21980322 -14899565 -6900066
$$ packed form
1635a0034339K278850K019530j533598o748695p333239o28831P080757P999499
$$ [...]
##END NTUPLES=NMR SPECTRUM
##END=
