##TITLE=31Pdec_DE-78_oil5-TFA2
 CDCl3, 64 sc
 25.12.2024
##JCAMPDX= 6.0         $$ Bruker NMR JCAMP-DX V2.0
##DATA TYPE= NMR SPECTRUM
##DATA CLASS= NTUPLES
##ORIGIN= UXNMR, Bruker Analytische Messtechnik GmbH
##OWNER= root
$$ XWIN-NMR		Version 3.5
$$ Wed Dec 25 15:27:46 2024 Russian Standard Time (UT+4h)  she@DPX200
##.OBSERVE FREQUENCY= 81.013821
##.OBSERVE NUCLEUS= ^31P
##.ACQUISITION MODE= SIMULTANEOUS
##.ACQUISITION SCHEME= undefined
##.AVERAGES= 64
##.DIGITISER RES= 17
##SPECTROMETER/DATA SYSTEM= spect
##.PULSE SEQUENCE= zgpg30
##.SOLVENT NAME= CDCl3
##.SHIFT REFERENCE= (INTERNAL, CDCl3, 0, 198.062)
##AUDIT TRAIL= $$ (NUMBER, WHEN, WHO, WHERE, WHAT)
$$ ##TITLE= Audit trail, XWIN-NMR		Version 3.5
$$ ##JCAMPDX= 5.01
$$ ##ORIGIN= Bruker BioSpin GmbH
$$ ##OWNER= she
$$ F:/spectra/data/she/nmr/P31/2/pdata/1/auditp.txt
$$ ##AUDIT TRAIL=  $$ (NUMBER, WHEN, WHO, WHERE, WHAT)
(   1,<2024-12-25 15:26:47.73 +0400>,<she>,<DPX200>,
      <created by zg, POWCHK disabled, PULCHK disabled
       configuration hash MD5:
       00 E9 B6 7A A2 85 ED C7 34 08 36 98 17 FE 4E 26
       data hash MD5: 32K
       A4 73 10 C0 2B DC 2A 61 EE DD 18 21 6F 2D 44 56>)
(   2,<2024-12-25 15:26:49.92 +0400>,<she>,<DPX200>,
      <Start of raw data processing
       efp BC_mod = 2 LB = 1.5 FT_mod = 6 PKNL = 1 PHC0 = 2061.364 PHC1 = 175.4863 SI = 64K 
       data hash MD5: 64K
       97 8B 19 80 E0 A5 CB FF A6 59 3F 89 B1 38 0E 8E>)
(   3,<2024-12-25 15:27:06.65 +0400>,<she>,<DPX200>,
      <pk PHC0 = 21.7077 PHC1 = 0 
       data hash MD5: 64K
       59 B6 5C FB 79 CA 49 B0 E1 3B 6F 1C 99 E6 AD 47>)
(   4,<2024-12-25 15:27:12.32 +0400>,<she>,<DPX200>,
      <abs ABSG = 5 
       data hash MD5: 64K
       A5 CF E8 35 77 F4 E4 3A 73 27 FD F1 02 F7 C2 58>)
$$ ##END=
$$ 
$$ hash MD5
$$ 37 96 31 F1 7B D6 9D 41 36 A1 B0 59 AE FF EC 8A
##$RELAX= 
##$RELAX= 
##$RELAX= 
##$RELAX= 
##$RELAX= 
##$RELAX= 
##$RELAX= 
##$RELAX= 
$$ Bruker specific parameters
$$ --------------------------
##$DU= <F:/spectra>
##$EXPNO= 2
##$NAME= <P31>
##$PROCNO= 1
##$TYPE= <nmr>
##$USER= <she>
##$AMP= (0..31)
100 100 100 100 100 100 100 100 100 100 100 100 100 100 100 100 100 100 
100 100 100 100 100 100 100 100 100 100 100 100 100 100 
##$AQSEQ= 0
##$AQ_mod= 1
##$AUNM= <au_zg>
##$AUTOPOS= <>
##$BF1= 81.014009
##$BF2= 200.13
##$BF3= 200.13
##$BF4= 200.13
##$BF5= 200.13
##$BF6= 200.13
##$BF7= 200.13
##$BF8= 200.13
##$BYTORDA= 1
##$CFDGTYP= 0
##$CFRGTYP= 5
##$CHEMSTR= <none>
##$CNST= (0..31)
1 1 145 1 1 1 1 1 1 1 1 1 1 1 1 1 1 1 1 1 1 1 1 1 1 1 1 1 1 1 1 1 
##$CPDPRG= <waltz16>
##$CPDPRG1= <>
##$CPDPRG2= <waltz16>
##$CPDPRG3= <>
##$CPDPRG4= <mlev>
##$CPDPRG5= <mlev>
##$CPDPRG6= <mlev>
##$CPDPRG7= <mlev>
##$CPDPRG8= <mlev>
##$CPDPRGB= <>
##$CPDPRGT= <>
##$D= (0..31)
0 1 0 0 0 0 0 0 0 0.06 0 0.03 2e-05 3e-06 0 0 0.0002 0 0 0 0 0 0 0 0 0 
0 0 0 0 0 0 
##$DATE= 1735126007
##$DBL= (0..7)
120 120 120 11 120 120 24 19 
##$DBP= (0..7)
150 150 150 150 150 150 150 150 
##$DBP07= 0
##$DBPNAM0= <>
##$DBPNAM1= <>
$$ [...]
##$SUBNAM3= <"">
##$SUBNAM4= <"">
##$SUBNAM5= <"">
##$SUBNAM6= <"">
##$SUBNAM7= <"">
##$SUBNAM8= <"">
##$SUBNAM9= <"">
##$SW= 400.765351723535
##$SWIBOX= (0..15)
0 1 3 0 0 0 0 0 0 0 0 0 0 0 0 0 
##$SW_h= 32467.5324675325
##$TD= 32768
##$TD0= 1
##$TE= 0
##$TE2= 300
##$TE3= 300
##$TEG= 300
##$TL= (0..7)
0 120 53 12 22 120 120 120 
##$TP= (0..7)
150 150 150 150 150 150 150 150 
##$TP07= 0
##$TPNAME0= <>
##$TPNAME1= <>
##$TPNAME2= <>
##$TPNAME3= <>
##$TPNAME4= <>
##$TPNAME5= <>
##$TPNAME6= <>
##$TPNAME7= <>
##$TPOAL= (0..7)
0.5 0.5 0.5 0.5 0.5 0.5 0.5 0.5 
##$TPOFFS= (0..7)
0 0 0 0 0 0 0 0 
##$TUNHIN= 0
##$TUNHOUT= 0
##$TUNXOUT= 0
##$USERA1= <user>
##$USERA2= <user>
##$USERA3= <user>
##$USERA4= <user>
##$USERA5= <user>
##$V9= 5
##$VALIST= <valist>
##$VCLIST= <CCCCCCCCCCCCCCC>
##$VD= 0
##$VDLIST= <DDDDDDDDDDDDDDD>
##$VPLIST= <PPPPPPPPPPPPPPP>
##$VTLIST= <TTTTTTTTTTTTTTT>
##$WBST= 1024
##$WBSW= 4
##$XGAIN= (0..3)
0 0 0 0 
##$XL= 0
##$YL= 0
##$YMAX_a= 7192
##$YMIN_a= -8092
##$ZGOPTNS= <>
##$ZL1= 120
##$ZL2= 120
##$ZL3= 120
##$ZL4= 120
##$ABSF1= 198.0616
##$ABSF2= -202.7028
##$ABSG= 5
##$ABSL= 3
##$ALPHA= 0
##$AQORDER= 0
##$ASSFAC= 0
##$ASSFACI= 0
##$ASSFACX= 0
##$ASSWID= 0
##$AUNMP= <proc_1d>
##$AZFE= 0.1
##$AZFW= 0.5
##$BCFW= 0
##$BC_mod= 2
##$BYTORDP= 0
##$COROFFS= 0
##$CY= -3
##$DATMOD= 1
##$DC= 0
##$DFILT= <>
##$DTYPP= 0
##$F1P= 0
##$F2P= 0
##$FCOR= 1
##$FTSIZE= 65536
##$FT_mod= 6
##$GAMMA= 0
##$GB= 0
##$INTBC= 1
##$INTSCL= 9.790993e-09
##$ISEN= 30
##$LB= 1.5
##$LEV0= 0
##$LPBIN= 0
##$MAXI= 10000
##$MC2= 0
##$MEAN= 0
##$ME_mod= 0
##$MI= 50
##$NCOEF= 0
##$NC_proc= -9
##$NLEV= 6
##$NOISF1= 182.463
##$NOISF2= 159.3651
##$NSP= 0
##$NTH_PI= 0
##$NZP= 0
##$OFFSET= 198.0616
##$PC= 4
##$PHC0= 2083.072
##$PHC1= 175.4863
##$PH_mod= 1
##$PKNL= yes
##$PPARMOD= 0
##$PSCAL= 0
##$PSIGN= 0
##$REVERSE= no
##$SF= 81.0140089999434
##$SI= 65536
##$SIGF1= 159.3651
##$SIGF2= -187.1042
##$SINO= 113.3802
##$SIOLD= 16384
##$SREGLST= <1H.CDCl3>
##$SSB= 0
##$STSI= 65536
##$STSR= 0
##$SW_p= 32467.5324675325
##$SYMM= 0
##$S_DEV= 0
##$TDeff= 32768
##$TDoff= 0
##$TI= <>
##$TILT= no
##$TM1= 0
##$TM2= 0
##$TOPLEV= 0
##$USERP1= <user>
##$USERP2= <user>
##$USERP3= <user>
##$USERP4= <user>
##$USERP5= <user>
##$WDW= 1
##$XDIM= 65536
##$YMAX_p= 325919293
##$YMIN_p= -172497892
$$ End of Bruker specific parameters
$$ ---------------------------------
##NTUPLES= NMR SPECTRUM
##VAR_NAME=  FREQUENCY,     SPECTRUM/REAL,   SPECTRUM/IMAG
##SYMBOL=    X,             R,               I
##VAR_TYPE=  INDEPENDENT,   DEPENDENT,       DEPENDENT
##VAR_FORM=  AFFN,          ASDF,            ASDF
##VAR_DIM=   65536,         65536,           65536
##UNITS=     HZ,            ARBITRARY UNITS, ARBITRARY UNITS
##FACTOR=    0.49542278885378, 1,            1
##FIRST=     16045.7642231865, 0,            0
##LAST=      -16421.768244346, 0,            0
##MIN=       -16421.768244346, -172497892,   0
##MAX=       16045.7642231865, 325919293,    0
$$ Real data points
##PAGE= N=1
##DATA TABLE= (X++(R..R)), XYDATA
$$ [...]
9373 13129628 14048136 12293920 9208389 5922513 3473432 2499490 2405211 2264892 2196271
9364 2196271 2131379 -22792 -6434746 -15604157 -22985217 -25539432 -23554692 -18348906 -11331514
9355 -11331514 -5632865 -4917475 -8828040 -12373456 -11656592 -7924741 -4525049 -2666806
9347 -2666806 -2195564 -3635084 -6524226 -7852367 -5193558 48333 4939436 8613697
9339 8613697 10888255 9719483 3955773 -2958129 -6257625 -6003313 -5951298 -7136159 -7109609
9330 -7109609 -5292119 -4212130 -4807316 -5033974 -4016391 -3074195 -1684096 2536482 8226947
9321 8226947 10149006 7384789 6273460 11264626 17781163 19171296 16548976 15682227
9313 15682227 17093776 15971675 10547228 4032711 -1554063 -7280916 -12296101 -12854491
9305 -12854491 -8367385 -3665392 -2697051 -3603929 -2556407 461452 2309435 1165020
9297 1165020 -1895529 -4697845 -5974836 -6240818 -6951645 -8053999 -7409999 -4555589 -3478958
9288 -3478958 -8180116 -16223126 -20760082 -18945045 -14316422 -10873042 -9394958 -9787052
9280 -9787052 -11508882 -10700812 -3183656 7465397 11442826 5902969 74223 2278877
9272 2278877 8234590 9013488 5098798 3829767 6294818 6364621 1908854 -2064719 -2326961
9263 -2326961 -1443772 -1140762 950511 5285303 7794345 6660401 5973193 8810593 11618500
9254 11618500 9726220 4534688 925039 413699 683657 -406436 -3396998 -7285147
9246 -7285147 -8374172 -2416107 8631313 15307675 10577787 -1198898 -9437461 -9228190
9238 -9228190 -3518738 4129882 12553430 19082930 19256228 12777877 5443497 2698795
9230 2698795 4353207 7523484 11494485 16809449 21790791 23262594 20182673 14326578
9222 14326578 7653219 932635 -4823701 -7404079 -5369579 -795901 1450810 -1376577
9214 -1376577 -5983273 -5942224 596264 7928169 9285303 4834528 713951 981209 3680242
9205 3680242 5117803 4772561 4460287 5119831 6554910 8802712 11525124 12844294 10913074
9196 10913074 6572036 2847443 1652107 2131840 2263855 857012 -2103255 -5581884
9188 -5581884 -7321219 -5003766 958777 6502493 7470484 4203585 1212680 1973751 5477219
9179 5477219 8581311 10135719 11278763 12868389 14696538 16815920 19607954 22490398
9171 22490398 24332439 25187466 25757948 25171376 21700944 16253127 12605055 12972019 15507488
9162 15507488 17419599 18199602 18176686 16463814 12764331 9120524 7165363 5429343 2210181
9153 2210181 -773279 -1093268 -302587 -1450195 -2675503 1415767 10823033 17337475 13438030
9144 13438030 1208963 -10053905 -13204495 -8394038 -882258 4083213 5225554 5525959
9136 5525959 7928136 10881387 10432434 6838908 5228703 7850848 9832669 6534800
9128 6534800 1933300 3980929 12412165 17162569 10860199 -1518498 -8685093 -6186431
9120 -6186431 -44061 1755758 -1978628 -6100637 -6015041 -2388628 367947 -1025946 -5545827
9111 -5545827 -8921757 -7793113 -3350703 -709142 -3604370 -9536471 -11799847 -7372990
9103 -7372990 -914627 1409242 565625 3223234 11458335 18257396 15691294 4388378
9095 4388378 -8255931 -16778394 -20664731 -20585425 -16909342 -12293788 -10727887 -11836395
9087 -11836395 -9973373 -2009009 6760964 8130591 960389 -7891665 -11901009 -10460531
9079 -10460531 -6072875 -227289 5716982 8614303 6131237 537735 -3043233 -2531393
9071 -2531393 -1015360 -2501996 -7256643 -12080629 -13738178 -11174417 -5624476 156907
9063 156907 3440589 3476128 1792714 325514 136188 2154319 7089221 13003518 14913233
9054 14913233 9771768 1260478 -3366157 -1364879 3371733 6576232 8417437 10360363
9046 10360363 10777042 7414127 2586382 1720148 6350786 11832414 13277927 11330088
9038 11330088 10189935 11620553 13424148 13464264 12592593 12469076 12284281 9840094 5473484
9029 5473484 2484277 2714042 3644662 1753668 -2421679 -4850581 -3186868 998099 5230818
9020 5230818 8847419 11917659 13844825 14449812 14552304 13879375 10102229 1957871 -7811549
9011 -7811549 -14640151 -16620537 -15271446 -12778042 -10393471 -8970033 -8945680 -9633675 -9868819
9002 -9868819 -9322346 -8284130 -6829425 -5324617 -4661563 -4358756 -1694222 4854123 12087460
8993 12087460 14758205 11550510 5781538 401566 -4560882 -9314016 -12560294 -13587651
8985 -13587651 -13059920 -10588077 -4946970 1700766 3940274 542848 -2145619 1195684
8977 1195684 6086960 4232555 -3381068 -6878121 -1972169 3482558 1151548 -5881391
8969 -5881391 -8755762 -6041265 -4033040 -5704294 -7068789 -5309406 -3504254 -4499442
8961 -4499442 -5819502 -4599946 -3002280 -3905985 -4650059 -759772 5846617 8163133 3461628
8952 3461628 -3613459 -7689076 -7783338 -5124344 -717503 3225332 3797345 1584788 580314
8943 580314 1770845 894407 -4615738 -10624348 -11942922 -9117578 -5149125 661906 9510752
8934 9510752 16511057 14782904 5566039 -2997100 -7853962 -14339904 -25145387 -33528223
8926 -33528223 -32576489 -25599565 -20894937 -19716321 -16444372 -9277984 -3584733 -3449677
8918 -3449677 -5710136 -5201858 -2052617 -543479 -3081431 -8401165 -14413965 -19813546
8910 -19813546 -23056988 -22238547 -16736934 -7957416 1525440 8596221 10275131 6149856
8902 6149856 134474 -3082415 -4252455 -8873794 -18064088 -23909428 -18727287 -6786677
8894 -6786677 -504760 -5011151 -13204948 -17760167 -20449051 -24923198 -27234333 -21544918
8886 -21544918 -11417587 -6521443 -9068607 -11699041 -9216403 -4478165 -1011026 2312384
8878 2312384 5883678 5738806 80799 -6147462 -8197063 -8150873 -9312435 -8650954 -1579268
8869 -1579268 8894127 15087323 15305744 14673577 15792719 15633122 12833717 11445542 14389157
8860 14389157 18034581 16970438 11243780 5693640 3945467 5598768 8069066 9089704
8852 9089704 8076833 6464503 6327452 8098540 10298860 11635940 12228317 12534924 12260390
8843 12260390 10631098 6988129 1529595 -3465298 -4358191 -504963 2797150 -1001623
8835 -1001623 -11508099 -20872966 -22594590 -18108645 -13185586 -10749952 -9965368 -10307921
8827 -10307921 -12740875 -16740940 -19045497 -16797149 -10914368 -5312860 -2956537 -3153393
8819 -3153393 -2837843 -206060 3513865 6074128 7056067 7672615 8204636 7071755 2792990
8810 2792990 -3991399 -10708054 -14445159 -13434612 -7933378 -186552 6672543 9996499
8802 9996499 8673495 4089580 42425 -182970 2479665 3853699 2138250 120891
8794 120891 110206 -250342 -3796429 -8045772 -8159938 -4301116 -1029055 146879 2289237
8785 2289237 6664541 10258476 11028978 10494171 9277280 5514650 419745 -281534 5187942
8776 5187942 9781813 6907990 798486 943991 8317156 14339459 13547438 10493268 11893061
8767 11893061 16984140 19036533 13900878 4362108 -3054562 -4281251 -1157070 1170095
8759 1170095 537027 -2374 2487051 5672285 5363964 2453220 2219451 7039647 13825072
8750 13825072 18865049 21165183 20545438 17004662 13509400 15070306 22437189 29888703
8742 29888703 31661261 27779037 21662267 15608924 11341982 11033073 13502583 12515968
8734 12515968 4177035 -5732890 -7521948 -352155 6450541 5825611 1221374 -143520
8726 -143520 2409900 3616832 552901 -4082185 -6322187 -5217591 -2687700 -1525978
8718 -1525978 -3586093 -7795288 -9973244 -6902995 -786014 2920120 2853158 4047816 10925661
8709 10925661 20418592 25264370 23066927 18581958 16808638 17150037 15819780 11457907
8701 11457907 6274599 3127403 3281883 5857905 7839818 6017511 978355 -2146437
8693 -2146437 381526 5063161 4579764 -2753563 -10321035 -11195524 -5833459 114655 3081344
8684 3081344 3786292 3678377 2600394 259465 -2466179 -4692579 -6647908 -8783634 -10594780
8675 -10594780 -11052432 -9860346 -7874416 -6405405 -6168312 -6736107 -7069387 -6751852 -6569895
8666 -6569895 -7649546 -9999417 -11822452 -10281134 -3783521 5426864 11556968 10209572
8658 10209572 3640329 -870237 814110 4859971 4642121 -786573 -6121064 -7059787
8650 -7059787 -4995279 -3852628 -5014168 -6927716 -7836720 -7040235 -4576510 -1433589 487668
8641 487668 55407 -1825612 -3714966 -5660941 -8159806 -9648277 -7267987 -707309 6524899
8632 6524899 10841102 12409826 13889280 16104656 16747121 13630344 8000749 3875396
8624 3875396 4465817 9434259 15121388 17302193 14461556 8825777 3674266 -450605
8616 -450605 -5643611 -12202881 -16330790 -14658765 -9934471 -8576763 -11967445 -13977633
8608 -13977633 -9461715 -1894814 1356989 -747439 -2544226 -1139966 -562226 -4449093
8600 -4449093 -9607064 -10810805 -8715581 -8223625 -10598863 -12099450 -10357554 -7718865
8592 -7718865 -7283629 -9252032 -12584351 -17100788 -22047831 -25182877 -25469390 -24740086 -24630770
8583 -24630770 -23728042 -20243873 -16136370 -15598022 -19582871 -24183262 -24941462 -21343803 -16580288
8574 -16580288 -13648011 -12013418 -8163365 -29580 9354174 14243267 12595926 7861629
8566 7861629 3297747 -2575121 -12108106 -22421471 -27274137 -24656150 -18973507 -15254571
8558 -15254571 -14082579 -12920952 -9944242 -5679856 -2675963 -3845210 -9181161 -14069796
8550 -14069796 -13215405 -6593705 599149 3842284 2666119 -1366330 -6351338 -9314989
8542 -9314989 -7908958 -4301610 -3630389 -6795703 -8623952 -5480172 -648463 1169725
8534 1169725 926552 2324665 4580461 3255366 -2750899 -9619979 -13868636 -15593153
8526 -15593153 -16684563 -18965442 -23663648 -29578012 -32258611 -28335193 -20355377 -13976186
8518 -13976186 -10593860 -6436413 745857 7886148 10795971 9394673 7301067 7705822
8510 7705822 10137190 10367457 4586230 -4635741 -8661285 -2346983 8690014 14813733
8502 14813733 14657261 14757247 17675635 18051251 12404662 5609484 3342410 3631576 1084641
8493 1084641 -4374769 -8362753 -9214302 -9335376 -10523794 -11862297 -11689736 -9086277 -4477194
8484 -4477194 -520912 -181273 -2053031 -944191 4095411 6379757 690148 -7851959
8476 -7851959 -10012894 -5281298 -1804666 -4376625 -9494260 -13089853 -16150506 -19780952
8468 -19780952 -20357475 -13971670 -2496554 8637548 16759003 22771261 26968608 27354480
8460 27354480 22529312 14530845 7982755 6385240 9065100 12147552 13034455 12985837 14151060
8451 14151060 15446449 13756355 8626954 3248984 892758 2531471 7402632 12996332
8443 12996332 14683587 8890956 -2298278 -12260683 -16345728 -15084420 -10948396 -5309605
8435 -5309605 456946 4250953 5462155 5563452 5277733 3574775 308644 -3163223 -6894814
8426 -6894814 -12161226 -16957539 -16222279 -9331700 -2902532 -2035595 -2705229 1824759 10011433
8417 10011433 13934418 10916632 6463610 5085736 4703362 2440894 272644 953215
8409 953215 2273525 86179 -4850012 -7477105 -5537671 -2354827 -1676944 -2483752 -816976
8400 -816976 4190594 7909389 4573212 -6196664 -17924460 -22913732 -19125247 -10922206
8392 -10922206 -3705565 473902 1966426 944233 -1899834 -3348956 425179 9075606
8384 9075606 17368210 20725920 19991837 18932330 18400001 15857997 10532676 5704509 4410498
8375 4410498 5509945 6251703 6624185 8250697 10585828 11941828 13600623 18519288 25169002
8366 25169002 26952194 20101872 9185019 2222111 2485334 7193999 11787392 12786957
8358 12786957 8866687 2719158 381573 4926476 11484896 12051219 4934480 -3852083
8350 -3852083 -8246676 -7511246 -4030959 -105861 1887520 299790 -2448907 -542494
8342 -542494 8332973 18914708 23858182 21644044 16553961 12472342 9755040 7343083
8334 7343083 4778734 1862335 -1432792 -4391427 -6612513 -9516112 -14690245 -20429247
8326 -20429247 -22121722 -17231940 -8495337 -1002965 2942508 4969306 7361080 10031672
8318 10031672 11004045 9111304 5454104 1942673 -1025562 -4244512 -6787223 -5206640
8310 -5206640 2325436 11763084 15747587 11164855 2022504 -6187200 -12400895 -18024565
8302 -18024565 -21578352 -19743286 -13664921 -9625597 -11255249 -14315851 -12245477 -4657068
8294 -4657068 3172451 7750823 10016211 10781239 8324243 2380786 -3184853 -4704248
8286 -4704248 -3656591 -4633741 -9651484 -16519422 -21420396 -21241750 -15411211 -8014767 -5840781
8277 -5840781 -10612996 -15001281 -11135376 -2030139 1512371 -3908053 -8867576 -4128629
8269 -4128629 6666288 12532027 9465400 3126555 -621062 -1207224 459722 4837340
8261 4837340 10689003 13993688 12830763 10199484 9462599 9731069 8342118 5327416 2238704
8252 2238704 -1493050 -7204736 -12757243 -13500511 -8164088 -834855 4220530 7478776
8244 7478776 12150250 18645506 23271960 22578580 17481995 12071718 8821318 6339065
8236 6339065 2486058 -1566502 -2389495 745313 4477657 6132497 7585910 11969640
8228 11969640 17958533 20454245 16847054 9875198 3918353 1067572 1534883 4947993
8220 4947993 9224243 10289311 5654334 -2294197 -8475960 -10292926 -9295865 -8316297 -8634077
8211 -8634077 -9859815 -11072193 -11716136 -12250531 -13960054 -17343079 -20810450 -21925550 -20007473
8202 -20007473 -16650416 -13424357 -9828266 -4254731 2978642 8233582 7338177 316072
8194 316072 -7783550 -12050265 -12606524 -12368978 -11336922 -7027570 -648037 2105312 -1340991
8185 -1340991 -6345467 -7872295 -7370810 -8363723 -8884619 -4648676 2177375 4384263 -118021
8176 -118021 -5986376 -9019689 -10667824 -12507340 -12818407 -11402399 -11524573 -13231032 -10545736
8167 -10545736 -295050 11111591 15290737 12384594 8243062 4802423 155616 -4214972
8159 -4214972 -4051173 -66654 1755081 -1163842 -4431547 -3217208 2107224 8048429
8151 8048429 11702530 11418750 7651473 4148953 4719975 8123281 9653673 7821299 5186391
8142 5186391 2751614 -796036 -3547743 -933330 5487819 6648358 -1773712 -11369904
8134 -11369904 -11547270 -4107757 -289676 -5380535 -13419439 -16882095 -14801561 -9850725
8126 -9850725 -3446186 2917050 5609318 2439306 -3215517 -5204814 -1413701 4331558
8118 4331558 7242109 6595379 4973998 3903455 2257303 -768657 -3149487 -2386015 504839
8109 504839 1732388 -264905 -2589712 -1457510 3457655 8921099 11219003 9173433
8101 9173433 5543936 5289824 10364938 16340996 16962759 12275061 8712606 10109280 12654601
8092 12654601 11061374 5911126 1467817 -639214 -1326837 43613 4724903 10202471
8084 10202471 11348341 6730691 662297 -1784208 415884 4601742 7387462 6989071
8076 6989071 4489372 3114721 4989673 8763409 11412505 11532969 9708034 7023518
8068 7023518 4893483 4919188 6921728 8318313 7190476 4487973 1748312 -843431 -2065080
8059 -2065080 1244522 9145205 15849990 16658131 14938997 16714041 20434742 18705932
8051 18705932 9379783 -1726905 -9325258 -13371218 -14732306 -13004746 -10239967 -10108835
8043 -10108835 -10884428 -5682088 7113700 19623641 24265615 22156496 18036942 12950063
8035 12950063 7008979 3674357 4708642 5061890 -431855 -8351595 -11327459 -8808486
8027 -8808486 -6242346 -5314245 -2412814 3588382 9120657 12188745 14481782 16005782
8019 16005782 13667599 7317492 1924651 1036464 2328969 2297408 1466672 1842849 2343937
8010 2343937 307249 -4220372 -8670985 -11455318 -13002307 -13882306 -13693501 -11902599 -9086154
8001 -9086154 -7152269 -7666873 -9167622 -7359102 -29865 8991419 13376146 11514379
7993 11514379 7546376 5540333 6026126 8466897 12878994 17143873 16525013 9204626
7985 9204626 256333 -3182031 17213 4236260 4262554 1107298 64220 4001038 9717969
7976 9717969 11731819 9352075 7902207 11463715 16677975 17076690 12281897 8369961
7968 8369961 8740530 9352455 5052776 -3168577 -9904284 -11408759 -7405589 391715 8515312
7959 8515312 12691955 11880205 10161996 12029483 17025460 21209596 22048706 19177746 12445612
7950 12445612 2996045 -4932591 -7455828 -6289535 -7020498 -11753216 -16602946 -17139934
7942 -17139934 -13466188 -8876810 -5841358 -4540216 -3763274 -2304775 -510208 -580765 -3990905
7933 -3990905 -8760601 -11159235 -10288004 -9034279 -9936255 -11804852 -11334975 -7089183 -1244892
7924 -1244892 2347325 2071618 527226 1183583 2769329 6045 -8168722 -14873648 -13968403
7915 -13968403 -9320771 -9251719 -13447302 -13063164 -4364269 5918301 11597291 15348287
7907 15348287 20889449 23916553 18423739 7645029 618278 156287 1874206 3706431
7899 3706431 8076878 14055170 15331619 8759078 -997331 -8136186 -12055734 -14376714
7891 -14376714 -14606205 -12355331 -10077557 -10036692 -11380139 -12873119 -15206889 -17832659 -17442657
7882 -17442657 -13429424 -11169703 -14987077 -20670871 -20620893 -14851372 -10993187 -13470662
7874 -13470662 -18058416 -18204098 -12439071 -4197357 2261975 4574013 3900179 4777465 10652351
7865 10652351 19068442 24088954 23493992 19968588 15163015 7734217 -900620 -4192845
7857 -4192845 1982107 12580248 18421123 16083368 9191099 1803357 -4935059 -10082086
7849 -10082086 -11536112 -9096298 -6253024 -6887243 -10857038 -13760001 -10986330 -2178346
7841 -2178346 7867728 12989482 10830700 4298573 -1588674 -3381335 -549612 4545566
7833 4545566 7803820 6772655 3418181 1442480 1019625 -423622 -2060021 645491
7825 645491 8073235 13601868 12449872 8589919 7806371 8236763 4458788 -2218245 -5418815
7816 -5418815 -4171645 -3467555 -4404579 -2445235 2655916 3710623 -3110180 -11424289 -13675032
7807 -13675032 -11426476 -11157943 -14249431 -16894848 -16694035 -13839091 -8398830 -1760669
7799 -1760669 1523129 -1181881 -5438445 -5223891 -2175830 -3326620 -10105273 -16002044
7791 -16002044 -16196446 -13490709 -12193408 -11130667 -6571828 873461 6223985 6126539 2307431
7782 2307431 -815996 -470348 2573654 5585805 6855502 6799970 6516112 6644554 7875335
7773 7875335 10400890 11948166 9300242 3924683 2829099 9994420 19404778 21360818
7765 21360818 14323210 5546975 1026591 540219 2391295 6330166 10049525 9087431
7757 9087431 3554759 83342 3442425 10097320 13458390 11785979 7408039 2015208
7749 2015208 -2797009 -3470679 1888544 9485296 13778691 14065363 13259758 11890071 7918942
7740 7918942 1620390 -3886279 -6848519 -7986965 -7884952 -6894664 -6949667 -9483617 -11989521
7731 -11989521 -10719022 -6433952 -3245493 -2263474 -1330047 -633275 -2300186 -3619436 1933446
7722 1933446 13640799 20399460 14144316 1336236 -5374756 -3268390 -5066 -2566
7714 -2566 1177662 7508544 14775412 16053315 10706644 4166146 1221932 2622784 6346367
7705 6346367 8946469 6612156 -1822795 -12395353 -18571968 -17228420 -11295671 -6137535
7697 -6137535 -4003552 -2459854 2019237 9289809 14695644 13435344 5748460 -3025203
7689 -3025203 -7925709 -9042409 -9878110 -11896253 -12514955 -9014870 -2885224 1426139 1906939
7680 1906939 1392649 3547570 7478121 8266857 3205844 -4230213 -8000350 -6095034 -1776572
7671 -1776572 1227172 2344999 2474335 1395396 -998397 -2669152 -1578583 809771
7663 809771 1328963 454434 2184174 7325782 10825367 8788503 4869618 5051134 7939856
7654 7939856 6014993 -3183802 -12756089 -15389490 -11896561 -7928297 -6434876 -7329301
7646 -7329301 -11015706 -16982454 -20820690 -18070931 -10610560 -4620137 -2440647 -977823
7638 -977823 1913351 4529530 5591663 6457747 7649627 7950991 8660645 13496950 21526429
7629 21526429 25464273 21068551 13654726 10494432 10883384 9489703 6000823 4344835
7621 4344835 4337783 1960064 -2038195 -1496698 5237064 11302261 10314726 4140743 -1624827
7612 -1624827 -5245416 -7774291 -8088293 -4009858 3035369 8453914 9295777 6371432 2454208
7603 2454208 369230 1857835 6393810 11639467 15838070 18321032 17327644 10506721
7595 10506721 -461683 -8764332 -9055470 -3300353 2558344 5565300 6307726 4845580
7587 4845580 506782 -4925172 -7714577 -6038965 -738848 6995698 15509475 21000654
7579 21000654 19750363 12323795 2766120 -5850269 -11947633 -12961822 -7570825 -501187
7571 -501187 740605 -4235295 -7530327 -4528987 -1137048 -4628238 -11568268 -11580150 -1772307
7562 -1772307 9015244 11323264 5502050 -917694 -2602861 -470501 1513430 813542
7554 813542 -1895266 -3671450 -2036296 2342844 5892926 5761914 2933543 956904 1805133
7545 1805133 4097200 5633736 6233176 6764096 6462613 3576964 -1273124 -5018106 -6388266
7536 -6388266 -7478231 -9259011 -8714953 -4005944 154084 -2333803 -9163141 -11003794
7528 -11003794 -3927976 5094058 7670107 3920568 -705713 -3973378 -6974061 -8618854
7520 -8618854 -6001720 323206 6185707 8908533 8684410 5238290 -2298625 -11386728
7512 -11386728 -16234992 -14087118 -8763508 -6255561 -8730597 -14009446 -18803026 -20894757
7504 -20894757 -19714222 -16504771 -13494613 -12178037 -12553497 -13425114 -12371952 -6608442
7496 -6608442 3464611 11727359 10583296 -739095 -14024645 -19725601 -15834252 -8582832
7488 -8582832 -5851689 -10816362 -20657694 -29813547 -34354188 -33791497 -29543428 -23273770
7480 -23273770 -17352754 -14656685 -15482434 -16079431 -13199892 -9220696 -9390736 -14306542 -18669458
7471 -18669458 -17768520 -11806324 -3521097 4622482 9983550 10475421 7505813 5065452
7463 5065452 4561835 3776695 1871480 1261678 3028759 5191857 7730714 13929107 23109231
7454 23109231 27516798 21983991 12568504 9275560 13026602 16258599 14262276 8981719
7446 8981719 2768145 -4148438 -9438230 -8845994 -2520497 4053489 6969532 7115494 5860083
7437 5860083 3194512 1456606 4717927 11971653 16717857 16320911 15960483 19523127 22591537
7428 22591537 19867732 14437675 13087283 16123628 18822016 20240640 22934633 25257643
7420 25257643 22145202 14285100 8868130 8828974 7959125 371152 -10400291 -16053714
7412 -16053714 -13592167 -6659883 257458 4791124 5899261 4206838 2124614 615293
7404 615293 -2606168 -8505541 -12602486 -10151769 -4200819 -2637121 -6706782 -8719400
7396 -8719400 -3805857 1972108 415815 -6024850 -7269852 -306598 6379173 5003178
7388 5003178 -885766 -2170873 3227456 8756186 8848897 4925133 1036284 -1993445 -5361669
7379 -5361669 -7895420 -6542781 -1015532 4934202 7896081 8592063 9773294 11665838
7371 11665838 11892634 9736869 7638853 7147465 5985700 1806555 -3054791 -4460233
7363 -4460233 -3336700 -4908556 -10331774 -14436162 -14513449 -15941936 -23689889 -32160968 -31097882
7354 -31097882 -20666668 -12683565 -14825490 -20606028 -19231283 -10103219 -1899377 -370720
7346 -370720 -3093479 -5322700 -5454214 -4000866 -1753887 -744072 -3707049 -10432131 -16854273
7337 -16854273 -19703510 -20086186 -20137875 -17864654 -9056487 5173311 16148727 15635165
7329 15635165 5011257 -6036449 -9819149 -7223076 -3663915 -1668973 182820 3114381
7321 3114381 6362497 8945128 10129946 8180526 1728420 -7015380 -13298392 -15078375
7313 -15078375 -14682084 -14288305 -12788809 -8988283 -5198775 -4888948 -8111329 -11406093 -11361138
7304 -11361138 -7048520 -358884 5044763 6979610 7809400 11542004 16781674 16645535
7296 16645535 8513445 -237047 -769067 5887744 11159145 10374568 6221452 2216477
7288 2216477 -834776 -1900326 267210 2881657 823976 -5337355 -8593099 -5608272
7280 -5608272 -2398505 -5980130 -14439859 -19656267 -16920456 -7756757 4032196 14323165
7272 14323165 18431081 14253321 6169022 2148722 5900219 13758542 19365426 19480901
7264 19480901 15245077 9760459 5173069 1437910 -2269027 -5396737 -6794086 -7611703
7256 -7611703 -10715485 -15895541 -18300960 -13847964 -4247607 5368989 11769177 14496846
7248 14496846 14050336 12233037 12171038 14519304 15335174 11279136 5348130 3471857 6634216
7239 6634216 10660255 12971054 14765453 16492682 16061256 12739826 8884567 6447280
7231 6447280 5010139 4178612 4551751 5332064 4273441 1085272 -2047654 -3813971 -4328119
7222 -4328119 -2396909 3204215 9238138 10313994 7281865 7337331 12909668 16702084 12387101
7213 12387101 4571423 1978979 5100377 7596547 6809162 5195680 3081328 -1793377
7205 -1793377 -7348257 -7666308 -2282383 1821042 248065 -2749256 -1806009 1102474 394230
7196 394230 -4324529 -7965492 -6899891 -2519363 1292468 1637843 -1571547 -5257166 -5671286
7187 -5671286 -2843350 -1112335 -3688242 -8498769 -11253762 -10538981 -7483599 -2540174
7179 -2540174 3955984 9233197 9934425 6660863 3558634 2844980 2468823 61113 -3391408
7170 -3391408 -5510713 -6429843 -8489878 -12229776 -14386301 -10992271 -2336768 6199206
7162 6199206 9314040 7507927 6212190 9056055 13897742 16381331 15151785 11566791
7154 11566791 6319797 -316900 -5670550 -5899805 -973295 4482339 6810698 7543799
7146 7543799 10074644 13781252 14053756 8071520 -1310764 -8105018 -8815197 -4974772 -390515
7137 -390515 3401970 8140308 15177503 22105018 24664205 21843464 17217749 14553329
7129 14553329 13837738 13163497 13097035 16326306 22459478 25730850 20331614 7588120 -4396326
7120 -4396326 -8976482 -7152107 -4353796 -2958619 -889739 2846767 5099733 3066804
7112 3066804 -749583 -1314900 1957776 3997455 322770 -7615976 -14105478 -14662970 -9225516
7103 -9225516 -1447745 3918260 3898834 -752339 -5984510 -7383244 -3425318 3514997 9155016
7094 9155016 10781772 9320751 7972594 8894948 11728563 15063094 17872036 19076277
7086 19076277 17412713 12976813 7740670 3546888 957208 904941 5068710 12565765
7078 12565765 18569722 19157103 15834610 12238209 8405653 2480874 -3609216 -5682504
7070 -5682504 -4197589 -3786079 -5002862 -2576069 5729340 14044783 15805324 11847702
7062 11847702 7329408 4467574 2437795 926947 -831594 -5532301 -13324678 -18401133
7054 -18401133 -15485228 -7955611 -3962552 -5776373 -8900863 -10862830 -13836102 -17544578
7046 -17544578 -16585242 -8059241 3337239 11492430 16021718 19440449 20951963 18088364
7038 18088364 12591734 9376594 9500231 8516026 3295967 -2752771 -3903760 30335
7030 30335 3186779 1412696 -2185847 -1567809 4002704 9221573 9840194 6628395 1459817
7021 1459817 -5840574 -13775737 -16744343 -11627358 -4354184 -3996612 -11134322 -17750250
7013 -17750250 -18495984 -15937764 -13683553 -10887741 -6665127 -4537012 -7979913 -14716788
7005 -14716788 -19311015 -19284074 -15754719 -10408988 -4929192 -1471691 -769097 -1173754 -1624802
6996 -1624802 -3493086 -7405003 -10841712 -11505957 -10387789 -8470917 -3448826 5921648
6988 5921648 14446969 14907274 7597230 752636 658850 5102656 7915096 6915707 5311106
6979 5311106 6698137 10469643 12425827 9818049 5111373 3136627 4675226 5925703
6971 5925703 5401553 7233119 14247593 21271563 20560600 12397336 4945097 3614213 5396229
6962 5396229 4527829 -499618 -6938226 -11237790 -11031461 -6712997 -2540181 -3527834 -9712014
6953 -9712014 -15628499 -16599183 -13361619 -9564714 -7335351 -6908823 -8239059 -10655547 -12235767
6944 -12235767 -11687723 -10543260 -12056329 -17606445 -24464215 -27422964 -23565018 -15872608
6936 -15872608 -10639275 -10158079 -10011825 -5818251 -334909 -6014 -5854960 -12586723 -16455502
6927 -16455502 -18635106 -19587089 -15655954 -4658499 8935136 18272737 21443141 21496585
6919 21496585 21152693 20738871 20113879 19369114 17736611 14016399 8155020 1162476 -5946214
6910 -5946214 -11843278 -14359927 -12094946 -6672546 -2242021 -2097674 -5646861 -8727541
6902 -8727541 -7618965 -3291801 -613980 -2297491 -5245596 -4888501 -1347874 1759132
6894 1759132 2989904 3318622 1756605 -3901300 -11591909 -15812515 -15419020 -15164920 -17201703
6885 -17201703 -16622463 -9108941 1748671 9097518 10979448 9577604 5939030 338007
6877 338007 -4807293 -7183659 -7753677 -7696226 -4891583 1891393 7894828 6870304 -886549
6868 -886549 -9784432 -16220551 -19412732 -17359169 -8884507 1014215 4803610 1920009
6860 1920009 -1450939 -2366715 -4036712 -7527393 -8064558 -3021255 2759137 4268544 4116030
6851 4116030 7759835 14176424 16671341 11723647 2658490 -5263468 -10073538 -12816398
6843 -12816398 -14091515 -12234401 -5460371 4121554 10458464 9829945 6013035 5952298 11006675
6834 11006675 16527666 19782536 22917112 26706362 26985387 20724633 11601921 5729733
6826 5729733 4645381 5770147 7042464 7621779 6407829 3642969 2504579 5914230
6818 5914230 12873385 20112762 25240272 25830840 18590166 3882414 -10678721 -16101524
6810 -16101524 -11478710 -3866775 1163486 4853532 10201835 15259569 14365010 5390694
6802 5390694 -6120105 -11260031 -6634177 2038497 6699468 6189757 5680379 7706502
6794 7706502 8925652 7033164 5070466 5436118 4955228 805971 -3272921 -2638341 363917
6785 363917 1028567 1340160 6106331 12395578 12626482 7979512 8230389 15836867 20292091
6776 20292091 13106527 -211851 -9069287 -11075153 -9440683 -3943921 6616192 17422843
6768 17422843 22348579 23175028 25427121 26934928 20140129 5707184 -6024228 -9330385
6760 -9330385 -9822208 -13283015 -16341112 -13946173 -9060835 -7608741 -8699548 -7725208 -5950767
6751 -5950767 -8607653 -14626328 -16741491 -12888129 -9888406 -13063617 -18637359 -20424549
6743 -20424549 -18804536 -17990619 -18097000 -15725669 -10807201 -7407610 -7676026 -9252975 -9318708
6734 -9318708 -7791025 -5670453 -3151076 -545295 1117852 1497671 1337882 850077 -760643
6725 -760643 -3754764 -7211995 -9853450 -10061487 -5957330 1982714 9065076 10576867 7899329
6716 7899329 6770788 9201253 11568944 11693919 12305248 14709611 14498333 8378456 1185719
6707 1185719 346305 5932114 11919310 15345273 17999163 20065851 18881612 14720746
6699 14720746 11792203 11930923 12464338 11890171 12419967 14707635 15163607 11508796 6522459
6690 6522459 2941847 -1199501 -8265403 -15702812 -19462132 -19959430 -20104720 -19517099 -15409497
6681 -15409497 -8018107 -774776 4310955 7653036 9214065 8604542 7797352 9866298
6673 9866298 14606673 18469202 18989797 16541145 12170392 7069885 3873757 4610230 7110531
6664 7110531 7288759 5339143 5319471 7669675 7152265 668409 -7395799 -11174253 -11064216
6655 -11064216 -11256233 -12200593 -10463002 -5108131 297257 2345463 1077003 -1804920
6647 -1804920 -5163057 -8306681 -10983291 -14003882 -17963624 -21246603 -21425403 -18686927
6639 -18686927 -15422900 -12180278 -6956176 354387 5563695 4322847 -2896945 -11584035
6631 -11584035 -17600373 -19441500 -17754586 -14616851 -12255458 -10605397 -7056860 -590573
6623 -590573 4783912 3424519 -4933862 -13873785 -16840811 -13526661 -9131320 -8720005 -13156708
6614 -13156708 -19362757 -23193742 -22300920 -17229803 -10437745 -4578194 -1433513 -1238957
6606 -1238957 -2168196 -1509365 1224768 3044854 998989 -3558612 -6192276 -4769622 -1578068
6597 -1578068 88159 -638198 -2560350 -4154726 -4418583 -3849196 -4703941 -7987019 -10396066
6588 -10396066 -7748945 -1754329 1226874 -366949 -528095 4413518 8862776 6533445
6580 6533445 1058519 309845 3331673 2469875 -2007809 115690 13270791 27309986
6572 27309986 29880700 20906969 8909228 -1236509 -9729681 -15325194 -15545439 -11934488
6564 -11934488 -8406778 -5371183 -1551011 -71982 -5165561 -12899428 -13536961 -5409153
6556 -5409153 1282954 -1385849 -7841810 -7798120 -1260677 2494655 -1421513 -8104625 -11093461
6547 -11093461 -9763868 -6859672 -3580006 28218 2814892 3565535 2923677 2476427 3070432
6538 3070432 5155610 9043775 13158063 13771111 9051181 2537212 -242244 1277336
6530 1277336 1895080 -2177964 -7890100 -9292316 -5326137 -787435 223492 -1101283
6522 -1101283 -1236350 495700 1751936 984198 -791171 -1824778 -1367532 610562 3626987
6513 3626987 5857502 4738507 14110 -4516663 -4136978 1471736 7190603 7433751 1490955
6504 1490955 -6673529 -13063213 -16786330 -18963068 -20412783 -21214481 -21104223 -18993213 -13184375
6495 -13184375 -3881442 4958045 8187866 4191149 -4054940 -12086786 -16271770 -13790142
6487 -13790142 -4030533 8405422 15120976 11430365 1409414 -6799287 -9770069 -10657588
6479 -10657588 -13299672 -17579671 -21099278 -22884888 -23875412 -24646782 -23802073 -19048908 -10450633
6470 -10450633 -2427449 -364437 -3671938 -4448970 3664596 16355454 22402733 16972325
6462 16972325 7091981 2234952 3387460 4817996 3893212 4167903 8655752 14263224
6454 14263224 15132649 9555845 1432731 -4238714 -5262276 -1913040 4613139 11706890
6446 11706890 14976338 11488879 3854105 -1493477 -1382069 940826 1366212 849526 2425339
6437 2425339 4413249 1768381 -5550226 -10694776 -8654508 -2943187 -510733 -2917692
6429 -2917692 -6149828 -7197015 -6795339 -6366763 -6023117 -5914594 -6528764 -7087429 -6330959
6420 -6330959 -5600115 -8283331 -14551895 -18914095 -15506848 -5016969 5688102 10584254
6412 10584254 9479895 6074111 3100767 736653 -1152946 -1245477 1721974 6285821
6404 6285821 8489693 5691398 -67710 -3524193 -1854058 1479159 -112235 -8612548
6396 -8612548 -17949346 -19830930 -12623117 -2565439 3720722 5227150 4185215 1258929
6388 1258929 -3420747 -6446608 -3224897 5488471 12965212 14006122 10172986 5865996
6380 5865996 2246716 -1968278 -5761159 -5937553 -2229848 862458 -1020565 -6692441
6372 -6692441 -10493024 -8646931 -3505631 -829847 -3324960 -8118040 -10947003 -11047739
6364 -11047739 -10187994 -8400337 -3929502 2448749 6318750 4294404 -2462872 -10790667
6356 -10790667 -19260049 -27312602 -32619976 -32262979 -26271118 -17975474 -10734482 -5563608
6348 -5563608 -1983916 -71152 -962126 -5033078 -9722099 -10752057 -7164225 -3744781
6340 -3744781 -5517042 -10655028 -12926732 -11263955 -11709600 -17858025 -24579859 -25255200 -21249189
6331 -21249189 -19112839 -20771262 -21701747 -17828123 -9664248 -115901 7735913 10944003
6323 10944003 8745306 4636552 3366670 5799452 9129656 11107110 10886590 7037662
6315 7037662 -941708 -9379021 -12913404 -10739400 -7063459 -5387956 -5829183 -7820359
6307 -7820359 -11291726 -14649719 -15283403 -12609681 -7536341 366463 10811903 18629044
6299 18629044 17501453 8775908 929167 -1352336 -2104440 -6107116 -11757519 -15164698
6291 -15164698 -16235321 -16566794 -15243795 -10955703 -5473506 -1522123 361847 287064 -2527546
6282 -2527546 -7007592 -9245402 -7233486 -3581499 -1137964 417237 1299704 -257098
6274 -257098 -3333961 -3047928 1616645 3927726 -1156302 -8706760 -11561142 -11548305 -14754232
6265 -14754232 -19134122 -16542353 -6090214 3878788 7919258 9275867 12023797 15154196
6257 15154196 16926537 18281307 18974635 16209350 10110770 5275273 3893363 2259490
6249 2259490 -2797759 -8565676 -10689767 -8719326 -4566322 470571 4243664 3600667
6241 3600667 -876987 -3926376 -3020651 -2795398 -7710121 -13742839 -12686728 -2854101 9374062
6232 9374062 17690091 21215038 22183125 22369047 22527687 22752345 22566175 21651272 19998223
6223 19998223 16680964 10371199 2577080 -2040990 -1312358 359864 -3000998 -10710136
6215 -10710136 -15639718 -12789793 -4688691 2515806 5981864 7772486 10826908 15067383
6207 15067383 17918895 17945283 16618168 15767325 14600974 11155961 6018621 2175611 1243607
6198 1243607 2351266 4842057 9158886 14418903 18029960 18700418 17209517 13592001
6190 13592001 6818872 -1736286 -8075426 -10382144 -10880586 -11750046 -12913816 -14980586
6182 -14980586 -19572546 -24736940 -25293792 -20607418 -16486595 -15804651 -13522286 -6190048
6174 -6190048 184220 -748404 -4160937 -928365 7497354 11151331 6930083 1866856
6166 1866856 1184369 2929156 5312115 9140241 10641925 2458110 -13441067 -23132535
6158 -23132535 -17368554 -3464839 5703116 7536071 7334432 6732908 3809680 636921
6150 636921 1119610 3060622 983408 -4074263 -5969650 -4460692 -5984939 -11917765 -14760302
6141 -14760302 -9784372 -2978719 -1906452 -4436749 -3382060 1308276 2685112 -1726019
6133 -1726019 -5940823 -4845831 -1670887 -2556011 -7684063 -12399358 -14774109 -16597232
6125 -16597232 -17184384 -12197611 -1113348 8955822 11263282 8231300 7250295 9675783
6117 9675783 10201212 6996683 5397299 8777550 11824615 7801091 -1410525 -7967484
6109 -7967484 -8486750 -6296544 -4291186 -1217622 4078886 9397074 12131325 12364151 11274430
6100 11274430 9026702 6045351 4262653 4973714 6592861 6248382 3032629 -1328288
6092 -1328288 -4299457 -4184976 -820439 4241458 8488302 10066700 8661567 4997544
6084 4997544 349513 -3360680 -4215597 -1881803 1965416 5184158 6554540 5559240 2076185
6075 2076185 -2810137 -6667901 -7776921 -7105081 -7062639 -8198734 -8154313 -4261036 3585457
6066 3585457 12967348 20842197 24578386 22244084 14027995 3781628 -2827976 -3388584
6058 -3388584 -1268863 -1602955 -5093885 -7355874 -4549525 1797677 6357329 5691833 1761545
6049 1761545 -165937 2881654 8075787 9543935 4862387 -2437249 -7468407 -9093796
6041 -9093796 -8754835 -6646948 -2604849 624321 -382242 -4123592 -5439177 -3265158
6033 -3265158 -2188218 -4303209 -4807572 475166 7607344 9693690 6560415 3802042
6025 3802042 4070482 5111362 5686697 7438736 10193122 10928856 9220842 9049880 12722612
6016 12722612 16727186 16483153 12472637 8896707 8277226 9890208 11877040 12440242 10136505
6007 10136505 5369382 1120627 487378 3736631 8649594 12867671 14952813 14393033
5999 14393033 12051001 9839717 8718914 7785815 6404585 6027077 8218653 11767309
5991 11767309 13798447 13384671 11866077 9544806 4765658 -2304865 -7310259 -6076990
5983 -6076990 -744602 1763329 -1560482 -5530649 -3573673 3302434 7780590 5547819
5975 5547819 -520426 -5475788 -7316444 -5897215 -1559127 2601364 1550146 -4662106
5967 -4662106 -8375173 -3662114 4757947 7670219 4323139 2520799 6366153 11059965
5959 11059965 11111523 7016864 1299335 -5903629 -13575720 -17333456 -14806175 -9798150
5951 -9798150 -6720162 -4197353 931518 5945854 4447717 -4232435 -12812774 -14211936
5943 -14211936 -8703487 -2080534 854520 -72173 -1762839 -1685802 -175875 1297155 3192202
5934 3192202 6932354 10814516 10123948 2914683 -6952619 -14179039 -16711128 -14587211
5926 -14587211 -8076792 -91930 3296737 -587031 -6218502 -6234494 -978405 2900670
5918 2900670 2017577 -638420 -1559062 -401859 2637394 8126894 14488934 17686978 15732591
5909 15732591 10924047 6538641 3755935 2455313 2394529 2944249 3988963 7075084 12885789
5900 12885789 17981395 17793032 12928745 8292711 5453514 804797 -7126550 -13695115
5892 -13695115 -14520036 -11636901 -9630488 -9113642 -8136745 -7253270 -8487545 -10831925 -11272972
5883 -11272972 -9606865 -8115121 -6663621 -2262403 5697664 13319475 16893499 17185406
5875 17185406 17308683 18211259 18312169 16627787 14143296 11961106 9701249 6679151 3832639
5866 3832639 3020628 4230213 4915789 3148886 389220 -354545 1614257 4528838 7420433
5857 7420433 11068344 15252741 17523211 16101404 12366427 9050468 7254187 6603303
5849 6603303 7075801 8760163 10222210 8882756 3545110 -4142030 -11078006 -15298762
5841 -15298762 -16939780 -16770586 -14702340 -11018347 -8567391 -10911880 -16940151 -20193256
5833 -20193256 -16487168 -9985271 -7718366 -9608574 -9053017 -3212183 3066065 5203673
5825 5203673 5344592 7645720 11351503 12610436 10502999 7411505 5008394 2973890
5817 2973890 407282 -3847645 -10650227 -18153819 -21896596 -19573723 -13714648 -7623004
5809 -7623004 -1517490 4715063 8557241 8831946 9594940 14787139 20907856 20714723 13412285
5800 13412285 5443737 1138463 -1529044 -4677958 -5875469 -2842799 1280339 1090635
5792 1090635 -4587965 -11966477 -16761279 -17585592 -15944097 -14363929 -14194548 -14784595 -14959097
5783 -14959097 -14354124 -12342681 -7513573 -607548 3813508 2172100 -2801751 -5624899
5775 -5624899 -6081758 -8686788 -14159949 -17378549 -15606394 -13100448 -14272311 -17029868
5767 -17029868 -17105343 -15323947 -15810232 -19305544 -22897165 -25037894 -26530788 -27066420 -24573036
5758 -24573036 -18201996 -9326690 162028 8210118 12110785 10749547 7163947 5869235
5750 5869235 7285757 7436812 3633537 -2211495 -6950670 -10432973 -14484817 -19018390
5742 -19018390 -21320536 -19382281 -14674380 -10713930 -8948550 -6993194 -2014937 4440143
5734 4440143 6907836 2459791 -4686712 -7154973 -2969156 1866195 523812 -5979221
5726 -5979221 -9287426 -3562245 6829091 11744315 7013219 -1320949 -5553102 -5434105
5718 -5434105 -5566317 -6912893 -6356231 -3565026 -2101281 -2836937 -2201948 939145 2486386
5709 2486386 508392 -149082 4420855 9479924 7823360 585773 -4725637 -5222495 -4834096
5700 -4834096 -5938984 -5599334 -1414407 4564615 9754976 14284922 18303272 20046079
5692 20046079 18698718 15896789 12753455 8748834 5003120 4697638 7950797 9931001
5684 9931001 7032215 2075331 330509 2546800 4739732 3213449 -2462908 -9720053
5676 -9720053 -14294979 -13341406 -9130415 -7320777 -9730230 -11868438 -9965692 -6576756
5668 -6576756 -5349958 -3959899 2081221 10719989 14739113 11369088 4753286 -1286767
5660 -1286767 -6914954 -11546867 -11668970 -6424146 -487185 2278475 4140199 8646854
5652 8646854 14029846 16257628 16214512 18196119 21835833 21141969 13191301 3634211 706936
5643 706936 5815798 12588107 14340041 10280447 4378033 158317 -1965181 -3017837
5635 -3017837 -3409495 -3767453 -6183382 -11940373 -18088161 -19201153 -13770870 -6559783 -3102474
5626 -3102474 -4082857 -6899311 -10039444 -12816682 -13073301 -9527561 -5567664 -6163720 -10655220
5617 -10655220 -12874629 -9631580 -5220208 -5641864 -11512018 -18583709 -22338477 -20129918
5609 -20129918 -12032917 -2307769 2778562 1670055 -370317 1027961 2471618 -1743025
5601 -1743025 -9358664 -11291410 -3406546 7932173 13618460 11083339 3995616 -3635310
5593 -3635310 -10179854 -15323285 -19003071 -20823852 -19484485 -13975393 -6085090 17117
5585 17117 1921753 1384597 1626835 3603273 5956617 7435958 8340998 10271875 14506685
5576 14506685 19390870 19991774 13127594 2926643 -2104437 1047441 6239966 6404308
5568 6404308 2103747 -1179284 -1329331 -797510 -1046749 -675444 507229 -362345 -5155688
5559 -5155688 -11267844 -14094908 -11999358 -7575906 -4348221 -2942134 -858745 3724400
5551 3724400 8539440 9250301 5143575 538416 -803230 -363774 -1621681 -3986296 -3303787
5542 -3303787 2076939 8769266 12181785 10624220 5352019 -1312036 -7243105 -11422460
5534 -11422460 -14175588 -15765873 -15138545 -11263738 -5266332 134320 2937160 2607746
5526 2607746 -476657 -4931261 -8843391 -11831295 -15077049 -17620835 -15201252 -6142196
5518 -6142196 3773747 7022330 4060527 2312149 5385747 8736601 7558451 3857988
5510 3857988 2761219 5635503 10127272 14189490 16914963 17467895 15978819 13866318
5502 13866318 11293868 6683596 1033748 -412369 5252615 12503586 12832822 6002506
5494 6002506 1106802 5083232 13997830 18305432 14335205 7270369 3371396 2626139
5486 2626139 685026 -4059196 -8510313 -10143744 -11029615 -14332583 -18825457 -20209284
5478 -20209284 -17377287 -14040710 -13610443 -15410964 -17081669 -18164780 -19654297 -21722553
5470 -21722553 -23405868 -23499067 -21125660 -16814087 -13263442 -12958262 -14410929 -13070523 -7033785
5461 -7033785 168552 3545312 1609398 -3272540 -7281535 -7156480 -2323088 3756338
5453 3756338 6334900 4190806 -239337 -5067495 -9798150 -12199059 -9310091 -2743470
5445 -2743470 2130759 4022614 7128403 12388648 14174909 10021117 6613085 9316314
5437 9316314 11741956 4574510 -9174042 -17632970 -17136475 -15752161 -19176340 -22756830
5429 -22756830 -20607443 -14835357 -11244101 -11002208 -10482247 -6088230 2918156 13263067
5421 13263067 18621796 15849607 10444628 10431820 14465213 12976987 2884842 -6830643
5413 -6830643 -8263629 -5685438 -7319841 -12219005 -13144969 -8562420 -3483163 -154781
5405 -154781 4194667 10306088 14503748 14639120 12938370 11463449 9610256 7914838 9697476
5396 9697476 15992839 22170974 22784113 17678949 10566384 3507536 -3704053 -9622163
5388 -9622163 -10774785 -6484509 -992142 1616814 2567733 5336893 8700180 7369339
5380 7369339 447601 -5396434 -4200935 1465806 5033684 5445944 6946030 10916577
5372 10916577 13706015 12533902 8281358 2190353 -4686865 -8245969 -3985111 5196430
5364 5196430 10189081 7469800 3427297 3408783 3467798 -1218070 -5972753 -2662565 7593757
5355 7593757 15840100 17415829 15060478 11147904 4815987 -2705611 -7254218 -7975941
5347 -7975941 -8447652 -9844970 -8654502 -3373485 1853166 3192873 2186830 1616493 161485
5338 161485 -5059226 -13120076 -19813754 -22013433 -19263501 -12893526 -5806161 -1340862
5330 -1340862 62979 1663568 5669588 9182315 7704978 2088031 -1114629 2682069
5322 2682069 9823987 11633325 3926872 -7949732 -14623033 -12551653 -6649395 -3248677
5314 -3248677 -3364894 -4415628 -5539416 -7744935 -10293632 -10666654 -7835376 -2638057 4471159
5305 4471159 12747957 18732752 18455407 12651700 6434099 3112023 1458709 -465360
5297 -465360 -2402691 -3767067 -4804456 -4453768 -433778 6732785 12714098 14145807 11757739
5288 11757739 7371548 1061104 -6595329 -12502101 -14071875 -12309152 -9841010 -7944987
5280 -7944987 -7264859 -8860440 -12172041 -14140110 -12767587 -9777957 -7815319 -7117892 -6859109
5271 -6859109 -7222292 -7708291 -5828925 -310654 6340661 10977716 13467357 14899269 14726162
5262 14726162 12458389 9466678 5929216 -957700 -11686715 -20361754 -21092673 -16371648
5254 -16371648 -13498407 -14203131 -14044049 -11351360 -9597226 -9791612 -7612824 -1174190 4196723
5245 4196723 3160786 -1834476 -4351039 -2624427 -211226 -88484 -2335440 -6584505
5237 -6584505 -12728610 -19022773 -22456172 -21704488 -18099459 -13670979 -9696870 -6981461
5229 -6981461 -6053548 -6977486 -9728797 -14107084 -18327142 -19003400 -14635538 -8488839 -5446711
5220 -5446711 -5659413 -3798397 4064288 14666663 20510140 17679528 8981780 25206
5212 25206 -5572221 -7118514 -5829542 -4464232 -6028929 -10516446 -13773853 -11801255 -5813435
5203 -5813435 -1031943 -819809 -4277023 -9315352 -14974727 -19842517 -21168710 -17571018
5195 -17571018 -11086877 -5234474 -2277661 -2708236 -5139456 -6141475 -3045955 2124655
5187 2124655 4695140 4247334 5212257 8795189 9841946 5679551 2560188 7000696 14772169
5178 14772169 16183884 10087864 4526230 4198456 5568023 5116570 4291788 4183336 2899529
5169 2899529 1183986 3383749 8994896 10164164 2565719 -7289697 -11150795 -9970788
5161 -9970788 -9546408 -10187326 -8307533 -5107201 -5733628 -10962450 -16478675 -19705790 -21159660
5152 -21159660 -19811707 -13738552 -5484675 -424096 754009 1668615 1751179 -4483713 -17030560
5143 -17030560 -26250572 -23967321 -13941578 -6333337 -5278472 -7042721 -7888484 -8076558
5135 -8076558 -8642997 -9078912 -9060486 -9257406 -9591231 -9098204 -8210866 -9046145 -12376169 -15732225
5125 -15732225 -15680904 -11537655 -6327480 -4267181 -7223990 -13174114 -18040853 -19140924
5117 -19140924 -16660296 -12130323 -6851367 -2484913 -1577023 -5299759 -10867685 -13506628
5109 -13506628 -12100203 -11176775 -15237231 -21914228 -23721938 -17574199 -9680682 -8022275
5101 -8022275 -11509615 -10865271 -887617 12321833 18756472 15827815 8778253 2234001
5093 2234001 -3680830 -9065719 -11176301 -7953250 -1718045 3204763 5185744 5791580
5085 5791580 6743340 8357574 10665305 14208782 18842306 22381679 21726716 16307576 10037646
5076 10037646 8197249 11715883 16009463 16355803 12568164 6998666 531280 -6407701
5068 -6407701 -10867230 -9759258 -4867232 -1339017 -794624 148776 3813540 8215301 11391421
5059 11391421 14591820 18464057 19995576 17164978 13879107 15596757 20948538 22030176
5051 22030176 13848912 808493 -7346486 -4911237 4833208 13358160 15388388 13391689
5043 13391689 12779405 13677160 10653279 1307447 -8721940 -12068763 -8207442 -2353787
5035 -2353787 2130790 6108859 10199532 12237477 10328649 5825590 2021556 1248425
5027 1248425 3688736 7670740 10614663 10609492 7655364 3595832 1356534 3563560 9721030
5018 9721030 14613411 12625869 4936814 -964786 -997480 249732 -2454475 -5789929 -2686855
5009 -2686855 5961849 11550016 10012937 7251175 10226790 17850862 23486049 22526997
5001 22526997 14879615 3614099 -5724841 -7511618 -1440988 5966280 8048799 5034187
4993 5034187 2302602 3219664 6223140 7923645 6424229 1901013 -3761630 -7570407
4985 -7570407 -7324920 -3701658 180294 1787513 1812048 3710346 10197375 19820369 27463430
4976 27463430 28775231 23675752 15508300 8388717 5956493 9849335 16885364 20104979
4968 20104979 16192572 10332561 9785819 13949786 15533336 11022652 4586041 1032991
4960 1032991 403224 1164868 3463708 6476373 7050862 4221231 1503471 1646047 2342590
4951 2342590 252332 -3602577 -5541043 -3958386 216223 5411396 9517985 10735330
4943 10735330 10512733 12905344 18957123 24760180 27026904 26949367 26239949 23410411 16998142
4934 16998142 8793617 1015506 -5855128 -9985343 -8041252 -1408883 3129901 3134007 4715560
4925 4715560 11684148 17286505 14354455 7777880 7594816 13855411 18172465 17452738 15954416
4916 15954416 15289282 12607659 8573283 7583223 9371794 9028517 6069091 5321110 8297288
4907 8297288 11695890 14465740 17815504 18483898 11822992 2271519 511069 8405414
4899 8405414 16481167 17999741 15375070 11077816 3787711 -3302961 -2132643 7695238
4891 7695238 16515594 18632835 17906502 16216119 9335503 -1222106 -6147824 -3654017
4883 -3654017 -2356476 -3480340 2450222 14254672 16562409 8416294 11055993 30970673
4875 30970673 43888212 42929473 73201065 172341951 290773906 325919293 243760605
4868 243760605 120504989 47313251 34975454 36907327 27640385 18871343 18874588 18206319
4860 18206319 13245842 13092728 20041149 24863916 24063834 24487985 28770461 30862658 27685927
4851 27685927 22774963 17865924 12426422 10752656 17185253 24801817 21919409 10500248
4843 10500248 5071579 11602784 20430350 23184139 23655373 26566860 27618847 22451065
4835 22451065 16233271 15842312 18946851 18705110 14564330 11158331 9810251 7751124
4827 7751124 3984020 634259 -595035 348809 2986467 5806297 6175210 3371234 282571
4818 282571 -164205 1100137 831613 -2466545 -7514992 -11712936 -12301111 -7971824 -1111477
4809 -1111477 2914225 476584 -6760660 -13604001 -15894275 -13322828 -9118154 -7266636
4801 -7266636 -9038800 -12337340 -15027036 -17390605 -19743754 -19867811 -15992721 -10683467
4793 -10683467 -7748451 -6217994 -1905306 5216505 10060615 9774466 7522175 7144121
4785 7144121 7828529 6434432 2517650 -1026824 -873923 3867308 10056354 12144620 7922275
4776 7922275 2018718 401731 2178105 1208192 -4469005 -10117503 -11876983 -11202866 -9942216
4767 -9942216 -6575337 -431210 5097945 7209274 7829558 9661154 11537926 11338946 10419148
4758 10419148 11057134 11574337 7865935 -1138902 -12073174 -20109160 -21795070 -16875038
4750 -16875038 -8975647 -2532657 2156503 8303485 16181846 20972070 18861991 11765406
4742 11765406 4023899 -1890813 -4512474 -2770880 922146 1341464 -2685266 -6451851
4734 -6451851 -7367036 -9257157 -14534835 -18176869 -15599392 -11095519 -10946650 -12571980 -9104862
4725 -9104862 -1565244 2979374 3776206 6965796 13438246 15791292 9901806 1355588
4717 1355588 -3105762 -3820851 -4187575 -4116088 -1665624 2716123 6894293 9069579 7439407
4708 7439407 1476790 -5151773 -7173076 -4612651 -2646171 -3347070 -2998767 423740 3128447
4699 3128447 2124049 173586 -166666 -2029326 -8133856 -13548074 -11344876 -3294462
4691 -3294462 1657870 -836282 -5857385 -6911970 -3636985 -171231 926185 711873
4683 711873 839082 481572 -2505418 -7379868 -9667223 -6879585 -3296518 -4825943 -9852474
4674 -9852474 -10850477 -5897921 -1973326 -3855841 -6316654 -2510417 5165669 8983858
4666 8983858 6906704 3061671 -30436 -2808625 -4175051 -2837390 -2195255 -6588504
4658 -6588504 -12780094 -12736006 -5838900 -482074 -1054507 -1326898 4334371 9958676 5534815
4649 5534815 -7898505 -18367244 -17917258 -11297454 -8064696 -10567418 -13085484 -10950793
4641 -10950793 -6699289 -5948053 -9357358 -11703560 -9110996 -4027802 -1142693 -1285493
4633 -1285493 -2596344 -5054307 -8874961 -10042044 -4049986 5311594 7917660 909964
4625 909964 -6063051 -3848689 3488771 5381587 269116 -3544410 -1220962 2597738
4617 2597738 2422270 -711193 -3835065 -8115042 -15258533 -21590970 -21633224 -16552472 -13830719
4608 -13830719 -17700340 -23852534 -25458199 -21706790 -17854308 -17968514 -20069283 -18869631
4600 -18869631 -12124786 -3443341 1288054 84839 -3202695 -3868614 -2430095 -3516531
4592 -3516531 -8376729 -11657393 -8239266 -940707 2816344 1321464 610984 5148813
4584 5148813 11592056 14753171 15048093 15287715 13945712 8404021 3063815 6060454 16561273
4575 16561273 22939497 17400954 6266814 423335 492002 -1428568 -7931670 -12415027
4567 -12415027 -9811311 -4200072 -2472655 -5123336 -7455681 -7261531 -6963741 -8720969
4559 -8720969 -10980158 -10921775 -8392887 -5973398 -5578641 -6003473 -4336161 353499 5381868
4550 5381868 6873632 3347667 -3416646 -10071723 -13243252 -10567898 -2574018 6115595
4542 6115595 9421961 4938876 -4080711 -12017747 -15206513 -13206935 -7957098 -2855156
4534 -2855156 -1098070 -3134834 -6305614 -8172166 -9459293 -12383324 -16896481 -20528363
4526 -20528363 -21802558 -21738409 -21323003 -19334289 -14194081 -7111300 -1730879 -576477 -2920437
4517 -2920437 -6389919 -9585786 -12305808 -13924404 -13119473 -9785707 -6145652 -4630737
4509 -4630737 -4868803 -4226460 -1770208 -108643 -1898813 -5698351 -7649168 -7131230 -7770271
4500 -7770271 -11326648 -13306995 -8138100 2083438 8015392 3634659 -6555497 -13122571
4492 -13122571 -12304246 -7982296 -4457696 -1436204 2898132 7345263 8911896 7143904
4484 7143904 4783372 4250611 5031322 4700811 1605346 -3542317 -8138992 -9853278 -8767746
4475 -8767746 -7212862 -7320919 -9313117 -12338586 -15789146 -18869321 -19885230 -17423218
4467 -17423218 -12004240 -5610848 73740 4161027 6111804 6217627 6080378 7001251 7870118
4458 7870118 6066725 704616 -6061067 -10976466 -12006745 -9240565 -5147424 -3673953
4450 -3673953 -6827007 -11555747 -12134568 -6835622 -524865 875242 -2801822 -6324465
4442 -6324465 -5247844 76939 6119795 9751614 9877906 7141174 3172511 -185134
4434 -185134 -1707739 -1390125 -469481 -487772 -1519052 -1326779 2585880 9530831 15235902
4425 15235902 15767172 11162045 4391978 -2299425 -8567186 -13960544 -16662557 -15141469
4417 -15141469 -10411241 -5857183 -4511059 -6229207 -7476633 -4404048 3361877 12097576
4409 12097576 17215760 16742194 11845145 5337138 399804 -594134 2253227 6132367
4401 6132367 8265653 8750444 9535593 10889212 10593973 7092489 1893398 -2222587 -4426266
4392 -4426266 -5954357 -7440353 -7711545 -5726314 -2386630 871128 4554479 10230397
4384 10230397 16996114 21206780 21163354 19870477 20517704 20985144 16827366 9195692 4873792
4375 4873792 7077379 11027821 11544155 10520773 12237743 14766323 12483234 6026174
4367 6026174 2971567 7139087 12728889 11985173 4902983 -1769572 -2556964 2646328 10521696
4358 10521696 17271407 20360781 19750777 17641747 16231477 16091083 16608637 16422540 13404885
4349 13404885 6826164 322805 -440558 4958333 9678007 7830209 2503012 1861563
4341 1861563 8287742 15254344 15267685 7780143 -1681053 -7828929 -9726003 -10010228 -11334160
4332 -11334160 -13469845 -13956739 -11680511 -8526361 -6328255 -3719811 1541854 7843972
4324 7843972 10343657 6861572 600390 -4061845 -6210533 -7224347 -6950374 -3737791
4316 -3737791 2050553 6924081 7613696 4525363 1168507 889704 4781120 11699870 18602605
4307 18602605 21171396 16713095 7922085 1848356 2786073 7350353 9215153 7553358
4299 7553358 6889983 8773029 8715168 3628991 -2220541 -2755501 1245705 3628335 1775036
4290 1775036 -341007 1989372 8848729 16616856 21437352 21356115 17477307 13484970 12131668
4281 12131668 12236206 11014528 8672521 7951387 9496906 10930673 10826569 10317325 9818789
4272 9818789 7333990 1810341 -4099776 -6672831 -5439088 -3651074 -5025946 -10149116
4264 -10149116 -15189404 -14857212 -8395281 -1667772 -578054 -3255609 -2541609 3970758
4256 3970758 11020104 13691535 13192012 12156176 9250765 2885239 -3364237 -4629506
4248 -4629506 -2414853 -2864826 -7437585 -10501029 -7763077 -2725107 -1577066 -4258047
4240 -4258047 -4681361 280147 5785531 5246153 -454571 -3482977 983681 8776764 12599512
4231 12599512 10956370 8139889 7506629 8831866 11135939 13456551 12928270 7001774
4223 7001774 -1404288 -5489654 -2880834 1817714 4422340 6533809 10979260 16355541
4215 16355541 19637296 20645153 20328879 17909006 13615489 11282717 13921585 19018376
4207 19018376 22413334 24722583 29401934 35908339 39332807 36421468 28664304 20251277
4199 20251277 15732773 17934595 24741285 29506034 28100430 23984795 23051659 25664807
4191 25664807 27600886 26440108 22660057 16961226 11514270 11095001 16806886 21052663
4183 21052663 16128473 6416093 3672792 10128983 15199352 11068898 2987502 89516
4175 89516 3247021 7255414 9561944 11188666 12606607 13612100 14774786 15241401 11753698
4166 11753698 3444881 -4864415 -7721630 -5416367 -2205948 -201351 1664920 3999299
4158 3999299 5586465 5491749 4582800 4937505 8197230 13648919 17987927 18498868 16186042
4149 16186042 13879615 12111399 9653195 7227245 7048844 9106223 11580917 14506052
4141 14506052 19256103 25188330 30676423 36061168 41525805 44948998 47147789 54810507
4133 54810507 70745098 87062350 98522866 114021497 135799852 133331265 67970274
4126 67970274 -48119344 -146130156 -172497892 -145645206 -120283054 -115854024 -109901724
4119 -109901724 -88530717 -66227205 -54736764 -45182011 -30668369 -21212598 -24082554
4112 -24082554 -29313441 -27202299 -23686480 -26384473 -30242501 -29311105 -29136152 -34316296
4104 -34316296 -35951898 -25717365 -12313234 -9239326 -14389482 -16557811 -15329388 -18774389
4096 -18774389 -25834579 -27029427 -21385476 -18156428 -21112113 -23905588 -22588850 -21083218
4088 -21083218 -21600709 -19918189 -13745789 -7446152 -4917585 -4631753 -4677643 -6553685 -11083088
4079 -11083088 -15744654 -18444788 -19635069 -19409918 -17018348 -14188691 -14311265 -17416923
4071 -17416923 -20174204 -20960246 -20355980 -17237840 -10274183 -3260421 -2313592 -6708211 -9040002
4062 -9040002 -6169796 -3413652 -5290786 -8480203 -7767635 -3838244 -933822 -524697 -1212455
4053 -1212455 -2316837 -4502003 -8551837 -14865085 -21999209 -25786558 -23679990 -19837837
4045 -19837837 -20698099 -25052877 -24906417 -17831006 -11320353 -11533942 -14850105 -15623230 -15701251
4036 -15701251 -19245013 -22942436 -19538145 -9069352 511600 3284949 379934 -4118309
4028 -4118309 -6945054 -5851146 -1160185 2771206 2034295 -942918 -232595 4960823 9069085
4019 9069085 8103749 4252548 963380 -2561278 -9141349 -18018899 -24270674 -23781276 -17694036
4010 -17694036 -11388004 -8687094 -7591251 -3370180 4286849 10204075 10770385 8403851
4002 8403851 6713288 5050219 1483287 -2339444 -4038710 -5306503 -8351342 -9937798
3994 -9937798 -5519483 2054706 5334071 3805515 4886681 11696713 17454064 15542062
3986 15542062 8548344 2820341 -199708 -1850308 -507378 5239437 10606295 8765059
3978 8765059 150475 -8085601 -11558971 -12262604 -12636893 -11661991 -8486838 -5195992 -3288203
3969 -3288203 -932339 3125353 5459488 1604715 -6942951 -12884415 -11152127 -4439777
3961 -4439777 734459 1740028 1242058 1575604 995145 -2930531 -8626596 -11968378 -11323197
3952 -11323197 -8499133 -5551479 -3633968 -4169525 -7120795 -8154633 -2485694 6998935
3944 6998935 10491469 3059858 -8690125 -15332435 -15687973 -14410033 -12545095 -7347346
3936 -7347346 215420 4906200 4681329 2867555 1764272 -817290 -7095832 -15723602
3928 -15723602 -23967467 -29508594 -29461804 -22653864 -14157912 -11846534 -15939560 -17709405
3920 -17709405 -12090525 -5602384 -6282837 -10845234 -9318438 116252 8654275 8992458
3912 8992458 3291346 -1858086 -2706053 988978 7543486 13218224 14290441 11652217
3904 11652217 10467998 13311429 16458390 15132266 9859447 5064911 3282424 3587238
3896 3587238 4835710 7662971 12670378 18044128 20224255 17586199 13187021 12056046
3888 12056046 14560920 14626962 7361767 -3309911 -8887161 -7494139 -5562689 -7414626
3880 -7414626 -8929501 -4672051 3522395 9479003 10687985 8665610 4181047 -2390848
3872 -2390848 -7642515 -7965010 -5625934 -6635820 -12046450 -16537959 -16675424 -15113918 -14418342
3863 -14418342 -12165159 -6154674 -188713 604117 -2143399 -1902091 3621937 9894483
3855 9894483 11980892 9259655 3518553 -2987263 -6397489 -3038519 4886291 9489348
3847 9489348 6766802 2447027 3531544 7048530 4050817 -6045759 -13081847 -10344154
3839 -10344154 -3779534 -2359780 -5491622 -6966581 -7022793 -11471181 -20021892 -24689205
3831 -24689205 -21481711 -15567279 -11702286 -7288067 -56747 4217386 -782595 -10864819
3823 -10864819 -15789832 -12965957 -9242208 -9582453 -11222765 -10083519 -6483038 -2340996
3815 -2340996 2033209 6056311 8302602 9909742 14019354 19567237 20601880 15146324
3807 15146324 10006213 12069670 18386911 20196166 14487214 6178151 226305 -2785576
3799 -2785576 -3420928 -1392715 1720761 2125708 -1635505 -6649927 -9756298 -11007856 -11452956
3790 -11452956 -10377931 -7349312 -5017734 -6763056 -11955082 -15922424 -14957810 -9961790
3782 -9961790 -4934167 -3048333 -4648434 -8183963 -12069718 -15369682 -17230752 -16767293
3774 -16767293 -14263487 -11893323 -11903666 -13790550 -14343187 -11172527 -5494840 -581032 2133449
3765 2133449 4282290 7665193 11149362 11738089 8792940 5761056 6399566 9974112 12084179
3756 12084179 10399832 7496783 6990752 8793874 9951195 8648681 5179779 150312
3748 150312 -5500071 -9366905 -9730428 -8936348 -11199930 -16298093 -19236086 -17909037 -16955910
3739 -16955910 -20548231 -24956302 -23628037 -17809789 -15707592 -20558497 -25788616 -24631934
3731 -24631934 -19155061 -15509533 -14523599 -12742149 -10215028 -10402799 -12485751 -10575179
3723 -10575179 -2861100 3993594 3302965 -2785532 -7110294 -7247539 -6647649 -7749675 -9229410
3714 -9229410 -10075099 -11520732 -13591995 -13668236 -10489393 -6539889 -4165256 -1797990 3211259
3705 3211259 9568929 12718898 10167156 4030559 -1694829 -4903430 -6389277 -8135164
3697 -8135164 -10608672 -11435884 -7717918 -413068 5141433 4999502 1866610 1891152 6211340
3688 6211340 8813719 4439097 -3798180 -7627426 -3584603 3554536 7929163 9812202
3680 9812202 13122615 18079780 20532493 18484101 15089866 13611518 12965025 10807753
3672 10807753 7961264 6324595 4864237 1961313 80051 3029829 8933855 11039872
3664 11039872 6251223 -1769953 -8765043 -13921781 -16228315 -12767536 -4298128 2371189
3656 2371189 2249532 -1163824 -1627714 781969 1609935 318539 569686 3327718 5363051
3647 5363051 4550873 1926550 -1357172 -4597025 -5462182 -2337903 1207031 -474428 -6817051
3638 -6817051 -10951382 -9045498 -4727169 -2655916 -2754307 -2995736 -3068073 -2600960 -319448
3629 -319448 2161303 447265 -5177673 -7287383 -1183137 6936973 7646581 1141890 -4258700
3620 -4258700 -4776707 -4861618 -7691311 -9323986 -5676749 -205989 -9420 -6598045 -14493362
3611 -14493362 -18271363 -17999833 -17492103 -19259468 -22101686 -22968241 -20569275 -16964115 -15249596
3602 -15249596 -15543325 -13964856 -6674049 4838828 13549149 13288492 5259138 -3169816
3594 -3169816 -6351761 -5182198 -3314680 -1431481 1898873 5680133 6925448 5217125
3586 5217125 2927216 847213 -2252153 -5257489 -4773736 -1169673 386258 -2243451
3578 -2243451 -3888216 512116 8034565 11749562 9505820 4224486 -1540436 -5873332
3570 -5873332 -4745215 4247390 15550441 19157184 11797824 281668 -7168226 -8675577
3562 -8675577 -6896175 -3986669 -696458 2444683 5183655 7368709 8162115 7084820
3554 7084820 5606975 5585856 6687361 7588987 8404410 9078201 7582278 3965423 3679927
3545 3679927 10599882 18389813 16902094 7389934 2401424 8204079 16481403 18027619
3537 18027619 15782488 17089604 20336486 18652569 12587306 9541578 12277330 16420947
3529 16420947 18838468 20724496 21880200 19002319 11325705 2488130 -4697360 -10644227
3521 -10644227 -15087320 -15428146 -10607031 -3148938 3570411 7176492 5964869 842031
3513 842031 -2892199 -547019 5303069 8213316 7379827 7291944 7894743 3544899 -5659342
3504 -5659342 -10256677 -4611509 3460209 3461366 -2566647 -3644533 4339844 14385392 18696314
3495 18696314 15933270 8300664 -1584033 -9401736 -10401161 -4545006 2866948 6950043
3487 6950043 6815773 3569949 -1001514 -2981012 1870430 12549047 22104719 24512809
3479 24512809 20035493 12806794 6201824 2080228 1219066 1828937 -40635 -5900711
3471 -5900711 -12067156 -13690224 -10365761 -5969865 -4182835 -5925101 -9967721 -14030949
3463 -14030949 -15811832 -14423500 -10644598 -5456249 379705 4925351 5488335 1843780
3455 1843780 -2828482 -5735203 -7290980 -8562239 -8393868 -5866319 -3681252 -5504999
3447 -5504999 -10630028 -14594957 -15075169 -14243993 -15010722 -17525927 -19953193 -20532540 -18442432
3438 -18442432 -14649043 -12229473 -13673270 -17267208 -18217124 -14203095 -8116010 -4479479
3430 -4479479 -4609446 -5965861 -5015873 -377185 5587678 8288657 5573752 680960 -1347615
3421 -1347615 342839 2709394 4517757 7626404 11798087 12868809 8616801 2610689
3413 2610689 -1010382 -3201506 -6564688 -9268651 -7486486 -2300711 1080892 626357
3405 626357 -838817 -1306770 -1941665 -2869928 -1705872 1502640 2188534 -2759876 -9999486
3396 -9999486 -13694771 -12042805 -7170223 -1130889 4701791 8350870 9013048 8783432 9245372
3387 9245372 7893360 2097971 -4451974 -4470442 3177607 11389268 14109050 12944204 11852649
3378 11852649 10127213 5617505 1646633 4072166 11681343 15667083 10757889 2302287
3370 2302287 -755022 3343934 8926534 11136635 10322356 8959425 8163079 7979949 8299688
3361 8299688 8368288 7269371 5553178 4630758 4274422 3054300 1817432 3750133 9356000
3352 9356000 14272423 14765770 13106405 14062132 17604067 19168783 16664007 12761116 9406370
3343 9406370 4485703 -3549158 -11055707 -12738851 -8347527 -2843277 -582679 -1724056
3335 -1724056 -3741436 -4038457 -1415537 2637184 4335306 1907101 -625610 2559548
3327 2559548 10349035 13880213 7366568 -3274841 -6884903 -597268 8073108 12487915
3319 12487915 14208629 16561105 16651662 9688253 -1539718 -8391415 -7729902 -5385761
3311 -5385761 -6558839 -8540017 -6508479 -1811768 543580 -384430 -1654403 -2498426 -4482278
3302 -4482278 -6310540 -4535155 -330588 141404 -5664837 -12538087 -14739615 -12994392
3294 -12994392 -10818104 -7972810 -2444981 3617363 5272350 1381665 -4491946 -9470161
3286 -9470161 -13642376 -16973970 -18037511 -16795137 -15276619 -14240539 -12036103 -8188372
3278 -8188372 -5528785 -6919157 -11603481 -16382210 -19050437 -19413189 -18194575 -16268489
3270 -16268489 -14193932 -11749953 -8659731 -5801238 -4212650 -2870082 304303 4614243
3262 4614243 6365672 3897309 405194 -309282 1204748 1960034 1775269 3404324 7945554
3253 7945554 13012707 15580536 14351860 9393990 2024987 -4628554 -7762585 -8691573
3245 -8691573 -12029963 -19338837 -25607244 -24525301 -16290013 -7607708 -3944838 -4177183
3237 -4177183 -3949200 -2455377 -3608448 -10502551 -20601235 -27640777 -27598087 -21629610 -13644739
3228 -13644739 -6702631 -2005548 612750 2672087 6287930 11732976 16436339 17952583
3220 17952583 17175134 16698936 16623146 14506333 9562943 4197915 580380 -1684030 -3080694
3211 -3080694 -1982522 2665734 8118578 10014832 7195972 2202084 -2503641 -6633605
3203 -6633605 -10615452 -14104445 -16132206 -15252303 -9887024 -489720 8776288 12826223
3195 12826223 10702269 6115944 2741878 1100735 511760 1310409 3417965 4907917
3187 4907917 4391710 3571994 4912295 7253236 6332823 344906 -6899766 -9834159 -7487522
3178 -7487522 -4444559 -5111611 -8505806 -10413946 -9855449 -10197067 -12888935 -13911275 -9814613
3169 -9814613 -4238256 -3126103 -5024470 -2848100 4191468 7863220 3208347 -3308067
3161 -3308067 -3124283 2525764 6525617 7215439 7993679 8442535 4798575 -1074764 -1829858
3152 -1829858 4592051 11629948 13665874 12075812 9274086 3991868 -3463211 -7911644
3144 -7911644 -6679700 -4881494 -7432466 -10449325 -7355709 41501 4170959 3435381
3136 3435381 3498260 6986259 9433553 7291716 3725815 3328048 5472580 6334739 4820549
3127 4820549 3477421 4715813 7877932 9411632 5737801 -2587626 -9712678 -9736677 -3425748
3118 -3425748 2554284 3483982 1215597 211311 1463331 1981714 -1010418 -6674329 -10890162
3109 -10890162 -9875379 -4159511 1652073 4203702 5246950 8188310 12268003 13476464
3101 13476464 10604973 6516904 3127253 -886773 -6145007 -9972755 -9696868 -5779749
3093 -5779749 20719 6819239 12939978 14820248 10433218 2493428 -3794014 -5264788
3085 -5264788 -2219295 2638639 5381258 3377783 -1305500 -2942131 1316936 7633023
3077 7633023 10224406 8130767 4941074 3458230 3377092 3198745 1785878 -1370635 -5120341
3068 -5120341 -6493433 -3887136 -56737 251211 -4405273 -10931364 -15438288 -16438398
3060 -16438398 -14520140 -10727824 -5769015 2558 5892577 10086576 10784350 8766104
3052 8766104 7163282 7505614 7903886 6771304 5992256 7688021 9916925 9307248 6727565
3043 6727565 6047514 7486961 6820177 2338718 -1647954 -587549 4363961 9057939 12396761
3034 12396761 15948868 18866055 17470203 10764350 3158959 -363203 -84931 -256910
3026 -256910 -2755699 -4844634 -3992650 -2268291 -3487927 -7377613 -9829381 -8988170 -7593468
3017 -7593468 -7795368 -6879940 -1310830 6640901 9955515 4749014 -5436639 -13765220
3009 -13765220 -16568352 -15007758 -12103901 -9668789 -7796856 -6186469 -5154456 -5207167
3001 -5207167 -6338397 -8562683 -12342930 -16828962 -18429738 -14180863 -6960154 -3721124
2993 -3721124 -6681229 -9708260 -6397063 1334132 6616123 7118538 6269824 6284924 5415445
2984 5415445 2500979 -647207 -2767429 -5073214 -8133384 -10296385 -10718386 -10571353 -9597280
2975 -9597280 -5075425 3268011 10382791 11025839 5798338 -569644 -5012902 -7352063
2967 -7352063 -7515679 -5218212 -2020173 -466162 -649801 -75037 2240782 3516682 489043
2958 489043 -5985179 -11023872 -10522437 -5132156 794127 3471244 2091275 -2212554 -7569561
2949 -7569561 -10925428 -9012323 -2179636 4217988 5046231 1249788 -2204222 -3370207
2941 -3370207 -4753441 -7775266 -9905138 -8748757 -5757270 -3913335 -3962558 -4492935 -3822144
2932 -3822144 -750261 4361714 8334124 7560792 2788568 -1170970 -1589839 -509828 47921
2923 47921 1525114 4743430 6073810 1653089 -6775098 -13760215 -16129758 -14157060 -9162565
2914 -9162565 -3616301 -1490127 -4252495 -7884866 -7928700 -6096844 -7367883 -11600073 -13238206
2905 -13238206 -9413236 -3339142 1113008 3514378 4356333 3205984 1636783 3830154
2897 3830154 11023479 18194342 19599121 15890345 12688405 13017278 14055129 11695942
2889 11695942 6354535 2896339 4904644 10127917 13124077 12257629 11317994 12781623
2881 12781623 12930955 7463065 -552279 -3624569 146316 5580405 8817574 10897767
2873 10897767 11923439 8893656 2698775 387549 4948422 8389905 2040835 -10048902
2865 -10048902 -15888839 -11816076 -5782660 -4396881 -4828001 -1762647 4733701 11944578
2857 11944578 19174172 25047934 24906623 16727873 6894351 4060570 8185313 11093276
2849 11093276 8130928 4071877 5724682 12878504 19457532 21032274 18167044 13851289
2841 13851289 10681954 10177501 12098039 13769128 11933116 6292069 263738 -2449888
2833 -2449888 -1317931 1349280 3121263 3069993 1654553 269923 502920 2526136 4255964
2824 4255964 3406206 719134 -104421 3461628 9535446 13696095 13618348 11009507 9412043
2815 9412043 11029935 15183676 18493643 16860465 9216509 -90237 -4474089 -1884540
2807 -1884540 3100332 5381053 5707350 8270498 13113040 14888688 10007470 1494857
2799 1494857 -5321690 -9231065 -12514686 -15921396 -17580940 -16046598 -11425634 -4158810
2791 -4158810 4103144 8871668 6172922 -1474484 -6179146 -3746062 1431531 2906847
2783 2906847 702939 -155202 2218430 4118805 1980691 -3030451 -7459786 -10101282
2775 -10101282 -12076759 -13546098 -12684962 -8667803 -4296812 -3610530 -6340910 -6774034 -334819
2766 -334819 9771971 15590115 14101451 10420919 10255082 12822682 13579981 10681601 5379675
2757 5379675 -1356173 -8369366 -12060128 -9358675 -2879125 1069425 224640 -1486957
2749 -1486957 -309300 2504387 3717485 2757635 1234078 245851 353820 2222124 4838645
2740 4838645 4625947 -678536 -7569305 -9140302 -3111561 4406089 5333559 -617652 -5104262
2731 -5104262 -1224479 7855632 13095888 10847622 5610610 1642341 -2473303 -8222779
2723 -8222779 -11487910 -7707896 405916 5839411 6126534 4053935 1386012 -2032662
2715 -2032662 -3991916 -1615744 2285821 1248307 -5276294 -10849106 -12017821 -12288132
2707 -12288132 -13661836 -11946125 -5090391 780399 -194794 -4781624 -7040139 -8587536
2699 -8587536 -14298194 -21028625 -19874496 -9310965 2082090 7182432 7648218 7744150
2691 7744150 7214052 3879263 -883601 -3078249 -642120 5048275 10695158 13014966
2683 13014966 10953567 6843663 3786232 1704942 -1908969 -7225797 -10724136 -9467372
2675 -9467372 -4569758 506722 3256553 2880062 -519777 -6163420 -12551429 -17675858
2667 -17675858 -19384716 -16643828 -11178051 -6301088 -2914772 1169076 6080491 7191920
2659 7191920 1473206 -5793153 -6057666 1208599 7592301 6756007 1307434 -2892712 -4429010
2650 -4429010 -5497663 -7092869 -8547935 -9820056 -11166438 -11480890 -9121505 -4116802
2642 -4116802 1332029 4127886 2385762 -2274408 -5123234 -3342136 -241869 -1538405
2634 -1538405 -7571138 -12728933 -12947809 -9867994 -6612323 -3689776 -977294 296478
2626 296478 291254 1848984 5875342 8184734 4423205 -3645555 -9876434 -10639929 -7677511
2617 -7677511 -5239263 -6217013 -9816202 -11664264 -7945154 -558582 4219995 3445237 734116
2608 734116 57342 174665 -1662353 -4110193 -4118505 -2319332 -1451453 -1126581 1271332
2599 1271332 5447856 8208266 8127019 6563883 4607750 2453803 1051175 843598 -228545
2590 -228545 -3665314 -6270377 -3412851 3987755 10173220 12185303 12304876 12719539 12644029
2581 12644029 11633764 10966826 10304623 7589274 3979708 4101315 8939419 13214194 13187184
2572 13187184 12707729 17050144 24133436 27059769 23369167 16533194 9266463 920834
2564 920834 -7764027 -12393776 -10031688 -3619777 1360974 2922214 2867946 2359239 364002
2555 364002 -2961894 -4243105 -768128 4633885 5709597 526885 -5660165 -7221343
2547 -7221343 -5496758 -6276607 -11407652 -16799333 -18588102 -17236932 -14607037 -10891586
2539 -10891586 -6514060 -3839303 -4132537 -4757263 -1950535 4808725 12845192 19039738
2531 19039738 21019929 17920779 12274028 9075704 10270117 11904084 9555383 4739792
2523 4739792 2513359 4237437 6713272 7542402 6881094 4114743 -2141614 -9472607 -11831424
2514 -11831424 -6936292 -25451 2743244 1944060 2688002 6785844 10861639 11719995 10308027
2505 10308027 9775062 11623133 14290144 14304414 8986209 -426460 -8291842 -8943268 -2374006
2496 -2374006 5324736 7756620 3923854 -1901048 -4921237 -3708034 -76393 3573891
2488 3573891 6200462 8022236 9577610 11150412 12239039 11121256 6250933 -601514
2480 -601514 -3993711 -220396 7297126 11098593 8638609 4814707 4291979 5170667 3201977
2471 3201977 -1088432 -3858782 -4439998 -5459923 -7416098 -8177449 -7850377 -8948117 -10913522
2462 -10913522 -9831389 -5417225 -2954492 -5296816 -7927147 -6050691 -2241513 -1952514
2454 -1952514 -4807600 -6061229 -4338228 -1942137 806274 4882417 6882889 1414568
2446 1414568 -9438822 -15758538 -11801659 -2993664 2313014 3247264 4659279 8903017
2438 8903017 13906961 16931355 16111740 10028335 -429273 -10733002 -16246230 -16426266
2430 -16426266 -13852804 -11062691 -10360118 -13865516 -20298821 -23922228 -20630531 -13694850
2422 -13694850 -9705815 -10071057 -10512516 -8059207 -4199664 -1223384 408621 495511 -1460595
2413 -1460595 -4280012 -5395986 -3900073 -1086555 2079377 5477233 7850719 7204589
2405 7204589 3706805 -30936 -1767342 -938991 2109243 5934074 8143599 8368003 9492037
2396 9492037 12765230 14079360 9802187 3920573 2872689 4718911 1517566 -7223058
2388 -7223058 -12409069 -9156173 -3914944 -3378130 -4401597 -1114725 4875486 8645102
2380 8645102 10638656 13326251 13947115 9388061 4854459 8022132 15996603 17686494
2372 17686494 9531925 15375 -3036147 -1490460 -765706 -2059728 -4143740 -6619403
2364 -6619403 -7569977 -3306385 5630395 12803560 13895416 11956993 11001533 9374052 4624503
2355 4624503 530056 2326974 7144725 6521664 -1257742 -7790047 -5718648 1605570
2347 1605570 5160497 2167638 -1105828 1816447 9324060 14138233 12659026 9176803
2339 9176803 9903931 15091382 19662067 20706116 20895977 23613544 27634893 28699153 24704195
2330 24704195 17346734 9485629 2652893 -2948514 -7111255 -8817114 -7198499 -3574315
2322 -3574315 -1236251 -1638739 -2047749 462653 3706612 2790027 -2277303 -5715472 -3869644
2313 -3869644 202506 1856900 415280 -2892827 -8247807 -14827886 -18735077 -17757198
2305 -17757198 -15430504 -15857657 -17122064 -15088325 -11537899 -12085902 -16619301 -18533212
2297 -18533212 -14684021 -10071384 -10116958 -13194482 -14031133 -10743598 -4936018 2477757 11645561
2288 11645561 20986009 27135229 28015889 24721164 20296284 16817494 13261879 7028619
2280 7028619 -1229845 -6045850 -3509611 2137842 3017526 -1375875 -3445145 670282
2272 670282 4941072 3131978 -1059251 225039 6742134 10807079 8704897 4375957
2264 4375957 1568418 -843757 -3816212 -4396270 -503677 4675174 6744459 5712280
2256 5712280 4068743 1437028 -4963560 -15080948 -24300517 -27392658 -22865839 -13830560
2248 -13830560 -5843824 -3276900 -6277324 -11191933 -14306757 -14526781 -12630453 -10108291
2240 -10108291 -9472365 -12813562 -17952733 -18788972 -12766956 -5715271 -4713511 -7465831
2232 -7465831 -4794506 5217762 11862306 4825203 -11461449 -22119926 -19130881 -8971266
2224 -8971266 -2536638 -2601082 -4161994 -3820830 -4173573 -8856491 -16738501 -23036658 -24760280
2215 -24760280 -22841729 -19116085 -13733800 -7011867 -1832870 -1142666 -3415173 -4026846
2207 -4026846 -2145899 -2709491 -8960863 -16108429 -16752248 -11204450 -7381567 -9983878 -14535931
2198 -14535931 -14065400 -7661741 458487 7117416 11634312 13153363 10671424 5410388
2190 5410388 101117 -4010766 -7080417 -8217738 -6096397 -2063837 109003 -1876800
2182 -1876800 -7124314 -13385615 -18051305 -17721903 -10545935 -20090 6782058 6335765
2174 6335765 1491276 -3770983 -8969428 -14706820 -19368054 -21401789 -22062681 -22445375 -20403777
2165 -20403777 -14519218 -8867983 -8684403 -12324915 -13045823 -8845606 -4862332 -4754734 -5570935
2156 -5570935 -4201471 -3736378 -8564290 -16408271 -20628312 -19125087 -16040744 -14828120
2148 -14828120 -14254218 -12302699 -10093630 -9685139 -10407546 -9810030 -7172519 -4173974 -2459588
2139 -2459588 -1939305 -1534388 -683152 243228 621848 154317 -1435384 -4747832 -9754193
2130 -9754193 -14427789 -15667607 -12462773 -7239390 -3236299 -1549237 -1582002 -2706319 -3639347
2121 -3639347 -1807412 3696474 9191371 9792839 5955503 3217901 4384155 5472760
2113 5472760 1712788 -5294103 -9553343 -8075103 -3036420 2409552 6999042 10163718
2105 10163718 11425507 11889912 13500293 15459174 14009739 7912120 2042586 2382661
2097 2382661 8067893 11790729 9097553 4540293 6217719 15478738 24803509 26063883
2089 26063883 18564902 8104262 397534 -2650543 -1952891 288553 1080016 -1714112
2081 -1714112 -7110926 -11754015 -13330709 -11805553 -7387901 6474 8193868 12430896
2073 12430896 10114853 4186151 -448240 -2587882 -4481386 -7165889 -9082834 -8943143
2065 -8943143 -7021730 -3464159 1769969 6497983 6607217 512311 -8223709 -14302827
2057 -14302827 -15965521 -15881796 -17427808 -20894944 -23297112 -21948847 -18322865 -17215455
2049 -17215455 -20941658 -25801236 -26636668 -23758252 -21840227 -22118857 -20137986 -13007821
2041 -13007821 -4876657 -1747495 -3378112 -4396623 -2559639 -1881101 -6621900 -14845240
2033 -14845240 -19793614 -16992972 -8826009 -1718411 825967 1259156 3330775 6067584
2025 6067584 5179855 -13328 -4804935 -5317729 -2935250 -639501 1436470 3835301 4532226
2016 4532226 2041447 -587606 453587 3425327 3426719 376392 -633446 2695246 6696618
2007 6696618 7843638 7175073 6450871 4356684 -104791 -3653243 -1972807 4692805 12142170
1998 12142170 17154892 19262323 18742695 15677441 10958145 6383754 3502276 2881882
1990 2881882 3753139 3918170 1566692 -1833088 -2191290 2126266 7385775 8562600 5392359
1981 5392359 2549845 4267772 10105476 15642007 16443888 11930357 6025285 3414990
1973 3414990 5018338 8064251 9908849 9392748 5053444 -3752998 -12776825 -14515780
1965 -14515780 -6858066 3615870 10165794 13708683 17802271 20127234 15804673 6938062
1957 6938062 1059151 63531 -1774201 -7237929 -11045646 -8787212 -4677690 -5277496 -9799070
1948 -9799070 -12134312 -9808542 -5540937 -1327647 3816148 10032798 14535684 14346253
1940 14346253 8969884 364314 -7725355 -10947352 -7521256 -482888 5179468 7578267
1932 7578267 8357698 8725241 7846308 5613392 4432566 6850757 12634135 18975337 22647596
1923 22647596 21799414 17120599 11806765 9045810 8802849 8115822 5152420 1865627 1807905
1914 1807905 6122139 12463685 17237111 18192148 15431309 10788776 6181332 2209321
1906 2209321 -1444200 -4270027 -4557906 -1606731 2211271 2845502 -1489617 -8213680 -12600223
1897 -12600223 -11998182 -7847120 -3960687 -3199013 -5507415 -8456996 -9402234 -7568725 -4560867
1888 -4560867 -2884304 -3904609 -7252219 -11629435 -15082657 -14629488 -7841275 3463469
1880 3463469 12535732 13496979 7951783 3480804 5010720 10056939 13620114 15076224
1872 15076224 17396265 20861618 21159769 14748163 3920611 -5235699 -9149772 -9388335
1864 -9388335 -8928486 -7659247 -3420574 2939756 6237086 2480025 -5698686 -11558380
1856 -11558380 -11784594 -9114749 -7405467 -6850702 -5350819 -2602774 -941025 -2577554
1848 -2577554 -6739004 -9415313 -6786068 -158946 4007683 1811724 -1826977 740686
1840 740686 7914601 9315317 389231 -9822147 -10072391 -1112491 7070519 8398741
1832 8398741 4844765 250497 -3011142 -2415412 2870877 8367672 8113152 2196593 -4429435
1823 -4429435 -9473971 -13441498 -13605208 -6306310 3962748 6792888 171107 -5687693
1815 -5687693 -2884754 3778446 6366751 6108425 8709865 13312197 14640214 12507007
1807 12507007 11057996 10977165 10061538 9602259 12436587 15847269 14359723 9463517 8667175
1798 8667175 13921630 18533065 17581300 14354698 13372367 13218767 10301368 4887151 -758305
1789 -758305 -6520117 -12769980 -17570532 -19400444 -20362368 -22963318 -25350851 -23356526 -16494784
1780 -16494784 -8767104 -3481110 285158 5340096 11846958 16226309 14839054 8388044
1772 8388044 1612909 -1576096 -954916 2424632 8042934 12846375 10426412 -1349652
1764 -1349652 -14206642 -17419043 -11019467 -4201785 -958638 3862204 12058463 15463049
1756 15463049 8152463 -2194476 -3642293 3603975 8800982 6554722 2462407 2563262
1748 2563262 4926731 4512171 1074301 -1428392 -752750 1118261 697209 -2903724 -6568611
1739 -6568611 -6469123 -3114966 -1263000 -3473488 -6169215 -4614696 260218 3184081 1333932
1730 1333932 -3191932 -6555617 -6200097 -2200356 1709183 407766 -6304758 -12122591
1722 -12122591 -12547054 -11603639 -15052814 -19943502 -18274697 -9872312 -3426999 -3775847 -6053088
1713 -6053088 -4936937 -2167420 -745255 1807753 8711322 16775271 19546562 15007712
1705 15007712 5898935 -4781191 -14157300 -17965840 -13778437 -4838491 2996875 7035812
1697 7035812 7642303 4879182 -433459 -4244115 -3046223 425042 123261 -4660972 -8451250
1688 -8451250 -8207764 -7877188 -11985477 -18527054 -21614438 -19211175 -15044426 -13369041 -14186226
1679 -14186226 -13995446 -10043278 -3302891 2428310 4065860 1645471 -2608379 -6588955
1671 -6588955 -9046323 -9246555 -7627425 -6474122 -8081950 -11678505 -13394046 -10106226
1663 -10106226 -2850643 3965302 6435146 4233930 410518 -1587836 -897832 477917
1655 477917 107499 -2370726 -4894402 -4590535 -54796 7022090 12440756 12594448 7303258
1646 7303258 -566606 -7414302 -10104679 -6820779 589511 6348920 6593172 5152129
1638 5152129 8995470 17371282 20922571 14415302 4708481 1562253 4799790 6506735
1630 6506735 3101006 -1520696 -3687539 -3932637 -2763560 1221777 7109578 10709396
1622 10709396 10173048 8465646 8200871 8142000 7108159 6926529 8069350 6236197 -2073812
1613 -2073812 -12847277 -18117889 -15386143 -9424743 -5034411 -2202657 531740 1685043
1605 1685043 -1214883 -6623126 -9035896 -5179376 1392582 4027921 1340908 -662089
1597 -662089 3530585 11179638 14609204 11048558 5143851 1836306 1422054 2804971 6445456
1588 6445456 10880360 10783135 3456634 -5313335 -7172125 -1871178 2991308 2544206 -480540
1579 -480540 -2571727 -5581941 -12334543 -19605898 -20543248 -13666200 -5383105 -2154181 -2812642
1570 -2812642 -1099459 5340828 11665574 12510351 9296056 8008047 10781831 13434088
1562 13434088 12130878 8895482 8039470 9681867 10113210 7312889 2770360 -1731933
1554 -1731933 -5842206 -8742381 -8537683 -4866739 -142239 3108095 4705536 5501388 4985688
1545 4985688 1969595 -2620184 -5233087 -3159997 1502411 2746748 -2702089 -9960523
1537 -9960523 -9964008 -120588 11732642 16453389 14186257 12168504 13836631 15278225 12534492
1528 12534492 7055938 2092159 -1710376 -4360115 -4264941 -1676388 -1174124 -6088885 -12338273
1519 -12338273 -12774947 -7177207 -3135095 -6233294 -13492360 -18156863 -17489366 -13472616
1511 -13472616 -8530280 -3745124 -145761 1226215 681248 -536317 -2142888 -4693721
1503 -4693721 -7345725 -7512306 -3909548 1005828 3092282 998339 -2488707 -3849882
1495 -3849882 -2580482 -795286 7772 294673 720184 758927 46485 -107042 1987670
1486 1987670 5917981 9209105 9901963 8217452 5619255 3103607 684575 -2051529
1478 -2051529 -5137554 -7548644 -7347251 -3252557 3558874 9736056 12404077 11531899 9508798
1469 9508798 8512595 8594511 8520097 8195039 9284581 12570684 15390984 13622338 6753278
1460 6753278 -874158 -5199917 -7089544 -9688250 -12555786 -11817805 -6197789 656515
1452 656515 5280833 8717559 13242089 17221706 17021999 13396697 12070631 16627711 23410890
1443 23410890 25541862 20672214 12639353 5980853 1303508 -2886563 -5785889 -4626571
1435 -4626571 326165 4073262 2698649 -651134 803304 7985205 13939150 13221805
1427 13221805 9619434 10731368 17215018 22250887 20998990 15383384 8621784 420416
1419 420416 -9320984 -16392947 -16775438 -13229326 -12408485 -15706246 -17533296 -13593802 -6747774
1410 -6747774 -2482224 -1751168 -1449232 -122298 457117 -732388 -1532761 737269 6049011
1401 6049011 12130750 16683045 18002196 14926133 8211544 1555317 -721891 2383568
1393 2383568 7712668 10967651 9828304 4953764 -123466 -531099 5601620 13632938
1385 13632938 16245063 12233422 8185825 8989846 10477826 6170156 -1458206 -3157947
1377 -3157947 3766056 11162379 11352753 6863849 4971532 7096471 8676108 6911180
1369 6911180 3448785 226416 -3053610 -7128870 -11713285 -15824047 -17721585 -15494657
1361 -15494657 -9686139 -3887207 -475720 2393223 6893462 10964137 11374762 9338958
1353 9338958 8467581 8369315 5287947 -1354751 -8035090 -12594315 -15418276 -15074272 -8929977
1344 -8929977 286493 4564002 298783 -6837174 -9750869 -8111509 -5233972 -1339264
1336 -1339264 5116850 12115611 15020771 12112053 6233137 1899525 2411003 7566252
1328 7566252 12441657 11411576 5483230 2004589 4477209 7214357 4256101 -1028844
1320 -1028844 -1255297 3483022 6589666 5804898 5679102 9075800 13055585 14824037 16083693
1311 16083693 19026192 22135380 22301153 18352811 11377807 4250558 1110767 3834780
1303 3834780 8495087 8842934 3877865 -1487611 -3392787 -2422521 274123 5069527 10412532
1294 10412532 12249474 9548746 6366170 5744098 5391446 2346325 -1803335 -3889210
1286 -3889210 -4224011 -4874510 -5354655 -4049233 -2240525 -2716428 -5076816 -5864651 -3383079
1277 -3383079 106851 1217810 -967254 -3964961 -3906614 583823 6189572 8339034 7182186
1268 7182186 7423534 11290907 15084918 14657471 10821694 6466095 1715717 -3953963 -7369134
1259 -7369134 -4551214 2664979 7409095 5786815 941332 -1551942 84450 2882478
1251 2882478 2763054 -1291471 -5842897 -6195160 -1644938 3667727 5913368 5587365 5128764
1242 5128764 5137128 5181704 5928923 7666629 8786093 8528036 8953264 11089470 11821155 8605975
1232 8605975 4597333 3990692 4506962 817651 -5567610 -6991340 -1168273 4724339 3994515
1223 3994515 -1122261 -4219268 -3381108 -1404286 -684790 -1497902 -3251311 -4657552 -4240087
1214 -4240087 -2349644 -778017 427143 2696603 4654839 2488058 -3388438 -6931518
1206 -6931518 -5208517 -3760799 -8235150 -14682496 -14728290 -8129352 -3096730 -4586685 -9130264
1197 -9130264 -12142382 -13628465 -14173533 -11372332 -4477490 1703525 2312736 -776786 -2022418
1188 -2022418 -98153 1620486 1028317 -940625 -3920065 -8501803 -12546927 -12201211 -8274829
1179 -8274829 -6593370 -8962802 -8613493 369193 12612248 17001648 11359586 4741158
1171 4741158 4546208 8216539 10175823 10389922 11235389 10883854 6177371 -435048 -3101742
1162 -3101742 -988172 923050 -467040 -2746694 -2770868 -697679 1981333 4718210 6736759
1153 6736759 6654985 4682515 2693080 1279736 -594938 -2509202 -2416009 -404291 918235
1144 918235 977948 2230368 4732608 4029217 -2141376 -8480219 -7964007 -1353390 3443229
1135 3443229 1255705 -4447813 -6049966 -122880 9106891 13552648 8725668 -1962876
1127 -1962876 -11023674 -15055600 -17213130 -21115374 -25274496 -25516056 -20530889 -12618126
1119 -12618126 -4752505 804614 2810610 2448213 2932951 5637745 8509942 10312189
1111 10312189 13383744 18808124 21910655 17624075 8658027 2871514 3059325 4709412
1103 4709412 3880386 1433945 -1671959 -7118133 -14320280 -18116336 -15654054 -11752767
1095 -11752767 -12609050 -16789279 -17613415 -13057544 -7825016 -5424742 -3521327 808472
1087 808472 5479691 6623698 5010254 5129829 8262059 10270581 7663031 3095685 2314467
1078 2314467 6739175 11712228 12391309 9513557 8458914 13494756 23361373 31785144
1070 31785144 32309613 23790541 11557334 2437673 -1265080 -2020933 -2323975 -2088608 -667627
1061 -667627 1473310 4060121 7423310 10457852 10887712 9134485 8990408 12047672 14109040
1052 14109040 10259614 1652418 -5866158 -8475700 -6900258 -3848079 -2132201 -3897279
1044 -3897279 -8204740 -10409685 -7370910 -2286397 -801133 -3402445 -5736754 -5604878
1036 -5604878 -4969744 -5164614 -4953508 -3962337 -3454809 -2773992 464662 5394689 7668219
1027 7668219 5946233 4284231 5899220 8521782 8166623 3765362 -3883341 -13327277
1019 -13327277 -20116760 -18353013 -8775713 -1112407 -3362513 -11801608 -16591346 -14479766
1011 -14479766 -10236787 -7572135 -5306941 -2446160 -729273 -438017 1550187 7223901
1003 7223901 14143049 18469555 18809660 15955314 11589574 8544244 9410449 12801615 13310430
994 13310430 7788451 319173 -1768838 3494290 10587488 13572367 13106168 14392739
986 14392739 19094596 22326111 18979322 10499575 2444730 -3162810 -8822129 -14889984
978 -14889984 -17032728 -12864378 -7030356 -5651576 -8155244 -8839051 -5147377 -203662
970 -203662 2315671 1826244 -734641 -4369253 -7014899 -5998623 -682150 7041449 14979874
961 14979874 21444808 24397857 22775647 18862343 16457241 16185875 15284905 12301141 8826250
952 8826250 5878983 2100299 -2852904 -6252162 -5737206 -2360176 1605954 5182511 6915189
943 6915189 3831273 -4218750 -11416341 -11551641 -5932385 -1563447 -1634192 -2402576 -615156
934 -615156 830634 -2037112 -6997220 -8282918 -5242983 -3197954 -4816039 -5471584 -103657
925 -103657 8862328 14671902 15373415 14993395 16021031 15780388 11601899 5210387 -321946
916 -321946 -4316005 -6544100 -5187139 -385325 3104371 1141597 -3812857 -6131206 -4681598
907 -4681598 -2539150 -824392 1432354 2062246 -2826482 -10957447 -13889702 -7881219 587125
898 587125 3900160 3431747 5978020 13259804 19981305 20860537 15456009 7004270 157268
889 157268 -839491 4656691 12181984 16425864 16774002 16401890 16772573 16157267 13469297
880 13469297 10346302 8578046 7824077 6836509 5193625 3025386 449276 -2046558 -3777854
871 -3777854 -4792151 -5539954 -5494486 -3450018 456755 4342822 6760169 8148635 9434261
862 9434261 10209360 9366208 7099162 5222703 5267349 6793758 7978762 7628386 6072701
853 6072701 4069201 1624484 -1596740 -5412135 -9335994 -12724002 -13729411 -9595780
845 -9595780 -327184 8659704 10595292 4635787 -3290941 -7365167 -7041661 -4962630 -3254104
836 -3254104 -3567332 -7413930 -13616210 -17689604 -16494178 -11729420 -6615335 -1624799 3452858
827 3452858 5771563 2098970 -5910630 -13124893 -16883437 -17698628 -14983758 -7176377 3199701
818 3199701 9542679 8666206 5067484 5277920 10128572 14762055 14772209 10410668 5499647
809 5499647 3500784 4572873 6532606 8918834 14304520 23382305 30543490 28571769
801 28571769 17756426 6040941 -840906 -4879663 -9451937 -12236839 -8777042 -412472
793 -412472 6137724 6601470 3035275 -55023 -567049 517415 898936 -1310292 -6069728
784 -6069728 -10990810 -13262194 -12123055 -8897267 -5150728 -1856741 57386 -344867 -3236385
775 -3236385 -7589611 -11321355 -11899244 -7960299 -1054380 5190797 8451619 9334081 9040530
766 9040530 7090312 2893426 -1860502 -4711001 -5747028 -7025694 -8574358 -7407380
758 -7407380 -1712650 5627309 9517229 8314358 5546973 5539986 8338984 10072280 8028187
749 8028187 3799115 639689 -844697 -2610826 -5509177 -7978804 -8635692 -7969828 -6517335
740 -6517335 -3287445 2236229 7554629 8590482 3945089 -3208710 -7913721 -7909527 -5041125
731 -5041125 -2037964 1351237 7220789 14211282 16288989 9503345 -1875526 -9496796
723 -9496796 -10310753 -8139733 -6706920 -5975426 -5825588 -7833294 -11089183 -11020417 -5638049
714 -5638049 835198 3960391 5296758 8992205 15195121 20673460 23327141 22380563 16990123
705 16990123 8869257 3466991 3758753 5381389 2991825 -1245716 -1603970 1159585 1177292
696 1177292 -2048093 -2700865 900416 2858650 -689278 -5411172 -5764188 -2471359 613083
687 613083 2089484 1777434 -1385033 -6106719 -7426219 -2737217 4231481 8893017 11308023
678 11308023 12445549 9587433 982207 -8393903 -11904330 -9978435 -7966130 -7101467
670 -7101467 -4053047 1156621 3526053 688196 -3243808 -3521799 -475038 2583615 3966797
661 3966797 4166700 4073822 4228133 4484457 4010133 3090801 4305312 9258465 14549841
652 14549841 14503173 8577945 2811261 2598345 6730263 9994070 9275794 5507965 1693749
643 1693749 909291 4765918 11731650 17234850 16671136 8810869 -3159288 -13280651
635 -13280651 -16453584 -12284799 -5345312 -438756 1778125 3187116 3909332 2634601
627 2634601 469392 726335 4292868 8291092 10084827 9722918 7742347 3926276 -331858
618 -331858 -1660011 1127971 4897824 6265196 5741632 5955107 7760983 10028755 11366667
609 11366667 10202471 5288394 -1603265 -5487641 -3407172 1514417 3858818 2565640
601 2565640 1163910 2405025 5600898 8784248 10458642 8990267 3180602 -5283360
593 -5283360 -11745740 -12458993 -8084222 -2678870 528876 1968377 4240440 8006985 10423674
584 10423674 8832672 5031861 3389823 4823835 5857380 4617448 4162250 7444125
576 7444125 12084532 13593196 11569349 8840822 5915164 578658 -7271910 -14281235
568 -14281235 -17565167 -17023382 -13674176 -8759482 -4614216 -3175203 -3226103 -2231107 -1016016
559 -1016016 -2729256 -6468159 -6555668 -327913 7504817 11324570 11800494 12753879 13901643
550 13901643 11851662 6986370 3977075 4900880 6337256 4874244 1978299 1270215 3540457
541 3540457 6736782 8951824 9009526 5608386 -1102397 -7375375 -8131260 -2394026 5062248
532 5062248 8372767 5963561 929023 -2638645 -2898237 -989943 308515 -831432 -3338326
523 -3338326 -4505294 -3543788 -2431339 -2369865 -1511939 1648949 4533508 3562314 149103
514 149103 -405692 3648407 8174328 9347848 8140819 6733433 4683720 1817036 1144517
505 1144517 4608436 8674911 8857746 6528246 6066453 6785466 3786800 -3177433 -7874292
496 -7874292 -6143342 -984368 2997973 5362819 7343114 8119977 7229960 7196683 9826171
487 9826171 12403321 11295400 7257643 3530867 574845 -3336102 -7631237 -9786280
479 -9786280 -9695335 -9788127 -10677966 -10329066 -8179199 -6744857 -7860871 -9969101 -10639118
470 -10639118 -9760976 -8683344 -7706475 -6127524 -4033698 -2598904 -2588360 -3290739 -3186456
461 -3186456 -1677762 -60286 -307085 -2700500 -5362797 -6506095 -6219467 -5431725 -4313079
452 -4313079 -2785806 -1451348 -560795 885024 3229131 4259361 1507238 -3802216 -7408458
443 -7408458 -6955394 -4239639 -1919191 12994 3151103 7446497 10824811 11790933 11026025
434 11026025 9889789 8171370 4454596 -1195630 -6211983 -8250959 -7962781 -7427608 -6768562
425 -6768562 -4893568 -3089659 -4123529 -7028526 -7186721 -3965663 -3792525 -11238566 -20420895
416 -20420895 -21107597 -11864896 -1099197 4682529 7198122 9628059 10074686 5867565
408 5867565 155189 -827352 4325798 10612377 12487377 9000958 3626180 808402 2384588
399 2384588 6269046 8879962 8863917 7269281 4581892 457036 -3047000 -1592914 5661728
390 5661728 12960415 13644717 7757762 1627628 855716 5633856 11849312 14766728 12493457
381 12493457 7625394 4759961 5244627 5836131 3682649 183266 -2181841 -4067775 -6948849
372 -6948849 -8918065 -7275181 -4168880 -4819030 -9969577 -14494479 -14189049 -9841874 -3745180
363 -3745180 3203829 9022342 9918109 5530742 1560896 3227536 8325489 10656623 8606573
354 8606573 6044956 5654640 5986157 5430869 4759880 4353508 2631114 -707774 -2879810
345 -2879810 -1841392 494598 1340755 1085137 1393968 1443106 -180405 -1381374 945684
336 945684 4741117 4346138 -739150 -3980654 -1150769 3509235 4323485 2764951 3439676
327 3439676 4905285 1707109 -5378861 -8476489 -3306366 5341656 10879480 12147533
319 12147533 10778230 6827396 1031257 -2962221 -3255245 -3442563 -7281080 -12419742 -14053501
$$ [...]
##END NTUPLES=NMR SPECTRUM
##END=
