##TITLE=31Pdec_DE-78H_2_HCl
 D2O, 64 sc
 29.1.2025
##JCAMPDX= 6.0         $$ Bruker NMR JCAMP-DX V2.0
##DATA TYPE= NMR SPECTRUM
##DATA CLASS= NTUPLES
##ORIGIN= UXNMR, Bruker Analytische Messtechnik GmbH
##OWNER= root
$$ XWIN-NMR		Version 3.5
$$ Thu Jan 30 14:01:53 2025 Russian Standard Time (UT+4h)  she@DPX200
##.OBSERVE FREQUENCY= 81.013821
##.OBSERVE NUCLEUS= ^31P
##.ACQUISITION MODE= SIMULTANEOUS
##.ACQUISITION SCHEME= undefined
##.AVERAGES= 64
##.DIGITISER RES= 17
##SPECTROMETER/DATA SYSTEM= spect
##.PULSE SEQUENCE= zgpg30
##.SOLVENT NAME= MeOD
##.SHIFT REFERENCE= (INTERNAL, MeOD, 0, 198.062)
##AUDIT TRAIL= $$ (NUMBER, WHEN, WHO, WHERE, WHAT)
$$ ##TITLE= Audit trail, XWIN-NMR		Version 3.5
$$ ##JCAMPDX= 5.01
$$ ##ORIGIN= Bruker BioSpin GmbH
$$ ##OWNER= she
$$ F:/spectra/data/she/nmr/P31/2/pdata/1/auditp.txt
$$ ##AUDIT TRAIL=  $$ (NUMBER, WHEN, WHO, WHERE, WHAT)
(   1,<2025-01-30 14:00:02.53 +0400>,<she>,<DPX200>,
      <created by zg, POWCHK disabled, PULCHK disabled
       configuration hash MD5:
       00 E9 B6 7A A2 85 ED C7 34 08 36 98 17 FE 4E 26
       data hash MD5: 32K
       74 BB 59 F2 D6 D1 89 D3 B3 2D 9E 17 AC 03 9D 0F>)
(   2,<2025-01-30 14:00:11.54 +0400>,<she>,<DPX200>,
      <Start of raw data processing
       efp BC_mod = 2 LB = 1.5 FT_mod = 6 PKNL = 1 PHC0 = 1780.901 PHC1 = -20.30954 SI = 64K 
       data hash MD5: 64K
       81 70 4F 27 90 C5 7A 0B 8F 3F 05 6E 0E 34 34 03>)
(   3,<2025-01-30 14:00:40.68 +0400>,<she>,<DPX200>,
      <pk PHC0 = -25.85406 PHC1 = 36.00015 
       data hash MD5: 64K
       C9 E0 22 B2 55 B3 21 7B 92 BF C4 10 D3 59 7F C5>)
(   4,<2025-01-30 14:00:49.12 +0400>,<she>,<DPX200>,
      <abs ABSG = 5 
       data hash MD5: 64K
       F1 C3 76 3C 66 6D 58 51 85 A9 15 3D 62 DE 3B AD>)
$$ ##END=
$$ 
$$ hash MD5
$$ F2 72 24 EF 9A 31 44 60 61 1A 89 FF 0A 8C 91 4C
##$RELAX= 
##$RELAX= 
##$RELAX= 
##$RELAX= 
##$RELAX= 
##$RELAX= 
##$RELAX= 
##$RELAX= 
$$ Bruker specific parameters
$$ --------------------------
##$DU= <F:/spectra>
##$EXPNO= 2
##$NAME= <P31>
##$PROCNO= 1
##$TYPE= <nmr>
##$USER= <she>
##$AMP= (0..31)
100 100 100 100 100 100 100 100 100 100 100 100 100 100 100 100 100 100 
100 100 100 100 100 100 100 100 100 100 100 100 100 100 
##$AQSEQ= 0
##$AQ_mod= 1
##$AUNM= <au_zg>
##$AUTOPOS= <>
##$BF1= 81.014009
##$BF2= 200.13
##$BF3= 200.13
##$BF4= 200.13
##$BF5= 200.13
##$BF6= 200.13
##$BF7= 200.13
##$BF8= 200.13
##$BYTORDA= 1
##$CFDGTYP= 0
##$CFRGTYP= 5
##$CHEMSTR= <none>
##$CNST= (0..31)
1 1 145 1 1 1 1 1 1 1 1 1 1 1 1 1 1 1 1 1 1 1 1 1 1 1 1 1 1 1 1 1 
##$CPDPRG= <waltz16>
##$CPDPRG1= <>
##$CPDPRG2= <waltz16>
##$CPDPRG3= <>
##$CPDPRG4= <mlev>
##$CPDPRG5= <mlev>
##$CPDPRG6= <mlev>
##$CPDPRG7= <mlev>
##$CPDPRG8= <mlev>
##$CPDPRGB= <>
##$CPDPRGT= <>
##$D= (0..31)
0 1 0 0 0 0 0 0 0 0.06 0 0.03 2e-05 3e-06 0 0 0.0002 0 0 0 0 0 0 0 0 0 
0 0 0 0 0 0 
##$DATE= 1738231202
##$DBL= (0..7)
120 120 120 11 120 120 24 19 
##$DBP= (0..7)
150 150 150 150 150 150 150 150 
##$DBP07= 0
##$DBPNAM0= <>
##$DBPNAM1= <>
$$ [...]
##$SUBNAM3= <"">
##$SUBNAM4= <"">
##$SUBNAM5= <"">
##$SUBNAM6= <"">
##$SUBNAM7= <"">
##$SUBNAM8= <"">
##$SUBNAM9= <"">
##$SW= 400.765351723535
##$SWIBOX= (0..15)
0 1 3 0 0 0 0 0 0 0 0 0 0 0 0 0 
##$SW_h= 32467.5324675325
##$TD= 32768
##$TD0= 1
##$TE= 0
##$TE2= 300
##$TE3= 300
##$TEG= 300
##$TL= (0..7)
0 120 53 12 22 120 120 120 
##$TP= (0..7)
150 150 150 150 150 150 150 150 
##$TP07= 0
##$TPNAME0= <>
##$TPNAME1= <>
##$TPNAME2= <>
##$TPNAME3= <>
##$TPNAME4= <>
##$TPNAME5= <>
##$TPNAME6= <>
##$TPNAME7= <>
##$TPOAL= (0..7)
0.5 0.5 0.5 0.5 0.5 0.5 0.5 0.5 
##$TPOFFS= (0..7)
0 0 0 0 0 0 0 0 
##$TUNHIN= 0
##$TUNHOUT= 0
##$TUNXOUT= 0
##$USERA1= <user>
##$USERA2= <user>
##$USERA3= <user>
##$USERA4= <user>
##$USERA5= <user>
##$V9= 5
##$VALIST= <valist>
##$VCLIST= <CCCCCCCCCCCCCCC>
##$VD= 0
##$VDLIST= <DDDDDDDDDDDDDDD>
##$VPLIST= <PPPPPPPPPPPPPPP>
##$VTLIST= <TTTTTTTTTTTTTTT>
##$WBST= 1024
##$WBSW= 4
##$XGAIN= (0..3)
0 0 0 0 
##$XL= 0
##$YL= 0
##$YMAX_a= 5701
##$YMIN_a= -5140
##$ZGOPTNS= <>
##$ZL1= 120
##$ZL2= 120
##$ZL3= 120
##$ZL4= 120
##$ABSF1= 198.0616
##$ABSF2= -202.7028
##$ABSG= 5
##$ABSL= 3
##$ALPHA= 0
##$AQORDER= 0
##$ASSFAC= 0
##$ASSFACI= 0
##$ASSFACX= 0
##$ASSWID= 0
##$AUNMP= <proc_1d>
##$AZFE= 0.1
##$AZFW= 0.5
##$BCFW= 0
##$BC_mod= 2
##$BYTORDP= 0
##$COROFFS= 0
##$CY= -3
##$DATMOD= 1
##$DC= 0
##$DFILT= <>
##$DTYPP= 0
##$F1P= 0
##$F2P= 0
##$FCOR= 1
##$FTSIZE= 65536
##$FT_mod= 6
##$GAMMA= 0
##$GB= 0
##$INTBC= 1
##$INTSCL= 9.790993e-09
##$ISEN= 30
##$LB= 1.5
##$LEV0= 0
##$LPBIN= 0
##$MAXI= 10000
##$MC2= 0
##$MEAN= 0
##$ME_mod= 0
##$MI= 50
##$NCOEF= 0
##$NC_proc= -8
##$NLEV= 6
##$NOISF1= 182.463
##$NOISF2= 159.3651
##$NSP= 0
##$NTH_PI= 0
##$NZP= 0
##$OFFSET= 198.0616
##$PC= 4
##$PHC0= 1755.047
##$PHC1= 15.69061
##$PH_mod= 1
##$PKNL= yes
##$PPARMOD= 0
##$PSCAL= 0
##$PSIGN= 0
##$REVERSE= no
##$SF= 81.0140089999434
##$SI= 65536
##$SIGF1= 159.3651
##$SIGF2= -187.1042
##$SINO= 113.3802
##$SIOLD= 16384
##$SREGLST= <1H.CDCl3>
##$SSB= 0
##$STSI= 65536
##$STSR= 0
##$SW_p= 32467.5324675325
##$SYMM= 0
##$S_DEV= 0
##$TDeff= 32768
##$TDoff= 0
##$TI= <>
##$TILT= no
##$TM1= 0
##$TM2= 0
##$TOPLEV= 0
##$USERP1= <user>
##$USERP2= <user>
##$USERP3= <user>
##$USERP4= <user>
##$USERP5= <user>
##$WDW= 1
##$XDIM= 65536
##$YMAX_p= 267881653
##$YMIN_p= -363777808
$$ End of Bruker specific parameters
$$ ---------------------------------
##NTUPLES= NMR SPECTRUM
##VAR_NAME=  FREQUENCY,     SPECTRUM/REAL,   SPECTRUM/IMAG
##SYMBOL=    X,             R,               I
##VAR_TYPE=  INDEPENDENT,   DEPENDENT,       DEPENDENT
##VAR_FORM=  AFFN,          ASDF,            ASDF
##VAR_DIM=   65536,         65536,           65536
##UNITS=     HZ,            ARBITRARY UNITS, ARBITRARY UNITS
##FACTOR=    0.49542278885378, 1,            1
##FIRST=     16045.7642231865, 0,            0
##LAST=      -16421.768244346, 0,            0
##MIN=       -16421.768244346, -363777808,   0
##MAX=       16045.7642231865, 267881653,    0
$$ Real data points
##PAGE= N=1
##DATA TABLE= (X++(R..R)), XYDATA
$$ [...]
##PAGE= N=2
##DATA TABLE= (X++(I..I)), XYDATA
6732C810364K425960o26680l371099l155677K40003M139445N607759L809218J20652
$$ 3810364 6236324 5609644 2238545 -917132 -677129 3462316 9070075 12879293 12999945
6723A2999945l059588l856306k313430k89630N47384K78497j13411l38054p58319
$$ 12999945 9940357 6084051 3770621 3480991 4028375 4306872 4193461 3855407 3097088
6714C097088j466535k252542k902132k895736j652018K97187J488121J593586
$$ 3097088 1630553 -621989 -3524121 -6419857 -8071875 -7774688 -6286567 -4692981
6706d692981J850891K490483J716636j034878k887461j252705J760314J977244
$$ -4692981 -2842090 -351607 1365029 330151 -2557310 -3810015 -2049701 -72457
6698g2457n82500j762772K96265K549782K020121l1815r79176j202142k756879
$$ -72457 -654957 -2417729 -2121464 428318 2448439 2416624 1437448 235306 -2521573
6689b521573n054394m801250m39263N164394P233582L864994j939936n130189
$$ -2521573 -7575967 -12377217 -12816480 -7652086 -418504 3446490 1506554 -3623635
6681c623635l681505l52869J188641R15629J375363K905991K872257K25532k158223
$$ -3623635 -7305140 -7658009 -6469368 -5553739 -4178376 -1272385 1599872 1825404 -332819
6672c32819j425382J234284K674634K222531J614309J629459J363213M67428k19016
$$ -332819 -1758201 -523917 2150717 4373248 5987557 7617016 8980229 9447657 9228641
6663I228641m11402q74544j840985k372893j649526J13678K044991K992748J906791
$$ 9228641 8817239 7942695 6101710 3728817 2079291 2192969 4237960 7230708 9137499
6654I137499q29189k716328j394903K254348M644637L408312k89408l374436l626969
$$ 9137499 8308310 5591982 4197079 6451427 11096064 14504376 14214968 10840532 7213563
6645G213563j002618K261960K892627k75086m162856m385588p28257K492055K250869
$$ 7213563 6210945 8472905 11365532 11090446 6927590 2542002 1813745 4305800 6556669
6636F556669L89316j70103n0878j451528l413820k654883J287979M964472N409666
$$ 6556669 6945985 6775882 6725004 5273476 1859656 -795227 492752 5457224 10866890
6627A0866890L011768m00924l630522n421726m370932j106785J387552J219334
$$ 10866890 13878658 13477734 9847212 4425486 54554 -1052231 335321 1554655
6619A554655j93839o36395j4220P51537J684974K472400J242322k430459m902451
$$ 1554655 1360816 724421 710201 1461738 3146712 5619112 6861434 4430975 -471476
6610d71476k606464J883495K227325k716575o671193m573878M59536J970703q24642
$$ -471476 -3077940 -1194445 1032880 -1683695 -8354888 -12928766 -12469230 -10498527 -11323169
6601a1323169k841926p37492L212890N041781L772561J246267n62553r48755m55423
$$ -11323169 -14165095 -14902587 -11689697 -6647916 -2875355 -1629088 -2191641 -3140396 -3595819
6592c595819j61191k67304M34163K518180L902844J950689k367689m867805l542061
$$ -3595819 -3757010 -4024314 -3590151 -1071971 2830873 4781562 2413873 -2453932 -5995993
6583e995993j177504j047539k128744j057571K365364M506163K840740p46697
$$ -5995993 -7173497 -8221036 -10349780 -11407351 -9041987 -4535824 -1695084 -2441781
6575b441781k451530q62492K120945L703514K624307k14672k638198k853721q55973
$$ -2441781 -4893311 -5755803 -3634858 68656 2692963 2478291 -159907 -3013628 -3869601
6566c869601J660342K936635K666323J855851J420596J154883P4003k305351n015909
$$ -3869601 -2209259 727376 3393699 5249550 6670146 7825029 7899032 5593681 577772
6557E77772o045978l956688O70129N371681P540659O278184K798714q17690l206162
$$ 577772 -5468206 -9424894 -8754765 -3383084 4157575 10435759 13234473 12416783 9210621
6548I210621m111603l589455j579864J246246K869908J463874k089032m311843
$$ 9210621 5099018 1509563 -70301 1175945 4045853 5509727 3420695 -891148
6540h91148k761933R41350K754177P37625l053673n259055m623544k226022N26590
$$ -891148 -3653081 -2711731 42446 780071 -2273602 -7532657 -12156201 -14382223 -13855633
6531a3855633K892867M290030M252761L181688K093219J199803k90281k320021
$$ -13855633 -10962766 -6672736 -2419975 761713 2854932 4054735 3764454 1444433
6523A444433k994305p64108K897534M585594K898939j19008j920561k335630k498362
$$ 1444433 -1549872 -2313980 583554 5169148 8068087 7949079 6028518 3692888 1194526
6514A194526k287000p04318J690861K782430J739161K12329j46283N024q19552
$$ 1194526 -1092474 -1796792 -105931 2676499 4415660 4627989 4481706 4486730 3667178
6505C667178k085240j729768M77717J907141M34281k360391l007449q09551J240096
$$ 3667178 1581938 -147830 329887 2237028 2671309 310918 -2696531 -3506082 -2265986
6496b265986Q07835m17202N29798L035186L496893P71427j865519j474313L33183
$$ -2265986 -1458151 -1875353 -1345555 1689631 5186524 5957951 4092432 2618119 2951302
6487B951302J71467j908462k865150j453660N20452J657095K527863L100251J724487
$$ 2951302 3122769 1214307 -1650843 -3104503 -2584051 -926956 1600907 4701158 6425645
6478F425645j634407l763407k226463P23345R49840j831665l916142k978425q27224
$$ 6425645 4791238 1027831 -1198632 -475287 474553 -1357112 -5273254 -8251679 -9078903
6469i078903j25741o95538o01037M85324R04331j97308j275661m19588J707880
$$ -9078903 -9204644 -9900182 -10501219 -10015895 -9111564 -9308872 -10584533 -11004121 -9296241
6460i296241K272242Q0126k160859r16731L186864N483517L035941j628164l951600
$$ -9296241 -7023999 -6943873 -9104732 -10021463 -6834599 -1351082 1684859 56695 -3894905
6451c894905k897612j040971k59698O3008P59737J384342J584206J902424K372913
$$ -3894905 -6792517 -7833488 -8093186 -8030178 -7270441 -5886099 -4301893 -2399469 -26556
6442b6556K031374P25456j78483Q1956L62606l66864j235185j283305j604994
$$ -26556 2004818 2730274 2551791 2633747 2996353 2629489 1394304 110999 -1493995
6433a493995l430265n002916l233921J354059M195622K521554o62463o45209K367903
$$ -1493995 -4924260 -9927176 -13161097 -11807038 -7611416 -5089862 -5752325 -6397534 -4029631
6424d029631L609142O47116l052922k901833O63546L203781K417081M64912k1945
$$ -4029631 -420489 226627 -2826295 -5728128 -5064582 -1860801 556280 1021192 999247
6415I99247M13652k48183k052672l187058k582461p37184J406510K871544K543284
$$ 999247 1412899 1164716 -887956 -4075014 -6657475 -7394659 -5988149 -3116605 -573321
6406e73321L77284j627372j401705L95028J285156N62348l9834N18990R78356
$$ -573321 -196037 -1823409 -3225114 -2830086 -1544930 -982582 -1022416 -503426 474930
6397D74930J06628j269487j677097r79070J2919N56346j06931k212061m068405
$$ 474930 581558 -687929 -2365026 -3344096 -3331177 -2774831 -2881762 -5093823 -9162228
6388i162228l195250J1803J981468R24547l38232J177391L717021L576072J044125
$$ -9162228 -12357478 -12345675 -10364207 -9439660 -9777892 -8600501 -4883480 -1307408 -263283
6379b63283k66888Q77295K285479K702306L114114L372982J712381j328778k551321
$$ -263283 -530171 347124 2632603 5334909 8449023 11822005 13534386 12205608 9654287
6370I654287j196826l91223j501262j359021J812698L937927J105473l198720
$$ 9654287 8457461 8066238 6564976 5205955 7018653 10956580 12062053 8863333
6362H863333k550413K389373M374524J29815n314127o269707l445277r48091j92948
$$ 8863333 6312920 8702293 13076817 13206632 7892505 1622798 -1822479 -2770570 -2963518
6353b963518J07620N17365N14845J08044m47392j387129k321860j840850L08707
$$ -2963518 -2855898 -2338533 -1823688 -1715644 -2163036 -3550165 -5872025 -7712875 -7404168
6344g404168K293915K865295K977734L147350J666128k101617m993738l888884
$$ -7404168 -5110253 -2244958 732776 3880126 5546254 3444637 -1549101 -5437985
6336e437985n71710P99396j64784l68068J094087J840218R15343L58081J175233
$$ -5437985 -6009695 -5210299 -5375083 -5743151 -4649064 -2808846 -1893503 -1535422 -360189
6327c60189J619153O94816k63524p96215k180111l468987j197795M179761O204625
$$ -360189 1258964 1953780 1690256 894041 -1286070 -4755057 -5952852 -1773091 4431534
6318D431534J136055n105998m389715J821295M669344R34425l188618k368966
$$ 4431534 5567589 461591 -3928124 -2106829 2562515 3496940 308322 -2060644
6310b060644N83432P92310q86203o92710J103675J192011o82209j385477K38677
$$ -2060644 -1477212 -684902 -1571105 -2263815 -1160140 31871 -650338 -2035815 -1797138
6301a797138J731012J231448K4870k16264j38908j029322k101861j409386J034232
$$ -1797138 -66126 1165322 1190192 973928 835020 -194302 -2296163 -3705549 -2671317
6292b671317K730621J812249l57727r15409M24807Q31079j172503k700866m86067
$$ -2671317 59304 1871553 1513826 598417 1023224 1854303 681800 -2019066 -2505133
6283b505133L415634L645474n82082l805291k112776J413882J906797j66272j015877
$$ -2505133 910501 4555975 3973893 168602 -1944174 -530292 1376505 1210233 194356
6274A94356L974N87128M52664J138219J583141q68797m818560n307804j159753
$$ 194356 198330 785458 1238122 2376341 3959482 3090685 -1727875 -7035679 -8195432
6265h195432K866767K990861J130666O17084J404595K216812L520421N110483
$$ -8195432 -5328665 -2337804 -1207138 -590054 814541 3031353 6551774 11662257
6257A1662257M207766l41906m806845n220778k784317r83641m8040J451375K071384
$$ 11662257 15870023 15528117 10721272 5500494 2716177 1732536 1684496 3135871 5207255
6248E207255k37692l063329k266885J117502K281461M73351m70373M46127j07111
$$ 5207255 4969563 1906234 -360651 756851 3038312 3511663 3041290 3487417 3380306
6239C380306k525966k209611K351592N524144K732169k338637l593016j444260
$$ 3380306 854340 -1355271 996321 6520465 9252634 6913997 3320981 1876721
6231A876721m28095j093382m10349J433343Q97429k316730m061398k150504N67754
$$ 1876721 1448626 355244 -55105 1378238 2275667 -41063 -4102461 -6252965 -5685211
6222e685211J085541M36560J033373K610268L015788J374449j299467l626932
$$ -5685211 -4599670 -4163110 -3129737 -519469 2496319 3870768 2571301 -1055631
6214a055631m767503m440018k861056n36142J817721L031313K220428N03315M02479
$$ -1055631 -5823134 -10263152 -13124208 -13660350 -11842629 -8811316 -6590888 -6087573 -5685094
6205e685094K054979J965593j888136n524509l418133L199106O944084L881999
$$ -5685094 -3630115 -1664522 -3552658 -9077167 -12495300 -9296194 -2352110 1529889
6197A529889j668787l612876j611726M85405Q61130R97281K005105K690921J379806
$$ 1529889 -138898 -3751774 -5363500 -4878095 -4016965 -3019684 -1014579 1676342 3056148
6188C056148j828969m707859m535881r64872K719066K895303L95169l64689K269292
$$ 3056148 1227179 -3480680 -8016561 -8981433 -6262367 -3367064 -2971895 -3336584 -1067292
6179a067292M651578L350854K71198n26471J098972J917497P59885j85171N58670
$$ -1067292 3584286 6935140 7206338 6679867 7778839 9696336 10456221 10271050 10829720
6170A0829720J469490N67258j827466l705112l568774j667336K40938N49377k56527
$$ 10829720 12299210 12866468 11039002 7333890 3765116 2097780 2338718 2888095 2631568
6161B631568k24631Q56724O58580j756498l301970r26507L184658L936398K80903
$$ 2631568 2406937 3263661 3922241 2165743 -1136227 -2062734 1121924 5058322 5339225
6152E339225l683666m565847l011628o85263K157149M534825L862583j38877l326871
$$ 5339225 1655559 -2910288 -5921916 -6607179 -4450030 84795 3947378 3808501 481630
6143D81630j981779J941140L390087R42306k045318k546629j152429J32447P99772
$$ 481630 -1500149 440991 3831078 4773384 2728066 181437 -970992 -838545 -38773
6134c8773J361221J610292P84255j128972l100350l819859k484584N70957L598986
$$ -38773 1322448 2932740 3716995 2588023 -512327 -4332186 -6816770 -6245813 -2646827
6125b646827M386770K267715q55001k064899k77378K625748L633849J523814k014137
$$ -2646827 1739943 4007658 3152657 1087758 810380 3436128 7069977 8593791 6579654
6116F579654l919963k429993J289471L853231K637420j176282l121931l05449
$$ 6579654 2659691 229698 1519169 5372400 8009820 6833538 3711607 3406158
6108C406158M606505O078919K505720j996226l390712k551549k324351k513442
$$ 3406158 8012663 14091582 16597302 14601076 11210364 8658815 6334464 3821022
6100C821022j228036N92467L49223j090306j55863K867618K893207k196539p143811
$$ 3821022 2592986 3185453 3534676 2444370 2288507 5156125 8049332 5852793 -1291018
6091a291018o135154q37853K502254J923978J131454K690645M389887L351816
$$ -1291018 -7426172 -8264025 -5761771 -3837793 -2706339 -15694 4374193 7726009
6083G726009L52826j707247j637111o89296n30415j527806k571857k283495p53137
$$ 7726009 8078835 6371588 4734477 4045181 3514766 1986960 -584897 -2868392 -3621529
6074c621529L57253J29336j64348P32533J528321K03265k368694l232273j585737
$$ -3621529 -3264276 -3134940 -3299288 -2566755 -1038434 -835169 -3203863 -6436136 -8021873
6065h021873N50286J967747L407970M432225K779647j334413l615320j225959
$$ -8021873 -7471587 -5503840 -2095870 2336355 5116002 3781589 166269 -1059690
6057a059690K609004K878947j55656j935109o05260J044541P23455k77137l11770
$$ -1059690 1549314 4428261 4272605 2337496 1732236 2776777 3500232 3223095 2911325
6048B911325k43435j088333j457523J58641K299161K336014M45697o66547K96039
$$ 2911325 2667890 1579557 122034 280675 2579836 4915850 5361547 4695000 4991039
6039D991039J733345J731269K70650j566488k978170l348137k193188k56437L89061
$$ 4991039 6724384 8455653 8726303 7159815 4181645 833508 -1359680 -1616117 -1227056
6030a227056j312825l425650k837787P83627M118976L980960J088245j033294
$$ -1227056 -2539881 -5965531 -8803318 -8019691 -3900715 80245 1168490 135196
6022A35196m90907J060400J233850J97230k0843J305952K654069K411907P11126
$$ 135196 -355711 704689 1938539 2135769 2114926 3420878 6074947 8486854 9197980
6013I197980j160539k166999k065076j448397j465701k536055l250247j878351
$$ 9197980 8037441 5870442 3805366 2356969 891268 -1644787 -4895034 -6773385
6005f773385P49036J614730l37271k215705r34133K442039M120349K563866M360
$$ -6773385 -6024349 -4409619 -4746890 -6962595 -7896728 -5454689 -1334340 1229526 1233886
5996A233886p24690R20891L340658M296260K498993q70353k671735j396323M55796
$$ 1233886 509196 1430087 4770745 9067005 11565998 10695645 8023910 6627587 7083383
5987G083383m09291l223453m142142j745940J445549L093133L416532K805246
$$ 7083383 6674092 3450639 -691503 -2437443 -991894 2101239 5517771 8323017
5979H323017N41019k636128l931695k484825j137519k039668l206535k007844
$$ 8323017 8864036 6227908 2296213 -188612 -1326131 -3365799 -6572334 -8580178
5971h580178M36493J323853N61589J2310J10136L35536J415383L748142N103053
$$ -8580178 -8143685 -6819832 -6258243 -6245933 -6135797 -5800261 -4384878 -636736 4466317
5962D466317L389003M74169l68667L78398j32938j605816j121914J085770J258651
$$ 4466317 7855320 8329489 7960822 8339220 8206282 6600466 5478552 6564322 7822973
5953G822973j789964m652090m524006k402490K0928K526997M034449K395410j385708
$$ 7822973 6033009 1380919 -3143087 -5545577 -5524649 -2997652 1036797 3432207 2046499
5944B046499k668238N88757M540484M894592K351659P3941r38427j073919K7146
$$ 2046499 -621739 -32982 4507502 9402094 11753753 11827694 10889267 9815348 9842494
5935I842494J580781O50436l412549o270768m135693N18589K753312K156021J485684
$$ 9842494 11423275 12073711 8661162 2390394 -1745299 -1226710 1526602 3682623 5168307
5926E168307O68096k280778n550451m748256o4164L215677K373821N08066O15506
$$ 5168307 5836403 3555625 -1994826 -6743082 -6807246 -3591569 -1217748 -709682 -94176
5917i4176J155171o4132j526944o89060J620213K490400J043885j125605k466482
$$ -94176 1060995 996863 -530081 -1219141 401072 2891472 3935357 2809752 343270
5908C43270k501944j278504N89614J862172J692088L32369j337551k124190p24973
$$ 343270 -2158674 -3437178 -2847564 -985392 706696 1039065 -298486 -2422676 -3147649
5899c147649K616153M888252L245752n39525j500994J638756M184829K070659
$$ -3147649 -531496 4356756 7602508 7062983 5561989 7200745 11385574 13456233
5891A3456233k179914l108818R0168L200845L285526J730950P38957k4549j904416
$$ 13456233 11276319 8167501 8257669 11458514 14744040 16474990 17213947 17189398 15284982
5882A5284982m414357n600098m474840k020880o4751L42328l01935n59759L31387
$$ 15284982 10870625 5270527 795687 -1225193 -1289944 -947616 -1249551 -1809310 -1477923
5873a477923J523942J636778N46139n50099p00099j1614J022125J936564J856530
$$ -1477923 46019 1682797 2228936 1678837 978738 967124 1989249 3925813 5782343
5864E782343r497k662992l419280j185140J297097N27175k758127m170068j739363
$$ 5782343 5772846 3109854 -309426 -1494566 -197469 329706 -2428421 -6598489 -8337852
5855h337852J383572J825986P75964J058544J779135R6497k695696j897527L017916
$$ -8337852 -6954280 -5128294 -4352330 -3293786 -1514651 -1418154 -4113850 -6011377 -2993461
5846b993461O385140M108232o75327k734185j997347j749213k300612j230318
$$ -2993461 3391679 7499911 6824584 4090399 2093052 343839 -1956773 -3187091
5838c187091J320434K386800J307533R91104L129272N358105M473596L07732m480511
$$ -3187091 -1866657 520143 1827676 2818780 5948052 11306157 15779753 16087485 11606974
5829A1606974o801285n036071l78244L494293L791038J685546M59880J125006
$$ 11606974 4805689 -230382 -608626 2885667 6676705 8362251 8822131 9947137
5821I947137J992123J981637J624933R08111j006896l555055m855707m481292
$$ 9947137 11939260 13920897 15545830 16453941 15447045 11891990 7036283 2554991
5813B554991l834563l582798l135312k656199k791960k344159N51128M492583
$$ 2554991 -1279572 -4862370 -7997682 -10653881 -13445841 -15790000 -15238872 -10746289
5805a0746289N501314K554340q71165j867638j355766r79752l02804J010501J551121
$$ -10746289 -5244975 -2690635 -3561800 -5429438 -6785204 -7764956 -8067760 -7057259 -5506138
5796e506138J000750J599928M237581N791395L240315j686326m737760m317336
$$ -5506138 -4505388 -2905460 1332121 7123516 10363831 8677505 3939745 -377591
5788c77591j958519P10540K922550L930416L503961K435902J066934j402316m819962
$$ -377591 -2336110 -1625570 1296980 5227396 8731357 11167259 12234193 10831877 6011915
5779F011915o988291o135443k927381J014966M561494O167218M372155O48841
$$ 6011915 -976376 -7111819 -10039200 -9024234 -4462740 1704478 6076633 6725474
5771F725474j237324l76460K3004j694004k666975q72471Q09943l89958k001659
$$ 6725474 5488150 5111690 5134694 3440690 773715 -98756 711187 321229 -1680430
5762a680430p18026J549486J140477p84788p03955P15336M91638k87617J472402
$$ -1680430 -2398456 -848970 291507 -493281 -1197236 -481900 9738 -277879 1194523
5753A194523L770204J638378l799788n712811k017104J611492J191363Q6891J945896
$$ 1194523 4964727 6603105 2803317 -2909494 -4926598 -3315106 -2123743 -2036852 -90956
5744i0956M027744K051439k718266n818957n883204m393334j663086K710181O837140
$$ -90956 3936788 5988227 3269961 -2548996 -8432200 -12825534 -14488620 -11778439 -4941299
5735d941299P743158N152231J585162p67646j485107j168301r55510j898391l428010
$$ -4941299 2801859 7954090 9539252 8771606 7286499 6118198 5162688 3264297 -163713
5726a63713l441517j119684J516783K090180P66346n06322o27972j45267k16547
$$ -163713 -3605230 -4724914 -3208131 -1117951 -351605 -857927 -1485899 -1631166 -1847713
5717a847713j437431k946737k715268j9594K688086K421312J4381q13364R76931
$$ -1847713 -3285144 -6231881 -8947149 -8966743 -6278657 -3857345 -3842964 -4656328 -3679397
5708c679397K215365N81563j897594k148224k53929J612174K300216J783851R5644
$$ -3679397 -1464032 -882469 -2780063 -4928287 -5182216 -3570042 -1269826 514025 609669
5699F09669j863921k152980l23089J383212J076089j16305j65768O61897O84953
$$ 609669 -1254252 -3407232 -3730321 -2347109 -1271020 -1387325 -1553093 -891196 -206243
5690b06243l70429j280944j159459j2416J500969J865092k16221l405325m194231
$$ -206243 -576672 -1857616 -3017075 -3029491 -1528522 336570 120349 -3284976 -7479207
5681g479207j238793K532478L711814K491673J186770N69818p4602o97827o66980
$$ -7479207 -8718000 -6185522 -2473708 17965 1204735 1774553 1699951 1002124 335144
5672C35144l21474l82580n34208j49821M17367N79726N24882M22300p43j53721
$$ 335144 13670 -368910 -903118 -1052939 -635572 -55846 469036 891336 890593 736872
5662G36872J232884L460179L718060J147930j452768j829548j354804j610416
$$ 736872 1969756 5429935 9147995 10295925 8843157 7013609 5658805 4048389
5654D048389j115085J242483K606544L09450k826882k301731P00541J242977j018105
$$ 4048389 2933304 4175787 6782331 7091781 4264899 1963168 2663709 3906686 2888581
5645B888581j488467R99526J663103k349269o826778o373505j552210L056989
$$ 2888581 1400114 2399640 4062743 1713474 -5113304 -11486809 -13039019 -9982030
5637i982030M941833M606087K831273M04083q04133M30190K424100K347953j76870
$$ -9982030 -5040197 -434110 2397163 2801246 1997113 2427303 4851403 7199356 7022486
5628G022486l014892m476480m566252l656759j707597R62483L279471M182006
$$ 7022486 4007594 -468886 -5035138 -8691897 -10399494 -9437011 -6157540 -1975534
5620a975534L436732J824226P06250R08986J748818J706477K21915j890364l775840
$$ -1975534 1461198 3285424 3991674 4900660 6649478 8355955 8577870 6687506 2911666
5611B911666n074410m961076k412440J587279L740877K089321r65500j271829
$$ 2911666 -2162744 -7123820 -9536260 -7948981 -4208104 -2118783 -3084283 -4356112
5603d356112J701388M098978K710719j015407l130905k148455k23047K29250o47285
$$ -4356112 -2654724 1444254 4154973 3139566 8661 -2139794 -2362841 -2133591 -2780876
5594b780876j171137n57775O85155J853005K301411J279006j000236k467159j138198
$$ -2780876 -3952013 -4509788 -3824633 -1971628 329783 1608789 608553 -1858606 -2996804
5585b996804J900524L182516J062638k331329l970005l133152r66757J378917
$$ -2996804 -1096280 2086236 3148874 817545 -3152460 -6285612 -7252369 -5873452
5577e873452K907635K674659J078118k3778O8142l98241k586900m333176k869584
$$ -5873452 -2965817 -291158 786960 763182 831324 433083 -2153817 -6486993 -9356577
5568i356577P80296K896037K150813Q90359J181294K141195J941980M39705j199240
$$ -9356577 -8576281 -5680244 -3529431 -2639072 -1457778 683417 2625397 3065102 1865862
5559A865862k117895k152758j517071o69819O5899Q06905J512220J606151J083443
$$ 1865862 -252033 -2404791 -3921862 -4591681 -4525782 -3718877 -2206657 -600506 482937
5550D82937J160557K404266L024684R98135k532331m180774k699310l25360N84506
$$ 482937 1643494 4047760 7072444 8070579 5538248 1357474 -1341836 -1667196 -1082690
5541a082690K26670j4938J87790K28402k00251p04122l34868J786345M929358
$$ -1082690 -856020 -870958 -683168 -454766 -655017 -1359139 -1694007 92338 5021696
5532E021696O285179L778723q42640l780744m044235m081978n142541m961718
$$ 5021696 11306875 15085598 14242958 10462214 6417979 2336001 -2806540 -7768258
5524g768258j717631K164557K740293q7108k386860j169753K379060M889957M588404
$$ -7768258 -9485889 -7321332 -4581039 -4668147 -7055007 -8224760 -5845700 -955743 3632661
5515C632661K411039J70457j369300k388862k744091j902741k66585P36160O62933
$$ 3632661 6043700 6214157 4844857 2455995 -288096 -2190837 -2457422 -1721262 -1058329
5506a058329Q82103K110106K485795J91175k980509l441418r97059P93898L3490
$$ -1058329 -176226 1933880 4419675 4610850 1630341 -1811077 -2808136 -2014238 -1980748
5497a980748q21142P63781L126941K963403N02685q16046N02148J870139M63545
$$ -1980748 -2801890 -2038109 1088832 4052235 4554920 3738874 4241022 6111161 6574706
5488F574706k657779l923921k157390k20124r26805k749887j744938K494357N616358
$$ 6574706 3916927 -6994 -2164384 -2384508 -3311313 -6061200 -7806138 -5311781 304577
5479C04577M467971J537415Q75770J758448K55772l743609n535324k509970J820999
$$ 304577 4772548 6309963 7185733 8944181 9199953 5456344 -78980 -2588950 -767951
5470g67951K754996N25577r85156J71020K259371K862659J535530l89326j330201
$$ -767951 1987045 2512622 1527466 1698486 3957857 6820516 8356046 7966720 6636519
5461F636519p97127J71201J29993j053651k245395k814335l261123l825829l695400
$$ 6636519 5839392 6010593 6140586 5086935 2841540 27205 -3233918 -7059747 -10755147
5452a0755147k183186K08501K374876L550730L513459K624080J668303R55886
$$ -10755147 -12938333 -12729832 -10354956 -6804226 -3290767 -666687 1001616 1957502
5444A957502o654j111685r57800Q53143J894455j32019l340330l599873m98487
$$ 1957502 1950848 839163 -118637 734506 2628961 2496942 -843388 -4443261 -4941748
5435d941748J856766O81747j878165k206739K76722L433242N081998M119237R16270
$$ -4941748 -3084982 -2403235 -4281400 -6488139 -6211417 -2778175 2303823 6423060 7339330
5426G339330k230216k727431o15948J639371K415088J946824L60150k324324m183081
$$ 7339330 5109114 2381683 1765735 3405106 5820194 7767018 8127168 5802844 1619763
5417A619763l002689m03907l22750k471288k003340K469778N567429K970265k012578
$$ 1619763 -1382926 -1786833 -2109583 -4580871 -6584211 -4114433 1452996 4423261 2410683
5408B410683l669123j674904Q17447L154161N806746N917863O14361o384266p701110
$$ 2410683 -1258440 -2933344 -2115897 1038264 6845010 12762873 13377234 6992968 -708142
5399g08142k222002L140183K610249j894378m714264l296829N48830L545811L565104
$$ -708142 -2930144 210039 2820288 925910 -3788354 -7085183 -6536353 -2990542 574562
5390E74562J058702j323823j730219j339165j958577k519033p66447K288493L114777
$$ 574562 1633264 309441 -1420778 -2759943 -4718520 -7237553 -8004000 -5715507 -2600730
5381b600730R81442r53679o50838O4354p31448j471493L19618L534309M183715
$$ -2600730 -1619288 -2572967 -3223805 -3159451 -3890899 -5362392 -5042774 -1508465 2675250
5372B675250N53535l988561m304544M77683N191118M179284j665783n614481l525754
$$ 2675250 3228785 -759776 -5064320 -4586637 604481 4783765 3117982 -2496499 -6022253
5363f022253J155493K710720P37108q13287k93781R5065r42671j480438K24317
$$ -6022253 -4866760 -2156040 -1418932 -2232219 -2526000 -2430935 -3373606 -4854044 -4629727
5354d629727K823302L691184K053707m76983j562997l64259J117530k32308m485503
$$ -4629727 -1806425 1884759 3938466 3461483 1898486 1534227 2651757 2419449 -2066054
5345b066054p691617o689504l126957m30642J214136L620959N988524N624704
$$ -2066054 -9757671 -16447175 -19574132 -20004774 -18790638 -15169679 -9181155 -3556451
5337c556451K723809M42002J14256M108r15311j454488j029391p06940p18956
$$ -3556451 -832642 -390640 -276384 -272276 -1187587 -2642075 -3671466 -4378406 -5097362
5328e097362O8987J517876J889178Q12913q6981J1319L73207R11889K112655K565999
$$ -5097362 -5028375 -3510499 -1621321 -808408 -895389 -884070 -510863 401026 2513681 5079680
5318E079680O0241m202231n985044l657185j94230J480407J761787J726993Q05297
$$ 5079680 5139921 937690 -5047354 -8704539 -8898769 -7418362 -5656575 -3929582 -3124285
5309c124285j007418j701363j79731J818827K519461K435260K276658J130986
$$ -3124285 -4131703 -5833066 -6012797 -4193970 -1674509 760751 3037409 4168395
5301D168395j357177l326058l176171j682464R793K217595M704775N202662K383938
$$ 4168395 2811218 -514840 -3691011 -5373475 -5363682 -3146087 1558688 6761350 9145288
5292I145288j371434k604489j117950L51460P6403q41680m92688J062889J465898
$$ 9145288 7773854 5169365 4051415 4402875 4479278 3637598 3144910 4207799 5673697
5283E673697j040862m333825l882584R99026M752017K559447k391448l200623
$$ 5673697 4632835 299010 -3583574 -2584548 2167469 4726916 2335468 -865155
5275h65155N86758K901098J093045n60592J201100L573145L421406K272793J919419
$$ -865155 -278397 2622701 3715746 3155154 4356254 7929399 11350805 13623598 15543017
5266A5543017L25542l655346o087679l527318Q54345J842423j31041j044560m92848
$$ 15543017 15868559 12213213 6125534 2598216 3452561 5294984 5163943 4119383 3626535
5257C626535j318012l589048m271996k374944l3240J190099J474826Q92597k73734
$$ 3626535 2308523 -1280525 -5552521 -7927465 -7960705 -6770606 -5295780 -4403183 -4676917
5248d676917k92036J717423L431481K473095L33167l58859n76675k634641m859772
$$ -4676917 -4968953 -3251530 179951 2653046 2986213 2627354 2050679 -583962 -5443734
5239e443734l573345M13039K478893J340921M76454J855478L157595K507414J496878
$$ -5443734 -9017079 -8604040 -6125147 -4784226 -4307772 -2452294 705301 3212715 4709593
5230D709593J603193J417486k76566j690066p53360J408866J948531Q7951k100303
$$ 4709593 6312786 7730272 7453706 5763640 5010280 6419146 8367677 8455628 6355325
5221F355325k130406K79998K550312J564230k427818n246980l736088Q849J710107
$$ 6355325 4224919 4504917 7055229 8619459 6191641 944661 -2791427 -2782578 -1072471
5212a072471R11532O31456J739036J678039o67713k610534j724992N77549J427080
$$ -1072471 -160939 470517 2209553 3887592 3219879 609345 -1115647 -538098 888982
5203H88982N02709j26902R54364K960062L892844K568968K9647j309263m99313
$$ 888982 1391691 1264789 2219153 5179215 9072059 11641027 11670674 10361411 9862098
5194I862098P51268O20763m16264j149953j936816l264358l664279j942365j48707
$$ 9862098 10613366 11234129 10817865 9667912 7731096 4466738 802459 -1139906 -1288613
5185a288613r05745k695479j698923J933267L796724J831963p16820l41291K001335
$$ -1288613 -2194358 -4889837 -6588760 -4655493 -858769 973194 256374 -84917 1916418
5176A916418L007159J466734j120949k708415k267539m64800O87853O2376q91233
$$ 1916418 4923577 6390311 5269362 2560947 293408 -171392 516461 578837 -312396
5167c12396k66700J181645J339733M06710L29903J070293Q26998j75675J17421
$$ -312396 -579096 602549 1942282 2348992 2678895 3749188 4576186 4400511 4517932
5158D517932J365284Q51835j463333k123491R8363J738901R9319k483478k469976
$$ 4517932 5883216 6735051 5271718 3148227 3246590 4985491 5084810 2601332 131356
5149A31356j92927J655929K073494J590784L27361j119182q31165J710614L785553
$$ 131356 -61571 1594358 3667852 5258636 5585997 4466815 3635650 5346264 9131817
5140I131817K882785M04151o42690j10798l0414o34828k05066J419450K001521
$$ 9131817 12014602 12418753 11776063 11665265 11634851 11000023 10794957 12214407 14215928
5131A4215928Q4441k878761m220051k890082l30590R76175k5120j730592j691639
$$ 14215928 14300369 11421608 7201557 4311475 3980885 4957060 4931940 3201348 1509709
5122A509709L14209K175598K520178K165699J913716R27543j327101l215124k819451
$$ 1509709 1823918 3999516 6519694 8685393 10599109 11526652 10199551 6984427 4164976
5113D164976o80368J000194J214666P80303O16417O86800M74732l43437j545466
$$ 4164976 3484608 4484802 5699468 6479771 7096188 7782988 8257720 7914283 6368817
5104F368817k301448j931047r62922p13724j531118k259724j763600k44826J117601
$$ 6368817 4067369 2136322 1173400 459676 -1071442 -3331166 -5094766 -5339592 -4221991
5095d221991J151526n13315k708615l156780q86672K154076L320959K606626K046070
$$ -4221991 -3070465 -3583780 -6292395 -9449175 -10335847 -8181771 -4860812 -2254186 -208116
5086b08116K402990K649768K320253J819345N95512k061929m246221k760093J875781
$$ -208116 2194874 4844642 7164895 8984240 9579752 7517823 3271602 511509 2387290
5077B387290M881422L142000j020359l570856l702482l120873k542916j215014
$$ 2387290 7268712 10410712 9390353 5819497 2117015 -1003858 -3546774 -4761788
5069d761788J181173L812889N271248M281085J007127k105244k512553r19350
$$ -4761788 -3580615 232274 5503522 9784607 10791734 8686490 6173937 5254587
5061E254587n02749k481037m646497m702118k705812K08544K969266L960265K072734
$$ 5254587 4751838 2270801 -2375696 -7077814 -9783626 -9575082 -6605816 -2645551 -572817
5052e72817r88583k194988j404969j019339j277840Q9505K804871L247056L55304
$$ -572817 -1561400 -3756388 -5161357 -6180696 -7458536 -7369031 -4564160 -1317104 -961800
5043i61800k214711k005176j231970j620475n48781L783732P495154O005780R18496
$$ -961800 -3176511 -5181687 -6413657 -8034132 -8582913 -4799181 2695973 8701753 9620249
5034I620249k570600k762596j735914p41325L21322M70830j155851k813499k353739
$$ 9620249 7049649 4287053 2551139 1809814 2131136 2601966 1446115 -1367384 -3721123
5025c721123o20790M70862J402898L165987L952113J768660j251128j381105R32358
$$ -3721123 -4341913 -3871051 -2468153 697834 4649947 6418607 5167479 3786374 4718732
5016D718732J868180p468k524540l691245l150087p61732K657346M104933J638423
$$ 4718732 6586912 6579444 4054904 363659 -2786428 -3548160 -890814 3214119 4852542
5007D852542j937037k331049J23697J521477P33688L73449J663546K728784K434904
$$ 4852542 2915505 584456 708153 2229630 2963318 3336767 5000313 7729097 10164001
4998A0164001J995186K056248J638640O48158K96423M76091k79715j786981k155039
$$ 10164001 12159187 14215435 15854075 16502233 16798656 17274747 16995032 15208051 13053012
4989A3053012j179580p84821j500377j476310Q8528J215202N5598k396049l515005
$$ 13053012 11873432 11088611 9588234 8111924 8200452 9415654 9471252 7075203 3560198
4980C560198j803143J725632L870015J696792l718692p069960m529428J265274
$$ 3560198 1757055 3482687 7352702 9049494 5330802 -1739158 -6268586 -5003312
4972e003312M353059K615135r40226l153414l665090l062078j339283J057454
$$ -5003312 -650253 1964882 1024656 -2128758 -5793848 -8855926 -10195209 -9137755
4964i137755K887667L432836K810787J243833n79896j140594K65108K197679K766912
$$ -9137755 -6250088 -2817252 -6465 1237368 657472 -483122 -218014 1979665 4746577
4955D746577J685996l17838k340842k535245P20025N181382N595039P50513l734278
$$ 4746577 6432573 6114735 3773893 1238648 1958673 7140055 12735094 13485607 9751329
4946I751329k887717Q13862J971694J78832j205022j228088j228293q88448N68746
$$ 9751329 6863612 7677474 9649168 9828000 8622978 7394890 6166597 5278149 5846895
4937E846895J267733m65516k261954j363870M22444K85570j21812J716525L359980
$$ 5846895 7114628 6649112 4387158 3023288 3445732 3731302 3609490 5326015 8685995
4928H685995J499079j257236o16125J382062J83446k326084j193226J712601O03670
$$ 8685995 10185074 8927838 8311713 9693775 9877221 7551137 6357911 8070512 8674182
4919H674182l027468k220513K889443M654774Q15408k189324m01975K577662L617372
$$ 8674182 5646714 3426201 6315644 10970418 11785826 9596502 9194527 11772189 15389561
4910A5389561M160759M306196J559593k425717k463399Q64118J147899k836050
$$ 15389561 19550320 23856516 25416109 22990392 20526993 21391111 22539010 19702960
4902A9702960n019565k789563n87409p26212K370K378463K737305Q18019L61005
$$ 19702960 14683395 11893832 11306423 10580211 10582581 12961044 15698349 16516368 16877373
4893A6877373Q91651j092608k857859R02179N802135L114864l296494j902457
$$ 16877373 17769024 16676416 13818557 14720736 20522871 23637735 20341241 18438784
4885A8438784M953821M162085k617314K4421J1323082J2651244K665424L048057
$$ 18438784 23392605 27554690 24937376 24961797 36284879 48936123 51601547 54649604
4877E4649604J7420052K0338189O816142J1907690M6798621N5312076j2472774
$$ 54649604 72069656 92407845 99223987 111131677 157930298 213242374 200769600
4870B00769600j08541161j32772913o4956985J1621531K6845381L251114l826246
$$ 200769600 92228439 -40544474 -105501459 -93879928 -67034547 -63783433 -67609679
4863f7609679J0106248J4659118N333226K228577P959982P415569k4264j154349
$$ -67609679 -57503431 -42844313 -37511087 -35282510 -27322528 -19906959 -19931223 -21085572
4855b1085572L742849K320571m735745m900409K089722L924163j322832k701803
$$ -21085572 -17342723 -15022152 -19757897 -24658306 -22568584 -18644421 -19967253 -22669056
4847b2669056K624679N013923Q89447j552339J764989M280635J770853j179962
$$ -22669056 -20044377 -15030454 -14141007 -15693346 -13928357 -9647722 -7876869 -9056831
4839i056831j169591r91429j615990K91122L999815L732532j118590l908641j568514
$$ -9056831 -10226422 -11217851 -12833841 -12542719 -8542904 -4810372 -5928962 -9837603 -11406117
4830a1406117J054548L07078r92938j73448R49987J147007K266468M040070K887272
$$ -11406117 -10351569 -10044491 -11037429 -11210877 -10260890 -9113883 -6847415 -2807345 79927
4821G9927j539022m554114l403342m98989J814578L832146M459025J122399m219533
$$ 79927 -1459095 -6013209 -9416551 -9915540 -8100962 -4268816 190209 1312608 -2906925
4812b906925n358984p77587L544283K954583K4477j360805k028941l733748m349523
$$ -2906925 -8265909 -9043496 -5499213 -2544630 -2520153 -3880958 -5909899 -9643647 -13993170
4803a3993170j484907K579429L844362K127258K53244k90461o5418K59851K68499
$$ -13993170 -15478077 -12898648 -9054286 -6927028 -6673784 -6964245 -7029663 -6769812 -6501313
4794f501313m04504j110905m99894J322545K721038L046438L013568K459484O26769
$$ -6501313 -6905817 -8016722 -8516616 -7194071 -4473033 -1426595 1586973 4046457 4673226
4785D673226j067922m6181K828890L272622l90906m519747n129656k628977P4629
$$ 4673226 3605304 3559123 6388013 9660635 9269729 4749982 -379674 -3008651 -2934022
4776b934022J427934J451023N37695l25900j58515J93842r21996k576689j907536
$$ -2934022 -1506088 -55065 482630 156730 -1785 192057 -729939 -3306628 -5214164
4767e214164R61708K134430l06083l088842k469297O96822K930565K792270J298757
$$ -5214164 -4252456 -2118026 -2424109 -5512951 -7982248 -7285426 -4354861 -1562591 -263834
4758b63834k83081j005933m01210L31802p18904k789346k678251O9020J449696
$$ -263834 -546915 -1552848 -1954058 -1622256 -2341160 -5130506 -7808757 -7739737 -6290041
4749f290041j099609m304881l849020p81166Q87327Q32935J867825L753242K860263
$$ -6290041 -7389650 -11694531 -15543551 -16324717 -15437390 -14604455 -12736630 -8983388 -6123125
4740f123125j206947l408611o7169N445575O877071L100691j206786k242150j196585
$$ -6123125 -7330072 -10738683 -10805852 -5360277 1516794 4617485 3410699 1168549 -28036
4731b8036q54381q82365Q79067L582781L237882j597776o686029o912238k615572
$$ -28036 -882417 -1764782 -885715 2697066 5934948 4337172 -2348857 -9261095 -11876667
4722a1876667J479691K694914K728056L650554M758719M458193K786658N90874
$$ -11876667 -10396976 -7702062 -4974006 -1323452 3435267 7893460 10680118 11270992
4714A1270992j951249m440773n300665l371371J81745K707152K519523J20056
$$ 11270992 9319743 4878970 -421695 -3793066 -3611321 -904169 1615354 1735410
4706A735410k404640l002990j464339L24802O81920K44582N84741J455040J383196
$$ 1735410 -669230 -3672220 -5136559 -4811757 -4129837 -3885255 -3300514 -1845474 -462278
4697d62278M90878K04632K65954j082421l487904m092254j788641R20642J648546
$$ -462278 28600 233232 499186 -583235 -4071139 -8163393 -9952034 -9031392 -7382846
4688g382846J101797R01164J005512R36712J067302R84150q18027l719709m275499
$$ -7382846 -6281049 -5379885 -4374373 -3437661 -2370359 -1386209 -2204236 -5923945 -10199444
4679a0199444j085825K407643K719649J109874L89924q7351k012001l177807k58860
$$ -10199444 -11285269 -8877626 -6157977 -5048103 -4658179 -4745530 -6757531 -9935338 -10194198
4670a0194198M667677N903188K421983q91820j040812p19001k551134m371487
$$ -10194198 -5526521 376667 2798650 1906830 866018 147017 -2404117 -6775604
4662f775604l194305k40745J292918R60724N39614P21940J119123K010598L498594
$$ -6775604 -9969909 -10210654 -8917736 -7957012 -7417398 -6695458 -5576335 -3565737 -67143
4653f7143M160673K851570O99153p23483j779522l132689l449179j620118J19653
$$ -67143 4093530 6945100 7644253 6920770 5141248 2008559 -1440620 -3060738 -2941085
4644b941085j226079m385154n013329j921973J503880K631192K615821K868835
$$ -2941085 -4167164 -8552318 -13565647 -15487620 -13983740 -11352548 -8736727 -5867892
4636e867892K184120k50050j939093k91252L042310M092836J916483o58950j127802
$$ -5867892 -3683772 -3933822 -5872915 -6164167 -3121857 970979 2887462 2228512 1100710
4627A100710K05625J618822J872086Q47342j72915O26510K922415L483263K24957
$$ 1100710 1306335 2925157 4797243 5644585 5471670 6098180 9020595 12503858 12728815
4618A2728815m011559m615894j524278J000869Q23804K32474R00075P53329j812472
$$ 12728815 8717256 4101362 2577084 3577953 4401757 4634231 5534306 6287635 4475163
4609D475163m155426l175021m54665Q2857j714325k205373K56894K880516K444059
$$ 4475163 319737 -2855284 -3309949 -3227092 -4941417 -7146790 -6889896 -4009380 -1565321
4600a565321o34364l194545k885903j12638K805168M053144L974931L796297K971456
$$ -1565321 -2199685 -5394230 -8280133 -8392771 -5587603 -1534459 2440472 6236769 9208225
4591I208225k09172m703651o181812k569364K249441L312673J304367P05712K503355
$$ 9208225 8999053 4295402 -1886410 -4455774 -2206333 1106340 2410707 3116419 5619774
4582E619774L158693P57133k234729l302637l082511k804299k047988q17209o38287
$$ 5619774 8778467 9535600 7300871 3998234 915723 -1888576 -3936564 -4753773 -5392060
4573e392060j512811p74161K528736M869489K988163p12342j127739K259626M659004
$$ -5392060 -6904871 -7679032 -5150296 -280807 2707356 1995014 867275 3126901 7785905
4564G785905K522285k272672n475382n251027k749021L41888L112073M835732
$$ 7785905 10308190 8035518 2560136 -2690891 -5439912 -5098024 -1985951 2849781
4556B849781M562850K071825j033664k099034o4083K976566L770661J401645k073602
$$ 2849781 7412631 9484456 8450792 6351758 6287675 9264241 13034902 14436547 12362945
4547A2362945m236033m346692k996626j376063j029945k500470l781906k145420
$$ 12362945 8126912 3780220 783594 -592469 -1622414 -4122884 -7904790 -10050210
4539a0050210J696496L421362N14528m046120n362990k396029J834949M628599
$$ -10050210 -8353714 -4932352 -4417824 -8463944 -13826934 -16222963 -14388014 -9759415
4531i759415N829134O140335N502219L640962R81287j440129k562178k070466
$$ -9759415 -3930281 2210054 7712273 11353235 12334522 10894393 8332215 6261749
4523F261749r63823o97863j319337j391237l13352N63087M5301r96232j055787
$$ 6261749 5297926 4600063 3280726 1889489 1576137 2139224 2184525 1188293 132506
4514A32506j69781O44135J055185J184247P44669k26142q34951q10360j155021
$$ 132506 -37275 606860 1662045 2846292 3590961 3364819 2529868 1719508 564487
4505E64487j867223q16511K853043N837783M226794r12680m617884m357570k191456
$$ 564487 -1302736 -2119247 733796 6571579 10798373 9885693 5267809 910239 -1281217
4496a281217o65593Q2440M20449l30671j997434k595848j097808N99429J84887
$$ -1281217 -1946810 -1864370 -1443921 -1774592 -3772026 -6367874 -7465682 -6866253 -6681366
4487f681366j815719k766405j084941K276977M738780M011985K92198l072948
$$ -6681366 -8497085 -11263490 -12348431 -10071454 -5332674 -1320689 -1028491 -4101439
4479d101439k661375O88990K429241Q2115l533241m298129k029631M39161J871923
$$ -4101439 -6762814 -6073824 -3644583 -3562468 -7095709 -11393838 -13423469 -12984308 -11112385
4470a1112385L442993N348217N516723K674013j145397k593370r36690J080567
$$ -11112385 -7669392 -2321175 3195548 5869561 4724164 2130794 1194104 2274671
4462B274671N01952k186305l390952q38883L078841L786689K18245l818650m524916
$$ 2274671 2776623 590318 -2800634 -3639517 -560676 3226013 3444258 -374392 -4899308
4453d899308k338983n1364J221812K000300J955561L73745j489071j437361J57608
$$ -4899308 -7238291 -7289655 -6067843 -4067543 -2111982 -1738237 -3227308 -4664669 -4507061
4444d507061N81413r85985k085629q15963J392703K290512J983622J799732J680052
$$ -4507061 -3925648 -4911633 -6997262 -7813225 -6420522 -4130010 -2146388 -346656 1333396
4435A333396P39171p42261j819351k478687k970208k513690o32495J102569R27212
$$ 1333396 2072567 1330306 -489045 -2967732 -5937940 -8451630 -9084125 -7981556 -7054344
4426g054344j02752N70526K896227M089221K894891J249178Q02222M15487j297168
$$ -7054344 -7157096 -6586570 -3690343 398878 3293769 4542947 5345169 5760656 4463488
4417D463488l136947l213363k257018k605609m329106m591863j387180L480017
$$ 4463488 1326541 -1886822 -4143840 -6749449 -11078555 -15670418 -17057598 -13577581
4409a3577581O039967M408291P54348j190556k04169J661999K377850K382066
$$ -13577581 -7537614 -3129323 -2374975 -3565531 -3769700 -2107701 270149 2652215
4401B652215K674536K318978K49889j719748r96651J162659R26025j911913l241063
$$ 2652215 5326751 7645729 7895618 6175870 5179219 6341878 7267903 5355990 2114927
4392B114927j360575J67266j224289k521602n14833K190672J396428j406577j554114
$$ 2114927 754352 921618 -302671 -2824273 -3339106 -1148434 247994 -1158583 -2712697
4383b712697P54708Q48471k446979m920016l663277o14324J660860L118092L766886
$$ -2712697 -1957989 -1109518 -3556497 -8476513 -12139790 -12754114 -11093254 -7975162 -4208276
4374d208276K349436o85739k568942k281485j800740j859626m07559K770306M095083
$$ -4208276 -1858840 -2544579 -5113521 -7395006 -9195746 -11055372 -11462931 -8692625 -4597542
4365d597542J763526m55607J350728M919552M974165Q26312l165718l785029k060219
$$ -4597542 -2834016 -3289623 -1938895 2980657 7954822 8781134 5615416 1830387 -229832
4356b29832m99806k07772r24432j733014j453436K07964J884032J893964N1737
$$ -229832 -729638 -937410 -1861842 -3594856 -5048292 -4840328 -2956296 -1062332 -1010595
4347a010595k473963m308834m371076k461385l0848R92747P39273J136395K603093
$$ -1010595 -3484558 -7793392 -12164468 -14625853 -14656701 -13663954 -12924681 -11788286 -9185193
4338i185193L167415J791217J96661K8215M80130K96136j00617j40584n61923
$$ -9185193 -6017778 -4226561 -4029900 -4001685 -3521555 -3225419 -3326036 -3466620 -4028543
4329d028543j604738j991331j464671j917672m034430n370050m010240j522705
$$ -4028543 -5633281 -7624612 -9089283 -11006955 -15041385 -20411435 -24421675 -25944380
4321b5944380J94030K155461N350331P317756N407077J423354o96024k01452R04866
$$ -25944380 -25750350 -23594889 -18244558 -10926802 -5519725 -4096371 -4792395 -4993847 -4088981
4312d088981J770799K455504J646157j222539l078863q60265L097899L873046
$$ -4088981 -2318182 137322 1783479 560940 -2517923 -3378188 -280289 3592757
4304C592757J262371n70409k59098p32126l060991m062820j696628J480460K322379
$$ 3592757 4855128 4284719 4025621 3293495 232504 -3830316 -5526944 -4046484 -1724105
4295a724105J170659M085n94667p71356j13017J225538J923957J300533K25117
$$ -1724105 -553446 -549361 -1144028 -1915384 -2028401 -802863 1121094 2421627 2646744
4286B646744m10785n67707k59705K09560o75948l921066p316954p170312l200447
$$ 2646744 2235959 1668252 1408547 1618107 942159 -2978907 -10295861 -17466173 -20666620
4277b0666620Q43360K026286J243768Q03615J441678K577804L462553L344920
$$ -20666620 -19823260 -17796974 -16553206 -15749591 -14307913 -11730109 -8267556 -4922636
4269d922636K225901J634802K737710L831623K166025j705145m090708l083403
$$ -4922636 -2696735 -1061933 1675777 5507400 7673425 5968280 1877572 -1205831
4261a205831p40744K25105m42941j372231j392656p9928J686183J743109p40025
$$ -1205831 -1946575 -1721470 -2164411 -3536642 -4929298 -5009226 -3323043 -1579934 -2319959
4252b319959l086060k078451J301058L021163J637119m10887j068384p79236r1126
$$ -2319959 -5406019 -7484470 -6183412 -3162249 -1525130 -1936017 -3004401 -3783637 -3874763
4243c874763J208032J897849p1266l639332m718793j728513J914637K420779J70717
$$ -3874763 -2666731 -768882 -840148 -4479480 -9198273 -10926786 -9012149 -6591370 -6420653
4234f420653j887283k104455q83245O41299J420246J214502R36943J124962O33734
$$ -6420653 -8307936 -10412391 -11295636 -10654337 -9234091 -8019589 -7082646 -5957684 -5323950
4225e323950j315361k782562j489314J258847K120169N94752q61317r82936n31181
$$ -5323950 -6639311 -9421873 -10911187 -9652340 -7532171 -6937419 -7798736 -8781672 -9312853
4216i312853L38621J831687K351795N99065r89859N87014L108058J773399k715843
$$ -9312853 -8974232 -7142545 -4790750 -4191685 -5181544 -4594530 -1486472 286927 -2428916
4207b428916m525207j547014J941356K432232J260048K01677j306293k793136
$$ -2428916 -6954123 -8501137 -6559781 -4127549 -2867501 -2665824 -3972117 -6765253
4199f765253j966409P58269J856093M16041o40358j68879j38171l65763J678928
$$ -6765253 -8731662 -7973393 -6117300 -5701259 -6341617 -6510496 -6648667 -7014430 -5335502
4190e335502M294327J978462m826266p704066k077590N409220O149089Q22188
$$ -5335502 -1041175 937287 -3888979 -11593045 -13670635 -8261415 -2112326 -1290138
4182a290138l620066l842217k056335j160259k006635l490651l174600p9525K723120
$$ -1290138 -4910204 -8752421 -10808756 -11969015 -13975650 -17466301 -20640901 -20720426 -17997306
4173a7997306J832524o95140l07636K186001K269482M02399R79328K889176M74776
$$ -17997306 -16164782 -16859922 -17167558 -14981557 -12712075 -12309676 -11330348 -8441172 -7966396
4164g966396n394775p268981l602012r05258j708640j451238O98437J4743k505509
$$ -7966396 -13361171 -20630152 -24232164 -25137422 -26846062 -28297300 -27598863 -27584120 -30089629
4155c0089629k01193N251507M372133k458454l949919J705748L387879j467951
$$ -30089629 -30290822 -25039315 -20667182 -23125636 -27075555 -25369807 -21981928 -23449879
4147b3449879k438264J153279l055810j3188799j0474603M701887O421030j0496873
$$ -23449879 -25888143 -24734864 -27790674 -40979473 -51454076 -46752189 -40331159 -50828032
4139e0828032j5353456K784231Q420887j1568316O16298Q8452496J79809269J55784665
$$ -50828032 -66181488 -63397257 -54976370 -66544686 -65928388 22524108 202333377 358118042
4131C58118042J7416629j00959991j03647807m0938517j0187577k2856416k7186152
$$ 358118042 375534671 274574680 170926873 129988356 119800779 96944363 69758211
4124F9758211r199826j19530q695055j1090860r88063K299678n301614o576736
$$ 69758211 60558385 60438855 51743800 40652940 39664877 41964555 36662941 30086205
4116C0086205J288039K318956n166405n072799M171752N651673l622213o459055
$$ 30086205 31374244 33693200 28526795 23453996 27625748 33277421 29655208 23196153
4108B3196153K447000O535505k479625j0377510o166257Q65577M95117k188142
$$ 23196153 25643153 32178658 29699033 19321523 13155266 14020843 14515960 12327818
4100A2327818p50801J44411l015131l644760J430243L799768j476614n894092
$$ 12327818 11577017 11721428 8706297 5061537 6491780 10291548 8814934 2920842
4092B920842k097409L812321L940475J265855J390995J973607m44675k283844
$$ 2920842 823433 4635754 8576229 9842084 11233079 13206686 12762011 10478167
4084A0478167l19551J103784j660918l949279j149737K729677K287650l71770
$$ 10478167 10158616 11262400 9601482 5652203 4502466 7232143 9519793 9148023
4076I148023r83489p87659k112726k527211R5780K415671J432729j77614J47146
$$ 9148023 8164534 7376875 5264149 2736938 2832718 5248389 6681118 6503504 6650650
4067F650650k26974l065887m327313j002655K923498L016760J362636J550522
$$ 6650650 6423676 3357789 -969524 -1972179 951319 3968079 5330715 6881237
4059F881237K181494Q30497p52012o01951n64675j616455p37773K834506M314867
$$ 6881237 9062731 9893228 9141216 8539265 7974590 6358135 5620362 8454868 12769735
4050A2769735J352236j170757J69219P97963l118456o361348l132486K148805
$$ 12769735 14121971 12951214 13120433 13918396 10799940 4438592 1306106 3454911
4042C454911J537022l464410m834963q18007L114504L995762L684355K726144
$$ 3454911 4991933 1527523 -3307440 -4125447 -1010943 2984819 6669174 9395318
4034I395318k83502l669860l842579j299338K83449K47762P71067J616279P67267
$$ 9395318 9111816 5441956 1599377 300039 583488 831250 1602317 3218596 3985863
4025C985863o96159j16100J219163m1466k515871j408880L114008M972045R88262
$$ 3985863 3289704 3173604 4392767 4351301 1835430 426550 3540558 8512603 9500865
4016I500865m424357n344062j321190L467285N196165L187609j60402j457434
$$ 9500865 5076508 -267554 -1588744 1878541 7074706 10262315 10101913 8644479
4008H644479J91892J956496J018835j413551j898626L70710K759772K664002k4248
$$ 8644479 8836371 10792867 11811702 10398151 8499525 8870235 11630007 14294009 14269761
3999A4269761l201384m005828j237011K611000L566693J342970l48878L31582
$$ 14269761 11068377 7062549 5825538 8436538 12003231 13346201 12997323 13328905
3991A3328905Q19094o99440j789826l30011J487823J250887N51242J159887Q73344
$$ 13328905 14147999 13448559 11658733 11328722 12816545 14067432 14618674 15778561 16651905
3982A6651905k142904m451402k123482K441027L886106J668014q20971k391671
$$ 16651905 14509001 10057599 7934117 10375144 14261250 15929264 15108293 12716622
3974A2716622l689138l097381P23972L999361K050419k810343m113082j179963
$$ 12716622 9027484 5930103 6654075 10653436 12703855 9893512 5780430 4600467
3966D600467M79311j463078l267910k352407q81356o73007l41556P35125P97801
$$ 4600467 5079778 3616700 348790 -2003617 -2884973 -3557980 -3899536 -3164411 -2366610
3957b366610k38639J01180K171242L295228K860972L415144N134852M380031J0181
$$ -2366610 -2605249 -2504069 -332827 2962401 5823373 9238517 14373369 18753400 18763581
3948A8763581l709245l271916p60313L00868j1437j11064m41519j644401k161965
$$ 18763581 15054336 11782420 11022107 11322975 11311538 11200474 10758955 9114554 6952589
3939F952589r46156j58711k006640m727738m648172j016755L450894N761215M761271
$$ 6952589 6006433 5847722 3841082 -886656 -5534828 -6551583 -3100689 2660526 7421797
3930G421797J411577j652226k206619j103326j130231k479271j941539J895656
$$ 7421797 8833374 7181148 4974529 3871203 2740972 261701 -1679838 215818
3922B15818N418905M458878k663l422838l754615k951502k790619k183260L03292
$$ 215818 5634723 10093601 10090938 6668100 2913485 -38017 -2828636 -5011896 -4708604
3913d708604L256778L785136J705775L08691J834119L829961K466666j290795
$$ -4708604 -1451826 2333310 4039085 4347776 6181895 10011856 12478522 11187727
3905A1187727k418224O17886L168680J487794j519702j306358R98177J094364
$$ 11187727 8769503 9387389 12556069 14043863 12524161 11217803 12215980 13310344
3897A3310344j132405k183690j334803q42809p43562O65719J660729j131935n524815
$$ 13310344 12177939 9994249 8659446 7816637 7073075 7738794 9399523 8267588 2742773
3888B742773n328932n22285J437410k665714n934203j821612N674247Q229150
$$ 2742773 -2586159 -3108444 -1671034 -4336748 -10270951 -12092563 -6418316 1810834
3880A810834N059133K045570J938157K086058O99374p46960j490031k802926m520990
$$ 1810834 6869967 8915537 10853694 12939752 13639126 12892166 11402135 8599209 4078219
3871D078219m284181j415731J523522K225948J357262Q29103J247791J967950
$$ 4078219 -205962 -1621693 -98171 2127777 3485039 4314142 5561933 7529883
3863G529883K237632J549677q5480j725572k219073j654918j311246j866855k353122
$$ 7529883 9767515 11317192 11231712 9506140 7287067 5632149 4320903 2454048 100926
3854A00926j364595R90607K851734K487410J29471k474628m001685m133647k560608
$$ 100926 -1263669 -273062 2578672 5066082 5195553 2720925 -1280760 -5414407 -7975015
3845g975015O79719L472029K780300r81284l327451j744171L58513r32777l283263
$$ -7975015 -7295296 -3823267 -1042967 -2024251 -5351702 -7095873 -6737360 -7670137 -10953400
3836a0953400j534767L737893O699640N000849K342305J571502R01132j222998
$$ -10953400 -12488167 -8750274 -2050634 2950215 5292520 6864022 7765154 6542156
3828F542156k797035k392795j990768k782219k345707P52694L316073K059562
$$ 6542156 3745121 1352326 -638442 -3420661 -5766368 -5013674 -1697601 361961
3820C61961j274162k832279k053092q36136K53776J587709K254728J373453Q1301
$$ 361961 -912201 -3744480 -5797572 -6633708 -6379932 -4792223 -2537495 -1164042 -1082741
3811a082741k35683r4J88927R48751J978644J363822q20133j389711R47917K936366
$$ -1082741 -1318424 -1318518 -1129591 -180840 1797804 3161626 2341493 951782 1899699 4836065
3801D836065K027671N36984R76358J178933j365370l905061k599153N03933N39899
$$ 4836065 6863736 7400720 8377078 9556011 8190641 4285580 1686427 2190360 2730259
3792B730259k076226k652943j39643J937760J992665K075443K903658K535756
$$ 2730259 654033 -1998910 -2138553 -200793 1791872 3867315 6770973 9306729
3784I306729O03978q43291j257895j978701k500490r52026J436860J212718j364416
$$ 9306729 9910707 9067416 7809521 5830820 3330330 2378304 3815164 5027882 3663466
3775C663466k211963j59859J266560J36920r37745q5293N78361m75119r82298
$$ 3663466 1451503 1291644 2558204 2695124 1757379 1672086 2250447 1775328 793030
3766G93030O89673K048688Q22403p96947O9449J965165J658455o52315k412230
$$ 793030 1482703 3531391 4353794 3556847 3626296 5591461 7249916 6597601 4185371
3757D185371l082562l812435m194030k825630j67255K119833L677801M586978
$$ 4185371 1102809 -2709626 -6903656 -9729286 -9896541 -7776708 -4098907 488071
3749D88071L419391n34494m176948l507246O58085L447519K510840K41374j009702
$$ 488071 3907462 3372968 -803980 -4311226 -3653141 -205622 2305218 2546592 1536890
3740A536890j918500k848102j464755L235431P249576N790011N5321l875108k773613
$$ 1536890 -381610 -3229712 -4694467 -1459036 5790540 11580551 11635872 7760764 4987151
3731D987151M58121J750571Q16684l15471q88260j227219q76819N70325J919368
$$ 4987151 5445272 7195843 8012527 7697056 6808796 5581577 4704758 5275083 7194451
3722G194451J841935Q62028j66275k086220n238241o767719l887114R82109K647912
$$ 7194451 9036386 9898414 9732139 7645919 2407678 -4360041 -8247155 -7265046 -4617134
3713d617134O53838m06229J260089J877835p28883k619132q6495L941494M434448
$$ -4617134 -3963296 -4369525 -3109436 -1231601 -1960484 -4579616 -4666111 -724617 3709831
3704C709831J771984j48160n71659j405306k069740m41267K028379J644914j165811
$$ 3709831 5481815 5333655 4761996 3356690 1286950 845683 2874062 4518976 3353165
3695C353165j970189O92764L204920K719709P59452m20967j178866k441077l475159
$$ 3353165 1382976 2075740 5280660 8000369 8759821 8338854 7159988 4718911 1243752
3686A243752l435161k689464j397819R00256L379196M031752K563148R23315L26684
$$ 1243752 -2191409 -4880873 -6278692 -5378436 -1999240 2032512 4595660 5518975 5845659
3677E845659P9290k08040Q7659N01777n41781k797433l873932k766672j208637
$$ 5845659 5924949 5716909 5804568 6306345 5764564 2967131 -906801 -3673473 -4882110
3668d882110o10991j89492Q53573J728585J790981J724050J931767J648838M96615
$$ -4882110 -5493101 -5682593 -4829020 -3100435 -1309454 414596 2346363 3995201 4491816
3659D491816p58975j448226j401651l28752J225689J029128j965015m624760l033056
$$ 4491816 3732841 2284615 882964 554212 1779901 2809029 844014 -3780746 -6813802
3650f813802J493562L726176J862477p34109j472278j488816j674871o61654J400897
$$ -6813802 -5320240 -1594064 268413 -465696 -1937974 -3426790 -5101661 -5763315 -4362418
3641d362418J674179m31551j381640Q55894L268081K634359J81102j493829k569631
$$ -4362418 -2688239 -3119790 -4501430 -3645536 -377455 2256904 2438006 944177 -1625454
3632a625454l899720m017541j687483J120052J921871J201885P09111P13525J194192
$$ -1625454 -5525174 -9542715 -11230198 -10110146 -8188275 -6986390 -6277279 -5563754 -4369562
3623d369562K951880N202420N035453J703688j555402k259913j910386k267371
$$ -4369562 -1417682 3784738 8820191 10523879 8968477 6708564 4798178 2530807
3615B530807k367330j844645k750865m841340l907463J120800M441351J856308
$$ 2530807 163477 -1681168 -4432033 -9273373 -13180836 -12060036 -7618685 -5762377
3607e762377j893909n27824L359916K716537k203474m566266j949754J286972
$$ -5762377 -7656286 -8184110 -4824194 -2107657 -4311131 -8877397 -10827151 -9540179
3599i540179K308769K994064M104665L088203o13067l547507l275496j115243
$$ -9540179 -7231410 -4237346 -132681 2955522 2342455 -1205052 -4480548 -5595791
3591e595791J046508K607958K545238J14420k448204k085870K78384J382072J445772
$$ -5595791 -4549283 -1941325 603913 718333 -1729871 -3815741 -3537357 -2155285 -709513
3582g09513L175752N359475L581280j956071n414627l715578m23966N68752o2708
$$ -709513 2466239 7825714 11406994 9450923 4036296 320718 -103248 465504 402796
3573D02796n76409j381708k202017p03903L207440N677758M048377K39848k848927
$$ 402796 -173613 -1555321 -3757338 -4461241 -1253801 4423957 8472334 8712182 5863255
3564E863255m520838m309438j309168K494004K824759n17716k416014j22954K553731
$$ 5863255 1342417 -2967021 -4276189 -1782185 1042574 524858 -1891156 -2014110 539621
3555E39621J792917l99327p22167l71654j708579k974871j343510J623981K405884
$$ 539621 2332538 1933211 1211044 839390 -869189 -3844060 -5187570 -3563589 -1157705
3546a157705J191729O66654J054729O24234n07491j055145j534110k816433l282426
$$ -1157705 34024 700678 1755407 2379641 1872150 817005 -717105 -3533538 -6815964
3537f815964j147533J821668K596792J516829J022375J199991M04669q98949q84097
$$ -6815964 -7963497 -6141829 -3545037 -2028208 -1005833 194158 598827 -300122 -1184219
3528a184219j26121p90294k586498l106107j793367k75438P79995J877819K309405
$$ -1184219 -1310340 -2100634 -4687132 -7793239 -9586606 -9862044 -9082049 -7204230 -4894825
3519d894825R27050j015063j025839Q35385K296451K503308K250139J331485p48721
$$ -4894825 -3967775 -4982838 -6008677 -5173292 -2876841 -373533 1876606 3208091 2459370
3510B459370j967258K10519L877559L968288n40531m567874l634158N99445L342763
$$ 2459370 492112 702631 4580190 8548478 8007947 3440073 -194085 405360 3748123
3501C748123K629103K78380j231116j004430J39694O44846p3971q20166n37571
$$ 3748123 6377226 6655606 5424490 4420060 4559754 5204600 5130629 4310463 3772892
3492C772892m44286k258055m672844m279474m13303L484484M262177K602712J071049
$$ 3772892 3328606 1070551 -3602293 -7881767 -8295070 -4810586 -548409 2054303 3125352
3483C125352N97686L77818o6658k47755K99210J181794J259915k05929k125255
$$ 3125352 3723038 4100856 4034198 3786443 4085653 5267447 6527362 6321433 4196178
3474D196178k126803M37856L009355K848985O09795r71691r99234p05731n38017
$$ 4196178 2069375 2507231 5516586 8365571 8975366 8003675 7004441 6298710 5760693
3465E760693L10226J596696J883469Q66840l86518j444274k440378k379270l25665
$$ 5760693 6070919 7667615 9551084 10417924 10031406 8587132 6146754 3767484 3441819
3456C441819J912184J482118r83744j912476k71368J134196O57652J81680R65065
$$ 3441819 5354003 6836121 5852377 3939901 3668533 4802729 5460381 5642061 6607126
3447F607126J001367j168323l404305l430664k425046k305479k144149m91316
$$ 6607126 7608493 6440170 3035865 -394799 -2819845 -5125324 -7269473 -7760789
3439g760789J079304L66289j204647m30502K572753M623984M236604K830888J527476
$$ -7760789 -6681485 -6315196 -7519843 -7950345 -5377592 -753608 3482996 6313884 7841360
3430G841360N765j349428j310014l77786o90954k506645l291846j473898J096319
$$ 7841360 7847125 6497697 5187683 4809897 4118943 1612298 -1679548 -3153446 -2057127
3421b057127J902900J253807J256203K362011K763926J052659j870120l840107
$$ -2057127 -154227 1099580 2355783 4717794 7481720 8534379 6664259 2824152
3413B824152l682087k053477l92710M86383O64669M72595J49821m1975j02591
$$ 2824152 -857935 -2911412 -3304122 -2817739 -2153070 -1680475 -1530654 -1572629 -1675220
3404a675220o37091j996650l038344k032380P34211K671295K127437O07849M60924
$$ -1675220 -2312311 -4308961 -7347305 -9379685 -8645474 -5974179 -3846742 -3238893 -2777969
3395b777969J524432J835715R25861K97434O55780P12525n39052j885235j402003
$$ -2777969 -1253537 582178 1508039 1805473 2461253 3173778 2634726 749491 -652512
3386f52512Q03633K466059J757741o67036k551234k669059j957374j758537j727462
$$ -652512 151121 2617180 4374921 3707885 1156651 -1512408 -3469782 -5228319 -6955781
3377f955781n85180J421664K457350J803490R00266Q55164P00745m07461r39119
$$ -6955781 -7540961 -6119297 -3661947 -1858457 -958191 -103027 597718 190257 -748862
3368g48862P91531L152217K671296r68811l883015k692108J533052M895212M780527
$$ -748862 42669 3194886 5866182 4897371 1014356 -1677752 -144700 4750512 9531039
3359I531039J515572k664094n144819m467550j630713N94017N65122m13184Q0382
$$ 9531039 11046611 8382517 3237698 -1229852 -2860565 -2266548 -1701426 -2114610 -2034228
3350b034228K425374M472241L916204M74466l916081o333922m833308l54275L436070
$$ -2034228 391146 4863387 8779591 9254057 5337976 -995946 -5829254 -6183529 -2747459
3341b747459L427893M14876j910742j497184l6732J06634o69944n04378N07970
$$ -2747459 680434 1095310 -815432 -2312616 -2349348 -2242714 -2912658 -3417036 -2909066
3332b909066O41723j55004o8332J078644J056483p60190j498387Q16696L424460
$$ -2909066 -2267343 -2422347 -2490679 -1412035 -355552 -1115742 -2614129 -1797433 1627027
3323A627027K520807r33119k715873j604176j02828O50201K109202L819450K554657
$$ 1627027 4147834 3214715 498842 -1105334 -1208162 -557961 1551241 5370691 7925348
3314G925348k023060n203918l659152l12963N82808k62104K2147N42177j127683
$$ 7925348 5902288 698370 -2960782 -3273745 -2690937 -2953041 -2930894 -2388717 -3516400
3305c516400k868641l86102M806728O126832J783086k014291j85991M011351M496316
$$ -3516400 -6385041 -6771143 -1964415 4162417 5945503 3931212 3745221 7756572 12252888
3296A2252888J077163j617457j283806L22763J336846J471453M06050k014518
$$ 12252888 13330051 11712594 10428788 10751551 12088397 13559850 13965900 11951382
3288A1951382m116138l862091j918493o49911l23575P69121K410394K021686r50037
$$ 11951382 7835244 3973153 2054660 1404749 1081174 1850295 4260689 6282375 5332338
3279E332338l301106k439900p4236N37990p71963j493737l90394J235318J803567
$$ 5332338 2031232 -408668 -482904 55086 -716877 -2210614 -2601008 -1365690 437877
3270D37877J075500l58817j595727j471397L65290K327625K314471N38807n17369
$$ 437877 1513377 1154560 -441167 -1912564 -1547274 780351 3094822 3633629 3116260
3261C116260M93378J839400J131552j368901l101345k392136k09888J185628O39027
$$ 3116260 3609638 5449038 6580590 5211689 2110344 -281792 -491680 693948 1332975
3252A332975q86026j393437j13401J382807J055950o15205r71863Q19286J926729
$$ 1332975 446949 -946488 -1059889 322918 1378868 763663 -208200 611086 2537815
3243B537815j70606l317052l079405R04970M093420L218127L62207o99220K88596
$$ 2537815 2367209 -949843 -4029248 -3124278 969142 4187269 4549476 3850256 4138852
3234D138852Q55218O6841q05632j114911j594243k220129j669116M30779K422331
$$ 4138852 4994070 5060911 4255279 3140368 1546125 -674004 -2343120 -1912341 509990
3225E09990K633727J341310O046o44482j109484k040140l022797k566378J33454
$$ 509990 3143717 4485027 4491073 3846591 2737107 696967 -2325830 -4892208 -4758754
3216d758754L258870L520777L30427k560358j554471J667964K222855j050943
$$ -4758754 -1499884 2020893 2351320 -209038 -1763509 -95545 2127310 1076367
3208A076367l880821k571689J251941L599444L323669K032816N92597j418234
$$ 1076367 -2804454 -5376143 -4124202 -524758 2798911 4831727 5424324 4006090
3200D006090l421443l655432j551747J447265L658214M347905L134161j63791
$$ 4006090 584647 -3070785 -4622532 -3175267 482947 4830852 7965013 7801222
3192G801222m444860p212092o453636k533250J878777L700319J883699j365498
$$ 7801222 3356362 -3855730 -10309366 -12842616 -10963839 -7263520 -5379821 -6745319
3184f745319k359416K20916L757339M909503L627038K455257K466583K093227
$$ -6745319 -9104735 -8883819 -5126480 -216977 3410061 5865318 8331901 10425128
3176A0425128K21160j855751k626087k600802k822872k653123j075329P16704
$$ 10425128 10646288 8790537 6164450 3563648 740776 -1912347 -2987676 -2270972
3168b270972M87981j277288j252814K009659N157509L814002j502356n386130
$$ -2270972 -1782991 -3060279 -4313093 -2303434 2854075 6668077 5165721 -220409
3160b20409l803415J372405N027616M689854K226179M37138L6829K77795N24512
$$ -220409 -4023824 -2651419 2376197 7066051 9292230 9729368 9766197 10043992 10568504
3151A0568504N09k405945o156168p848977m495599J881341N366629K927847j875614
$$ 10568504 10569013 8163068 2006900 -5842077 -10337676 -8456335 -3089706 -161859 -2037473
3142b037473l527386j315279P60991l2865k056476k586416j710746j310806j577892
$$ -2037473 -5564859 -6880138 -6119147 -6152012 -8208488 -10794904 -12505650 -13816456 -15394348
3133a5394348o19015K538960O053956P028221M671743J257511j50591J047097
$$ -15394348 -16013363 -13474403 -7420447 -392226 4279517 5537028 5386437 6433534
3125F433534K205074M02011l879934o940674o041700k334671J104319K935658
$$ 6433534 8638608 9040619 5160685 -1779989 -7821689 -10156360 -9052041 -6116383
3117f116383L814785L978056K811420Q22769j91382L23743Q74001N97754P94190
$$ -6116383 -2301598 1676458 4487878 5310647 5119265 5443008 6317009 6914763 7708953
3108G708953K224032K760877K14621l598480m613501k302958o46144k273043m378600
$$ 7708953 9932985 12693862 12908483 9310003 4696502 2393544 1747400 -525643 -4904243
3099d904243k681122K239379N363158L708417j29458j667437R7884K397551K678903
$$ -4904243 -7585365 -5345986 17172 3725589 3596131 1928694 2026578 4424129 7103032
3090G103032J151938m74146j144219p71004K88981J007593q2084k906545m672782
$$ 7103032 8254970 7780824 6636605 5865601 6154582 7162175 7080091 4173546 -499236
3081d99236k641713J797697L972042J689033j924795k852656j462253r58976j994084
$$ -499236 -3140949 -1343252 2628790 4317823 2393028 -459628 -1921881 -2880857 -4874941
3072d874941k018419J94685K547367K922764J897985R81802L46730k36157p9080
$$ -4874941 -6893360 -6698675 -4151308 -1228544 669441 1651243 1997973 1761816 1682736
3063A682736J083751J839568R13886p66941j387741p41159M3033M09852N32171
$$ 1682736 2766487 4606055 5519941 4753000 3365259 2624100 2667133 3076985 3609156
3054C609156L10494l04525o77402n69769j029067k650397l866015k850621l63351
$$ 3609156 3919650 3615125 2937723 2367954 1338887 -1311510 -5177525 -8028146 -8391497
3045h391497J429143K303779L633153N008439M198691J042261j437726j047759
$$ -8391497 -6962354 -4658575 -1025422 3983017 8181708 9223969 7786243 6738484
3037F738484P32102J328848M62172o65958j685479k558564k259819k59162J610107
$$ 6738484 7470586 8799434 9261606 8595648 6910169 4351605 2091786 1832624 3442731
3028C442731J112542j018233j968390j025381n13337k007263l777763l270409
$$ 3442731 4555273 3537040 1568650 543269 29932 -1977331 -5755094 -9025503
3020i025503o56357J605183J957234J040535R4199n51132j072682j233645n74300
$$ -9025503 -9681860 -8076677 -6119443 -5078908 -4984709 -5535841 -6608523 -7842168 -8416468
3011h416468P67264J939911K105723J098740n08693j710761j550990J80455K469584
$$ -8416468 -7649204 -5709293 -3603570 -2504830 -3013523 -4724284 -6275274 -6094819 -3625235
3002c625235L658672K939576J160291j86881o40328j010540j995813l054306k897848
$$ -3625235 33437 2973013 4133304 3946423 3306095 2295555 299742 -2754564 -5652412
2993e652412r60675J703561L027276J777380r34443k401580j100598J603007L105983
$$ -5652412 -6613087 -4909526 -1882250 -104870 -1039313 -3440893 -4541491 -2938484 167499
2984A67499K504502J042056L2914m13272o23080o51199o53821q03280n49143P10515
$$ 167499 2672001 3714057 3746971 3333699 2710619 2059420 1405599 602319 53176 763691
2974G63691J860964O85798k839766n591067n062868k550902p35279M06944K603361
$$ 763691 2624655 3310453 470687 -5120380 -10183248 -12734150 -13469429 -13062485 -10459124
2965a0459124N066866M679468R38558k380851k091578K38950J099538L07074P82419
$$ -10459124 -5392258 -712790 225768 -2155083 -4246661 -4007711 -2908173 -2601099 -1818680
2956a818680L603613N916851M489796k70183m792752o013525l885631q23475O54868
$$ -1818680 1784933 7701784 12191580 11921397 7128645 1115120 -2770511 -3593986 -2939118
2947b939118p0709j548468j925304p89584P21854J479930J573750J784336K217935
$$ -2939118 -3009827 -4558295 -6483599 -7273183 -6551329 -5071399 -3497649 -1713313 504622
2938E04622J985518M19720j674676k482841j139578J069016J934275P15763j164727
$$ 504622 2490140 2909860 1235184 -1247657 -2387235 -1318219 616056 1331819 167092
2929A67092j873018j063011K00421Q65089P53571L07258m5570l27016r85617k187993
$$ 167092 -1705926 -2768937 -2568516 -1703427 -949856 -642598 -688168 -1015184 -2000801 -4188794
2919d188794l073002k346687k6316K083262K376784J374051P53281R10236P08716
$$ -4188794 -7261796 -9608483 -9634799 -7551537 -5174753 -3800702 -3047421 -2137185 -1428469
2910a428469m20005j481760j404257l69613R12240K215770L278497L185814J427469
$$ -1428469 -1848474 -3330234 -4734491 -5104104 -4191864 -1976094 1302403 4488217 5915686
2901E915686r03548k135077k121177k255298l228701l766724k209167J102689
$$ 5915686 5012138 2877061 755884 -1499414 -4728115 -8494839 -10704006 -9601317
2893i601317L663160L172248n1086l167953l499505j080444J719013K987450K988436
$$ -9601317 -5938157 -2765909 -2816995 -5984948 -9484453 -10564897 -8845884 -5858434 -2869998
2884b869998K891054K793270J961219M61870o96370j034481j095460j207756p72292
$$ -2869998 21056 2814326 4775545 5237415 4541045 3506564 2411104 1203348 431056
2875D31056O26714K091323K138194L68156k016251l251649k391321P7469K648196
$$ 431056 1057770 3149093 5287287 5655443 3639192 387543 -2003778 -1926309 721887
2866G21887L848350L086982P42029k152179m188481m241281k520234n85336M21897
$$ 721887 4570237 7657219 8399248 6247069 2058588 -2182693 -4702927 -5288263 -4866366
2857d866366J154831K737459M540060M748038L101668J341013M49758p15786k922371
$$ -4866366 -3711535 -974076 3565984 8314022 11415690 12756703 13206461 12490675 9568304
2848I568304m349016k792512P56723K833067J768842n40756j548919j121992p32732
$$ 9568304 5219288 2426776 3183499 6016566 7785408 7244652 5695733 4573741 3841009
2839C841009p74865k37322J117596J740765K86047k127658k857275r89419J461354
$$ 3841009 3066144 2828822 3946418 5687183 5973230 3845572 988297 -1122 1460232
2830A460232K103964Q90890n45034j232796j225374n10226O36617P74903j028104
$$ 1460232 3564196 4455086 3910052 2677256 1451882 941656 1578273 2353176 1325072
2821A325072k818746j574261K235029M564429L140024J79270j481103k050679
$$ 1325072 -1493674 -3067935 -832906 3731523 6871547 7050817 5569714 3519035
2813C519035k647153k440666p50675M63273m80072j575807k76457J707809R79975
$$ 3519035 871882 -1568784 -2319459 -1856186 -2336258 -3912065 -4188522 -2480713 -1500738
2804a500738j407912j262441J578477K529675l79484l265654k343546J022168
$$ -1500738 -2908650 -4171091 -2592614 -62939 -442423 -3708077 -6051623 -5029455
2796e029455L390013L712119K421725m61403l631912m075638j322200O99686q07350
$$ -5029455 -1639442 2072677 4494402 4032999 401087 -3674551 -4996751 -4297065 -5104415
2787e104415k848373j173717K824559M043270J223218j694631j489735P43850
$$ -5104415 -7952788 -9126505 -6301946 -2258676 -1035458 -2730089 -4219824 -3475974
2779c475974K185863J569702m08726j745838m21687K886028M203666R42225l770487
$$ -3475974 -1290111 279591 -129135 -1874973 -2296660 589368 4793034 5735259 1964772
2770A964772m613898j294253J388200N99615j308991j349290J03588J300019J884402
$$ 1964772 -2649126 -3943379 -2555179 -1955564 -3264555 -4613845 -4510257 -3210238 -1325836
2761a325836J896562O77787j384776k266364j175683L1321j37973n82406j24743
$$ -1325836 570726 1248513 -136263 -2402627 -3578310 -3546989 -3684962 -4267368 -4392111
2752d392111O6472j125575j992958m88078J894504J857613o10321j960964k13546
$$ -4392111 -4325639 -5451214 -7444172 -7932250 -6037746 -4180133 -4790454 -6751418 -6964964
2743f964964K354504K715187J199990M00857J126409J524949L08925j038782n67305
$$ -6964964 -4610460 -1895273 -695283 -294426 831983 2356932 2665857 1627075 1059770
2734A059770P80527L08109j937324k469138M58317L481746K604125p79386j890217
$$ 1059770 1840297 2148406 211082 -2258056 -1799739 1682007 4286132 3506746 1616529
2725A616529L17881K193256J603520O01403O66451r7784k485044l175143o1661
$$ 1616529 1934410 4127666 5731186 6332589 6999040 6901256 4416212 1241069 1179408
2716A179408K725711l988o152071q293530l598694K959870N874246N176722L742494
$$ 1179408 3905119 3901131 -2250940 -10544470 -14143164 -11183294 -5309048 -132326 3610168
2707C610168K377813K50786k171893l419862l260120k642017j970586r19311M05166
$$ 3610168 5987981 6238767 4066874 647012 -2613108 -5255125 -7225711 -8145022 -7739856
2698g739856J245788R84452m19649k334012l369413k167140R88138L920798M677382
$$ -7739856 -6494068 -5509616 -5929265 -8263277 -11632690 -13799830 -12811692 -8890894 -4213512
2689d213512L440419J704343K05016j259146k320033j868150Q7869J600587J020005
$$ -4213512 -773093 931250 1136266 -122880 -2442913 -4311063 -4223194 -2622607 -1602602
2680a602602n42709n65658R84652J035464k093692n270612m070647Q77025M010390
$$ -1602602 -2145311 -2710969 -1726317 -690853 -2784545 -8055157 -12125804 -11248779 -7238389
2671g238389K012256j854585k327135J057467M207848M305627K579438J368058
$$ -7238389 -5226133 -7080718 -9407853 -8350386 -4142538 163089 2742527 4110585
2663D110585R57752K18411j227701k587657k952029k074664m47600J065402J888748
$$ 4110585 5068337 5286748 4059047 1471390 -1480639 -3555303 -4002903 -2937501 -1048753
2654a048753K133947K251961K468138K660979K472072J519093M863j071465j216046
$$ -1048753 1085194 3337155 5805293 8466272 10938344 12457437 12462300 11390835 10174789
2645A0174789j607430l353117m784675l046974J008986K702195J36996k292744
$$ 10174789 8567359 5214242 429567 -2617407 -1608421 1093774 1230770 -1061974
2637a061974k17314L616097L079386j990273n427848l830035p69525l42734j254432
$$ -1061974 -1279288 2336809 5416195 3425922 -2001926 -5831961 -6601486 -6944220 -8198652
2628h198652l20244J714748J712301m37306j637910k18430K177650L272811K499997
$$ -8198652 -8518896 -6804148 -5091847 -5529153 -7167063 -7385493 -5207843 -1935032 564965
2619E64965N82034j402309k283694j566463k26142L11751Q8281M15636J592593
$$ 564965 1146999 -255310 -2539004 -4105467 -4331609 -4019858 -3931577 -3515941 -1923348
2610a923348K064211O25393j413608j552943M51535J852436N12314j827391j665269
$$ -1923348 140863 766256 -647352 -2200295 -1748760 103676 615990 -1211401 -2876670
2601b876670J159217K823137P66019k726015l850978k236399l00940O90015J144418
$$ -2876670 -1717453 1105684 1871703 -854312 -4705290 -6941689 -7242629 -6552614 -5408196
2592e408196Q90923m42550j433400m84599R36655J52345j795092j080186K526447
$$ -5408196 -4517273 -4959823 -6393223 -6877822 -5941167 -5788822 -7583914 -8664100 -6137653
2583f137653M570576K673146J26526L77298J764760R10317j737378l282997l062073
$$ -6137653 -1567077 1106069 1232595 1609893 3374653 4284970 2547592 -735405 -3797478
2574c797478k471628j786569m02542J009894J532775K007156L298074L889685
$$ -3797478 -6269106 -8055675 -8458217 -7448323 -5915548 -3908392 -610318 3279367
2566C279367K099014n70351j360156m90436l12143j139629j272661n68134n07243
$$ 3279367 5378381 4808030 3447874 2957438 2645295 1505666 233005 -335129 -842372
2557h42372q98114j0868J733264J600578j105033l468461k913258m49298J166137
$$ -842372 -1740486 -1751354 -18090 1582488 477455 -2991006 -5904264 -6353562 -5187425
2548e187425P79603n82260j237697m03651R63994J094397p2407m32747Q82024
$$ -5187425 -4407822 -4990082 -6227779 -6631430 -5667436 -4573039 -4645446 -5078193 -4196169
2539d196169J497040m20507k287074n85343L050014L548771k6931l005084j822089
$$ -4196169 -2699129 -3119636 -5406710 -5992053 -2942039 606732 579801 -2425283 -4247372
2530d247372J736567L982600L443428O11154k904301m110101j243464K453241
$$ -4247372 -2510805 1471795 4915223 5526377 2622076 -1488025 -2731489 -278248
2522b78248J719855k791529m352199O4970M957396M510800Q38218m49185J063577
$$ -278248 1441607 -1349922 -5702121 -5637151 -679755 3831045 4669263 4220078 5283655
2513E283655J641458L67403n65294r65379k549855m295560l021373J064434L837908
$$ 5283655 6925113 7292516 6727222 5761843 3211988 -1083572 -4104945 -3040511 797397
2504G97397L036751Q44866k6229N97967J985284L818128M758103K786993j537742
$$ 797397 3834148 4679014 4652785 5250752 7236036 11054164 15812267 18599260 17061518
2495A7061518m737477m781513l477197l019643k566458m47782J996010J630153
$$ 17061518 12324041 7542528 4065331 1045688 -1520770 -1968552 27458 1657611
2487A657611j738348m246223k473907K206539N075798L650895M52444o16300N85938
$$ 1657611 -80737 -4326960 -6800867 -4594328 481470 4132365 4584809 3968509 4554447
2478D554447R01776j026882l007930l335320l396737m311113l949118m18698L733716
$$ 4554447 5456223 4429341 1421411 -1913909 -5310646 -9621759 -13570877 -13989575 -10255859
2469a0255859M615442K870617K349197L608785L233466l8966k904884k555492
$$ -10255859 -5640417 -2769800 -420603 3188182 6421648 6382682 3477798 922306
2461I22306m46502P41410P52462M30384m42908j747842j759975L40702K360821
$$ 922306 475804 1217214 1969676 2400060 1957152 209310 -1550665 -1209963 1150858
2452A150858J694415j143032l340466l096010p29128K268931L992900L243976
$$ 1150858 2845273 1702241 -1638225 -4734235 -5463363 -3194432 798468 4042444
2444D042444J144078K66231J087891J129360j015179k973140k050206M98249J317881
$$ 4042444 5186522 5452753 6540644 7670004 6654825 3681685 1631479 2129728 3447609
2435C447609k44936k046730k985700l825747m289626k443378K028147O162580
$$ 3447609 3202673 1155943 -1829757 -5655504 -9945130 -12388508 -10360361 -4197781
2427d197781O764196L983200P88302n18426m22931r02021k449896l028200p20388
$$ -4197781 2566415 6549615 7337917 6819491 6396560 5494539 3044643 16443 -703945
2418g03945K935454L961376R02443k950535l564240q85486K009786L016817K171694
$$ -703945 2231509 6192885 7095328 4144793 580553 -304933 1704853 4721670 6893364
2409F893364o3788l033467m843837l738441p70865J033001N06285n74843m91774
$$ 6893364 6829576 3796109 -1047728 -4786169 -5557034 -4524033 -4017748 -4592591 -5084365
2400e084365L47435Q53410Q70504O30026K40380L74661J780493L364335K580379
$$ -5084365 -4736930 -3883520 -3013016 -2382990 -2142610 -1767949 12544 3376879 5957258
2391E957258j106036m693557m977968k257209O06684J749348J447189N75242k94331
$$ 5957258 4851222 157665 -4820303 -7077512 -6470828 -4721480 -3274291 -2699049 -2993380
2382b993380m65135O36706K454580L492719K832820R20396j179675k673816l097059
$$ -2993380 -3458515 -2821809 -367229 3125490 5958310 6878706 5699031 3025215 -71844
2373g1844k207814l63438J269315J529614N76181j6420R22045K414341K348927
$$ -71844 -2279658 -2643096 -1373781 155833 732014 715594 1637639 4051980 6400907
2364F400907M30286j104249m98513J019927J111633l29883j564257k011167k512148
$$ 6400907 6831193 5726944 5228431 6248358 7359991 7030108 5465851 3454684 942536
2355I42536k796466j488450P00507O54050k628937n576106m446324n53194J605570
$$ 942536 -1853930 -3342380 -2641873 -1987823 -4616760 -10192866 -14639190 -15192384 -13586814
2346a3586814N69855n97093Q67071L704658M740530K956613J41666j639808j970680
$$ -13586814 -13016959 -13614052 -12746981 -9042323 -4301793 -1345180 -1203514 -2843322 -4814002
2337d814002j627428j138841l20940R02070J882374K077100K107169K865934L586137
$$ -4814002 -6441430 -7580271 -7901211 -6999141 -5116767 -3039667 -932498 1933436 5519573
2328E519573K390931n31869k015654K42514M086583N131803K094280k008194l782286
$$ 5519573 7910504 7378635 5362981 5605495 9692078 14823881 16918161 14909967 11127681
2319A1127681k656232p3529K387598L296024J569005k173728n315031n513449
$$ 11127681 8471449 8397920 10785518 14081542 15650547 13476819 8161788 2648339
2311B648339k989776M0550J703559J648434N05081q80352j698985j408253j54832
$$ 2648339 -341437 -300887 1402672 3051106 3556187 2675835 976850 -431403 -586235
2302e86235J099048J204038o2221j541264j824711r12886j05563j10936k59744
$$ -586235 512813 1716851 1654630 113366 -1711345 -2624231 -2729794 -2840730 -3100474
2293c100474j5534M9612l02364j0297J309440J807832m0865k370372k033209P40861
$$ -3100474 -3116008 -3066396 -3368760 -3379057 -2069617 -261785 -302650 -2673022 -4706231 -3965370
2283c965370K634507K072275P23248n7871q95843j637930n49404K017635K636197
$$ -3965370 -1330863 741412 1464660 1406789 510946 -1126984 -1676388 341247 2977444
2274B977444k2343k190762l77407K956310K956222l23078k439263j290131J037582
$$ 2977444 2955101 764339 386932 3343242 6299464 5976386 3537123 2246992 3284574
2265C284574K731402M066115M332272J464281l679775o476544m279305k05068
$$ 3284574 6015976 10082091 14414363 15878644 12198869 5722325 1443020 1237952
2257A237952J143453m81848j811024j070320L36144M01548j161983k946577l183487
$$ 1237952 2381405 1899557 88533 -981787 -645643 -244095 -1406078 -4352655 -7536142
2248g536142j481843M14924O17988r9315O88258K922351L525280J169796j200727
$$ -7536142 -9017985 -8603061 -7985073 -8084388 -7396130 -4473779 -948499 221297 -979430
2239i79430p28454J000916Q68501m61873K23547K986961M003578Q92636m158720
$$ -979430 -1707884 -706968 161533 -300340 -76793 2910168 6913746 7806382 3647662
2230C647662p325834o921798l662442O27888L718616M238074L197897K885171
$$ 3647662 -3678172 -10599970 -14262412 -13634524 -9915908 -5677834 -2479937 405234
2222D05234L676065L492695J028990k162012l722614l201328j751960m26996K08543
$$ 405234 4081299 7573994 8602984 6440972 2718358 -482970 -2234930 -2661926 -2453383
2213b453383p1893o35281l40145O50317N90584j155377k410203q54170K440061
$$ -2453383 -2525276 -3160557 -3500702 -2850385 -2259801 -3415178 -5825381 -6679551 -4239490
2204d239490M047250K426505p20210l212795m457996m335317k253710J226879
$$ -4239490 -192240 2234265 1514055 -1698740 -6156736 -10492053 -12745763 -11518884
2196a1518884L446041K412093j34857n45838J868691L916782L072594Q36353J48613
$$ -11518884 -8072843 -5660750 -5795607 -6341445 -4472754 -555972 2516622 3352975 3501588
2187C501588J210284J982669J686492J207288M75429j616785m241337m501389
$$ 3501588 4711872 6694541 8381033 9588321 10063750 8446965 4205628 -295761
2179b95761j602701J330600J423879j34039o92446n97269j994537m267975m160840
$$ -295761 -1898462 -567862 856017 721978 29532 -567737 -2562274 -6830249 -10991089
2170a0991089p02508K891736L231395O88724j618343j362069J188128L751520
$$ -10991089 -11693597 -8801861 -5570466 -4881742 -6500085 -7862154 -6674026 -2922506
2162b922506L933373J461164j327564k094484j223743o84055q51066m90680M05588
$$ -2922506 1010867 2472031 1144467 -950017 -2173760 -2857815 -3708881 -4199561 -3793973
2153c793973K64418j215873k211512j516833o4122J032318J835605K169589J120176
$$ -3793973 -3529555 -4745428 -6956940 -8473773 -8537895 -7505577 -5669972 -3500383 -2380207
2144b380207q78969j645392l24629J170679J213897P61861R01685M71086j500305
$$ -2380207 -3259176 -4904568 -5229197 -4058518 -2844621 -2082760 -1181075 -709989 -2210294
2135b210294l054406j960970L26423N18952j525489k812245j898465m69660O2764
$$ -2210294 -5264700 -7225670 -6899247 -6380295 -7905784 -10718029 -12616494 -13086154 -13023390
2126a3023390O48091K299374L915671L690591J435353j335689k752393j775933
$$ -13023390 -12375299 -10075925 -6160254 -2469663 -1034310 -2369999 -5122392 -6898325
2118f898325Q50183K685454J865348n17936j545891j27077J904834K673305K635741
$$ -6898325 -6048142 -3362688 -1497340 -2015276 -3561167 -3688244 -1783410 889895 3525636
2109C525636L152510L880844K965115m02496m542928o710007n743438l062482
$$ 3525636 6678146 10558990 13524105 13121609 8578681 1868674 -3874764 -6937246
2101f937246q73738K44680J220986K182072J834439j01244j348909M30213M310374
$$ -6937246 -7810984 -7566304 -6345318 -4163246 -2328807 -2430051 -3778960 -3348747 961627
2092I61627O778762N490371J329190k793412m235226k422975N32545J687519O34615
$$ 961627 7740389 13230760 14559950 11766538 7531312 5108337 5640882 7328401 7963016
2083G963016r1917J014219J917608M54123j681921j430994M49179M77790j624388
$$ 7963016 7871099 8885318 10802926 11257049 9575128 8144134 8593313 9071103 7446715
2074G446715k195259M31534L132385K850500R57215L94296J013183O02799r83053
$$ 7446715 5251456 5682990 8815375 11665875 12623090 13017386 14030569 14633368 13650315
2065A3650315j610491l44572J101387O24340j859931m480698n230047l733648
$$ 13650315 12039824 11695252 12796639 13420979 11561048 7080350 1850303 -1883345
2057a883345j501865k51077j04828J1529N92664J216070J655996J980847J714457
$$ -1883345 -3385210 -3636287 -3741115 -3729586 -3136922 -1920852 -264856 1715991 3430448
2048C430448L85079j198044j760353j448150j197573o42126J142711L120318L169551
$$ 3430448 3815527 2617483 857130 -591020 -1788593 -2430719 -1288008 1832310 5001861
2039E001861J453041P2052n96882j817403k650393n78521K990823K818195k172090
$$ 5001861 6454902 6526954 5930072 4112669 1462276 883755 3874578 6692773 4520683
2030D520683n876685l614767P79702J279131q44001n8541L396208L736962m07602
$$ 4520683 -1356002 -4970769 -4191067 -2911936 -3755937 -3814478 -418270 3318692 2911090
2021B911090l274476r39611K789212K452152j325781l675970k415174J86746J267401
$$ 2911090 -363386 -1302997 1486215 3938367 2612586 -1063384 -3478558 -3291812 -2024411
2012b024411M11786p44083m28242J526462L310280L072434J214051l40289r35949
$$ -2024411 -1612625 -2356708 -2784950 -1258488 2051792 5124226 6338277 5997988 5062039
2003E062039j594915k668099l080718k286629j066967P5005J416656K473156K055694
$$ 5062039 3467124 799025 -2281693 -4568322 -5635289 -5560284 -4143628 -1670472 385222
1994C85222N42600r0274N54522L15654j999460m180466l473239l22085K503928
$$ 385222 927822 837548 1392070 1707724 -291736 -4472202 -7945441 -8267526 -5763598
1985e763598L303715K306621K44599k117141l602143l311364j511535R04041L142149
$$ -5763598 -2459883 -153262 91337 -2025804 -5627947 -8939311 -10450846 -9546805 -6404656
1976f404656M085398K477703j181696m016835l596957p41058J750338K369991
$$ -6404656 -2319258 158445 -1023251 -5040086 -8637043 -9378101 -7627763 -5257772
1968e257772J558855L6404j635389k276133q95769J557421K894405K431121J611933
$$ -5257772 -3698917 -3662513 -5297902 -7574035 -8469804 -6912383 -4017978 -1586857 25076
1959B5076J582110J653351Q67442k54549n76664n8859N29937J044126J891419
$$ 25076 1607186 3260537 4127979 3873430 3296766 3237907 3767844 4811970 6703389
1950F703389K686301K175897r6577k801138l988188k914465n58042J159760N76090
$$ 6703389 9389690 11565587 11469010 8667872 4679684 1765219 1207177 2366937 2943027
1941B943027k315164n103203m708565j058656J969888J061995j771969j458328
$$ 2943027 627863 -4475340 -9183905 -10242561 -8272673 -7210678 -8982647 -10440975
1933a0440975L026881O805974N628827J419696j017356n85155q1509j151055k516618
$$ -10440975 -7414094 -608120 5020707 6440403 5423047 4837892 4756383 3605328 1088710
1924A088710k916924k522819j138764J861357M907438M472329l72155n692220
$$ 1088710 -1828214 -4351033 -5489797 -3628440 1278998 5751327 5379172 -313048
1916c13048o764416l098634J935584N139493N635839M092166J619593o71243k105889
$$ -313048 -7077464 -10176098 -8240514 -3101021 2534818 6626984 8246577 7575334 5469445
1907E469445k608018k275182j254957j61207J49863m38199j088047r17917K89256
$$ 5469445 2861427 586245 -668712 -829919 -680056 -1118255 -2206302 -3124219 -2834963
1898b834963J952116K612637P30517l210049o074138n161029j413147K057278
$$ -2834963 -882847 1729790 2460307 -749742 -6823880 -11984909 -13398056 -11340778
1890a1340778L792015M216313L126173J39600k702643k431028K98018J662378
$$ -11340778 -7548763 -3332450 -206277 -66677 -2769320 -5200348 -4902330 -3239952
1882c239952M30942m45079Q59949K106376J182782o29240j876597l545537n606527
$$ -3239952 -2809010 -3254089 -2394140 -287764 895018 265778 -1610819 -5156356 -10762883
1873a0762883m863319N710M675903M737898K140032J450534K327493J133403j759674
$$ -10762883 -15626202 -15620492 -10944589 -6206691 -4066659 -2616125 -288632 844771 -914903
1864i14903k280010K18500J846692O04698j221680j842979k256969k646101j235629
$$ -914903 -3194913 -2976413 -1129721 -525023 -1746703 -3589682 -5846651 -8492752 -9728381
1855i728381J601864K496127L76656j348473j58560J746016J545004L48075O50783
$$ -9728381 -8126517 -5630390 -5253734 -6602207 -6760767 -5014751 -3469747 -3121672 -2470889
1846b470889J959848K048523N97038j108330k365755k626491q20998K409670L745855
$$ -2470889 -511041 1537482 2134520 1026190 -1339565 -3966056 -4787054 -2377384 1368471
1837A368471J261590k122428k199213P40484K706569J754495j79941r70208r03761
$$ 1368471 2630061 507633 -1691580 -951096 1755473 3509968 3330027 2359819 1456058
1828A456058j126524j695293j905256j265666Q7132J069591K72847j897954k615741
$$ 1456058 329534 -1365759 -3271015 -4536681 -4449549 -3379958 -3107111 -5005065 -7620806
1819g620806J6571L750197M614417K238534J65221N69121J452989M05319j260123
$$ -7620806 -7604235 -3854038 760379 2998913 3164134 3733255 5186244 5591563 4331440
1810D331440n14201K354820L420314L16959m165574n159025j668365K248935K594756
$$ 4331440 3817239 6172059 9592373 9909332 5743758 584733 -1083632 1165303 3760059
1801C760059J21529j476572r51674o30769j970327k729721m13866L275358M123442
$$ 3760059 3881588 2405016 1453342 822573 -1147754 -3877475 -4291341 -1015983 3107459
1792C107459J132705j961318j520899J546881L318752J631781j983167m542284
$$ 3107459 4240164 2278846 757947 2304828 5623580 7255361 5272194 729910
1784G29910m442458k108275Q83845K680374K032487n74049k871759k950089j495145
$$ 729910 -3712548 -5820823 -4936978 -2256604 -224117 -798166 -3669925 -6620014 -8115159
1775h115159p66222j169210m84650K573864N725782N800427K822681o65548l317788
$$ -8115159 -8881381 -10050591 -10535241 -7961377 -2235595 3564832 6387513 5721965 2404177
1766B404177n337609n780554k980490J763436M261517K684549M7252k40356J187287
$$ 2404177 -2933432 -8713986 -11694476 -9931040 -5669523 -2984974 -2937722 -3178078 -1990791
1757a990791J654525N99156o68013j504915j730416m38089K375649M321472L440382
$$ -1990791 -336266 262890 -405123 -1910038 -3640454 -4078543 -1702894 2618578 6058960
1748F058960J371822R43520J739881J235546n44309j170350l68987n25421k079211
$$ 6058960 7430782 8374302 10114183 11349729 10805420 9635070 9266083 8740662 6661451
1739F661451k290579K072J911433R14114j139400j031088Q93019J595111p2186
$$ 6661451 4370872 4372944 6284377 7198491 6059091 5028003 5921022 7516133 7443947
1730G443947k253278l014536k253413r15599j1622l12932j675352k735786k271836
$$ 7443947 5190669 2176133 -77280 -992879 -1004501 -1317433 -2992785 -5728571 -8000407
1721h000407n98270J158094K468940L069945K168556l78984k676266k496716l48750
$$ -8000407 -8598677 -7440583 -4971643 -1901698 266858 -112126 -2788392 -5285108 -5633858
1712e633858J008261L59114n51526o0947Q97810P05149r4529J22331R72385M63474
$$ -5633858 -4625597 -4266483 -4818009 -4878956 -3981146 -3275997 -3370526 -3248195 -2275810 -1812336
1702a812336j448214k126151j54067K047085J400247j336544k704989j701513
$$ -1812336 -3260550 -5386701 -5540768 -3493683 -2093436 -3429980 -6134969 -7836482
1694g836482r59089k108815k765275j66200M091904N761922L712733J150059P95587
$$ -7836482 -8795571 -10904386 -13669661 -13835861 -9743957 -3982035 -269302 880757 1676344
1685A676344J514176R41373p24058j546705j158296r15144j157265o25528R57286
$$ 1676344 3190520 4131893 3407835 1861130 702834 -212310 -1369575 -1995103 -1037817
1676a037817J822897Q80707j32712R17042K965066K933683L76318j711727j573954
$$ -1037817 785080 1665787 1533075 2450117 5415183 8348866 8725184 7013457 5439503
1667E439503j437906l458065n260990l098602J566819K957656p91170m451440
$$ 5439503 4001597 543532 -4717458 -7816060 -6249241 -3291585 -4082755 -8534195
1659h534195l009663J279313K594086m675k042090p12525J804514K697591K402701
$$ -8534195 -11543858 -10264545 -7670459 -7675134 -9717224 -10429749 -8625235 -5927644 -3524943
1650c524943K450109K332569Q93765q82491q86874R95668K652846K361082K59159
$$ -3524943 -1074834 1257735 2151500 1269009 382135 1377803 4030649 6391731 6650890
1641F650890k443337m273340l668440j17780M165510N171189J277915l919057
$$ 6650890 4207553 -65787 -3734227 -3852007 313503 5484692 6762607 2843550
1633B843550m727613J43891N674979O268589K132930j892271k884180k389517
$$ 2843550 -1884063 -1740172 3934807 10203396 12336326 10444055 7559875 5170358
1625E170358k450968k489026j595943r19603j385348j446781J29027J397210M41377
$$ 5170358 2719390 230364 -1365579 -2285182 -3670530 -5117311 -4988284 -3591074 -3149697
1616c149697n75563J204192L298509N31755o181577r250902m404497L494473P251827
$$ -3149697 -3725260 -2521068 777441 1309196 -4872381 -14123283 -18527780 -15033307 -7781480
1607g781480N868838L093135J103230k93085o92625L40203J116143K3402j214048
$$ -7781480 -1912642 1180493 2283723 1990638 1298013 1638216 2754359 2777761 1563713
1598A563713j31359J728100Q29549k132062k733918j23452J030980k034208n056724
$$ 1563713 1432354 3160454 3990003 1857941 -875977 -999429 31551 -2002657 -7059381
1589g059381k640981L437868O154209K709758j959983k092687J609312L805086
$$ -7059381 -9700362 -6262494 -108285 2601473 641490 -1451197 158115 3963201
1581C963201J968021q76787j096795L80248k53398l892221o814928n261760K2367
$$ 3963201 5931222 5054435 3957640 4337888 4084490 192269 -6622659 -11884419 -11862052
1572a1862052M832675N963800L625651L45098j420374j141241n13481j329371
$$ -11862052 -7029377 -1065577 2560074 2905172 1484798 343557 -169924 -1499295
1564a499295k710369j871077J574198M098343K945491M78651Q95546L665248L961506
$$ -1499295 -4209664 -6080741 -4506543 -408200 2537291 3015942 3911488 7576736 11538242
1555A1538242o5440m182710l928080o23573J073499j74158j250667K43424K470191
$$ 11538242 11472802 7290092 3362012 2738439 3811938 3637780 2387113 2630537 5100728
1546E100728K037259j363090m496349m468536j849161N76310J309413J164100
$$ 5100728 7137987 5774897 1278548 -3189988 -5039149 -4462839 -3153426 -1989326
1538a989326J005804K88903j213741j892803m29891J541117J268451r16129j810892
$$ -1989326 -983522 -694619 -1908360 -3801163 -4231054 -2689937 -1421486 -2337615 -4148507
1529d148507j71915J295556M1063k444038k779824l57021K182363K457921O21532
$$ -4148507 -4320422 -3024866 -2983803 -5427841 -8207665 -8564686 -6382323 -3924402 -3302870
$$ [...]
##END NTUPLES=NMR SPECTRUM
##END=
