##TITLE=31Pdec_DE-78H4_b
 D2O, 64 sc
 17.2.2025
##JCAMPDX= 6.0         $$ Bruker NMR JCAMP-DX V2.0
##DATA TYPE= NMR SPECTRUM
##DATA CLASS= NTUPLES
##ORIGIN= UXNMR, Bruker Analytische Messtechnik GmbH
##OWNER= root
$$ XWIN-NMR		Version 3.5
$$ Mon Feb 17 16:43:17 2025 Russian Standard Time (UT+4h)  she@DPX200
##.OBSERVE FREQUENCY= 81.013821
##.OBSERVE NUCLEUS= ^31P
##.ACQUISITION MODE= SIMULTANEOUS
##.ACQUISITION SCHEME= undefined
##.AVERAGES= 64
##.DIGITISER RES= 17
##SPECTROMETER/DATA SYSTEM= spect
##.PULSE SEQUENCE= zgpg30
##.SOLVENT NAME= CDCl3
##.SHIFT REFERENCE= (INTERNAL, CDCl3, 0, 198.062)
##AUDIT TRAIL= $$ (NUMBER, WHEN, WHO, WHERE, WHAT)
$$ ##TITLE= Audit trail, XWIN-NMR		Version 3.5
$$ ##JCAMPDX= 5.01
$$ ##ORIGIN= Bruker BioSpin GmbH
$$ ##OWNER= she
$$ F:/spectra/data/she/nmr/P31/2/pdata/1/auditp.txt
$$ ##AUDIT TRAIL=  $$ (NUMBER, WHEN, WHO, WHERE, WHAT)
(   1,<2025-02-17 16:41:54.37 +0400>,<she>,<DPX200>,
      <created by zg, POWCHK disabled, PULCHK disabled
       configuration hash MD5:
       00 E9 B6 7A A2 85 ED C7 34 08 36 98 17 FE 4E 26
       data hash MD5: 32K
       E9 96 80 89 65 E3 7F DF BB 04 78 18 89 D0 75 07>)
(   2,<2025-02-17 16:42:27.46 +0400>,<she>,<DPX200>,
      <Start of raw data processing
       efp BC_mod = 2 LB = 1.5 FT_mod = 6 PKNL = 1 PHC0 = 1714.488 PHC1 = 150.6954 SI = 64K 
       data hash MD5: 64K
       48 AE D7 AF EA 6D F4 65 73 73 CE E5 13 DB A8 28>)
(   3,<2025-02-17 16:42:45.40 +0400>,<she>,<DPX200>,
      <pk PHC0 = 8.831399 PHC1 = 0 
       data hash MD5: 64K
       9D 8F A0 60 14 A0 1F B3 F5 57 92 FA B3 E6 D9 B5>)
$$ ##END=
$$ 
$$ hash MD5
$$ 10 79 35 27 B0 0C E5 D1 F3 EC F7 52 F5 79 00 B0
##$RELAX= 
##$RELAX= 
##$RELAX= 
##$RELAX= 
##$RELAX= 
##$RELAX= 
##$RELAX= 
##$RELAX= 
$$ Bruker specific parameters
$$ --------------------------
##$DU= <F:/spectra>
##$EXPNO= 2
##$NAME= <P31>
##$PROCNO= 1
##$TYPE= <nmr>
##$USER= <she>
##$AMP= (0..31)
100 100 100 100 100 100 100 100 100 100 100 100 100 100 100 100 100 100 
100 100 100 100 100 100 100 100 100 100 100 100 100 100 
##$AQSEQ= 0
##$AQ_mod= 1
##$AUNM= <au_zg>
##$AUTOPOS= <>
##$BF1= 81.014009
##$BF2= 200.13
##$BF3= 200.13
##$BF4= 200.13
##$BF5= 200.13
##$BF6= 200.13
##$BF7= 200.13
##$BF8= 200.13
##$BYTORDA= 1
##$CFDGTYP= 0
##$CFRGTYP= 5
##$CHEMSTR= <none>
##$CNST= (0..31)
1 1 145 1 1 1 1 1 1 1 1 1 1 1 1 1 1 1 1 1 1 1 1 1 1 1 1 1 1 1 1 1 
##$CPDPRG= <waltz16>
##$CPDPRG1= <>
##$CPDPRG2= <waltz16>
##$CPDPRG3= <>
##$CPDPRG4= <mlev>
##$CPDPRG5= <mlev>
##$CPDPRG6= <mlev>
##$CPDPRG7= <mlev>
##$CPDPRG8= <mlev>
##$CPDPRGB= <>
##$CPDPRGT= <>
##$D= (0..31)
0 1 0 0 0 0 0 0 0 0.06 0 0.03 2e-05 3e-06 0 0 0.0002 0 0 0 0 0 0 0 0 0 
0 0 0 0 0 0 
##$DATE= 1739796113
##$DBL= (0..7)
120 120 120 11 120 120 24 19 
##$DBP= (0..7)
150 150 150 150 150 150 150 150 
##$DBP07= 0
##$DBPNAM0= <>
##$DBPNAM1= <>
##$DBPNAM2= <>
##$DBPNAM3= <>
##$DBPNAM4= <>
##$DBPNAM5= <>
##$DBPNAM6= <>
##$DBPNAM7= <>
##$DBPOAL= (0..7)
0.5 0.5 0.5 0.5 0.5 0.5 0.5 0.5 
##$DBPOFFS= (0..7)
$$ [...]
##$SUBNAM2= <"">
##$SUBNAM3= <"">
##$SUBNAM4= <"">
##$SUBNAM5= <"">
##$SUBNAM6= <"">
##$SUBNAM7= <"">
##$SUBNAM8= <"">
##$SUBNAM9= <"">
##$SW= 400.765351723535
##$SWIBOX= (0..15)
0 1 3 0 0 0 0 0 0 0 0 0 0 0 0 0 
##$SW_h= 32467.5324675325
##$TD= 32768
##$TD0= 1
##$TE= 0
##$TE2= 300
##$TE3= 300
##$TEG= 300
##$TL= (0..7)
0 120 53 12 22 120 120 120 
##$TP= (0..7)
150 150 150 150 150 150 150 150 
##$TP07= 0
##$TPNAME0= <>
##$TPNAME1= <>
##$TPNAME2= <>
##$TPNAME3= <>
##$TPNAME4= <>
##$TPNAME5= <>
##$TPNAME6= <>
##$TPNAME7= <>
##$TPOAL= (0..7)
0.5 0.5 0.5 0.5 0.5 0.5 0.5 0.5 
##$TPOFFS= (0..7)
0 0 0 0 0 0 0 0 
##$TUNHIN= 0
##$TUNHOUT= 0
##$TUNXOUT= 0
##$USERA1= <user>
##$USERA2= <user>
##$USERA3= <user>
##$USERA4= <user>
##$USERA5= <user>
##$V9= 5
##$VALIST= <valist>
##$VCLIST= <CCCCCCCCCCCCCCC>
##$VD= 0
##$VDLIST= <DDDDDDDDDDDDDDD>
##$VPLIST= <PPPPPPPPPPPPPPP>
##$VTLIST= <TTTTTTTTTTTTTTT>
##$WBST= 1024
##$WBSW= 4
##$XGAIN= (0..3)
0 0 0 0 
##$XL= 0
##$YL= 0
##$YMAX_a= 7153
##$YMIN_a= -6544
##$ZGOPTNS= <>
##$ZL1= 120
##$ZL2= 120
##$ZL3= 120
##$ZL4= 120
##$ABSF1= 0
##$ABSF2= 0
##$ABSG= 0
##$ABSL= 0
##$ALPHA= 0
##$AQORDER= 0
##$ASSFAC= 0
##$ASSFACI= 0
##$ASSFACX= 0
##$ASSWID= 0
##$AUNMP= <proc_1d>
##$AZFE= 0.1
##$AZFW= 0.5
##$BCFW= 0
##$BC_mod= 2
##$BYTORDP= 0
##$COROFFS= 0
##$CY= -3
##$DATMOD= 1
##$DC= 0
##$DFILT= <>
##$DTYPP= 0
##$F1P= 0
##$F2P= 0
##$FCOR= 1
##$FTSIZE= 65536
##$FT_mod= 6
##$GAMMA= 0
##$GB= 0
##$INTBC= 1
##$INTSCL= 9.790993e-09
##$ISEN= 30
##$LB= 1.5
##$LEV0= 0
##$LPBIN= 0
##$MAXI= 10000
##$MC2= 0
##$MEAN= 0
##$ME_mod= 0
##$MI= 50
##$NCOEF= 0
##$NC_proc= -9
##$NLEV= 6
##$NOISF1= 182.463
##$NOISF2= 159.3651
##$NSP= 0
##$NTH_PI= 0
##$NZP= 0
##$OFFSET= 198.0616
##$PC= 4
##$PHC0= 1723.319
##$PHC1= 150.6954
##$PH_mod= 1
##$PKNL= yes
##$PPARMOD= 0
##$PSCAL= 0
##$PSIGN= 0
##$REVERSE= no
##$SF= 81.0140089999434
##$SI= 65536
##$SIGF1= 159.3651
##$SIGF2= -187.1042
##$SINO= 113.3802
##$SIOLD= 16384
##$SREGLST= <1H.CDCl3>
##$SSB= 0
##$STSI= 65536
##$STSR= 0
##$SW_p= 32467.5324675325
##$SYMM= 0
##$S_DEV= 0
##$TDeff= 32768
##$TDoff= 0
##$TI= <>
##$TILT= no
##$TM1= 0
##$TM2= 0
##$TOPLEV= 0
##$USERP1= <user>
##$USERP2= <user>
##$USERP3= <user>
##$USERP4= <user>
##$USERP5= <user>
##$WDW= 1
##$XDIM= 65536
##$YMAX_p= 450802522
##$YMIN_p= -466921585
$$ End of Bruker specific parameters
$$ ---------------------------------
##NTUPLES= NMR SPECTRUM
##VAR_NAME=  FREQUENCY,     SPECTRUM/REAL,   SPECTRUM/IMAG
##SYMBOL=    X,             R,               I
##VAR_TYPE=  INDEPENDENT,   DEPENDENT,       DEPENDENT
##VAR_FORM=  AFFN,          ASDF,            ASDF
##VAR_DIM=   65536,         65536,           65536
##UNITS=     HZ,            ARBITRARY UNITS, ARBITRARY UNITS
##FACTOR=    0.49542278885378, 1,            1
##FIRST=     16045.7642231865, 0,            0
##LAST=      -16421.768244346, 0,            0
##MIN=       -16421.768244346, -466921585,   0
##MAX=       16045.7642231865, 450802522,    0
$$ Real data points
##PAGE= N=1
##DATA TABLE= (X++(R..R)), XYDATA
$$ [...]
8616 7979372 8708392 4246662 2088690 4164542 5127192 2707410 1836576 6549641 13910693
8607 13910693 18754552 19885164 19026266 17652848 17270008 18940939 20113026 15956733
8599 15956733 6618909 -1099872 -2656833 -1829418 -3323372 -3840892 2652248 13165490
8591 13165490 17009068 9547997 -1686123 -6612279 -3600446 1372590 2827292 536744
8583 536744 -1431392 1345805 8864831 15243096 14617692 8968189 6543560 11294240 18000748
8574 18000748 20464050 20300809 22887063 27211179 25992470 16373991 5174943 861263
8566 861263 3593548 6477406 4908470 1124767 -425224 948305 2286343 1110017
8558 1110017 -2589898 -7640911 -12739315 -15990136 -15384120 -10942144 -5412912 -1809311
8550 -1809311 -886085 -1682026 -3342856 -5080655 -5362719 -3139352 281106 2308037 2139365
8541 2139365 1308671 1210367 1836907 3159501 5623914 8363988 8951227 6589264 4196470
8532 4196470 5402919 10158288 15017785 17310994 17294664 16404778 15307694 14094892 12760478
8523 12760478 10688253 6945658 2055455 -1575506 -2259730 -1487400 -2455712 -6221797 -10484007
8514 -10484007 -12456909 -11983929 -11146133 -11307935 -11432562 -9634893 -6023574 -3165923 -3073958
8505 -3073958 -4324121 -3817521 -1710393 -2264920 -7840069 -14018359 -14309447 -9127087 -5638222
8496 -5638222 -7529425 -9629878 -5955160 864417 3357506 378459 -1387665 2849958
8488 2849958 10235938 15672966 18045177 18449964 16387229 11421088 5949466 2496212
8480 2496212 -215494 -5070792 -11526197 -16112583 -17440852 -17397326 -17169806 -15238749 -10549431
8471 -10549431 -5436192 -3534018 -5588708 -8778665 -10154145 -9632352 -8857975 -7919613 -5315983
8462 -5315983 -1902311 -2095186 -8105081 -14745677 -14493581 -7497131 -1612264 -1699036 -4518181
8453 -4518181 -6426102 -9731892 -16619077 -22153783 -20132974 -12715185 -7365028 -6300435
8445 -6300435 -5944038 -5245427 -6472666 -7714286 -3208113 6466362 12118561 7764270 -1269665
8436 -1269665 -6218435 -5694108 -4079033 -3549429 -2893785 -1265981 1754231 7656814 16130774
8427 16130774 22429309 21732016 14990428 7220142 1716341 -743484 661462 5483274
8419 5483274 9413187 7930587 2561425 -675665 592018 2399256 728397 -3013492
8411 -3013492 -4330162 -993622 5413893 11664391 15359996 16148352 15205521 13454305 10965212
8402 10965212 8444433 7430522 7522217 5531727 -63012 -5659017 -6754763 -4153746
8394 -4153746 -2100088 -1361319 1011205 5084566 6633820 3930593 955665 1047955 1735534
8385 1735534 -221379 -2228996 509736 6542847 8910321 4644959 -1162210 -2244915
8377 -2244915 1678738 6687072 10298998 12318521 12406804 10642858 9516202 11366380 13733311
8368 13733311 11419462 4529569 268000 3737757 10368098 11775237 6842418 1712348
8360 1712348 -230922 -2154227 -6387612 -9245047 -6684552 -998590 2205611 1247541
8352 1247541 -838891 -817454 2370877 7697128 11635620 9863527 2449410 -4919200 -8052816
8343 -8052816 -9690710 -13725009 -17415899 -15639428 -10792980 -10716459 -16533073 -20382970 -17486239
8334 -17486239 -13149154 -13658821 -16412562 -15001942 -10105898 -8688502 -13610248 -19628574
8326 -19628574 -20217441 -14566176 -6960646 -1689450 619714 2778358 7252894 12366022
8318 12366022 13821022 10755630 7529058 7242027 6384906 49301 -9115436 -12323550
8310 -12323550 -5712193 4426166 9418418 7844404 4829632 4359722 5852308 7356414
8302 7356414 8424898 8900631 7441093 3114926 -2583321 -6846429 -8245988 -7165189
8294 -7165189 -4138372 447378 4797634 5873809 2644569 -1707416 -2504914 1399834
8286 1399834 6355384 7903852 5336548 1886951 704945 1211264 95849 -3936124
8278 -3936124 -7685504 -7247874 -3505869 -1361468 -3320757 -6680718 -8097013 -7837089 -7413246
8269 -7413246 -5944153 -2127582 2152819 3791819 2953167 2379110 3224749 4791740 7235352
8260 7235352 10747637 12892512 11031082 7199379 6197675 8532879 9673797 7050519
8252 7050519 3357975 1762160 2281136 4473897 9102143 14723037 16778287 12947918
8244 12947918 6071503 -530650 -6688502 -11642163 -11372320 -4335091 3410948 4118640
8236 4118640 -2111091 -8193107 -9429374 -7811118 -7352372 -8919748 -10167119 -8159217
8228 -8159217 -1933971 5899173 10699767 10361360 7242337 4409289 2132676 -111182
8220 -111182 -1041622 -103264 -202355 -4012325 -9036731 -10407189 -7923018 -6451949 -9302478
8211 -9302478 -14519722 -18232390 -19083715 -18692978 -19321969 -21319033 -22173012 -18939611 -12064218
8202 -12064218 -4812620 1659516 9175309 16762159 18542413 11385272 1116756 -3828083
8194 -3828083 -2516532 -568925 -1707735 -5788830 -13019213 -23400450 -32531325 -34429890
8186 -34429890 -29177167 -22496068 -17577418 -12800427 -7728262 -5104285 -5396474 -4956621
8178 -4956621 -1693626 1999846 3661836 3842120 3560898 3028883 3681270 6607983 8314366
8169 8314366 3866853 -4475286 -8221281 -4495123 -333939 -1897358 -5858112 -5871956 -1651539
8160 -1651539 3581743 9286345 15088086 16389427 9459783 -1253174 -6886836 -4137582
8152 -4137582 2845600 8555700 9615571 4331636 -5878695 -15178137 -17546383 -12163511
8144 -12163511 -2501695 7552231 13936995 12625606 4582460 -2120760 -482639 6938934
8136 6938934 12541754 14170315 15082049 15553200 12029593 4627536 -1601576 -4076841 -5070297
8127 -5070297 -5202061 -969102 8406643 17189615 19967646 18304344 16993264 16898811 15208158
8118 15208158 10640456 5033868 839024 -711004 25827 967252 -257439 -3573033
8110 -3573033 -6540345 -7859901 -8652114 -9204246 -7074330 -525508 8033845 14187045 15630581
8101 15630581 12253615 3991938 -8217201 -19900329 -24956073 -21582434 -14557361 -10091491
8093 -10091491 -9372642 -8741166 -5495144 -971874 2814843 6697311 11750482 15089613
8085 15089613 12659099 6271361 3112800 6345052 10446957 8962245 3175202 -965198
8077 -965198 -1559645 -1496178 -2436830 -3426863 -4804863 -8325680 -13091591 -15779273 -15290981
8068 -15290981 -13113545 -9154992 -2237518 4564559 4698712 -3209400 -11853797 -13485703
8060 -13485703 -8512047 -3169899 -1443173 -2150767 -2000466 1085899 6435339 10844234
8052 10844234 11753226 10870122 12217415 15896127 17286069 14164147 10872278 12366232
8044 12366232 17089025 19556831 18255003 17027480 18966508 22050436 21476384 14796504
8036 14796504 4535338 -3563846 -5279844 -1445576 3581139 6529678 7145608 6593704
8028 6593704 6491678 8758725 12904907 13883855 7287713 -2818319 -6756294 -1825285
8020 -1825285 3661666 2052045 -3754261 -6744077 -6561985 -7200360 -8000957 -4988368 472682
8011 472682 2190646 -1503095 -5726336 -7195992 -7972672 -9434450 -8679056 -3930001 1284304
8002 1284304 2722649 657141 -2419264 -6004408 -10253329 -13054967 -11953865 -7619561
7994 -7619561 -2780938 1024065 3485961 4031794 3064114 3456040 7593127 13109666 14579998
7985 14579998 10204256 4389130 2306333 3765473 4622456 3246429 2593815 5122749
7977 5122749 8522249 9031239 7233323 6939507 8744702 8907710 5720328 2778405 3448783
7968 3448783 5820185 6642712 7100754 10241757 15042158 18150143 20087164 24113604 29318743
7959 29318743 30712954 27060882 23045787 21883792 21032591 17764920 13970500 11734693
7951 11734693 8349241 430890 -9556897 -15523007 -15305611 -12288403 -10285360 -10093545
7943 -10093545 -10687412 -10991119 -10466603 -9745675 -10035476 -10379520 -7092455 1650063 11954122
7934 11954122 17760205 17500362 14607603 12293062 10964506 10476250 11428980 13351474 14171059
7925 14171059 12631575 9671130 7004293 5954161 7670157 12318146 17605025 20172273
7917 20172273 19176458 16835646 15019871 13155141 9989301 5474022 264961 -4675339
7909 -4675339 -7365126 -6057601 -2363516 -800903 -3512731 -7306017 -7746839 -4466428
7901 -4466428 -429590 2345598 3835570 4032170 2719509 819900 -280637 -335891 698439
7892 698439 4027632 9685894 13891159 12440490 6528015 1080679 -3048587 -10193219
7884 -10193219 -21262255 -29412680 -28736059 -23342401 -21904700 -25094855 -24988164 -17343867
7876 -17343867 -8299366 -6155029 -10846714 -15221185 -14417688 -10479868 -8314483 -9590218
7868 -9590218 -11111939 -8618793 -2223234 2600333 970474 -5064399 -8788558 -7426278
7860 -7426278 -5057500 -5940079 -8752846 -9870897 -9005496 -8170151 -7416528 -5380043 -2682953
7851 -2682953 -1252601 -1074579 -706239 -138292 -59087 768586 3889130 7448059 7748068
7842 7748068 4535972 1402945 837537 2233311 4899849 9155011 13416268 13789451 8346763
7833 8346763 -544344 -9230750 -15788541 -19469466 -20132252 -19408014 -19764909 -21183573 -21119612
7824 -21119612 -18546875 -15282868 -12527295 -9309561 -5528311 -3098926 -2447161 -1205398
7816 -1205398 1710258 3998949 3984430 3415525 4045376 4785823 4620545 4688754 4762604 1750115
7806 1750115 -4675962 -8974337 -6793259 -1746349 -287408 -2869221 -5317463 -5993512
7798 -5993512 -5898688 -4591474 -2530833 -4690630 -13928535 -22654768 -20389994 -9454723
7790 -9454723 -3159494 -6695770 -10298731 -5494159 2207348 3830611 1325045 1992127
7782 1992127 4653424 2167691 -5160422 -9397385 -8058198 -7628226 -12105022 -16605436
7774 -16605436 -16184421 -14100631 -16003552 -20436323 -20864291 -15057625 -7469224 -2811456
7766 -2811456 -1310898 -882980 -868458 -1921116 -3634442 -4101173 -2062569 1278026 3203628
7757 3203628 2122629 -1281568 -5312511 -8460896 -9092646 -5747663 822399 7199988
7749 7199988 10656303 12049997 13655983 15326787 15281458 13749510 12606837 11595725 8511408
7740 8511408 3840781 1563513 3712911 7432934 9616768 11248276 13996067 15305938
7732 15305938 11411735 4192308 425601 3550836 9695722 13026986 12169547 9893578
7724 9893578 8878279 9686119 11412658 12621237 12411838 11475784 11179288 11280681 10249196
7715 10249196 8340991 7941906 9625204 10636455 9492960 9223332 12453682 15469939
7707 15469939 12033728 2448784 -6325513 -10145549 -11933015 -14718864 -16140909 -13788819
7699 -13788819 -11238609 -12989163 -16284277 -14500653 -7530249 -1894047 81087 4047959
7691 4047959 13604089 22664065 23056329 15842315 9257401 7351841 6525601 3064377 -1451051
7682 -1451051 -3760131 -3698505 -3057470 -2493825 -1809082 -1353548 -1177202 -175130 2398856
7673 2398856 5834821 9433600 13291824 16384133 16166213 12176615 7802429 5592298
7665 5592298 2929922 -3462754 -9916978 -8275267 2739652 13622766 14734882 7352460
7657 7352460 285909 -1939924 -2774872 -6473416 -12267841 -16825092 -18644809 -17927263 -14711058
7648 -14711058 -9523880 -4290976 -377682 3330957 8403383 13484660 15032823 11792820
7640 11792820 7136352 6075364 10216917 16038769 18268597 15045255 9564845 6426322
7632 6426322 6916174 8632148 9014026 7676723 5585148 4044436 4848992 9088764 14675878
7623 14675878 17124996 14350440 8998933 4551166 1162071 -2562247 -5867040 -7135388
7615 -7135388 -7458384 -9157906 -11214498 -10167925 -6136138 -3991143 -6774016 -11112399
7607 -11112399 -11571970 -7158231 -809994 5568872 11920770 16405951 14946759 6306311
7599 6306311 -4454283 -10107758 -8588483 -4313744 -1968233 -1230913 608931 2748316
7591 2748316 1349431 -3759582 -6795641 -2850135 5642465 12141495 13582666 11425511
7583 11425511 7144001 1226858 -4060881 -5875386 -5419851 -6944891 -10932673 -12541847
7575 -12541847 -8611857 -2131837 2575872 5205030 7072654 7051576 3709029 -1174138
7567 -1174138 -5110493 -8833135 -13807668 -17574264 -15924575 -9130377 -2306155 212412
7559 212412 -2149756 -8200481 -16581850 -25335181 -32566526 -37606491 -39723091 -36926975
7551 -36926975 -28687436 -18546913 -10952145 -6613237 -3980095 -3298446 -4826567 -4764543
7543 -4764543 1196381 10375901 14851312 11389083 4240744 -2639412 -9855737 -17204478
7535 -17204478 -20731872 -18822292 -15592046 -13995097 -10758958 -3141755 4132855 4905999
7527 4905999 1071345 -458864 2069105 4484889 4392489 3129339 1094242 -2137113 -3294759
7518 -3294759 1937857 10744290 14310379 9094461 953800 -4150941 -7259511 -10915140
7510 -10915140 -12708664 -9291957 -2336812 4494265 10551673 14949801 12517666 292758
7502 292758 -13997118 -17782983 -8486912 3840130 9536266 8756457 6424931 4539288
7494 4539288 3144011 3424542 4960929 3894129 -1069836 -4130095 270610 7929087
7486 7929087 9661274 5070318 3934996 11761102 20986215 21333528 13915024 8715993
7478 8715993 10439750 13518698 11503389 5760000 2604811 5489021 12605911 19935470
7470 19935470 24252561 24508495 22237053 19869210 17627051 13435578 6969756 1768882
7462 1768882 1210512 3850841 5275217 3661437 921110 -977840 -1816654 -1468557 153990
7453 153990 871170 -2521830 -9206417 -13830831 -13417557 -11658905 -12858308 -14244595 -9399115
7444 -9399115 1393364 9658633 8937456 2021233 -4198604 -7151641 -8648998 -9699007
7436 -9699007 -9528391 -8323488 -7111048 -5673096 -3879013 -3928663 -7188124 -9669088 -5936038
7427 -5936038 1988853 5417269 834725 -4764016 -4164430 -189870 147603 -2364503 -842593
7418 -842593 5407650 8735888 4915312 -247626 286040 5077315 8077499 8068956 8562507
7409 8562507 10275316 9306531 3025547 -6119259 -13348257 -15615279 -12988893 -8543554
7401 -8543554 -6900540 -10325494 -15829664 -18045859 -15018817 -9320286 -3981361 10719
7393 10719 2378270 3003561 3388512 5495872 7989977 6930857 2112415 -644374 3301505
7384 3301505 10419840 13166264 9638502 4638451 1553744 -1625698 -6527920 -9365558
7376 -9365558 -5586791 2898233 9356679 10413517 8922064 8517302 8849076 7586116 4425508
7367 4425508 1041927 -1384957 -2761349 -3242115 -3260717 -3414640 -3155345 -1026526 2328514
7358 2328514 3317977 88739 -3474161 -1851680 4565286 9607431 9095998 4775353 -149612
7349 -149612 -5202881 -10354828 -13312922 -12318253 -9284502 -7119778 -5816859 -4162849 -3487159
7340 -3487159 -6143993 -11224659 -15162623 -16199190 -15343265 -13428044 -10281019 -6486718
7332 -6486718 -2819308 1893426 8863270 15055731 14763174 7111887 -1071626 -2248286
7324 -2248286 3600157 9520399 9394627 3962066 -493645 929641 5961928 7301199
7316 7301199 1456886 -6699097 -10721738 -11337946 -13624415 -17055988 -15270665 -6940122
7308 -6940122 64064 -1036760 -7081630 -11044207 -12211146 -14432494 -17430741 -16499245
7300 -16499245 -10044110 -2013891 3203106 4265768 1884607 -1601816 -2429388 535947
7292 535947 2699819 -797131 -7498126 -10915046 -10560326 -11652022 -14090790 -10109401 3098308
7283 3098308 15688970 16556136 7691881 272987 -590308 87940 -2769363 -7314663 -8863969
7274 -8863969 -5588165 1070900 7115264 6401008 -4289658 -18633956 -24426200 -17024170
7266 -17024170 -4830118 2007729 3615327 6120424 9785592 9094790 3166604 -2165130
7258 -2165130 -3908731 -6002223 -10741280 -13036953 -8555712 -2449819 -3283781 -11054108
7250 -11054108 -17746607 -18152467 -13573038 -5759645 5173962 15603831 18713515 13631527
7242 13631527 8707032 11569695 20276629 28227334 33274060 36678875 36666430 29708013
7234 29708013 17312947 6109253 1045232 2245568 7687512 14708767 19526397 19851187
7226 19851187 18075928 17978439 18715349 16480954 11592222 8470732 8097837 6299442 1179947
7217 1179947 -3459498 -4893066 -6342248 -11082161 -15857974 -14861740 -7656818 1064681
7209 1064681 7597341 11087816 10905921 6425990 -745268 -7321760 -11140450 -11754908 -9378040
7200 -9378040 -5189459 -1301921 1698526 5649632 11101120 14766378 13672904 10050141
7192 10050141 8409236 8866824 7341483 2125035 -3603665 -6362921 -6159984 -4741868
7184 -4741868 -2790312 -152905 2992903 6262594 9111961 10320003 8712609 4823972
7176 4823972 946575 -607305 947002 3915251 3986445 -2811765 -14837377 -24293810
7168 -24293810 -24928077 -19096770 -13962156 -11705408 -7642032 1797963 13391134 20837264
7160 20837264 21026578 15066782 5782605 -3810866 -11288243 -15905738 -18263223 -18448344
7152 -18448344 -15824470 -10942015 -5969777 -2640231 -1113851 -1081374 -2426830 -4565763
7144 -4565763 -6552176 -7803869 -7454945 -3996778 2051394 6003069 2955866 -5863816
7136 -5863816 -13763330 -16011740 -13699544 -10097909 -7024148 -5919295 -8556915 -14166712
7128 -14166712 -18410941 -17622493 -12663445 -7427963 -5238470 -7275982 -12147027 -16250204
7120 -16250204 -17036079 -16312933 -17400876 -19048171 -16505424 -9466359 -3813456 -3244019 -4092995
7111 -4092995 -1677776 2639357 4469267 2599088 -1642346 -7423900 -12675218 -13103765
7103 -13103765 -7737420 -2121450 -1039753 -1436051 1856820 6779980 7306025 3554840
7095 3554840 953792 366073 -3012221 -10496527 -17107703 -19230496 -18197987 -14581012
7087 -14581012 -6106426 5562526 12478118 9543514 1634746 -2752441 -1759191 -287079
7079 -287079 -2515549 -7825590 -12424728 -12448693 -7072836 -324221 2119633 -761681 -4525575
7070 -4525575 -5599847 -5162356 -5457718 -6115580 -6291785 -6823584 -7636683 -6327235 -2068481
7061 -2068481 2246609 4535852 6856002 11041806 14397612 13596562 10059506 7398246
7053 7398246 5910484 3733935 1260905 24707 -920145 -2873965 -3243147 1605664 9847485
7044 9847485 15196943 14269874 8847221 1298351 -7419863 -14825452 -16941777 -13084723
7036 -13084723 -7159394 -2771173 -193146 710133 -1655054 -7406484 -12643466 -13138823
7028 -13138823 -9458140 -6217176 -6769956 -10182631 -13253941 -14266537 -14108773 -13862351 -12371156
7019 -12371156 -7877933 -2048249 217269 -3570269 -10324815 -15793475 -19535864 -22624344
7011 -22624344 -23129926 -18572068 -11651256 -8419288 -10290111 -12137453 -9321601 -3117212
7003 -3117212 1759880 1993073 -2444790 -8103362 -9567091 -4663345 1751463 3225561
6995 3225561 899729 2043767 8569733 13268188 10338818 3766479 728969 1497897
6987 1497897 1423316 -586908 -1785529 -1781361 -2700044 -3562065 -459377 6387166 10510248
6978 10510248 6616601 -2570597 -9102798 -8173766 -2330739 1980792 1128402 -2608402
6970 -2608402 -4589317 -3621000 -2649851 -3989575 -6536055 -8465592 -9773456 -10651307 -10258259
6961 -10258259 -8941513 -8575405 -8618486 -5656734 122386 2362526 -2953472 -10354811 -11993195
6952 -11993195 -8413368 -5219061 -2005189 6247089 17596087 23206450 20935314 18946291
6944 18946291 21634678 21461924 11676683 -664793 -3500041 3258301 9028183 8298116
6936 8298116 5522541 4700223 3589796 834017 942611 7443996 16087439 19889005 18326654
6927 18326654 17248788 20767833 26517690 28759535 24128889 14387857 4821094 -152150
6919 -152150 -528543 154056 -825611 -2754411 -3297519 -1559576 1479843 4708360 8028940
6910 8028940 11768623 15223650 16066691 12121521 4503544 -1907108 -2700676 1448664 5583693
6901 5583693 5658048 1767319 -3291004 -6926571 -8158317 -7610855 -6393651 -4254498 300501
6892 300501 6654934 10373036 7834958 2014803 122326 5073399 12602883 17374330
6884 17374330 18072787 15281429 9047109 1610872 -1594931 1789120 6535107 6528544 4092521
6875 4092521 6843776 15573544 21466730 17477189 7605663 1495494 2974952 7639767
6867 7639767 9925276 8614577 5445500 1581104 -3023420 -8178111 -12916547 -16398436
6859 -16398436 -18642954 -19908991 -19546952 -16321553 -10428366 -4410124 -842279 761337
6851 761337 3601542 9969348 18742813 26503673 30405155 30121097 27901830 26642985 27136101
6842 27136101 27609426 26838408 26688183 29594230 33931816 34408147 27808575 16607534 6191685
6833 6191685 65685 -1630873 -714277 697326 1538586 2410510 4167308 5933419 5959099
6824 5959099 4320821 2615403 763980 -3085791 -8458817 -11342725 -9170351 -4729291
6816 -4729291 -2703012 -4069105 -6421639 -8430526 -11178446 -15526472 -20203993 -22302241
6808 -22302241 -18843800 -9491297 1000769 5553917 2568619 -1325624 334642 4876897
6800 4876897 4483042 -2167404 -8004617 -8015067 -5886789 -7425309 -11704633 -12955329 -9093127
6791 -9093127 -4266635 -3247446 -6403293 -10942789 -15042842 -19057369 -22884509 -23745228
6783 -23745228 -18422793 -7959328 1974307 6972442 8430769 10054182 11830560 11126104
6775 11126104 8632216 8457644 11783603 15018199 15684581 15539437 15362081 11244227 390451
6766 390451 -12388788 -18937464 -17332071 -12928671 -10463393 -9494217 -8243487 -7753212 -9744282
6757 -9744282 -12469548 -11458726 -4566055 4906344 10855707 10236984 5735587 2031518
6749 2031518 415297 -974161 -2340743 -1354813 1796321 2462891 -2207291 -7912991 -8182394
6740 -8182394 -3114345 1119689 779289 -1817241 -3271169 -3267640 -2594146 -1027906 722569
6731 722569 176975 -3380342 -7067373 -8633663 -10155268 -14223224 -18003623 -15203081 -4411954
6722 -4411954 7706793 13071072 10142933 3765954 -1451862 -5352753 -10000950 -15533107
6714 -15533107 -19805778 -21353983 -20763111 -18678069 -14263833 -7370974 -1417041 -1605379
6706 -1605379 -9146750 -18559201 -22316992 -18111831 -10582094 -5996110 -6444638 -9680835
6698 -9680835 -13186286 -16458451 -19322466 -20139105 -17327491 -11862288 -6564711 -2977816
6690 -2977816 -396744 1768119 2145030 -1066313 -7157578 -12174841 -11496440 -3954860 6062244
6681 6062244 11753111 10625552 7337326 8095693 13096693 17043435 16603691 13905420 12082783
6672 12082783 10941419 8704248 5065573 468488 -5064616 -10161529 -11548061 -7841013
6664 -7841013 -2182695 1045183 448638 -2997519 -8120648 -12874115 -14456189 -13016695
6656 -13016695 -12261082 -13035738 -9975744 402156 11345916 12366765 3063622 -6302057
6648 -6302057 -8371765 -6289520 -6270855 -8893864 -10974959 -11393825 -11263192 -11036007 -10244420
6639 -10244420 -8278131 -4140671 2138045 7209733 6984360 2562019 -138640 2063479
6631 2063479 6491869 10375091 14606548 19067162 19485638 13424191 5430381 1375915
6623 1375915 775312 -273287 -1257680 1802901 8958352 15583832 18760646 19228296 16830809
6614 16830809 9513634 -1329940 -8947890 -7689739 733847 9376468 12779802 10289677
6606 10289677 4661972 -619829 -3611219 -5332800 -8808318 -15446859 -22181149 -23209510
6598 -23209510 -15571799 -2974504 6905108 9454806 6585838 2702888 -654535 -3931436
6590 -3931436 -5464908 -2751787 2347337 4601210 3104015 3302840 8632561 14405757
6582 14405757 13967376 7651294 1102185 -2881939 -5774229 -7920759 -7154605 -3377296
6574 -3377296 -230114 -659177 -3454712 -5420079 -5257537 -4513859 -5637876 -9163069 -12369253
6565 -12369253 -11827993 -7976528 -5239884 -6367298 -9111873 -10365681 -10583758 -11273473 -11208143
6556 -11208143 -9095530 -7365531 -8565836 -10056586 -7751586 -3974994 -5648907 -14473604
6548 -14473604 -24433378 -30040929 -32011668 -33165152 -33241965 -30248466 -24041737 -16799727
6540 -16799727 -11810381 -11853432 -16058260 -18828532 -15518379 -8785609 -5052682 -5106106 -3742013
6531 -3742013 677162 2704020 -1642948 -8446707 -11734450 -11412173 -11314970 -12576476 -13033207
6522 -13033207 -11279408 -8041566 -4872269 -3691063 -6005767 -10712084 -14185412 -13865835
6514 -13865835 -10375385 -6136756 -4438292 -9015673 -19772004 -28642455 -25787937 -12107559
6506 -12107559 163888 2397497 -605970 322468 5757526 9684029 9953755 9655311
6498 9655311 10072303 8567226 3136110 -5137137 -13427260 -18035753 -16041827 -9259030
6490 -9259030 -3788988 -2258968 -107111 6310852 12453525 12435558 9130519 9846607 14412161
6481 14412161 15750530 11395640 6487865 5156170 6286254 8408188 11599263 13493781
6473 13493781 10339780 3414262 -2125923 -5706134 -11287386 -17530549 -16609154 -6296795
6465 -6296795 4709593 8154137 5792803 2627227 -2012145 -9698290 -15425228 -13487616
6457 -13487616 -7397645 -5903323 -10973697 -16757993 -19049098 -18966753 -17992183 -15905286 -13746177
6448 -13746177 -13062130 -12014905 -7582127 -1607636 996844 266667 1149156 4434204 4469021
6439 4469021 -1404195 -7441742 -7751012 -4852016 -4847268 -7867252 -9237940 -7961241 -7779639
6430 -7779639 -10045074 -11215129 -8763178 -4999581 -2830968 -1301379 1845299 5801784
6422 5801784 8248381 9753322 12926122 17302973 18611633 14370907 7466773 2134757
6414 2134757 -1536927 -6244633 -11621742 -13236506 -8361271 -290769 4753569 3711895
6406 3711895 -1661552 -7915545 -12658171 -14521691 -12418709 -6060169 2869227 10495209
6398 10495209 12571645 7878156 206472 -4354404 -3144108 903418 3563475 4264118
6390 4264118 5068406 6212332 5604515 2569086 -1016132 -4118767 -8068490 -12867045 -14689915
6381 -14689915 -10184893 -1956110 3493872 2996430 -1028471 -5349816 -9274990 -12228307
6373 -12228307 -11959451 -8102627 -4809786 -6099610 -10024074 -11351030 -9398280 -8883489
6365 -8883489 -12355446 -15960684 -14675397 -8521192 -1317125 3949190 5887803 3518712
6357 3518712 -2022711 -6035967 -4339767 1303242 4738884 2359890 -4025105 -10952997
6349 -10952997 -16865308 -21376579 -23794539 -23746381 -21769201 -18596986 -15159538 -13272446
6341 -13272446 -14326810 -16841381 -17163925 -13251641 -6435319 541748 5548270 7495360
6333 7495360 7124486 7174546 8912956 8658039 1691989 -9533148 -15743162 -11953806 -4054600
6324 -4054600 -499444 -1077100 612225 5581830 7077045 680164 -8895866 -13988793
6316 -13988793 -13165305 -10874215 -10528207 -11825636 -13809644 -16413170 -18230841 -16253897
6308 -16253897 -10119229 -4606216 -4937090 -9950975 -12561686 -7598904 2780747 12138699
6300 12138699 15982259 13773659 7319869 -184848 -5071869 -6211407 -6490856 -8676710
6292 -8676710 -10748254 -8655654 -3029727 1053101 1213681 29807 -1001551 -4558121
6284 -4558121 -11614098 -17184412 -16528538 -12361312 -10665748 -11309826 -8547126 -526662 7191666
6275 7191666 8948332 5630256 2207155 1838181 4367489 8131613 11069862 11569486 9928053
6266 9928053 7985343 6440353 4123397 1039866 176133 3999735 9946491 11747054
6258 11747054 5793140 -5041323 -14455645 -18697301 -18672750 -16676877 -12751286 -5571398
6250 -5571398 3840692 11479602 14141599 12167419 7449304 801696 -6543521 -10622032
6242 -10622032 -7541697 1306186 9972051 14646795 16772178 18416514 18035878 13650997
6234 13650997 7652286 4415455 4126246 3156989 589667 -353496 1042962 -70931 -6489162
6225 -6489162 -12173639 -9314514 -583514 2977418 -2531049 -7753095 -3264997 7441775
6217 7441775 14105242 14040804 12641715 12072611 8190930 -696922 -9604697 -13471317 -11979354
6208 -11979354 -6069629 3909396 14031404 17466366 13438477 9903254 12894109 18501532
6200 18501532 20194989 18470355 16982325 14163603 6643503 -2007835 -4031182 2173386
6192 2173386 11101412 18085865 21526992 19056346 9568541 -1254090 -5478934 -3655456
6184 -3655456 -3446860 -6823866 -7044830 -539348 6737176 8781133 7958140 9093869 11436642
6175 11436642 11858754 10900264 10196485 8206960 3865739 779120 2427520 6173834 7060486
6166 7060486 4888177 2741196 1172211 -1060408 -2807280 -2566639 -3245847 -9403525 -19949367
6157 -19949367 -28100352 -28997659 -24246358 -18971726 -16839596 -17508969 -17183375 -12783924 -6646699
6148 -6646699 -4434680 -7014157 -8499216 -4867358 454112 3459711 6367997 11617175
6140 11617175 14458530 9817007 2756582 2358703 6847299 5251427 -5357498 -14374874
6132 -14374874 -12381399 -2789709 5273600 8659332 10229039 12630433 16104925 18394308
6124 18394308 14692734 2932772 -9317733 -10457985 -326318 7849178 5235865 -1689243
6116 -1689243 -4471076 -7406452 -18199128 -30781440 -31170707 -18398300 -6464187 -4372723
6108 -4372723 -6146745 -3896660 148896 340416 -2410080 -4397161 -6764150 -12281697
6100 -12281697 -18580274 -21073876 -19725330 -17150879 -12660332 -4206700 5537598 11087535
6092 11087535 11306319 9235292 5649518 -1129134 -8937342 -11907117 -8768376 -5273824
6084 -5273824 -5697296 -7208137 -6122667 -4558964 -5901370 -7880240 -6529948 -4355956
6076 -4355956 -7189140 -13561999 -15011654 -8621695 -1859906 -1209182 -2721328 80798
6068 80798 4206656 1636406 -6319041 -8481341 631400 12695615 17063141 13981758
6060 13981758 10732468 9356801 5611562 -1706299 -7812012 -9058486 -7072177 -4268875
6052 -4268875 -669824 2474570 1170730 -5294633 -10898031 -10204700 -6348057 -6608866 -11912071
6043 -11912071 -16333747 -16437114 -15232755 -15919652 -17077379 -16252212 -13943287 -11446558 -8416303
6034 -8416303 -5194022 -4053813 -5250389 -5321251 -2671760 -1290578 -4719016 -9750761 -11471169
6025 -11471169 -11690113 -15666652 -22010600 -23606397 -19087090 -15542148 -17303370 -19292644
6017 -19292644 -15803452 -9807345 -7871149 -10184285 -11733407 -10449581 -8037255 -4647757
6009 -4647757 775973 5365816 3986783 -2747558 -7465043 -5177738 733122 4062419
6001 4062419 3752098 3226824 4104726 3990026 49067 -7387795 -14823865 -18264768 -16490888
5992 -16490888 -12542320 -11153022 -13647335 -16023059 -13265304 -5139478 3679699 9305151
5984 9305151 12831780 17603010 23351954 25631922 22015374 16597915 15823633 20791099
5976 20791099 26457929 28120671 25640682 21225513 16725030 14034926 14173654 14125302 8707221
5967 8707221 -1670456 -9196127 -8336381 -3493886 -2389080 -5499515 -8025499 -9225363
5959 -9225363 -12135773 -15367313 -13701138 -7702068 -4431847 -5942675 -4809025 4449443
5951 4449443 15934033 19958325 15437610 9033155 5447688 4330587 4395964 4858549 3910072
5942 3910072 654536 -2213260 -1886985 -534225 -2389909 -6606738 -8075896 -5552175
5934 -5552175 -3889947 -6776920 -11537756 -13252085 -10553394 -4831219 3512190 14715030
5926 14715030 26660818 34988040 36435930 30966322 20987116 9751049 356595 -5181715
5918 -5181715 -6978106 -7259343 -8350853 -9929608 -8750896 -2359615 6833523 12741864
5910 12741864 11859885 7368774 5965446 11214644 20705785 28761373 30862244 26284916
5902 26284916 17952860 9914743 4514981 1934716 1613103 2408379 1768010 -2220810 -6875163
5893 -6875163 -6187324 1462086 9282453 8889225 -475183 -12624060 -22560539 -29673694
5885 -29673694 -33585554 -32175726 -25752954 -19531623 -18952883 -23891555 -29174040 -29668004
5877 -29668004 -23955298 -14878905 -7983877 -7626817 -12416555 -15482257 -11455727 -2737920
5869 -2737920 3272971 2995237 254963 492661 4122832 7834050 10587740 14781149 21370913
5860 21370913 27192934 28565512 25018837 17868636 8051816 -1858465 -6441329 -2859708
5852 -2859708 3788561 5445168 1107200 -3081314 -3702103 -3926440 -6097619 -7172254 -5118446
5843 -5118446 -3727103 -5878687 -7231887 -3116820 2366813 1929650 -2508691 -1492296
5835 -1492296 7823234 17115178 18293706 12651369 5917610 294223 -4531473 -6948346
5827 -6948346 -4742075 1238178 7992432 13362806 16037049 14856940 10671037 7086142
5819 7086142 6839262 8460767 8256532 4450925 -1847080 -8137785 -11656615 -10890555 -7637730
5810 -7637730 -5880923 -6907176 -7130438 -2539243 6160075 14613867 19487229 19971566 16138797
5801 16138797 8808682 905589 -3815044 -4487193 -4039266 -5161507 -6325326 -3619386
5793 -3619386 3169623 8283206 5905761 -2403962 -9073651 -9536017 -6229735 -2135284
5785 -2135284 4925423 17057602 28749797 30996019 22417516 10717619 3014912 210539
5777 210539 1082499 5012639 8219625 3994416 -8377819 -19264270 -18512599 -7304830
5769 -7304830 4117009 8744975 8646884 9430073 12766167 15225246 12894669 6510299 1444786
5760 1444786 1388998 3318726 1911186 -2225092 -4018366 -3542210 -6900000 -14961557 -18853554
5751 -18853554 -12109876 -1076941 3758504 2110825 1814393 5866212 10226997 13037378
5743 13037378 17125182 22501945 24038479 18838356 10192813 2301985 -3935186 -8285242
5735 -8285242 -9326199 -7373492 -5275910 -4548822 -4170963 -4117359 -6009746 -9150856 -10137880
5726 -10137880 -7836518 -4828920 -2902859 -1485778 -1538728 -5657646 -12266236 -15149076
5718 -15149076 -11762909 -6931653 -4847571 -2769004 2561751 7243313 5530825 -232078
5710 -232078 -1973710 2970485 9487439 13294049 15654639 18204143 18645843 14569154 8042674
5701 8042674 3408238 2348169 3156287 3461928 2226102 415148 876424 6046276 14423145
5692 14423145 20620316 20450153 15155486 9475255 6528063 5853526 5299874 3018519 -1445433
5683 -1445433 -5685630 -4690658 4181286 15939326 21240083 16924622 10118778 8871162
5675 8871162 11825652 11870275 7746412 5284251 6877807 7096021 1887620 -4142658 -4680014
5666 -4680014 -1345899 -639194 -4314794 -8548788 -10309792 -8643366 -1688743 10670051
5658 10670051 21843852 23182153 14241001 2580028 -6598004 -13750644 -17867194 -15035043
5650 -15035043 -7113494 -3188742 -7109018 -10871792 -6788459 424554 1887678 -198667
5642 -198667 4458107 17867509 30151508 33306202 30396158 28471670 28775752 27462614
5634 27462614 21718943 12221793 2608560 -1865014 1108907 5926667 3141326 -8449792
5626 -8449792 -17888122 -14624710 -2049115 6910828 6235237 2560461 3430896 6016235
5618 6016235 2022664 -9604032 -20734707 -24553147 -22770103 -20608901 -19005964 -15378385
5610 -15378385 -9381267 -3527035 801221 3754245 3875287 -907490 -8448688 -12903460
5602 -12903460 -11671262 -7947051 -4609451 -105118 6306297 9503160 4114626 -6704341
5594 -6704341 -13534612 -11787905 -6223243 -3578842 -4334394 -3640961 1619301 8624963 11221605
5585 11221605 6322068 -2328681 -7492233 -5734865 49985 5686983 10382512 14436006
5577 14436006 15439325 10819074 2859995 -3036850 -5092895 -6367821 -8617966 -8648379
5569 -8648379 -2816059 7061350 14556840 14824299 8901597 2288022 -190801 1606190
5561 1606190 3847802 2973936 -1553308 -8323300 -15645306 -21253717 -22606941 -19468103
5553 -19468103 -14746422 -10946933 -7249848 -1951760 4081787 8958848 13043237 17477099
5545 17477099 20507259 18896322 13040972 7689104 6954149 10500607 14719249 16054464
5537 16054464 13505287 9355302 6915093 6621085 5978558 4382973 4828134 8179048 9205669
5528 9205669 2871208 -7580206 -13789622 -12436534 -7686775 -4612524 -4962865 -8548581
5520 -8548581 -13612188 -16151471 -13892806 -10558415 -11055191 -13225265 -10651038 -3461476
5512 -3461476 876664 -1253300 -4691986 -3822123 824348 6576088 12451142 16129346
5504 16129346 14006553 7878774 4928413 7219189 8176570 3772676 -767850 -1263146
5496 -1263146 -3035760 -10700016 -17270687 -14412262 -7693302 -8619716 -14572265 -11212077
5488 -11212077 4156017 15719369 10571939 -4614844 -15440903 -19040854 -22464689 -27878780
5480 -27878780 -29541634 -24008033 -15241467 -8733072 -5948410 -5649763 -6588659 -7453892 -6907658
5471 -6907658 -4913257 -2344648 992610 5815677 10393142 10771444 5770808 -94922
5463 -94922 -1309737 1755107 3605152 1524864 -827903 342127 2659674 1535836 -1860426
5454 -1860426 -2035205 2029224 5647776 7047015 10597415 18344615 24588579 23970448 19851103
5445 19851103 18350639 17996567 12654339 2314832 -7001788 -13288847 -20397628 -29037908
5437 -29037908 -33794978 -31655483 -26679406 -22708439 -17489346 -8599864 -213145 1799393
5429 1799393 -1309400 -2752627 508578 4816306 6229044 5987984 8089867 13303007
5421 13303007 17322846 15288682 7878808 1491086 776247 2266716 -1402690 -11189577
5413 -11189577 -19630048 -20347083 -15450685 -10813066 -7671345 -3293262 1891945 2937890
5405 2937890 -2924359 -11616394 -16267247 -14588471 -10456722 -8324595 -7658154 -4363119
5397 -4363119 2655675 8799461 9229601 5093837 1491001 299690 -1327403 -5198731
5389 -5198731 -8701082 -8770368 -6323523 -4696401 -5586808 -8166879 -10523160 -10598010 -7411408
5380 -7411408 -2749399 -129442 -885910 -2743961 -3189328 -2458893 -2084385 -2287280 -2221683
5371 -2221683 -1560997 -963351 -2043970 -6761544 -14780975 -21684317 -22766690 -18738077 -14207871
5362 -14207871 -10466804 -4676582 2605488 5235703 544616 -4644695 -2359824 5853040
5354 5853040 12235475 13802151 13568960 12649119 8522783 1755938 -2203268 -315494 3743297
5345 3743297 5047690 3397161 1392960 -114394 -1833178 -3773375 -5989796 -9726000
5337 -9726000 -15031930 -18616363 -17137151 -12206421 -9187735 -10551190 -13097275 -13149485 -12075277
5328 -12075277 -13805708 -18087054 -20159230 -17889684 -15142261 -15520991 -16595981 -14729628
5320 -14729628 -12530494 -15077670 -20031524 -19260608 -11421971 -4911326 -4987707 -5762667 -545613
5311 -545613 6758390 8181175 4357019 1697550 277005 -5427111 -14458105 -18001990
5303 -18001990 -11978283 -2844892 1806125 1359335 -1912738 -7870728 -15065210 -18133090
5295 -18133090 -14027818 -7314548 -4843697 -7749411 -11967037 -13864585 -12480070 -9166916
5287 -9166916 -7676766 -11282610 -17265906 -18261889 -12138562 -5947467 -5996434 -8958311 -8585661
5278 -8585661 -6699980 -9598670 -16024910 -17701079 -12231224 -7208824 -9038326 -14594868
5270 -14594868 -17686512 -18109165 -19313691 -20854152 -18773236 -12297208 -5539618 -2158062
5262 -2158062 -1390202 -292268 2047198 3796932 3202478 933944 -1090020 -2904006 -6823698
5253 -6823698 -13241030 -17568397 -14259177 -4032280 5582421 7959288 3690801 -1719093
5245 -1719093 -4287916 -4087610 -3165537 -3239615 -4943651 -7672889 -10101854 -11463762 -11878215
5236 -11878215 -11227510 -9015757 -6016853 -4490398 -5481501 -7212152 -7603630 -7183677 -7800491
5227 -7800491 -9474796 -10422212 -9548194 -7223269 -4248260 -1617165 -299922 565327 3929217
5218 3929217 10837552 17543465 19685386 17925224 15368165 10829737 883243 -10970823
5210 -10970823 -14705946 -6985703 2424478 2986034 -2890056 -5165498 -1365681 1818199
5202 1818199 573515 -1091941 520087 3354044 4694300 5363910 6130581 5749086 5511685
5193 5511685 9681733 17314652 19453324 10184683 -3725859 -10351575 -6837531 -132398
5185 -132398 4179976 7043829 10405309 12855276 12388133 9590664 6777722 6221270 9014975
5176 9014975 13359731 15088772 12730259 10397760 11973727 14146588 10065872 -720345
5168 -720345 -10770397 -13190123 -7348034 3402358 14789277 22211902 23282915 20826453
5160 20826453 19379700 18639658 14977268 9132982 6305016 7693755 8436243 6030501
5152 6030501 4491529 7072973 10743440 11711411 11226762 11757319 12079357 10378117 7844027
5143 7844027 5090335 -263140 -7780031 -10973941 -5733562 2250225 4762346 1918023
5135 1918023 -1041650 -3889682 -9778612 -15784083 -14699869 -6567291 283207 1160544
5127 1160544 -49149 -35749 -2055239 -8776844 -16047653 -19057020 -19590358 -21628434 -23629307
5118 -23629307 -21119394 -14726994 -9949753 -9559292 -10917475 -11023707 -10383392 -10989371 -13233280
5109 -13233280 -15880156 -17258578 -15668997 -10279658 -2940752 1743616 -105034 -7246051
5101 -7246051 -13042987 -11034853 -1407448 9038818 13995930 13399442 11108138 8953231
5093 8953231 5775540 1211048 -2945060 -5218912 -5412426 -2951298 2568948 8603763
5085 8603763 10780794 8210324 4862378 4188409 5170011 5353438 4717407 4099082 2643181
5076 2643181 -32114 -1494540 -29398 1314943 -1336949 -5468212 -3881988 5359553
5068 5359553 15143885 17811989 14073783 10274158 9154816 7515509 2707814 -2552427
5060 -2552427 -3601136 109390 4367202 4805415 767038 -4785705 -7838506 -6157866
5052 -6157866 -970731 4120875 6898116 8898782 12626939 16658531 15730843 6566037
5044 6566037 -8046020 -21831003 -29935016 -30353674 -23169331 -11135580 411155 7371475
5036 7371475 10404059 12384848 13309061 11125462 7365677 7365189 12863837 18027938 16131597
5027 16131597 8007805 360760 -2913587 -3685730 -4161114 -3089073 617914 3886409
5019 3886409 2466004 -3493185 -9860035 -13802310 -15500163 -14686054 -9427418 -386954
5011 -386954 6714173 6425802 436571 -4091203 -3224711 -536512 -1633109 -6475689 -9065871
5002 -9065871 -4495739 4764802 10288228 5995995 -4954470 -12848220 -11584558 -4492497
4994 -4492497 1070535 2242608 957392 -1739406 -6676236 -12202880 -14000653 -10833533
4986 -10833533 -6704947 -5528434 -6807017 -8226318 -9404589 -11038441 -12789056 -13791480
4978 -13791480 -13379533 -10626579 -5661313 -1524934 -1148617 -2364790 -565393 3207593
4970 3207593 2751792 -3110233 -7559764 -6159953 -3351983 -3990085 -5219528 -3238604 -2234422
4961 -2234422 -8448429 -19140527 -25677734 -25418966 -22981184 -21166556 -17837101 -11324206
4953 -11324206 -3024986 4797710 9211804 6818410 -1271076 -7929332 -9313541 -11541887
4945 -11541887 -20787523 -31303605 -32908435 -26755783 -22314920 -20813110 -14492143 -2469231
4937 -2469231 6045187 7113009 8066016 13626700 17615385 14436938 8430358 4746809
4929 4746809 119000 -9117911 -17209847 -16026456 -7154176 753558 3419406 3480614 4388943
4920 4388943 7129772 10993964 13798160 13369008 11125452 11378703 15546088 20469919 23181048
4911 23181048 23106454 19690501 13433074 8969260 10292649 13206273 10415861 3719268
4903 3719268 1662730 4983485 5362725 -122462 -5092473 -6430352 -8259636 -10612608
4895 -10612608 -7372289 932355 5992048 6948126 11747040 19599146 19411152 10615360
4887 10615360 6073011 7821035 1920543 -14112476 -23742675 -22553679 -28535527 -45889453
4879 -45889453 -51168696 -37590707 -36806502 -65422858 -90742224 -96804065 -142921419 -281915737
4871 -281915737 -439796427 -466921585 -324257294 -140341889 -51254597 -53240705 -58776951
4864 -58776951 -34706262 -16155234 -20904545 -25004053 -16314419 -12503804 -20703569 -24166161
4856 -24166161 -16044793 -10182597 -11557887 -7480552 4980704 11142065 5740277 2611680
4848 2611680 9647201 16767743 16654746 16680940 22075540 25895401 23639136 20920963 19619637
4839 19619637 12781193 24050 -8053010 -7481873 -6919471 -9417612 -5308530 8023945
4831 8023945 16146288 8728034 -3843948 -7245446 -3768495 -3045352 -3562038 1843888
4823 1843888 9827354 10161286 1093344 -10431353 -19947957 -26775036 -28104945 -21658533
4815 -21658533 -11531431 -3387370 2798890 8110305 8109646 12361 -8171339 -6273276 2831726
4806 2831726 7114653 3048447 -1340200 -1217330 -1696518 -6834591 -11422534 -9166659 -2550231
4797 -2550231 1219667 -1456 -2800801 -4804149 -6611429 -8089494 -7369112 -4380413
4789 -4380413 -2077948 -2383745 -3070772 -1051684 2469008 3248826 436733 -1858310 -984916
4780 -984916 -102725 -2921598 -7155066 -8030769 -6772474 -9991153 -20100897 -31034417
4772 -31034417 -34965827 -30002315 -20359981 -12112958 -9382025 -11445934 -12951529 -9883510
4764 -9883510 -5167688 -4814825 -9064831 -12071030 -10383951 -6372977 -2433849 2543018
4756 2543018 9314048 16338540 23576175 32693172 41329434 43214702 37141093 29870457
4748 29870457 26207732 22107765 12647907 1345408 -4735723 -4983762 -3737635 -1952305
4740 -1952305 2660433 8891430 12156212 11113089 8809383 7382518 6289612 5525369
4732 5525369 6073687 7192749 7348980 7706076 10700625 15416483 18603014 20175119 22954609
4723 22954609 26214296 24459622 15039252 3333777 -2652725 -866594 4052753 7115904
4715 7115904 7565526 7556585 8497618 9746028 10305365 10556812 11388349 12025094 10271668 5463430
4705 5463430 -128019 -3653238 -4310259 -2908470 -378652 1965646 2067384 -1094397 -5833788
4696 -5833788 -9201082 -9866460 -8956618 -8740518 -10926743 -15012573 -17628853 -15095110 -7855497
4687 -7855497 -1029332 884600 -1207043 -2851047 -1581541 1178249 3217431 4596529
4679 4596529 6882457 10134265 11860137 9870128 5762786 3683586 4909749 6051677
4671 6051677 4411915 2224893 2072036 776255 -6526805 -17104711 -21750112 -16277390
4663 -16277390 -6178271 1959092 7776125 12930646 15450193 13349800 9991538 10363223
4655 10363223 13874589 15211647 11149069 3234179 -4799558 -9290836 -8086622 -2940460
4647 -2940460 887426 284467 -1808879 -683243 3658024 7162423 7434436 5884904 5145895
4638 5145895 6745353 10462199 14046555 14512449 11081224 5684893 81636 -5191271
4630 -5191271 -8661845 -8501400 -6605826 -7955817 -13808350 -19640415 -22041671 -22798116 -23281008
4621 -23281008 -20457118 -12929468 -5585516 -2666920 -984201 3768314 8561624 8300110
4613 8300110 5653583 6964752 10631212 8775118 91912 -7795714 -9873348 -9605093
4605 -9605093 -11203375 -13213444 -12988377 -11972330 -13031203 -16220341 -19666750 -21757664
4597 -21757664 -21087480 -17045554 -11192707 -5597649 -375719 4172955 4946872 470685
4589 470685 -3694517 -343039 8944327 15424809 15564496 14627812 16642884 18448522 16734648
4580 16734648 13916101 12642500 10415697 4784876 -826862 -2001905 -686059 -2268823
4572 -2268823 -7383495 -11500404 -11593385 -8972581 -5746642 -1933059 3225014 8980415 12986658
4563 12986658 13436191 11563497 11175917 14048878 16666455 14303880 7933177 3518895
4555 3518895 3968537 5477791 3321746 -1776948 -4918700 -2683736 3753028 9785645
4547 9785645 11369185 9133704 7583086 8415852 7063239 -433289 -9744631 -13264176
4539 -13264176 -11214871 -10556135 -12899421 -11759467 -4115629 3235852 3391971 -750023
4531 -750023 -1560777 2822487 8338231 12253271 15564903 19524950 23195507 23888549 19076353
4522 19076353 9840442 2377114 2379127 7772837 11615455 11972656 12471433 12799598 7662690
4513 7662690 -1814402 -5361231 1711808 9654638 8075342 1208130 -130879 4155868
4505 4155868 5430906 1961227 363957 2045225 158381 -7439773 -12516557 -8507816
4497 -8507816 -627219 1582551 -3267957 -8601099 -9304819 -6266707 -3044510 -1838898
4489 -1838898 -2823646 -5391025 -9241175 -14012602 -17726398 -17035682 -10668453 -1669192 5520812
4480 5520812 9204962 10133122 9035346 6944016 5893276 5894016 3032015 -5149469 -13540472
4471 -13540472 -13807574 -5158631 3909664 5785977 1469038 -3604842 -7358032 -11359419
4463 -11359419 -15575659 -16582806 -11309701 -777063 10435304 17820401 19883232 18067935
4455 18067935 14665820 11290420 8674739 6744730 5147819 4744105 7486872 12653281
4447 12653281 14510335 7738671 -4724361 -13655916 -14350873 -10841344 -7839844 -4117412
4439 -4117412 2674932 9894208 13735563 15323690 17474740 18228674 13341454 3530838
4431 3530838 -5905437 -11373592 -12429671 -9025079 -2652316 1328692 -1613612 -8566005
4423 -8566005 -12336409 -10657448 -7178962 -4233213 -784452 2253669 1174449 -4168108
4415 -4168108 -8426647 -7557294 -3560717 -508885 547629 853961 1267746 1976541 2422029
4406 2422029 731236 -3975295 -8328896 -7278394 -821180 5272539 6622264 4757173
4398 4757173 3095128 1870393 -660545 -4529979 -8136558 -10610629 -11966203 -11440462
4390 -11440462 -7365730 556545 8916794 11757391 6345676 -2092414 -4731527 144762
4382 144762 4335220 362872 -8736223 -14309644 -13546610 -10901772 -10302241 -11434629 -12504455
4373 -12504455 -11530493 -6110446 2871089 8615588 5299322 -3225124 -7486977 -4440810
4365 -4440810 714928 3965718 6481857 8990550 9822486 9967784 12615011 15580053 11829696
4356 11829696 859304 -7662492 -6129733 1192045 5492250 5150310 4468830 4863440
4348 4863440 3678728 -121750 -4482449 -7994674 -11210374 -14066377 -14522866 -10523957
4340 -10523957 -2987947 3201337 2807520 -3175633 -6601425 -1527726 7331015 10510380
4332 10510380 6597559 2593103 2141650 1452997 -1700266 -3342664 -1104381 895204
4324 895204 -343930 -774606 3529453 8770455 9034097 5344048 3096643 3387361 2497978
4315 2497978 -1766053 -7801362 -12999137 -15535594 -14959393 -13499806 -14773392 -19224435
4307 -19224435 -23319146 -24565449 -23798804 -21266674 -15290022 -7034666 -1498160 -811378
4299 -811378 -1528356 -1559657 -4180806 -11252833 -18131756 -20255721 -19893482 -21307660 -23836638
4290 -23836638 -24898305 -25229381 -25679697 -23385773 -17122111 -12217629 -13753585 -18562472
4282 -18562472 -20369763 -19296981 -19552867 -21105525 -21000108 -20273703 -21937686 -23910580 -21541250
4273 -21541250 -16178270 -13991753 -16571534 -19332672 -19223413 -17707005 -15791047 -12187357
4265 -12187357 -7490042 -5009498 -5931822 -7414104 -6608577 -3915500 -1807294 -1996704 -2956664
4256 -2956664 343823 10942012 22839544 25019894 16105225 8828978 13956710 25446014
4248 25446014 29533776 24151524 19777174 23021033 28898951 29659295 23361498 12792612
4240 12792612 2326984 -3498761 -3769800 -3489963 -7212719 -11804078 -11233733 -6653213
4232 -6653213 -4804531 -7569704 -10164047 -9037105 -4805730 1655853 8819224 11275489
4224 11275489 5038196 -4073100 -5522300 1870636 8634264 7913920 2106528 -4324043
4216 -4324043 -9836632 -11791469 -6382964 3732277 9098880 4838228 -3420602 -8213178
4208 -8213178 -9122702 -9602753 -10274076 -9508197 -7129170 -4180811 -1176007 1764064 4815683
4199 4815683 8408108 11189079 9890068 4589043 1329584 4630935 10256067 11265304
4191 11265304 8236735 6616715 6981919 5979710 4393427 5595055 8173019 9039907
4183 9039907 11203243 18238635 23701019 18178260 5759972 704765 7441293 16406223
4175 16406223 20188882 20442410 17562199 7981477 -4940098 -10976577 -8085243 -4905822
4167 -4905822 -5061524 -2390023 4765865 9070548 8613218 11121269 18395438 21318824 16214852
4158 16214852 11081562 9558976 4946662 -3063701 -3508093 5275406 8500623 -1010613
4150 -1010613 -9893097 -7336942 -2395356 -4313256 -4488469 5518175 15765100 15444209
4142 15444209 11913413 14566241 16977842 13171117 12699421 20541251 24096947 21215758
4134 21215758 33189684 62741098 75279844 65455983 103999514 247000079 415421569
4127 415421569 450802522 307188237 113013836 11105767 4989921 9005176 -12427671
4120 -12427671 -26418036 -16971913 -11272933 -23177981 -30606099 -19405292 -5875857 -3889373
4112 -3889373 -4398283 431110 1737484 -5200540 -8873032 -2223190 4849197 4550025 4496181
4103 4496181 11019852 15689625 10554640 3259874 4472401 10399345 9534794 -319740
4095 -319740 -11601206 -18126144 -18746465 -14484534 -8760553 -6891753 -10264478 -14144775
4087 -14144775 -14402780 -12215252 -9638399 -6011505 -2062393 -2046448 -7573043 -13719899 -15194167
4078 -15194167 -12491068 -8649108 -4248847 338504 1641384 -2975715 -10042399 -12881271
4070 -12881271 -9054239 -2122632 3299019 5881659 7049027 7649075 6114306 774075
4062 774075 -6103676 -9183929 -6919834 -4817407 -8407380 -15263161 -18517505 -16570805
4054 -16570805 -13912108 -13247669 -12854777 -11774370 -11218921 -9752739 -3690578 5369906 9856580
4045 9856580 6765314 3146493 6083450 11829082 11156647 2867269 -4722231 -5504418 -2835814
4036 -2835814 -3256601 -7329086 -10168365 -9321023 -8390180 -11730940 -17765199 -20364547 -16944092
4027 -16944092 -12254248 -12147460 -15593078 -15855699 -8844688 2515487 11875394 14687110
4019 14687110 10192092 1490399 -5701820 -7038975 -3234577 1818593 6021054 9402960
4011 9402960 10357986 6131311 -1965486 -8211955 -9341234 -7969265 -7042000 -5011947 163536
4002 163536 6026056 9149306 11025163 15365538 21011643 22789824 19124885 13763315
3994 13763315 9436913 4819597 -751548 -4371997 -4096869 -2421973 -1915060 -620829
3986 -620829 4205401 10119192 11631713 7189104 96580 -6561085 -11887598 -14926515
3978 -14926515 -15175511 -15334573 -18684542 -23186815 -23280207 -18515981 -14680809 -14556268 -14105747
3969 -14105747 -11125939 -10604283 -15893495 -20976422 -19038456 -13656175 -12674786 -14846838
3961 -14846838 -12780721 -7094053 -6299664 -12133127 -16171733 -13558131 -9475774 -7948161
3953 -7948161 -4491096 4049942 11437701 11374256 7547267 6235757 5123938 -1306962 -9579006
3944 -9579006 -10238135 -1564135 8107889 11678119 10270670 8753033 9699379 12259330 13263973
3935 13263973 9845291 3564974 -187517 332183 7612 -5059605 -10799465 -11909945
3927 -11909945 -10754724 -12499546 -15211620 -13165159 -7612578 -5428006 -7968542 -9855894
3919 -9855894 -8782927 -8218519 -9703670 -10486140 -10082355 -11521812 -14406089 -14249491 -10910339
3910 -10910339 -10244571 -14228889 -16252569 -10461747 -744050 3616541 -1989078 -13904324
3902 -13904324 -23411093 -22857967 -12952392 -4302048 -6578155 -16030042 -19913988 -13557722
3894 -13557722 -5525196 -4479030 -9061751 -13540860 -15375714 -13298967 -5662542 4410247
3886 4410247 9183885 6753454 4781699 8682387 13122803 11584386 7437517 7514686 10231712
3877 10231712 9033559 3982518 1132796 2565779 5120836 7591956 11554390 15758715
3869 15758715 16821082 15408144 15350787 16542366 14927898 10256375 8028579 11948873
3861 11948873 18730809 22292395 20365955 15707586 12353988 11047797 8086659 437893
3853 437893 -7825215 -8383832 146091 9080184 11258393 10042492 11282952 12153301 6206494
3844 6206494 -4301232 -10570350 -10234058 -9071768 -9892154 -8619659 -2977523 2756926
3836 2756926 4183042 1936380 -1386583 -4008249 -3704031 409935 4098133 2360107
3828 2360107 -1834416 -593509 5833228 7658951 441933 -7307954 -6851804 -2189420
3820 -2189420 -3327456 -11773982 -19926609 -21721304 -17579636 -10959685 -5412294 -3451673
3812 -3451673 -4094629 -3467987 -1274984 -3233625 -12515153 -22393317 -23592156 -16741448 -11169101
3803 -11169101 -12492307 -17604350 -21376624 -21874730 -18420283 -10793459 -2204410 2214374
3795 2214374 2147468 2819474 6638469 8600885 3464876 -5948878 -11711919 -10170009 -4722417
3786 -4722417 -262302 1759974 2784746 4419569 7039467 9656051 10644397 9184119
3778 9184119 5714464 482983 -7107424 -16092781 -21937345 -19834058 -10852300 -2599168
3770 -2599168 -1904309 -7640199 -12260109 -10039120 -2476922 4239745 5627215 2310587
3762 2310587 -1787078 -3557582 -2959583 -1707849 -662129 362970 523424 -1843172 -5439571
3753 -5439571 -4930786 3051097 14211523 21034083 22310565 23074022 24614681 21466319
3745 21466319 11835662 4294134 7185223 15570018 17019841 8784639 608279 -109339
3737 -109339 2587464 1889631 -1510806 -2935484 -2208946 -2663833 -4432676 -4097665 -136265
3728 -136265 4957415 7470589 5315956 -477436 -5523491 -5828520 -3626313 -5933350 -14363793
3719 -14363793 -20536759 -16496512 -6327881 -972321 -3215684 -5030880 -115344 8100703
3711 8100703 13239918 14467896 14262167 12547011 8261771 4045255 3824625 6248030 5357557
3702 5357557 -1024638 -7290747 -6899146 -1163200 2025811 -1688584 -7136055 -5642266
3694 -5642266 4395165 15546348 19694009 15434075 6512057 -3463263 -11847113 -15103732
3686 -15103732 -10720871 -1188796 7244139 10741048 10760205 10541303 11205811 12191415 13335365
3677 13335365 14969313 16805610 17464130 14815936 7547727 -2369242 -9913591 -11872056
3669 -11872056 -10434631 -9356532 -8173588 -4581195 -1489039 -5167985 -14679836 -19677042
3661 -19677042 -12867475 441709 10298620 15105695 20083185 25882402 26983482 21426085
3653 21426085 14571414 11118550 9429863 6525670 3464711 2279633 1946559 1471853
3645 1471853 3456462 9836499 16282765 15838860 7679340 -1666171 -5849401 -4352364
3637 -4352364 -704860 1727477 1450456 -1293270 -5371337 -10417012 -17119831 -24438631
3629 -24438631 -27941218 -23917613 -14664938 -6396921 -1765235 2105971 7539309 12219354
3621 12219354 13222737 11909201 11890396 14040074 16122349 15989372 12913437 7154101 546872
3612 546872 -3709957 -4270600 -3657723 -4898736 -7538146 -9594227 -11726156 -15547663 -18759719
3603 -18759719 -16779054 -9695998 -2842798 967045 4757646 10209920 12280297 6160744
3595 6160744 -3663278 -7671391 -3688188 1119356 1108361 -1109865 -1042497 228418 -893322
3586 -893322 -4130622 -7081732 -10543447 -16232611 -20632333 -17908557 -9793057 -5761565
3578 -5761565 -10084911 -14448200 -8807580 4235385 12434771 9687632 2077259 -2175388
3570 -2175388 -1960041 103911 4090839 10628943 16084286 15916369 11495281 7992331 5710329
3561 5710329 -545712 -11813830 -20500717 -19759822 -13371374 -10590056 -12920973 -12573010
3553 -12573010 -5085443 2778057 1749368 -7370974 -15076649 -15241933 -10513139 -6068128
3545 -6068128 -3679632 -3432080 -6044053 -10217067 -11540428 -7871419 -3067523 -1699661
3537 -1699661 -2700415 -2393773 -1219208 -2176549 -4288018 -3530654 260742 3239918 4118835
3528 4118835 4741472 4115225 -615932 -5835260 -2618361 9850144 19924379 18191363
3520 18191363 9561210 4045273 2258570 -1126029 -5039738 -4189372 -948514 -3512213
3512 -3512213 -11914792 -16684792 -13538290 -9285040 -9308136 -8611031 -1343119 8191111 11309310
3503 11309310 7022615 1650879 -357117 848318 4408250 9201821 11517810 7863871
3495 7863871 414609 -4399818 -3360506 346140 1949642 1109439 2380055 10078350
3487 10078350 22507396 32171206 33878069 31743901 34016226 40723988 42148581 32069248
3479 32069248 16941894 7556667 6235324 7716050 8788862 10172637 10892603 8111772
3471 8111772 2812592 -354251 33241 265404 -2309225 -5408669 -5597039 -2560272 1717965
3462 1717965 5330106 7024380 6622945 5237944 3246763 -1034125 -7929327 -13149365
3454 -13149365 -12159413 -6989377 -3736325 -3404089 -997150 5108153 9108790 6280024
3446 6280024 405190 -1695336 426118 1399785 -2259789 -9100922 -15690949 -18702747
3438 -18702747 -15331178 -5773218 4914166 10956015 12127969 13062119 16295473 19221445
3430 19221445 18631360 15028643 10725735 6385926 2103828 116770 2908752 8670120
3422 8670120 11945351 10113878 6649098 5935007 7199611 6828398 5082623 5821682 9235436
3413 9235436 9913967 4600360 -2319527 -4806450 -3614308 -4350373 -8972417 -13838792 -15459762
3404 -15459762 -13925803 -10873840 -8024846 -7737373 -11193317 -15782119 -17610814 -16282153
3396 -16282153 -13657412 -9201397 -1901572 3976925 2282094 -4530542 -5949414 1919465
3388 1919465 9210937 5294729 -6691947 -14851116 -13953454 -8731769 -4401940 -1430562
3380 -1430562 919306 2601477 4916991 9182750 12766018 11459920 6183603 2137005
3372 2137005 748125 -1811795 -6756621 -9536848 -7467544 -4751170 -5517989 -6656897
3364 -6656897 -3315665 1711539 949761 -6138818 -11158289 -8173636 -1948856 -1460949 -8320112
3355 -8320112 -15492581 -16239783 -10586467 -2745060 4284884 9424948 11103944 7691496
3347 7691496 758842 -4630941 -4463944 389515 5738898 8268852 7289695 4034208 1102693
3338 1102693 1403835 5325892 9523738 10621519 9297995 7971877 5307047 -2649300
3330 -2649300 -14877425 -23358751 -21605833 -12308070 -3245074 2007070 5355796 7950852
3322 7950852 7889930 4792675 2170651 2926493 5161849 4740346 379087 -5666584 -10687473
3313 -10687473 -13534943 -14398993 -13992120 -12504840 -8884490 -2307548 5335357 10493278
3305 10493278 12286814 13143055 13789065 11312624 5296910 2003289 6890064 15253079
3297 15253079 17235999 11752290 7657792 9315480 9305948 424508 -12132956 -17987121
3289 -17987121 -16252565 -14303736 -14173748 -9725457 1637501 12996653 17050821 14766696
3281 14766696 10845196 5935437 -1383831 -8408893 -9986486 -5553561 -199350 1345452
3273 1345452 -1130243 -4983280 -7846664 -8719401 -7861783 -6331655 -4974871 -3864871 -2854439
3264 -2854439 -1798023 59002 3580793 8088542 11675009 13735360 15408885 16828561
3256 16828561 16270356 13493241 11712987 14100117 19695899 24671344 26518409 25517789
3248 25517789 23360637 21731488 20914895 18744566 12886664 5328931 1811612 4639729
3240 4639729 8835435 8401259 3988110 853365 1328888 3482694 5762939 8154630 8969009
3231 8969009 5227815 -2618059 -9890996 -12971420 -12876926 -12682801 -13667501 -14924976 -15117031
3222 -15117031 -14064237 -13484984 -15184250 -17067444 -13332504 -2183157 8555230 8772713
3214 8772713 -1096261 -9938932 -9786595 -4622174 -3161303 -7570138 -12893994 -14456852
3206 -14456852 -12100023 -8873065 -8368323 -11926998 -16373259 -16194973 -9927982 -2531294
3198 -2531294 555965 -273893 -621200 1756405 5191896 7077731 6158918 3052204 594926
3189 594926 2296110 8188328 13570664 14257737 11766570 10649274 11822278 11688050 7679998
3180 7679998 1958278 -823519 2197189 9781293 16973100 18467934 13582030 7450448
3172 7450448 5467269 7173543 7745946 4942389 2000419 3408806 9731466 16848961
3164 16848961 18997152 13175937 2508759 -5323841 -5342398 -728507 1317927 -1214357
3156 -1214357 -3187097 131035 7055320 12597465 14579303 14089074 11804306 7057165
3148 7057165 444610 -4964861 -6014034 -2388250 3340234 8562206 13282398 19308818
3140 19308818 26563594 31547278 30998956 26069347 20505354 15224859 7933229 -1297208
3132 -1297208 -7731838 -7467770 -2449104 2797400 7115045 11804679 15386156 13998790
3124 13998790 7430678 576320 -2624571 -3266227 -3634604 -2860225 332730 3329900 2643910
3115 2643910 83959 951073 5666584 8260337 5336071 1841155 3803671 8702851
3107 8702851 8770820 2732127 -2053458 -598292 2287149 -547197 -7534392 -10156762 -4686462
3098 -4686462 2990438 5460882 2767568 704961 2385143 4810345 3777726 -402771
3090 -402771 -3515325 -2758826 77865 948369 -1877329 -6106634 -7848175 -5420963 -1355060
3081 -1355060 -930262 -7518529 -18131936 -24632662 -21479403 -12042953 -4960157 -4052678
3073 -4052678 -4667259 -1177203 4923744 7339581 3803812 -905152 -1153491 2802234 5558111
3064 5558111 3169295 -2011840 -3522333 1973493 10383119 14694023 13439361 11803127
3056 11803127 13420519 14869791 11468259 5446312 3291275 6060007 7898215 5036443
3048 5036443 1021830 420475 1464203 -1196845 -8736858 -16919396 -21495998 -21463035 -17480352
3039 -17480352 -10695100 -4096018 -2050430 -6006660 -11608809 -12465413 -7303915 -1576857
3031 -1576857 -444704 -1572284 1916782 10993765 17372486 13769047 4477853 529453
3023 529453 5192441 10160360 7453617 -492417 -5804180 -5671753 -3376165 -1795812 -833727
3014 -833727 49581 1180706 3961209 8979782 13346269 13673146 11306799 10572892 11918171
3005 11918171 11312717 7265040 3760835 4097308 5648408 3673893 -2219450 -8064199
2997 -8064199 -10148633 -7643170 -2488392 1498730 1269135 -2063920 -4421179 -4467479 -5099465
2988 -5099465 -7695931 -9228472 -8448048 -10327230 -18610935 -27342289 -27349910 -19925290 -15682483
2979 -15682483 -18702982 -20343274 -12668130 -624472 5277710 3103211 -843514 -3098796
2971 -3098796 -5865709 -9769580 -11594843 -10719170 -11455725 -16248166 -21276856 -21802300 -18095377
2962 -18095377 -13111787 -7809299 -2383003 718377 -608036 -3927055 -4756196 -2691943
2954 -2691943 -1417155 -2842277 -4960811 -6001226 -7093907 -9448447 -11851477 -12767723
2946 -12767723 -12665111 -12560319 -12376512 -12468894 -14334842 -17261688 -16618654 -9411664 -575225
2937 -575225 692506 -8277305 -19959921 -25072979 -21598250 -13752864 -5393437 2131706
2929 2131706 7445027 8550959 5276994 168805 -3229443 -1809849 6028317 18056154
2921 18056154 27674563 29046947 23279772 16855412 13738749 12230779 10055976 8240845
2913 8240845 7804090 6663033 3459115 1432003 4062104 8797201 10003866 7304402
2905 7304402 5758968 7352149 7662394 3160410 -2684877 -4065381 -634413 3120766
2897 3120766 4481809 4488212 3930862 1450012 -3097016 -6159230 -3607866 4517364 13823270
2888 13823270 19782954 21123934 19314821 16062212 12002644 7155235 1707713 -3605021
2880 -3605021 -7449007 -8719452 -8263293 -8995069 -12540981 -16191438 -15767599 -11822587 -9716888
2871 -9716888 -12032558 -14423424 -11867274 -5808171 -952254 2340284 6849961 10980004
2863 10980004 9057854 218097 -8822581 -12093006 -10635991 -8093696 -5047577 -1397381
2855 -1397381 -133434 -3927370 -10225587 -13852598 -13141397 -10431570 -8006234 -6112517
2847 -6112517 -3264436 3417400 15202028 26734811 28355455 17816570 5801980 3900758
2839 3900758 9956100 12149424 5758856 -2055267 -4215469 -2428191 -1767311 -3504973
2831 -3504973 -6719142 -11406344 -16070501 -16645031 -11773417 -5721959 -2703527 -1899561 -1508288
2822 -1508288 -3374579 -8295044 -9949434 -514507 17651559 31669113 31283302 18855512
2814 18855512 4885317 -3182701 -5575814 -6108374 -6888051 -7466953 -7289619 -7195365 -8140512
2805 -8140512 -9471230 -9628446 -8182549 -5815508 -2552815 2014362 6400605 7420239
2797 7420239 4003174 -1056935 -4888446 -8512966 -14692905 -22485224 -26535747 -22685935
2789 -22685935 -12997505 -4066638 -526200 -1063576 -1331979 134078 874770 -426228 -857281
2780 -857281 2309474 6562017 7499492 5980350 6963407 11022511 12456620 7815314 1307272
2771 1307272 -1583186 -1762695 -3754192 -8423993 -12870790 -15134322 -14437392 -8862225 1713240
2762 1713240 11197799 11657918 3146836 -5473549 -6920702 -2546235 2552851 6795416
2754 6795416 10911237 12678052 7844675 -3643298 -15622502 -21146584 -18752763 -12895988
2746 -12895988 -9062197 -8781681 -8890416 -5483397 1131678 5645466 2775831 -6532849
2738 -6532849 -14823539 -15259634 -8860504 -3088046 -2874487 -5192189 -4133515 843885 5078378
2729 5078378 6058620 6310431 8280495 10609426 11586570 12593996 14893735 15708474 11400044
2720 11400044 3285766 -3186092 -4612965 -2382281 85949 263986 -2760087 -7894283
2712 -7894283 -12405672 -14408472 -14495613 -13667655 -11422154 -8065285 -6698296 -9348105 -12587276
2703 -12587276 -11214627 -5861487 -2775144 -5657650 -11347444 -14164884 -11275838 -3405199
2695 -3405199 6220442 12980071 14403529 13386416 14454657 16441836 13382415 3994822
2687 3994822 -4802656 -6748379 -4090915 -2526530 -2006227 1945683 9376802 14019043
2679 14019043 11205538 4067352 242714 3970240 12102170 17166584 14760024 8722822
2671 8722822 7741385 15233900 23961626 23178073 10672058 -4626672 -11907523 -8124773
2663 -8124773 1546413 10065051 13912555 13969910 13266807 14035573 16004761 17020516 15243178
2654 15243178 10794715 5558655 1672940 160180 804520 3091950 6681154 10573729
2646 10573729 12689636 11635553 8711481 6716620 6748271 7824788 9652611 13088372
2638 13088372 16637792 15441154 6908966 -4025467 -9021008 -5999218 -1528785 -2460793
2630 -2460793 -8109898 -12789932 -13509095 -11736708 -9043848 -5689614 -4189665 -9340272
2622 -9340272 -21335370 -32083453 -32787126 -23683677 -12174581 -2951294 4524043 9631103
2614 9631103 9338707 5477057 5696076 12355365 16798892 11161112 677262 -3741908
2606 -3741908 -1412038 -1034774 -5935325 -10517672 -11913574 -14488278 -19569808 -20571552
2598 -20571552 -13757533 -5522050 -2178733 551509 9794752 22286234 27580026 21826629
2590 21826629 10527498 -494990 -8930077 -11777573 -5904522 5562279 14248971 16389372
2582 16389372 16325412 18047665 18828106 14885823 8941179 7199237 10821956 14981778 16202529
2573 16202529 16679627 19445695 21499754 15374608 -1058924 -18735714 -25013965 -17344638
2565 -17344638 -5738069 -242731 26390 2209798 7734287 10561419 6581941 -436354
2557 -436354 -3642732 -705414 4657258 6743669 2659149 -5543863 -12951775 -16326274
2549 -16326274 -15769429 -11969953 -4902411 2963946 5905919 1420395 -4922930 -5555832
2541 -5555832 -306077 4609837 5495380 4224873 3339102 3161635 3540040 3850909 1772900
2532 1772900 -3259812 -6434200 -3058136 3245783 4638823 1072082 276836 4837998
2524 4837998 8195275 6546265 5812909 11515152 19413270 22638024 21530266 19239121
2516 19239121 13536614 1692745 -10708689 -15167722 -12380872 -10203433 -10649967 -7801121
2508 -7801121 946915 10067266 14307062 14620533 13156243 8987112 2305825 -2797063
2500 -2797063 -3907327 -4302253 -7320360 -10404195 -9154253 -4479128 -902519 694897
2492 694897 3835132 10040571 15894189 17795292 16720147 16263908 17560105 18406775 17139851
2483 17139851 15152393 14438455 14193045 12059170 8181657 5126969 3241408 -574575
2475 -574575 -7588367 -13991405 -16043171 -15567015 -16019751 -15469284 -9406021 223493 5664694
2466 5664694 4473859 3251440 6813999 9791740 4806451 -5116633 -9344527 -3320039
2458 -3320039 7143710 15080930 19184862 19814053 14901796 4419372 -5389721 -7988955
2450 -7988955 -5179609 -4640433 -9265736 -14098573 -14867438 -14331001 -16871913 -20695150 -20275093
2441 -20275093 -14797800 -8971490 -5451325 -1619265 4395247 9169570 8891226 5477196
2433 5477196 3402418 2334290 -1935455 -9173156 -12373506 -6072974 6163490 15299112
2425 15299112 16025692 9965775 1408413 -6548876 -11555046 -11427672 -6562488 -1482608
2417 -1482608 -1284963 -6345505 -12361909 -15846405 -17247179 -17463799 -13965841 -3679621
2409 -3679621 11097093 23170843 27474903 25040367 19523615 12860774 5651849 -1081082
2401 -1081082 -6567987 -10646145 -12047784 -9097153 -3849098 -2007074 -5758196 -10113856
2393 -10113856 -10227257 -8769528 -10528698 -12643176 -7827457 3184554 10501160 8417554
2385 8417554 2767026 1316951 2968204 1683147 -3274158 -7033970 -6807186 -4429732
2377 -4429732 -2119343 -257811 869564 1058512 2023992 5768451 10568100 11559018 6362213
2368 6362213 -1841987 -7591681 -8076265 -4616115 -836375 201838 -1756188 -4413209
2360 -4413209 -5971941 -7343019 -10174925 -13475412 -14193385 -11308746 -7579514 -6366810
2352 -6366810 -7611710 -7849652 -4236689 1762897 5276457 3165208 -2319928 -6277362
2344 -6277362 -6992731 -6861404 -7562169 -7484077 -5274842 -2810714 -2063327 -1301721 2573319
2335 2573319 9312414 15564369 18493113 16741498 9734590 -654534 -9287704 -12368441
2327 -12368441 -11805416 -11323288 -9884882 -4124122 3641500 6531090 3468114 1768450
2319 1768450 6241534 11739045 11432776 7659120 8006516 13193382 15800817 10928201 2077704
2310 2077704 -4803762 -8019538 -8599778 -6349061 -967314 5217287 9149953 10796315
2302 10796315 12146656 12938165 10438000 4278788 -1174105 -1491957 2024088 3819858
2294 3819858 1415570 -1362788 71132 4277017 5198395 -96679 -7683672 -11455836
2286 -11455836 -9585083 -5205346 -1994479 -399791 2232422 8472453 17373827 24175024
2278 24175024 24415077 18501182 10979681 5223475 725038 -3759041 -6768769 -5775503
2270 -5775503 -892988 5034192 9412404 11529367 12014374 12200890 13363691 15171695 15636473
2261 15636473 14012640 12685595 14128835 16736554 16285212 11738019 7244583 7431657
2253 7431657 12249984 17440111 19087245 16909022 13682418 12147871 12566852 13461197 14470659
2244 14470659 16988818 21086315 23575318 21350098 15716370 10869165 8561620 7189168
2236 7189168 6092253 7020024 9804586 10034703 4227321 -4376093 -8476150 -4887016 2543776
2227 2543776 8277611 10777991 11839394 12376070 11210441 7770946 3983886 2432414
2219 2432414 3502655 5537969 7430385 9572777 12034606 13516032 13245241 12568288 12894274
2210 12894274 12756548 9018423 1354278 -5991882 -7850130 -3249862 3307212 5867378
2202 5867378 2995504 -390190 1355705 7063044 9508402 4853748 -2172573 -5274740
2194 -5274740 -5026912 -5551949 -5942245 -2095769 3844463 4041896 -3257794 -9930271 -9162993
2185 -9162993 -3560260 2066351 8730537 17542865 22176073 16036154 3650841 -4242919
2177 -4242919 -5504754 -7326059 -12319865 -13895422 -8416104 -3014450 -5741344 -14117647
2169 -14117647 -19440339 -18107655 -12730714 -5319526 3860979 11650532 12643075 6171792
2161 6171792 -1231593 -2505531 2529465 7603746 6691153 -613688 -9743213 -16138593
2153 -16138593 -18843144 -19113798 -17119526 -12195612 -5890720 -1832529 -1539552 -2538531 -1895398
2144 -1895398 104700 936358 -996172 -4965223 -8144759 -6903919 -159770 7965571
2136 7965571 11529600 9783420 7901569 9497602 11829334 10494665 5500434 -119719
2128 -119719 -4684871 -7715200 -8254763 -6938568 -7253837 -10942498 -14454708 -13966756 -11370085
2119 -11370085 -10348915 -8877757 -2054257 8433307 14706446 13719098 11464639 13631191
2111 13631191 17587964 17444892 13026487 9407122 9652179 11892476 12918302 12026219 11347740
2102 11347740 13533047 18646024 23019004 22367305 16234364 7921205 342855 -5732705
2094 -5732705 -9605334 -10161661 -8314346 -6868116 -6777750 -6307403 -4892579 -4615869 -6384923
2085 -6384923 -7947114 -7696621 -7414212 -9011167 -11425660 -13105715 -14717685 -16734569 -17073325
2076 -17073325 -14200008 -10372736 -8826741 -9667965 -11208270 -13168883 -15676086 -17153866
2068 -17153866 -16040675 -12634712 -7151121 721902 7619379 6604703 -3459038 -12763595
2060 -12763595 -11438172 -2726079 2062828 -313568 -2491810 394464 4410017 5456339
2052 5456339 5415166 6077959 4730014 518026 -1542333 1538187 4566091 1969717 -3149631
2043 -3149631 -4399968 -2415177 -2283618 -3366051 152109 8846898 15248263 12551674
2035 12551674 1222769 -13143079 -23571346 -23854380 -13400259 -1128291 1471997 -6633446
2027 -6633446 -14955512 -15289228 -10836470 -8574390 -8763160 -7597161 -5723105 -6889917 -9871163
2018 -9871163 -8895073 -2842002 1998033 684593 -3390669 -3568617 1090439 5849474 7917245
2009 7917245 9615327 12988566 14896006 10686302 1541679 -5527423 -6073472 -3698922
2001 -3698922 -4729014 -9362923 -11765444 -8654941 -3877373 -3013823 -6579822 -10892212
1993 -10892212 -13350016 -13956515 -13007068 -10432707 -7172961 -4570325 -2268329 1006294
1985 1006294 4304726 4521086 699555 -3493529 -3257391 1855985 6994552 6779935 1046987
1976 1046987 -4260849 -2763689 5180673 12024530 10907087 2857621 -5428103 -9366008
1968 -9366008 -9093397 -5640036 583407 6418472 6129529 -1482442 -9379048 -9970127 -4679707
1959 -4679707 -1516296 -4118808 -7928205 -7434566 -2541045 3642823 8997475 11918579
1951 11918579 10286475 4280486 -2181618 -6050839 -9068392 -13568687 -16553169 -12936502
1943 -12936502 -4068758 2336267 1743835 -2608732 -6328294 -9868526 -14570967 -17536072
1935 -17536072 -15941709 -13609643 -16910143 -24882599 -29553226 -26672543 -20223208 -14539011
1927 -14539011 -8022142 1555085 10563570 13766408 12051924 10330042 9515164 6575267
1919 6575267 2052256 1009645 4733144 7209340 3494913 -2419515 -2632011 3898956
1911 3898956 10205906 10585882 7029771 5406802 8291207 13590826 18516295 22185511
1903 22185511 24187616 22981553 17771601 11380077 8786445 11584838 15407033 14544487
1895 14544487 8168896 160334 -6176861 -10411039 -12160658 -9373413 -1135609 9749405
1887 9749405 18823132 23840589 25739675 26739746 28167557 29315356 28153597 23963454
1879 23963454 18703736 14297914 9830710 4347942 1164553 4466476 11320745 12958423
1871 12958423 6345392 -1233514 -2797844 -1078817 -1780045 -2862703 1226206 7716583
1863 7716583 7579150 -418693 -6866365 -5451318 -1598648 -3183653 -9150192 -12911790
1855 -12911790 -12434338 -10770226 -9175718 -5800803 -791648 2103487 -157929 -6830783
1847 -6830783 -14958822 -21830862 -25689052 -25959521 -23475596 -19741193 -15886860 -12468415
1839 -12468415 -9517895 -6580302 -3776872 -2772990 -4851568 -7888820 -7865679 -4342612
1831 -4342612 -1673938 -3078221 -6074734 -6180987 -3119453 -615856 -1280293 -4263652 -7295213
1822 -7295213 -8833672 -8542407 -7346108 -6846750 -7692107 -9061804 -10340009 -12090247 -14534283
1813 -14534283 -16334776 -15831284 -12598688 -7646685 -3333679 -2245292 -3503184 -1271318
1805 -1271318 8456122 19616852 20722749 9725415 -2016047 -4166513 427735 3089738
1797 3089738 2562523 3272573 4764672 2093053 -4668338 -9795093 -10919293 -11294141 -12586025
1788 -12586025 -12507669 -10658384 -9837690 -9924097 -7042815 -1012615 2575074 333614 -4449969
1779 -4449969 -7716724 -9182679 -8378883 -2748135 6003187 9512196 2325878 -10098917
1771 -10098917 -18011804 -18614662 -16055488 -13765086 -12278540 -12155111 -13445984 -13485777 -9906498
1762 -9906498 -4946047 -2917703 -4716307 -8538300 -14189013 -22075832 -29068236 -30257872
1754 -30257872 -25025270 -17731052 -12447969 -10032308 -9562877 -9064185 -5462066 2227741
1746 2227741 9727377 11140267 5882196 -1267917 -6715431 -10805185 -13953411 -14424225
1738 -14424225 -11507544 -7559161 -4933797 -3134304 -649239 1920865 1825064 -3397908
1730 -3397908 -13227428 -22764011 -25200276 -18295935 -8009623 -3035312 -5817398 -11314122
1722 -11314122 -13823425 -11578729 -5034997 4728679 14409701 19184652 17538091 13073394
1714 13073394 9637262 6792254 1954848 -4963752 -11163083 -14027053 -13055571 -9643997
1706 -9643997 -5916221 -2861333 740044 6181695 11608997 13151163 9914304 5626206
1698 5626206 4325780 6320094 9117051 10177534 8036547 3246835 -851242 -1062854
1690 -1062854 980072 525757 -2363674 -986934 8397272 18934175 20267804 11342189
1682 11342189 951009 -3646520 -3454798 -2919247 -3598152 -4348050 -3779756 -515566 5703272
1673 5703272 11365018 11285293 6012940 3620907 10110526 20415957 23692284 16526992
1665 16526992 5942149 -860492 -4312813 -7908024 -10698354 -8836665 -2351616 4010497
1657 4010497 6143516 3477969 -2677968 -9791677 -13242518 -9461917 -1594213 1940724
1649 1940724 -2813575 -10184347 -12518555 -10149848 -9556657 -13368893 -17333561 -17502799 -15732509
1640 -15732509 -15916964 -17821100 -17409728 -12196304 -4365820 1232828 1508298 -2159190 -5544092
1631 -5544092 -6288793 -6287699 -8363659 -11713675 -12742205 -9805366 -4740154 -35961 2819708
1622 2819708 2400915 -1769435 -6572805 -6975786 -2197350 2376667 1306970 -5005699 -12110578
1613 -12110578 -16760540 -18321551 -17102049 -13751795 -9126849 -3308495 3465159 7914393
1605 7914393 5179917 -4201471 -12070776 -11310806 -4353300 1182189 3073173 5363125
1597 5363125 9952261 13609862 13894395 12061832 8472107 1009837 -8896889 -14020089
1589 -14020089 -9606420 -231740 6130485 7771995 8047283 7410830 3297128 -2758923
1581 -2758923 -4827675 -1170713 2524976 1420146 -1457032 -102297 6050245 12872430
1573 12872430 18215023 22822015 25427893 22176756 12447488 1873471 -2427719 1972454
1565 1972454 11941677 21619587 25112721 19317754 6947822 -4034577 -6219528 1351138
1557 1351138 12830830 20056652 17808292 7388351 -3667088 -7731863 -4814905 -2251223
1549 -2251223 -5023729 -9307162 -8866123 -5035358 -4874379 -10039657 -13565916 -9683542 -1936974
1540 -1936974 1968352 248694 -1954614 -81915 5021675 9507178 10757115 8618163
1532 8618163 4414216 -148181 -3690892 -5408649 -4942252 -2534020 843848 4553814
1524 4553814 9490138 16685007 24317872 27977021 25065740 17606566 9692466 3678575
1516 3678575 -96717 -1969239 -3390439 -6977963 -13399320 -19072605 -19719715 -15982739
1508 -15982739 -12962037 -13993858 -17224736 -18799937 -17123604 -12975810 -7504452 -1873374
1500 -1873374 2184372 3349696 2386856 1907313 4131180 8980507 14206103 17203471 16858515
1491 16858515 13855565 9461403 4501419 -272091 -3457515 -3497120 33675 5958141
1483 5958141 12158526 16363522 16650033 12110925 3703897 -5554099 -11922514 -13594399
1475 -13594399 -12529869 -12719642 -15631696 -18244463 -17059034 -13078300 -10245567 -9209262
1467 -9209262 -6113772 1073600 8255141 9919919 6113414 1672480 -270624 -803963
1459 -803963 -1606093 -2017712 -691803 1837265 3373363 2094914 -1758170 -5464292 -5618722
1450 -5618722 -1766075 2059700 976832 -5537843 -13224713 -17400028 -16373931 -11326630
1442 -11326630 -5056655 -709357 716908 2020384 6544048 12554991 13671334 6794049
1434 6794049 -2644978 -6206267 -2160240 3337913 4690940 3176029 3334556 5824385
1426 5824385 7117894 5469556 3491812 3701892 4714118 4465437 4893837 9349504 15784828
1417 15784828 16895602 8797368 -3347907 -10557239 -9071031 -2449763 3468113 5506531
1409 5506531 4360286 3128068 4191074 6363313 6203372 3091351 909742 2739296
1401 2739296 5984081 5694416 1373573 -2844743 -4254974 -4411086 -5474281 -6715032 -6130627
1392 -6130627 -3944481 -2896056 -4952769 -8084289 -7228894 -52552 8507975 10280265
1384 10280265 3554578 -4127719 -4734449 1622496 9131191 13962494 15946936 15655733
1376 15655733 14495263 15719643 20561163 24676659 22854818 15717212 7300662 -1575368
1368 -1575368 -11583910 -18828615 -18301720 -12806939 -10169450 -10903989 -7384462 2688667
1360 2688667 11151874 11678286 8570159 7701398 6728453 1893002 -1849039 3266024 15116202
1351 15116202 23452267 22940434 17373558 11953497 8151137 6079594 5913359 6170643 4937477
1342 4937477 2979148 2246174 2402526 2475077 3811565 6651303 6249445 -1065369 -9337636
1333 -9337636 -8056733 3625296 14871336 17027416 12769057 8814928 6247807 2723337
1325 2723337 -680923 -567713 3126213 7289757 10451529 13847345 18108803 21674898
1317 21674898 22692521 20947973 17870251 15311241 13956449 12707288 10270173 7061530
1309 7061530 4371961 2230124 -83145 -1928069 -2059756 -1296481 -2004268 -4993849 -9236894
1300 -9236894 -13968930 -17867903 -16925407 -7921601 5112935 12648268 9987357 2045622
1292 2045622 -4103463 -7082599 -8668267 -7931184 -3005908 3630336 6864329 5550222
1284 5550222 3469466 3652675 5036417 5201498 3704044 1765499 364577 -564435 -1884245
1275 -1884245 -4492106 -8454993 -13169818 -18294221 -23344451 -26399525 -25338875 -21127485
1267 -21127485 -17626561 -17065631 -18143830 -19705561 -22726531 -26217751 -25152587 -17081392
1259 -17081392 -8209457 -7209713 -13652368 -17986441 -13583230 -4038598 2558589 2101945
1251 2101945 -4311177 -12967615 -18554665 -16462716 -7821653 101700 1866250 279518
1243 279518 1612299 6458400 9837258 9780840 10856557 17345188 26210193 29614439 23376365
1234 23376365 11195628 913310 -2422549 -80091 2975694 3785228 3732312 4834447
1226 4834447 5584394 3167913 -858578 -1025660 4460451 10084957 9929910 5617682 3312406
1217 3312406 4257463 3497674 -1229417 -4560592 -881530 6568204 8517304 995233 -9868607
1208 -9868607 -15035215 -11774419 -4494498 1285887 3377827 2107644 -2093961 -8589572
1200 -8589572 -14916569 -17431696 -14568938 -8482735 -2492842 2083874 5203208 5573398
1192 5573398 1754779 -4262355 -7747151 -6698787 -4047342 -2953469 -2633605 -1060917
1184 -1060917 776063 565237 -993888 -1089287 605804 1508812 256309 -1583884 -2160726
1175 -2160726 -1403604 -421105 -845271 -4193339 -9498294 -12567977 -10851809 -8123852 -10015363
1166 -10015363 -15195968 -16437596 -11559345 -7139545 -7999948 -8877927 -2570796 7442010
1158 7442010 10181547 2386732 -6752194 -8085400 -3693487 -1703071 -4381486 -7057718
1150 -7057718 -7081239 -7486978 -10371934 -12111183 -9329908 -6405872 -11192234 -23328914 -32329459
1141 -32329459 -29698134 -18898452 -9901766 -6972716 -6286364 -3807619 -302234 1768602
1133 1768602 2029086 1547672 1287823 2083732 3770531 4153693 1753511 -245785 3571541
1124 3571541 13309472 21898569 22410110 14781692 4206321 -4369834 -8853494 -9898377
1116 -9898377 -9910717 -10448413 -10232380 -7890079 -5722347 -6608156 -7873183 -4277169 2284484
1107 2284484 3467361 -2480660 -6317887 -1572453 4800792 3146422 -3460509 -4171164
1099 -4171164 2458613 6487042 1443231 -8136928 -15466985 -19574215 -21730369 -20627530
1091 -20627530 -15231616 -8182618 -2941806 -218095 988600 1505144 2076476 2316941 -754043
1082 -754043 -9357678 -19690535 -24318204 -20912957 -14631251 -10910329 -10207592 -10867572 -12238427
1073 -12238427 -12890043 -10157507 -3864664 3020462 8823550 13996059 16444005 11959397
1065 11959397 2179860 -3745622 70689 8329738 11919954 9110641 4564168 1090748
1057 1090748 -1817578 -3811874 -3761493 -2640469 -1857019 -466769 1807950 1484708 -3492660
1048 -3492660 -7944724 -5186135 2780492 7397584 5426314 1971518 1272391 1484247 454599
1039 454599 107084 1821510 2702521 165935 -3718888 -5772494 -6031359 -5513491 -3489716
1030 -3489716 -640642 -1265663 -7621985 -14621424 -15261665 -9906431 -5122195 -3974701 -2891787
1021 -2891787 1045697 4826842 4011536 -1056044 -6400047 -9328561 -9341552 -6107436 -85063
1012 -85063 5454131 6480309 2970138 -857048 -1841182 -1072549 -762807 -678000 22133
1003 22133 -345003 -3724103 -7759421 -7330969 -1273025 5645416 8585933 7625066 5535691
994 5535691 3716353 2661191 3742954 7215839 9955763 8318241 2385777 -5074381
986 -5074381 -12353994 -18403148 -20375131 -16002145 -7965882 -1340309 3401640 9560646
978 9560646 15278130 11956970 -3771096 -21067497 -24617249 -12461378 1581190 4138858
970 4138858 -3817011 -11382044 -12017067 -9324717 -9866452 -14624014 -19341573 -20887979 -20266327
961 -20266327 -19540495 -18615351 -16352265 -12705777 -7710378 -273170 8853609 14198080 10276939
952 10276939 -149523 -7136233 -5081720 948226 3713740 4462993 9437262 17883787
944 17883787 20685066 12329290 -1361850 -10425901 -11791509 -9823806 -8907529 -9714828
936 -9714828 -11553336 -14133570 -16280008 -15721231 -11564364 -5740462 -1213265 540302 132217
927 132217 -726174 -643055 202378 96945 -2226134 -5736596 -8093602 -8355272 -7617109 -6969558
917 -6969558 -6272183 -5514845 -5950515 -8506290 -11707946 -12661887 -10244252 -6262671 -3060836
908 -3060836 -891459 1447545 3934195 4880131 3809426 3283933 5841363 9474008 8822499
899 8822499 2078568 -5598600 -7886028 -4981477 -2491738 -3477993 -5424309 -5617934 -5370930
890 -5370930 -6541967 -7197239 -4445734 27672 1026237 -3809504 -11638919 -18355454 -22163828
881 -22163828 -23021017 -21200729 -17269937 -11616277 -3584528 6973256 17159787 22690899
873 22690899 22950523 21844294 22302397 22361197 18565798 11235754 4063470 -287726 -2217956
864 -2217956 -3834865 -7224321 -12942761 -18608549 -20393947 -17936074 -16323308 -20441122
856 -20441122 -28035586 -31267663 -25302928 -13161836 -2028272 3134829 2369064 -415527
848 -415527 -847080 1714295 3104957 -721924 -8003316 -13062517 -13899766 -14316751 -17246747
839 -17246747 -19663839 -16884001 -9342170 -1879658 2102435 2739694 1369213 -438143
831 -438143 -317165 2601628 4773209 1492737 -6001441 -10588478 -8510598 -4991759 -7135519
822 -7135519 -13626004 -16111406 -10552178 -2820908 -1357844 -7109294 -13047329 -12345237 -5120953
813 -5120953 2449192 4473639 955439 -2559134 -1543797 1504933 -428082 -9675331
805 -9675331 -19689381 -22189258 -16627579 -9589370 -5873883 -3806724 298760 6353134
797 6353134 10571524 9336531 2140282 -7442993 -13377210 -12347536 -8034557 -7239993 -10717636
788 -10717636 -11734696 -6207917 -130592 -2113104 -10862317 -15864906 -10570037 237740
780 237740 7655496 8935939 7875130 7884983 8325801 7336185 5679072 6357001 10516556
771 10516556 14733512 14002989 7887719 1607183 -603153 -934898 -3888424 -8724386 -10512633
762 -10512633 -8094008 -5833864 -6432394 -7003216 -4667148 -1564142 -750863 -608571 2256339
753 2256339 6570429 7367671 2955702 -2633659 -4408292 -1325992 3495346 5831926 4270166
744 4270166 2420012 5587882 13309918 17541778 11698187 -212042 -7708512 -6337324
736 -6337324 -1590230 -406758 -3646215 -8166728 -11641362 -12861964 -11089384 -8124900
728 -8124900 -8124349 -12311071 -16293734 -15657092 -11837732 -8972804 -7227632 -3906282 -15326
719 -15326 -299344 -5927852 -11861078 -13441050 -11776035 -10138826 -8557947 -5571665 -2838222
710 -2838222 -3474823 -6500809 -7178994 -3504016 1109398 2668946 923491 -2771219 -8649203
701 -8649203 -16519966 -22522244 -21598148 -13150456 -1845273 6904571 10008445 6244083
693 6244083 -3291965 -13417064 -17435757 -14175915 -10160454 -11877527 -17293170 -18122293
685 -18122293 -10119811 1823363 9444392 9712504 6439721 4665031 5169089 4849977 1583019
676 1583019 -2794127 -5236434 -6020739 -8112462 -11931361 -13692076 -10468991 -4416000 209850
667 209850 2057942 2221397 1042568 -1231065 -2472628 -1482112 -1437572 -5741170 -11123533
658 -11123533 -10626777 -4155264 -62183 -4050765 -12074536 -17356451 -18948902 -18918137 -16199693
649 -16199693 -9552592 -3245866 -2756925 -6113047 -5982810 -147281 5952107 7282819 4219043
640 4219043 -990641 -6913955 -10843448 -9813783 -5888316 -5169629 -9042129 -11653830 -9211844
631 -9211844 -6331157 -8662402 -13958964 -16047911 -14088540 -11720664 -9500881 -4994099
623 -4994099 320491 810154 -5444439 -13301050 -16401030 -12921865 -5138615 2977285 7205064
614 7205064 5876607 2120232 402499 1029335 1580865 2743440 7155828 12392175 11952402
605 11952402 5389108 660789 2589749 5393076 2186218 -3789163 -4885386 -2060460
597 -2060460 -3185667 -9319952 -11646653 -4197855 7478831 13884069 12647173 8247588
589 8247588 4590247 2143032 249960 -1651247 -4358571 -7734488 -9737041 -8605306
581 -8605306 -5371731 -2469354 -519081 1755702 4835229 7236695 7040908 3649736 -1675092
572 -1675092 -6312016 -8102926 -7825828 -9158743 -14647888 -21905778 -25367904 -22170654 -15088779
563 -15088779 -9155293 -6552163 -5877859 -5602498 -6343567 -9086451 -12538554 -13885048 -12082234
554 -12082234 -9115635 -7657747 -8417491 -10050153 -10606876 -8752305 -4946270 -2174507 -4041036
545 -4041036 -10800210 -18230074 -21607265 -19892555 -15150352 -9580689 -4854344 -2639770
537 -2639770 -3077380 -3508853 -1234875 2940881 6038869 6705055 5012680 -21251 -8388760
528 -8388760 -14886719 -12291387 -766542 10093217 11667541 6004861 2230095 5408543
520 5408543 11925915 14534097 9277254 -1753146 -12252982 -16694802 -15062401 -12217318
512 -12217318 -11956570 -13192440 -12815639 -9995364 -5889826 -1338538 2825320 5097574 5507091
503 5507091 6695853 9947886 11954715 9134822 3887698 2278359 5683812 9015509
495 9015509 8012706 4242455 1126422 -1395271 -5350261 -10115409 -12509016 -10903563
487 -10903563 -6975071 -3508782 -2178407 -3445559 -6902145 -10980422 -13401177 -12973958
479 -12973958 -10661199 -8018849 -4811951 400598 6652170 9183777 3975016 -6418029
471 -6418029 -13782151 -12009476 -2762128 7038246 11745143 10293771 4999095 -983295
463 -983295 -5550013 -8306127 -9528757 -8935993 -6647759 -4670007 -4927437 -5865796 -4207836
454 -4207836 -689554 -133122 -4068578 -7391505 -5375979 -407270 1964222 447512 -2714014
445 -2714014 -6681875 -10859774 -11270819 -4699677 4159279 6173805 -654194 -8419910 -9259645
436 -9259645 -3167689 5258826 12580557 16692605 15874401 11064695 6467891 5472334 7716436
427 7716436 10937291 12998680 11725190 6507632 1002773 214177 3682087 5809978 4181343
418 4181343 2458519 3020201 2588735 -1085801 -3622418 -297204 6102547 9261711 8203124
409 8203124 6691286 6160759 4887396 2642146 736467 -1435931 -4578993 -5230684 707478
400 707478 9978461 13313077 6341512 -5223692 -12682842 -12698126 -7441699 -740151 3768133
391 3768133 4062802 1811232 805933 1834266 1598988 -1829424 -5387247 -5055278 -1248056
382 -1248056 2250657 3111898 1940310 237120 -685270 643836 5010636 11011818 15684710
373 15684710 17010800 15276622 12091851 8697423 5346428 2009057 -694532 -1730583
365 -1730583 -926918 699735 2337389 4170542 5925750 5734554 2052772 -3813800 -8675278
356 -8675278 -10606932 -9710169 -6463723 -1556664 2701190 3295128 -169223 -4609889 -6807397
347 -6807397 -6449209 -5271033 -4436801 -3689891 -2424254 -906263 -518753 -2487474 -5833583
338 -5833583 -7366431 -4964498 -222358 3780128 6674963 10389460 14579951 15509866 11100074
329 11100074 5068978 3610522 8238125 13641978 13288944 6573278 -389039 -1511493
321 -1511493 2354076 4839233 2650472 285838 4039075 13059818 19760966 18931282 13201391
312 13201391 8651715 7774856 8282990 6823197 2062693 -4723362 -10557369 -12812296 -11363614
303 -11363614 -8374114 -5716435 -3517006 -1529879 -645769 -2055387 -5417494 -8394541
295 -8394541 -7824142 -1754244 8518987 18244320 22135239 18287195 9367118 432535
287 432535 -4265171 -3693766 -575015 1297902 1304105 2288224 5502401 7606893 5365175
278 5365175 1251868 492105 3591452 6154104 5906326 5326502 6673105 8969776 11315451
269 11315451 14745490 18620759 19181094 14498990 7636033 2186194 -2112740 -6343336
261 -6343336 -8320181 -5676639 -928467 862524 -1351940 -3949559 -3996747 -1935480 1011163
252 1011163 4960292 9906551 13951465 14174640 9312995 1972621 -2146016 859264 8293432
243 8293432 12965347 11064931 5818925 2378914 2008612 3106219 4798368 6578486 6741688
234 6741688 4309381 912013 -1614450 -3398844 -4030811 -956634 6232614 12890194 14945036
225 14945036 14868749 17200588 20497269 19642811 14778618 11305762 10918133 9261659 4060234
216 4060234 -428491 199163 4353196 7688585 8855270 9266610 10198074 12677164 17555504
207 17555504 23205417 25478210 22361352 16831785 13055329 11436639 9237009 4568911
199 4568911 -1898015 -8109987 -12404133 -14947308 -17458222 -20208511 -20264891 -15421009 -8952872
190 -8952872 -6447957 -8058590 -8636390 -6143630 -4421773 -5760057 -6574018 -4030794 -1806182
181 -1806182 -4484910 -10145294 -13535381 -13524557 -12340943 -10180807 -6174425 -2710070 -2898793
172 -2898793 -4810612 -4032277 -1447147 -2433953 -7864333 -11905726 -10471455 -6528916 -4533366
163 -4533366 -4238913 -3270293 -2084479 -2411519 -2970874 -545452 5449357 12158107 16510154
154 16510154 17216194 14291239 8942432 4005893 2490641 4652185 7121425 5698375
146 5698375 -613598 -8117714 -11213771 -7414284 110091 5208384 3883214 -3317826
138 -3317826 -12956383 -21273415 -25410515 -24149509 -18835238 -12977681 -9666627 -8926616 -7993407
129 -7993407 -4614882 102843 2820703 1976920 -558943 -2457854 -3662691 -4310871 -2159063
120 -2159063 4040531 9726910 8398112 1024108 -3966933 -2190287 1066813 299637 -1344039
111 -1344039 1267121 4846882 2290554 -4894013 -7545287 -1930694 6153251 10909194
103 10909194 12276310 10816728 5149321 -2438203 -5363802 -1960089 1155942 -643363
95 -643363 -2677782 770126 6791153 8970276 7404805 6517272 6571156 4918857 3156235
86 3156235 5156516 9083130 8917606 3900802 -587393 -2081160 -3921346 -7504465 -8380549
77 -8380549 -3276978 4092472 7788912 6654052 3585812 763420 -1644992 -4139941 -7302667
68 -7302667 -10816929 -12160634 -8815786 -2676100 902821 -123332 -1841483 -265307 3347721
59 3347721 5299386 4485321 1821828 -2610013 -8290171 -11874827 -9937922 -3882202 754299
50 754299 273385 -3608442 -6165663 -4213699 1759706 8771459 14104019 16993443 17779622
41 17779622 16468222 13410034 10470126 9249096 8502536 6025730 3053667 3433099 7690378
32 7690378 11513255 11646593 9761983 8367394 6520730 2766171 -787931 -1370233 -549020
23 -549020 -2213910 -6590289 -10076121 -10605516 -9702444 -9124453 -8390261 -6020078 -1193421
14 -1193421 5657939 12134792 14678677 12422174 9201776 8953763 10161165 8382160 3666582
5 3666582 1159364 3701880 8019821 9991808 10070932
0 10070932
$$ Imaginary data points
##PAGE= N=2
##DATA TABLE= (X++(I..I)), XYDATA
65535 -9838675 -13226360 -17307139 -19011255 -17644543 -15436118 -13922649 -11910462 -7819914
65527 -7819914 -2883412 -579081 -2581132 -6282396 -7530250 -5522529 -3462170 -4120762
65519 -4120762 -6533035 -7968853 -7434181 -5756096 -3665783 -1655224 -645427 -665746 525830
65510 525830 5167875 11556665 14265588 9404949 -869907 -9825215 -12423883 -10095702
65502 -10095702 -8530003 -10353133 -11789946 -8625831 -3491018 -2842354 -7039108 -8911896
65494 -8911896 -3992519 3145563 6031065 4924680 3848905 3296932 1664263 799560
65486 799560 3502558 7085518 6036559 656947 -3179302 -2988481 -2219988 -3119039 -3359746
65477 -3359746 -1693443 -1183043 -3892242 -6907270 -6719740 -4101860 -2056330 -1913754 -3436285
65468 -3436285 -5759898 -6622471 -3961246 227432 1268380 -1418133 -3039572 -879581
65460 -879581 1459686 22188 -3619958 -5850983 -6402316 -6378696 -4557148 -261507 2813862
65451 2813862 509809 -5597835 -9945477 -9559680 -5377195 1126046 8374245 12929244
65443 12929244 11765969 6477541 1960074 727780 943114 -250592 -3790255 -8698752
65435 -8698752 -12884686 -14175738 -11996465 -7460997 -1293969 6281033 12706684 13469395
65427 13469395 7684051 344475 -3760323 -5387503 -7044541 -7414840 -4040237 1256728
65419 1256728 4775400 6831562 10053483 13299176 12809149 8672173 4699899 2201707
65411 2201707 -618904 -3093742 -1971795 1923546 2707156 -2378793 -8332543 -8817721
65403 -8817721 -3814757 1780014 4402882 4097327 2662966 2071526 3779335 7956944
65395 7956944 13489623 18657055 21220205 19186155 13460458 8446421 7337248 7911748
65387 7911748 5901614 1106823 -3460339 -6954632 -10433120 -12141654 -8796244 -2102036
65379 -2102036 1469863 -1136965 -6206070 -9144874 -8837019 -4980034 3070393 12155430
65371 12155430 15421552 10438216 3312114 1170437 3862317 6239518 5217065 1159999
65363 1159999 -4522172 -9391461 -10143332 -6431692 -2727197 -3383764 -7503695 -10911802
65355 -10911802 -11078052 -8154503 -3921948 -1770819 -4354159 -8762418 -7898918 21611
65347 21611 7333584 6603714 872137 -1060786 3074043 7330514 6944040 3805453 2441824
65338 2441824 4852816 9581385 12699187 10310597 3321266 -1369718 1878797 10060141
65330 10060141 15295826 14815712 12500717 11171248 8899663 4056660 -820237 -2437774
65322 -2437774 -907896 1289009 2300441 1924311 1655262 3846429 8391149 10603853
65314 10603853 5907770 -3071002 -8011811 -4795690 1636831 4155097 1979713 -181589
65306 -181589 777603 3096418 3134027 -561543 -6114960 -10193488 -11089565 -10175186 -9914430
65297 -9914430 -10868862 -11743044 -11762035 -11165022 -9670557 -6830372 -4244609 -4915424 -9145414
65288 -9145414 -12885900 -11727872 -5680223 1005369 4017921 2223527 -2530092 -7734199
65280 -7734199 -12044796 -15038345 -15958737 -14022826 -10118554 -6436042 -3481319 651983
65272 651983 6480637 10627838 9615934 4686872 -48287 -3176432 -6350919 -9586561
65264 -9586561 -10023086 -6376000 -1790536 -803401 -4926639 -11712863 -16670666 -16079948 -9826930
65255 -9826930 -1804773 3805321 6211446 6506607 4037773 -2431061 -10421030 -14467011
65247 -14467011 -12164068 -6777936 -3078433 -3043053 -6025765 -10153479 -12771193 -12528336
65239 -12528336 -12024530 -15289303 -21428294 -24214214 -20022896 -12964657 -9277144 -9126295
65231 -9126295 -7454568 -1705605 4733043 6953490 4150800 241742 -178713 3602274
65223 3602274 7544529 7032134 2130306 -2243891 -1679970 3270356 8200818 9070793 5072607
65214 5072607 -1011573 -4549891 -2513466 3995355 11408498 17614822 22568153 25361571
65206 25361571 23611151 16875040 8422363 2125431 -809661 -1035668 872214 3797942
65198 3797942 5184199 3028889 -1597165 -5523571 -6960041 -7169225 -8489084 -10876840
65190 -10876840 -10925694 -5536167 3225263 9201097 9572653 8468691 10195374 11872131
65182 11872131 8073550 1054797 -760564 4612465 8795390 5020901 -1985848 -3012237
65174 -3012237 2963178 8570512 8191990 3343834 -925461 -939582 3633159 9437246 11598155
$$ [...]
##END NTUPLES=NMR SPECTRUM
##END=
