##TITLE=31Pdec_DE-78H4_23
 D2O, 64 sc
 10.3.2025
##JCAMPDX= 6.0         $$ Bruker NMR JCAMP-DX V2.0
##DATA TYPE= NMR SPECTRUM
##DATA CLASS= NTUPLES
##ORIGIN= UXNMR, Bruker Analytische Messtechnik GmbH
##OWNER= root
$$ XWIN-NMR		Version 3.5
$$ Mon Mar 10 14:05:24 2025 Russian Standard Time (UT+4h)  she@DPX200
##.OBSERVE FREQUENCY= 81.013821
##.OBSERVE NUCLEUS= ^31P
##.ACQUISITION MODE= SIMULTANEOUS
##.ACQUISITION SCHEME= undefined
##.AVERAGES= 64
##.DIGITISER RES= 17
##SPECTROMETER/DATA SYSTEM= spect
##.PULSE SEQUENCE= zgpg30
##.SOLVENT NAME= D2O
##.SHIFT REFERENCE= (INTERNAL, D2O, 0, 198.062)
##AUDIT TRAIL= $$ (NUMBER, WHEN, WHO, WHERE, WHAT)
$$ ##TITLE= Audit trail, XWIN-NMR		Version 3.5
$$ ##JCAMPDX= 5.01
$$ ##ORIGIN= Bruker BioSpin GmbH
$$ ##OWNER= she
$$ F:/spectra/data/she/nmr/P31/2/pdata/1/auditp.txt
$$ ##AUDIT TRAIL=  $$ (NUMBER, WHEN, WHO, WHERE, WHAT)
(   1,<2025-03-10 14:01:56.39 +0400>,<she>,<DPX200>,
      <created by zg, POWCHK disabled, PULCHK disabled
       configuration hash MD5:
       00 E9 B6 7A A2 85 ED C7 34 08 36 98 17 FE 4E 26
       data hash MD5: 32K
       9F 66 84 53 32 CD 90 C2 85 86 30 93 A0 7D 38 40>)
(   2,<2025-03-10 14:02:19.54 +0400>,<she>,<DPX200>,
      <Start of raw data processing
       efp BC_mod = 2 LB = 1.5 FT_mod = 6 PKNL = 1 PHC0 = 1860.704 PHC1 = -145.3056 SI = 64K 
       data hash MD5: 64K
       BD B9 63 30 FC 22 B8 A1 82 82 E0 71 AC 13 61 8A>)
(   3,<2025-03-10 14:02:35.15 +0400>,<she>,<DPX200>,
      <pk PHC0 = -8.512526 PHC1 = 0 
       data hash MD5: 64K
       4B 37 76 15 FA 71 3A 9F 72 DC A6 BE 17 71 A1 16>)
(   4,<2025-03-10 14:02:48.43 +0400>,<she>,<DPX200>,
      <abs ABSG = 5 
       data hash MD5: 64K
       E3 2E 5E 71 BA 0B 5D 28 7B 4F 13 3E F4 AC FE F7>)
$$ ##END=
$$ 
$$ hash MD5
$$ FA 8E 3E AC A8 48 92 F1 9B 11 23 26 F9 90 E5 B2
##$RELAX= 
##$RELAX= 
##$RELAX= 
##$RELAX= 
##$RELAX= 
##$RELAX= 
##$RELAX= 
##$RELAX= 
$$ Bruker specific parameters
$$ --------------------------
##$DU= <F:/spectra>
##$EXPNO= 2
##$NAME= <P31>
##$PROCNO= 1
##$TYPE= <nmr>
##$USER= <she>
##$AMP= (0..31)
100 100 100 100 100 100 100 100 100 100 100 100 100 100 100 100 100 100 
100 100 100 100 100 100 100 100 100 100 100 100 100 100 
##$AQSEQ= 0
##$AQ_mod= 1
##$AUNM= <au_zg>
##$AUTOPOS= <>
##$BF1= 81.014009
##$BF2= 200.13
##$BF3= 200.13
##$BF4= 200.13
##$BF5= 200.13
##$BF6= 200.13
##$BF7= 200.13
##$BF8= 200.13
##$BYTORDA= 1
##$CFDGTYP= 0
##$CFRGTYP= 5
##$CHEMSTR= <none>
##$CNST= (0..31)
1 1 145 1 1 1 1 1 1 1 1 1 1 1 1 1 1 1 1 1 1 1 1 1 1 1 1 1 1 1 1 1 
##$CPDPRG= <waltz16>
##$CPDPRG1= <>
##$CPDPRG2= <waltz16>
##$CPDPRG3= <>
##$CPDPRG4= <mlev>
##$CPDPRG5= <mlev>
##$CPDPRG6= <mlev>
##$CPDPRG7= <mlev>
##$CPDPRG8= <mlev>
##$CPDPRGB= <>
##$CPDPRGT= <>
##$D= (0..31)
0 1 0 0 0 0 0 0 0 0.06 0 0.03 2e-05 3e-06 0 0 0.0002 0 0 0 0 0 0 0 0 0 
0 0 0 0 0 0 
##$DATE= 1741600915
##$DBL= (0..7)
120 120 120 11 120 120 24 19 
##$DBP= (0..7)
150 150 150 150 150 150 150 150 
##$DBP07= 0
##$DBPNAM0= <>
##$DBPNAM1= <>
##$DBPNAM2= <>
$$ [...]
##$SUBNAM3= <"">
##$SUBNAM4= <"">
##$SUBNAM5= <"">
##$SUBNAM6= <"">
##$SUBNAM7= <"">
##$SUBNAM8= <"">
##$SUBNAM9= <"">
##$SW= 400.765351723535
##$SWIBOX= (0..15)
0 1 3 0 0 0 0 0 0 0 0 0 0 0 0 0 
##$SW_h= 32467.5324675325
##$TD= 32768
##$TD0= 1
##$TE= 0
##$TE2= 300
##$TE3= 300
##$TEG= 300
##$TL= (0..7)
0 120 53 12 22 120 120 120 
##$TP= (0..7)
150 150 150 150 150 150 150 150 
##$TP07= 0
##$TPNAME0= <>
##$TPNAME1= <>
##$TPNAME2= <>
##$TPNAME3= <>
##$TPNAME4= <>
##$TPNAME5= <>
##$TPNAME6= <>
##$TPNAME7= <>
##$TPOAL= (0..7)
0.5 0.5 0.5 0.5 0.5 0.5 0.5 0.5 
##$TPOFFS= (0..7)
0 0 0 0 0 0 0 0 
##$TUNHIN= 0
##$TUNHOUT= 0
##$TUNXOUT= 0
##$USERA1= <user>
##$USERA2= <user>
##$USERA3= <user>
##$USERA4= <user>
##$USERA5= <user>
##$V9= 5
##$VALIST= <valist>
##$VCLIST= <CCCCCCCCCCCCCCC>
##$VD= 0
##$VDLIST= <DDDDDDDDDDDDDDD>
##$VPLIST= <PPPPPPPPPPPPPPP>
##$VTLIST= <TTTTTTTTTTTTTTT>
##$WBST= 1024
##$WBSW= 4
##$XGAIN= (0..3)
0 0 0 0 
##$XL= 0
##$YL= 0
##$YMAX_a= 3767
##$YMIN_a= -4584
##$ZGOPTNS= <>
##$ZL1= 120
##$ZL2= 120
##$ZL3= 120
##$ZL4= 120
##$ABSF1= 198.0616
##$ABSF2= -202.7028
##$ABSG= 5
##$ABSL= 3
##$ALPHA= 0
##$AQORDER= 0
##$ASSFAC= 0
##$ASSFACI= 0
##$ASSFACX= 0
##$ASSWID= 0
##$AUNMP= <proc_1d>
##$AZFE= 0.1
##$AZFW= 0.5
##$BCFW= 0
##$BC_mod= 2
##$BYTORDP= 0
##$COROFFS= 0
##$CY= -3
##$DATMOD= 1
##$DC= 0
##$DFILT= <>
##$DTYPP= 0
##$F1P= 0
##$F2P= 0
##$FCOR= 1
##$FTSIZE= 65536
##$FT_mod= 6
##$GAMMA= 0
##$GB= 0
##$INTBC= 1
##$INTSCL= 9.790993e-09
##$ISEN= 30
##$LB= 1.5
##$LEV0= 0
##$LPBIN= 0
##$MAXI= 10000
##$MC2= 0
##$MEAN= 0
##$ME_mod= 0
##$MI= 50
##$NCOEF= 0
##$NC_proc= -9
##$NLEV= 6
##$NOISF1= 182.463
##$NOISF2= 159.3651
##$NSP= 0
##$NTH_PI= 0
##$NZP= 0
##$OFFSET= 198.0616
##$PC= 4
##$PHC0= 1852.191
##$PHC1= -145.3056
##$PH_mod= 1
##$PKNL= yes
##$PPARMOD= 0
##$PSCAL= 0
##$PSIGN= 0
##$REVERSE= no
##$SF= 81.0140089999434
##$SI= 65536
##$SIGF1= 159.3651
##$SIGF2= -187.1042
##$SINO= 113.3802
##$SIOLD= 16384
##$SREGLST= <1H.CDCl3>
##$SSB= 0
##$STSI= 65536
##$STSR= 0
##$SW_p= 32467.5324675325
##$SYMM= 0
##$S_DEV= 0
##$TDeff= 32768
##$TDoff= 0
##$TI= <>
##$TILT= no
##$TM1= 0
##$TM2= 0
##$TOPLEV= 0
##$USERP1= <user>
##$USERP2= <user>
##$USERP3= <user>
##$USERP4= <user>
##$USERP5= <user>
##$WDW= 1
##$XDIM= 65536
##$YMAX_p= 278274683
##$YMIN_p= -464541800
$$ End of Bruker specific parameters
$$ ---------------------------------
##NTUPLES= NMR SPECTRUM
##VAR_NAME=  FREQUENCY,     SPECTRUM/REAL,   SPECTRUM/IMAG
##SYMBOL=    X,             R,               I
##VAR_TYPE=  INDEPENDENT,   DEPENDENT,       DEPENDENT
##VAR_FORM=  AFFN,          ASDF,            ASDF
##VAR_DIM=   65536,         65536,           65536
##UNITS=     HZ,            ARBITRARY UNITS, ARBITRARY UNITS
##FACTOR=    0.49542278885378, 1,            1
##FIRST=     16045.7642231865, 0,            0
##LAST=      -16421.768244346, 0,            0
##MIN=       -16421.768244346, -464541800,   0
##MAX=       16045.7642231865, 278274683,    0
$$ Real data points
##PAGE= N=1
##DATA TABLE= (X++(R..R)), XYDATA
$$ [...]
9355 5340645 13564651 22456337 27656614 24315481 14970200 9694729 14234280 22153686
9347 22153686 23780875 19213305 15895639 15822949 13423508 6387445 237141 -915688
9339 -915688 -1220196 -5920655 -12421130 -14232208 -10884594 -8195179 -9741677 -13031052 -14335848
9330 -14335848 -13426415 -12474793 -12744124 -13365567 -12198278 -7883551 -2111145 824788 -1728847
9321 -1728847 -7529685 -11977047 -13280123 -13367571 -14259803 -15744281 -16746975 -16931537 -16118655
9312 -16118655 -13449284 -8151367 -801820 6508180 11145782 11441559 7905569 2908739
9304 2908739 -1288085 -4137969 -6410623 -8904630 -12046679 -15938787 -19605146 -20286751
9296 -20286751 -14785294 -2642316 11953807 22444560 25301159 23133612 21177405 20589071
9288 20589071 17285303 8469715 -2212119 -8609089 -9378678 -8053717 -6855040 -4426452
9280 -4426452 -2665 3856005 3977723 -326626 -7405086 -14180491 -17046906 -14881029
9272 -14881029 -11182782 -9927545 -9507310 -4914217 4093102 12103801 15953308 17631149
9264 17631149 17826378 13464699 5074442 -208646 1752242 5268115 3784875 525489
9256 525489 2683101 8847663 10880264 6761735 3241826 5433208 10878103 14964103
9248 14964103 16236428 15177203 12836974 11592139 12808983 13728252 11389223 8865361
9240 8865361 11520844 17459250 19039090 14794580 11866006 13998286 15206048 10082111
9232 10082111 3395468 2972302 7880167 10530676 7638346 2746811 -537099 -2115468
9224 -2115468 -2810475 -2968306 -3601656 -5276762 -6202617 -4716355 -3058090 -5170479 -10976781
9215 -10976781 -16154198 -17566236 -15809684 -12489270 -8619088 -6435883 -8949935 -15372427
9207 -15372427 -19567064 -16119549 -7136506 -452228 -1009281 -6201482 -10503641 -12469995
9199 -12469995 -14717079 -17885459 -18191848 -12625334 -4075183 1563580 2280569 1004363
9191 1004363 249833 -814394 -3026792 -4109191 -1367176 3695204 5659301 404294
9183 404294 -10531751 -20796627 -24502470 -21096919 -14960906 -10313645 -7768357 -6289343
9175 -6289343 -6011650 -6778938 -5881949 -899672 5730328 8442515 5119477 -766160 -4472366
9166 -4472366 -3631310 1913692 10130294 16380197 16810828 12949616 9438338 6871469 1332679
9157 1332679 -8013208 -16135523 -19313228 -19999449 -20935987 -19124016 -10876777 127732
9149 127732 5622601 2755739 -3173334 -5562977 -2193497 5570428 14931832 21835656
9141 21835656 22218378 15306700 4805771 -4085980 -8453260 -8610094 -6324894 -2722029
9133 -2722029 1939804 6618680 8994593 8206550 7140670 9385079 14102209 16913197
9125 16913197 16060370 14106183 12723324 10141692 6006904 4537931 8956278 15510856
9117 15510856 17298360 12814232 7252721 6046935 9896591 15426197 18144412 15256505
9109 15256505 7889372 568425 -2710631 -1539993 1837626 4648254 4431363 683537
9101 683537 -3197105 -2802911 906069 1780842 -2831136 -7765493 -7643641 -4698204 -4762574
9092 -4762574 -9058517 -14838240 -20895364 -26668891 -28406440 -22791654 -13366401 -7269645
9084 -7269645 -6092442 -5700425 -4451203 -4945952 -7219956 -7177902 -3771093 -1401084 -2206181
9075 -2206181 -1612086 4353218 11720143 13360345 8505110 3005850 1441759 2981824
9067 2981824 4826358 6205999 7725109 8740847 7420933 3668931 867649 3198104
9059 3198104 10848669 19075278 22600378 19788235 12388283 3653347 -2310063 -2527775
9051 -2527775 1199290 3425441 2326504 2644140 8326063 16149069 21133883 24195242
9043 24195242 28105311 29408100 22748205 11675765 5876920 7107151 7097222 1575840
9035 1575840 -2935031 -562940 4125539 3925681 7048 -1782093 -701433 -9200 499414
9026 499414 3557496 7831004 9026202 7182180 7154087 11440165 17006802 19731417 18416736
9017 18416736 14142406 8803160 4592774 2509615 1540675 1192852 3384388 8947539
9009 8947539 13781521 12486865 5509972 -985325 -2426911 329316 4359190 7860929
9001 7860929 9091082 6034561 -628684 -6752763 -9136217 -9128880 -10144811 -12969499 -15184874
8992 -15184874 -14275418 -9953064 -4192454 85270 1413367 1780476 4788608 10528506
8984 10528506 14079338 11284022 4369334 -1304059 -4710757 -8699486 -12204802 -9414425
8976 -9414425 91827 6516798 1634712 -8441508 -10403555 -2142921 5089003 3757444
8968 3757444 -541090 -647106 621416 -2283823 -6120697 -3802808 3457302 8244335
8960 8244335 8749323 9517543 11722283 11693321 9101613 7910870 8213669 5427609 -623591
8951 -623591 -3703697 -562680 5044844 10210974 17158747 26366698 32769886 33151317 31079016
8942 31079016 30335409 29368043 26199653 22549790 18706253 10841898 -1339145 -10492427
8934 -10492427 -10901601 -6094961 -1594933 3388866 10095927 12760407 6247877 -3557575
8926 -3557575 -6709041 -3446539 -2024721 -4671744 -5673624 -2560431 662156 2061619
8918 2061619 4477482 8107183 8627464 5004308 1928358 1857596 998289 -4144812 -11817603
8909 -11817603 -18842994 -23881731 -24802799 -18827965 -8482813 -2092199 -4509344 -11420176
8901 -11420176 -16261686 -18803626 -22848726 -28570933 -31845885 -30161052 -25542913 -21332513
8893 -21332513 -18124503 -13802881 -7351182 -1786306 -1511996 -6233438 -10237081 -9569648
8885 -9569648 -6735240 -5252309 -3351848 1912622 7496284 7853832 3734634 482721
8877 482721 -1369537 -6145078 -13691241 -18088376 -16972188 -14377748 -12446374 -8371423
8869 -8371423 -2458925 -895066 -5863473 -10177857 -7149181 429683 6478075 10478980
8861 10478980 13886225 13677694 7265565 -438025 -2913679 -2145741 -5042395 -11731025
8853 -11731025 -15332875 -12727602 -8105465 -5570630 -5142614 -6969738 -12613785 -19851613
8845 -19851613 -22185878 -17119937 -10827514 -10915128 -17010641 -21607875 -18816324 -10031722
8837 -10031722 -1924917 -445937 -6073398 -13744642 -17739532 -16911707 -14477391 -12982016
8829 -12982016 -11270158 -7136753 -1350138 2697173 3020188 1071105 -1008923 -3825607
8821 -3825607 -9251521 -15546235 -17086200 -11232487 -3077862 346323 -706802 138676
8813 138676 5093080 8389214 4590981 -3952315 -10868694 -13201346 -11850458 -8044003
8805 -8044003 -3369689 -790512 -1418498 -1929950 933734 4836642 5081285 2504788 3544577
8796 3544577 11739575 22664582 28603161 26116429 18118240 10045687 4825389 1170727
8788 1170727 -3109826 -6611692 -5372164 850493 6478426 6780474 4033952 3704186 6533139
8779 6533139 8505666 7574537 5994508 5821191 6017609 4982711 2869914 285535 -2795411
8770 -2795411 -5674314 -6640187 -5376480 -4156235 -5353679 -8585727 -11234098 -11391726 -9693796
8761 -9693796 -8173014 -7446093 -5659747 -1114109 4565795 7605972 6532491 3565455
8753 3565455 1293307 72682 -913755 -2469241 -5601960 -9931528 -11529649 -6440161
8745 -6440161 2427468 6597091 2539892 -3713938 -5260249 -2450183 1499270 7254666
8737 7254666 15659649 21936504 21083929 16296602 14576987 15804510 13681187 6505726
8729 6505726 -625368 -4210689 -5518271 -5018424 -1245099 3386112 2946913 -3226878 -8141412
8720 -8141412 -6042738 1460552 9825842 16308403 18279270 13112276 3020624 -5202120
8712 -5202120 -8421401 -10459841 -14582385 -17947178 -16801705 -12331926 -7906755 -4905269
8704 -4905269 -4218285 -6977650 -10553320 -9013283 -1337527 5880882 7760939 7613260 9586384
8695 9586384 10830549 7130493 1260204 -1282793 -936137 -1325218 -1189241 3274115 10084043
8686 10084043 13018656 10536463 6574574 3377232 -73976 -3313334 -4578335 -5335905
8678 -5335905 -8322795 -11309521 -9197346 -2525605 2338543 2012248 -817017 -3467003
8670 -3467003 -6157301 -8062543 -6884904 -3840493 -3166205 -5221970 -5902886 -4068426 -3024293
8661 -3024293 -3072454 25499 6419465 9708422 7425500 6769512 14033373 24217348 27720860
8652 27720860 22827026 14957402 7358378 -359233 -6869702 -9318319 -8027290 -5743909
8644 -5743909 -3463374 -1697123 -3586127 -10829715 -18169021 -18395929 -12259119 -7226898
8636 -7226898 -6714593 -6970805 -5025714 -3067161 -3360664 -4813964 -6607194 -9767309 -13069199
8627 -13069199 -12910605 -9678568 -8389934 -9743206 -6763091 4485795 16156059 17481158
8619 17481158 9295102 2487640 3067411 5743287 3228766 -4166967 -10879957 -13752444
8611 -13752444 -13802577 -12328454 -8703606 -2557997 3552233 5427595 1983280 -2412594
8603 -2412594 -2550969 1028975 3280856 2849062 4251894 9329013 11727111 5346374 -5331852
8594 -5331852 -10243400 -7215149 -2933588 -1021082 2116669 7536398 8781082 1939799
8586 1939799 -6212828 -7126341 -3011375 -3036698 -9653279 -16323007 -18047176 -16729623 -15068995
8577 -15068995 -11879414 -6372581 -2136217 -3201649 -8987922 -15843843 -21156507 -23630089
8569 -23630089 -22307296 -18659078 -17726200 -23076242 -30767040 -32045801 -23428288 -11440220
8561 -11440220 -5032697 -4845598 -3355692 3887611 10856854 8192132 -3891586 -14449687
8553 -14449687 -14454341 -6389988 1168668 4568743 6296110 7840310 7325851 4410793 2270461
8544 2270461 2902884 4276846 4052150 2813999 1535531 -953108 -5200203 -8466029 -8046369
8535 -8046369 -5427192 -3776320 -2545381 1756572 9636141 16960434 19949352 18874987
8527 18874987 15460672 9306973 -351904 -10416417 -14762201 -10801737 -3660870 -1610478
8519 -1610478 -7224933 -14842252 -17438677 -14011177 -8441149 -3103864 2717339 8283737
8511 8283737 9598963 4514973 -2985337 -6675636 -5249245 -2975316 -3550609 -5795173
8503 -5795173 -6024701 -2808204 1848282 5141897 5984059 4882297 2463198 -795047 -3498092
8494 -3498092 -3491000 -254912 3529226 4217303 1003916 -3298505 -4825170 -1249426 6818863
8485 6818863 15053341 17202567 10744797 699849 -5211848 -5454112 -5347966 -8177285
8477 -8177285 -9823431 -4811524 5544216 14412537 16928728 13376378 6554631 -598028
8469 -598028 -5307768 -5842748 -2571611 2771577 7807182 8748031 1961523 -10695529 -20605899
8460 -20605899 -20971242 -15708156 -14985493 -21635159 -27072191 -22929948 -12631551 -7447279
8452 -7447279 -12691322 -21667443 -23837321 -16482350 -6553923 -1831170 -2555002 -3192723 -920532
8443 -920532 1089286 -275763 -2270425 124436 6566059 11332415 10976992 8352285 7721490
8434 7721490 8681848 7057943 328183 -9832145 -19708075 -26387012 -28394364 -25295933
8426 -25295933 -18276497 -10919540 -7487613 -8865478 -11157667 -10386313 -8049167 -9213679
8418 -9213679 -15018160 -20747926 -22757067 -23383179 -26050516 -28821158 -26983076 -20115977
8410 -20115977 -12449484 -7406204 -5640656 -7238652 -11410693 -14514371 -12926311 -8152999
8402 -8152999 -5062539 -4828348 -3837325 -82097 3857595 5369024 5069611 3995052 1690816
8393 1690816 -913488 -771748 2455320 4275928 1172326 -3964033 -5090676 74786
8385 74786 8493770 15087769 15600832 8637100 -2386677 -10735434 -12000802 -7398809 -821696
8376 -821696 4847492 7245448 3941262 -4392477 -12217512 -13728188 -8418058 -226386
8368 -226386 7385607 13541935 18495998 21890568 21756382 15300216 3315274 -6388993
8360 -6388993 -5068749 5311050 11850028 6147009 -4684675 -7510854 508466 11439331
8352 11439331 18967967 23251830 24686263 21485868 15082242 10785624 10160003 8226449
8344 8226449 1376490 -6448320 -8880320 -5091824 500894 4105223 5628097 7745575
8336 7745575 13437267 22321291 28581978 25747862 15062601 5672750 4227854 7436441
8328 7436441 7602376 2550755 -3319932 -5610342 -3886411 -419115 1610672 -725303
8320 -725303 -7737534 -15852886 -20585867 -20507139 -17196749 -12828541 -9678918 -10138417 -14146611
8311 -14146611 -17609799 -16663839 -13291571 -13436961 -18969876 -24577526 -24290305 -19152804 -16297544
8302 -16297544 -20756290 -29610927 -34898040 -32025087 -24360164 -18712258 -17384272 -17021083
8294 -17021083 -14911576 -12565437 -11471588 -9454703 -4972703 -1834473 -4395067 -9707101
8286 -9707101 -10421442 -5454753 -1637442 -3335649 -6519635 -6148117 -3854452 -3681556 -4595308
8277 -4595308 -2984637 298540 1672238 2088338 5949552 12640246 15660365 12136209
8269 12136209 7605426 8173557 12264341 13997082 11676024 8871659 8899664 11892327 16262385
8260 16262385 19917888 20804077 18961150 17201302 17194412 16147681 10578842 2267380 -3682216
8251 -3682216 -6547557 -11084293 -19493324 -26574919 -25941299 -18385497 -10668102 -7254280
8243 -7254280 -6438144 -4518273 -1073654 1049998 -194797 -3192811 -4038055 -520006 5668161
8234 5668161 10787603 12215082 9145450 1866804 -7231701 -12844192 -10668249 -3190758
8226 -3190758 1660515 -345726 -4611800 -4390488 -420404 -112790 -7585207 -18082187
8218 -18082187 -23390264 -20457514 -13085124 -6399911 -1668738 2915371 7433753 8230126
8210 8230126 2091025 -8554523 -17132523 -19981561 -19316066 -18041187 -14732319 -6766395
8202 -6766395 3548881 10079154 10199807 7729714 7578228 10041144 11899847 11227633 8947991
8193 8947991 6339809 3220929 -620633 -3559010 -3502845 -1278550 -790331 -4409553 -9614054
8184 -9614054 -12359469 -12542184 -12779911 -12381361 -7416377 1711771 7803986 5727134 132910
8175 132910 -268702 6225277 13783386 17897889 19370825 19840471 18746156 15898485 12900591
8166 12900591 10723387 9168815 9200010 11730881 13269417 7676435 -5181868 -16551390
8158 -16551390 -17922892 -10329701 -1499265 3611768 5619100 5775144 2886111 -3903298
8150 -3903298 -11986812 -16713855 -15609412 -10844334 -7421093 -8396142 -11861866 -13352554
8142 -13352554 -10992526 -7090365 -4947026 -5774190 -8660954 -11517235 -11688264 -7615513
8134 -7615513 -627184 6055357 9842313 9107747 2874222 -6480158 -11723812 -7267223
8126 -7267223 2514729 7007931 2969796 -1294806 1791843 8386429 9534641 3695550
8118 3695550 -2780423 -4873213 -2867663 1232584 5745852 8300965 7543266 5938844
8110 5938844 7184013 11005545 13754994 13548275 11603688 9379541 7777208 8160420 10508766
8101 10508766 11491553 8067651 1979180 -2968847 -6362373 -9451319 -10177715 -6149074
8093 -6149074 -1335458 -2420415 -8204442 -10450689 -6905682 -5180179 -10040595 -14953896
8085 -14953896 -12425302 -6321141 -6001621 -11965866 -15570281 -11864838 -5390594 -2577864
8077 -2577864 -4302782 -7634405 -10367763 -11352360 -9142699 -2981436 5385115 11933686
8069 11933686 12860123 7896866 1498088 -1071453 260603 672485 -1741337 -1740629 6113091
8060 6113091 18783233 27506792 28176359 24626275 21819107 20148924 17458159 13147004
8052 13147004 8639609 5812444 5757644 7469512 7914776 5514922 2989846 3918756 7019454
8043 7019454 7489445 4050909 424485 -1121502 -3118289 -7577483 -11524862 -11352918 -8596414
8034 -8596414 -7294920 -7456147 -5490256 -678037 2918026 2063526 -1030829 -1544105 1823642
8025 1823642 5241276 4252145 -964829 -5422277 -4431808 1769264 9013083 13904512 16159138
8016 16159138 17001018 17534813 18874725 21477670 23474311 21742004 15685642 8107162
8008 8107162 1553500 -3812887 -7654612 -7879814 -4012973 299998 1080959 -1285661 -3698711
7999 -3698711 -4898962 -5500350 -5254169 -3852047 -3298960 -5703956 -9305666 -10500240 -9619256
7990 -9619256 -10746015 -15352579 -19880595 -20655460 -18036569 -14730328 -12924495 -13911447 -17523734
7981 -17523734 -21021939 -21458561 -19820987 -19648156 -21213431 -21382098 -20195817 -22211778 -28544054
7972 -28544054 -32727157 -28898081 -20254033 -14472900 -13502735 -12833157 -8772388 -1468411
7964 -1468411 7616033 16065601 19553442 15974506 10160206 9216175 13159760 15501647
7956 15501647 13357799 10848765 10851080 9716951 3933395 -2851998 -4328870 -267391 3776808
7947 3776808 4064105 2024272 527368 209913 107185 -178456 -44593 743424 713599
7938 713599 -2296687 -7696372 -10868585 -7813114 -580967 4840222 5700372 3840533 133549
7929 133549 -6990697 -15842199 -20134219 -17070645 -11932170 -10123747 -9293915 -5142131 -761130
7920 -761130 -2178911 -6744539 -5106631 4479170 12470735 11611588 6577258 5325324 7020157
7911 7020157 4955393 -2375113 -9912972 -14018807 -15598634 -15642169 -13434648 -10109771 -8836100
7902 -8836100 -9462253 -7262498 119101 7773021 9080228 4075926 -1357890 -3351897
7894 -3351897 -3131661 -2605761 -1412149 52666 -1495779 -8125413 -16488614 -20997233 -20320966
7885 -20320966 -17884422 -16495020 -15522580 -13436913 -10056809 -5517524 290022 6179064
7877 6179064 9967006 11398499 12306057 12699052 9755364 2917707 -2923675 -2815227 1288339
7868 1288339 2501223 -2493276 -9726002 -12454067 -7153887 4187203 15052113 18318132
7860 18318132 12461516 4142216 1953288 7330048 14035615 16334907 14343630 11012201
7852 11012201 7840737 5335002 4278029 3934193 1486105 -3913327 -8401407 -7817810
7844 -7817810 -3803622 -2337597 -6252178 -11880484 -13648581 -9777876 -2496893 5482989
7836 5482989 12842570 18649497 21447191 20361901 16600457 12811006 10627022 9459780
7828 9459780 8166551 7164183 7836052 10195384 12524272 13589413 13889788 13939110 12444797
7819 12444797 7654595 300560 -6193408 -8995900 -8491874 -6918119 -5292858 -3199290
7811 -3199290 -1143255 -633139 -1095201 435689 4192194 4965627 -1282201 -9763055 -11577466
7802 -11577466 -6260007 -2973925 -6790871 -10761789 -7011648 -27203 -1062304 -12166362
7794 -12166362 -23996621 -28774626 -27353141 -22559216 -13676048 -931326 10855175 17456863
7786 17456863 19770498 19655164 15682331 7349636 -249318 -1350379 2653147 5049106
7778 5049106 2807568 -246752 571039 4660285 6822114 2759266 -6375279 -14707284
7770 -14707284 -17674930 -16886628 -16771789 -17008691 -12706256 -3306855 4078189 3998115 935349
7761 935349 2916964 9703822 13411297 9706127 2273287 -4111698 -9073272 -13401414
7753 -13401414 -15276244 -12859752 -7709509 -2850354 564999 2519990 2163493 -650208
7745 -650208 -3071053 -1525322 3599954 7798247 7505963 3389787 -2343147 -9669888 -19074472
7736 -19074472 -27061619 -27313104 -18104746 -5680858 2669035 6919918 12152732 19512657
7728 19512657 24085663 22242777 16720816 12882293 13469613 18468599 26258859 32632155
7720 32632155 32266844 24228790 13584480 5324885 -439945 -5100008 -7347346 -6178319
7712 -6178319 -4890788 -7334746 -11874133 -13345279 -9893587 -4152073 1115903 4667067
7704 4667067 5081003 1578225 -3356391 -5279863 -2019647 5037990 12685786 17006949
7696 17006949 14842088 7096148 -899813 -4759862 -4840256 -2777861 1955626 8555222
7688 8555222 12302986 10971869 10324630 16659371 26286243 29501735 23629828 15017938
7680 15017938 9040519 5667129 4745162 7668258 12539456 14821271 14278315 14671175 15709515
7671 15709515 13017856 7746358 7703040 15440054 22980566 22786174 17009631 11207113 5876936
7662 5876936 188161 -2013262 2835797 10781638 14392660 11539011 5478547 -722719
7654 -722719 -5405737 -7307845 -7812966 -10887010 -16648585 -19111558 -15039372 -10379708 -11753845
7645 -11753845 -15655654 -13437659 -4303668 4265021 7537856 7569841 6831901 5280431 4650820
7636 4650820 8830955 17387270 23529181 21465813 13227538 6378249 6526307 12819208
7628 12819208 19640388 22436790 21817616 20707673 18504927 12257684 3839523 -327226
7620 -327226 852117 541933 -4405696 -6884105 -1500771 4385446 1591060 -4692043 -2089575
7611 -2089575 8329967 12212008 3508871 -6915747 -7827916 -1637828 3335431 5317934
7603 5317934 7441110 10462798 13120158 14874057 14014970 8069955 -261381 -3255132
7595 -3255132 1635195 7188587 6263570 871159 -2864931 -3156776 -1137862 3183134 7709099
7586 7709099 6364335 -2712338 -11269878 -10294190 -1972590 4533983 6078236 6672835 8078887
7577 8078887 7837915 6309419 7531247 11872360 14825009 14877275 16081340 20077151 21405922
7568 21405922 14887899 3752047 -3897280 -4546465 -1421039 1688879 4972425 10077612
7560 10077612 15377072 16119350 9860983 506169 -4740349 -2481299 4120884 9334217
7552 9334217 9444084 3738838 -5293949 -11485858 -8725972 1929321 11838768 14326001
7544 14326001 11635022 9279087 7365377 2702850 -3291659 -5381966 -2664728 75196
7536 75196 -134053 -710570 1485462 5740465 9429264 10709048 8337897 2597570 -2681435
7527 -2681435 -3151776 -343677 -718857 -6453837 -11753962 -11400004 -8636838 -9944207 -14844976
7518 -14844976 -16427601 -11292307 -3901604 -72249 -226273 -1254225 -2100421 -4109777
7510 -4109777 -6802112 -7043171 -3877378 -1523990 -4367480 -9725396 -9475065 -301075 10820791
7501 10820791 13989438 7135038 -3376882 -10912163 -13599969 -12445020 -9180854 -6832437
7493 -6832437 -8576298 -14204614 -19879818 -22282441 -20881391 -15931253 -7481717 2444825
7485 2444825 9804498 12626407 12976162 13251302 12752667 9744840 4954064 1047502 -44594
7476 -44594 1951013 5673004 7937991 5830114 796142 -1322670 3577905 13040540 20713810
7467 20713810 22080065 16503490 6562165 -2391886 -4933678 -1136721 2613244 1538798
7459 1538798 -1107916 602791 5970014 9247837 9450052 11975098 19159650 25297375
7451 25297375 24269372 17527218 10556750 5010491 -821331 -5913473 -6529663 -2759759
7443 -2759759 -593198 -5391685 -15378811 -23118512 -22424824 -13404378 -2134497 4185382
7435 4185382 3374449 344628 1705373 7836506 12262221 9800097 2755037 -3208677
7427 -3208677 -6890083 -11280220 -16572079 -18701405 -16412757 -15045840 -19494253 -26285475
7419 -26285475 -27311897 -20395602 -11580791 -6655756 -4734420 -1868612 2543160 5682681
7411 5682681 5703709 3814881 2971396 5850777 12644056 19444610 20707944 15426870 9385529
7402 9385529 8959941 13928855 18935509 20739776 20540183 19581261 16722248 11841503 8211569
7393 8211569 8716191 11550352 12604085 11524487 12569685 18524237 25596239 26409042 18391406
7384 18391406 7962420 4933125 12524143 23989946 29598200 25676165 15867187 5384611
7376 5384611 -3191781 -9013608 -11473313 -11285632 -10965336 -12153285 -13303813 -11574835 -6560474
7367 -6560474 -943662 2396353 3252690 4293903 8485618 15449876 20396468 18403330
7359 18403330 10512371 3652038 2988419 6070118 6630116 2698052 -1841241 -2924545
7351 -2924545 -368829 3731135 7450361 9083411 7712423 5212389 5288361 8791793 11999579
7342 11999579 11278929 7447397 3498748 159874 -3468111 -6600246 -7732152 -8146764
7334 -8146764 -10585901 -14268628 -15226273 -12842507 -12170763 -16973698 -23188395 -23059946 -14950539
7325 -14950539 -5641016 -2278793 -4451622 -5621242 -1108888 7114676 13605548 15739966
7317 15739966 15180108 13416890 8508000 -1680364 -14379165 -22971797 -23276811 -16730295
7309 -16730295 -7642181 42403 3507561 2377678 249609 1282162 4004932 2855444
7301 2855444 -2052306 -2251981 7213804 18006778 17816125 7278007 -377038 3025590
7293 3025590 10714834 11201579 2513505 -7290702 -9792526 -3182975 7413389 13891348
7285 13891348 11851505 5197678 1697486 3292211 4688545 2499982 254020 1417024
7277 1417024 2942807 424858 -4676629 -8220861 -10270762 -13183454 -15789534 -15613507
7269 -15613507 -14693019 -16650039 -19335914 -17224555 -10729091 -6277556 -6617115 -7781968
7261 -7781968 -6955968 -6542358 -7954212 -7715010 -3495153 966931 1083421 -2052577 -3895396
7252 -3895396 -2240898 1959474 6357172 7145294 780212 -11077658 -21313740 -24815130
7244 -24815130 -23200693 -20059824 -15908058 -11053411 -8531910 -9373910 -9121629 -4576549
7236 -4576549 -372237 -2558466 -8531254 -10256780 -5710794 -204060 2378723 2434466 -414750
7227 -414750 -7166029 -13690401 -13431332 -7946034 -6899791 -14220387 -21582824 -20256855 -12994404
7218 -12994404 -8411279 -8598600 -8711277 -5647517 -1158406 1752800 678834 -5965558
7210 -5965558 -15949644 -22384151 -20576802 -14174160 -10006767 -8654497 -5354712 994883
7202 994883 5753655 5816495 3650621 2696033 2872652 2165165 -478292 -4881097 -9574179
7193 -9574179 -11603786 -9258980 -5068181 -2934440 -2444443 214806 5700010 10394458
7185 10394458 12522312 14407353 16915978 16718412 12180584 7642755 7665944 9927757 8125033
7176 8125033 339598 -9096516 -14958119 -15300284 -11363333 -6359687 -3913203 -5331033
7168 -5331033 -8605852 -11278164 -12897596 -13307313 -10832864 -4690264 2759024 9007379
7160 9007379 14862762 21717990 27068987 26741182 20859454 13811600 8571516 4585045
7152 4585045 884153 -2649672 -7082751 -13175599 -17763964 -15952562 -8385814 -1866134
7144 -1866134 -372970 344644 5897822 14627942 20301180 21147203 21216760 23297936 25183637
7135 25183637 23950052 20230834 16340154 12639535 8060857 3007019 -450849 -1203887
7127 -1203887 -524758 -534946 -2129932 -4893772 -8327639 -12049638 -14776229 -14542439 -11115462
7118 -11115462 -7352374 -6293376 -6772474 -3880187 4971069 15650041 20701281 17050239
7110 17050239 8988692 2968808 353414 -3386601 -12052369 -22700127 -28030082 -24669034
7102 -24669034 -16870812 -10964233 -8383500 -6357725 -3522118 -1393134 -1119482 -2652555
7094 -2652555 -7157794 -15859812 -25253907 -28067434 -21935704 -13440667 -9690891 -8821222
7086 -8821222 -3706110 6595407 14828866 15427621 11253898 8351160 7923568 6782071
7078 6782071 3445305 23472 -1802450 -3746737 -8420746 -14911647 -18592754 -16235406
7070 -16235406 -10530434 -7491972 -8668779 -8333631 -935980 10245841 15816901 11874597
7062 11874597 4947199 3537703 8143223 12790827 14061137 14188959 15508181 16182293
7054 16182293 13435348 8413516 5118005 5360810 7209463 8734633 11276452 17381053
7046 17381053 26054650 31922892 30245654 22251165 14296638 11511982 13157511 14606522
7038 14606522 12723773 8090897 2781671 -1845030 -4539750 -3468083 1664901 7314021
7030 7314021 8297293 3280946 -3297336 -5965377 -4009851 -1348725 -1424464 -3913286 -6302727
7021 -6302727 -6891449 -5726733 -4070100 -3661684 -5181080 -6554630 -4146120 3056575 11510894
7012 11510894 16895110 18916246 20447482 22450167 22290091 17689591 10152073 3096909
7004 3096909 -1825200 -4788083 -5264452 -1975673 4117852 8631184 7169923 -104997
6996 -104997 -7848405 -9506055 -2296634 10535100 21743155 25400194 21577736 15494985
6988 15494985 11244257 7474378 1075579 -6231341 -8833248 -5265247 -990895 -728379
6980 -728379 -1958650 -21496 3818625 5212712 5478200 10033347 17809938 20289953 14182338
6971 14182338 7762851 9320075 15202051 16140797 11012289 6121329 3303800 -1927918
6963 -1927918 -9935749 -13623223 -8798069 -899971 2917914 2983740 3614609 4996723 4410884
6954 4410884 2781110 3785191 7165293 8362793 5272724 768224 -2587135 -6154559
6946 -6154559 -11515559 -16581888 -18350889 -17366231 -16186963 -14614325 -10141032 -3363024
6938 -3363024 847034 -351554 -3023682 -1251477 4738964 9022960 8316868 5632797
6930 5632797 4429421 3582960 1245176 -100344 2709444 6843637 5966509 -691052 -6754449
6921 -6754449 -7248211 -4426550 -3480117 -6242273 -11234301 -16570665 -20162343 -19582847 -14500049
6912 -14500049 -7699528 -1834143 3052895 7242926 9111849 7573644 4703981 3290348
6904 3290348 3196565 2429858 445820 -1628889 -2541558 -898623 4239463 10542667 12734798
6895 12734798 8741564 3143612 1047185 1088521 -933658 -3809235 -2432283 3175689
6887 3175689 7021653 6288547 4898033 5821567 6415133 5335245 7792093 17320950 26486534
6878 26486534 24136547 11161276 1023369 2698265 9985898 11680150 6667709 2714177
6870 2714177 3310287 3187914 -2438001 -10321507 -13651129 -9982372 -1785633 7357177 13387583
6861 13387583 11732987 1944335 -8737254 -11734440 -7272645 -3330989 -3962250 -4407714
6853 -4407714 -111166 5253469 5462683 1354448 -1008018 397110 2058941 2135043 3303076
6844 3303076 7124957 10261652 8789704 3340970 -2449924 -6700577 -10244106 -13841544
6836 -13841544 -16436406 -16462930 -14181551 -12119047 -12489310 -14102063 -13176069 -8015307 -1327768
6827 -1327768 3325338 5403233 5703090 3140983 -3169824 -9880403 -11844465 -8971824
6819 -8971824 -6813077 -9215802 -13756414 -16073169 -15735591 -15372302 -15843680 -15025551 -11238012
6810 -11238012 -6274448 -4311803 -7597531 -13209449 -15121718 -10440369 -2658545 2389093
6802 2389093 2559092 41412 -2226578 -2666982 -1349848 -626896 -3440140 -8203162 -8335183
6793 -8335183 -1249855 5332459 2490346 -6570380 -10357308 -5856204 -2201588 -5635071
6785 -5635071 -10387475 -9284806 -4841111 -2882711 -1985522 2380803 7743225 7277728 153614
6776 153614 -8336887 -15080069 -20267388 -21988618 -17932531 -12363920 -13272825 -20939165 -26274239
6767 -26274239 -22821477 -14296684 -7530755 -3698269 -313384 2733293 3848728 3948561
6759 3948561 5874781 10374550 15100667 17144485 15402684 11213261 7112337 4029620
6751 4029620 197939 -5482220 -10120480 -9834725 -5344689 -1040409 1003659 1889343 1123625
6742 1123625 -3543634 -10365308 -13221453 -9455662 -3322300 951224 4480648 8730568
6734 8730568 10498245 6931203 1426750 -1172083 -2149039 -5748143 -11077008 -13942089
6726 -13942089 -15148308 -19288305 -25016399 -24430585 -14716275 -3527057 1521922 3286235
6718 3286235 9333820 19098882 23316848 16035008 1972501 -9530166 -14251747 -14490148
6710 -14490148 -13057187 -9368509 -2172986 6153028 10742892 10025196 8040793 9063804
6702 9063804 11467073 9968245 3554222 -2557707 -4013314 -2800595 -3018506 -3903420 -881456
6693 -881456 7470209 17182812 23600094 25103858 21875875 14687952 6808931 4158237
6685 4158237 10222910 21305605 28972878 27539398 18666891 9556986 7445114 14246724
6677 14246724 24550662 29587312 25225203 15919284 9367114 8164927 8918964 8585374
6669 8585374 7980938 8393865 8532175 7114209 5753499 6447644 8083007 8417454 8113841
6660 8113841 9382349 11297842 10242497 5455835 651890 -1171296 -1482687 -2861987
6652 -2861987 -4494742 -3780172 -990620 518861 -1572152 -6302599 -11013248 -13265777
6644 -13265777 -11502914 -6094517 -154518 2606182 1558471 -730852 -2282549 -3501033
6636 -3501033 -4506835 -3415070 603251 4692094 5750915 5205151 6823976 10292093
6628 10292093 11120154 7807778 4831525 6044932 8615606 7210622 2074484 -1121580
6620 -1121580 1282488 7213868 12408980 14569488 13900263 12233604 11740803 12269989 10621532
6611 10621532 5242779 427550 1639742 7190715 9712573 6463312 2552909 2232555
6603 2232555 2899896 964825 -1850563 -2534558 -2508514 -4346562 -6760976 -8204065 -11608763
6594 -11608763 -19141649 -25396378 -23297561 -15067676 -9635643 -9849087 -10214854 -7573415
6586 -7573415 -5410336 -5548596 -4172850 -319367 -741342 -10086171 -21451612 -23606109
6578 -23606109 -14973749 -4522777 -109894 -1007725 -1586157 1819929 8320784 14133289
6570 14133289 16112065 14453865 11627578 8988351 6517393 5545925 7816804 10887352
6562 10887352 9197921 2342728 -2216305 1392157 8964658 11826910 8122347 3478679
6554 3478679 2262711 3334639 3809721 2492811 -345363 -3024033 -2693375 1289904 5238610
6545 5238610 5768867 4946490 6508012 8666151 6549134 1330869 84204 4929310 8939541
6536 8939541 6385996 1370260 951741 3752591 2364272 -4045801 -6877330 -366317
6528 -366317 8759650 9046562 -574163 -9499574 -10130988 -7869615 -12218958 -22224801 -27775795
6519 -27775795 -24218959 -17777951 -14657203 -12588465 -7796058 -3527040 -4519496 -7606527
6511 -7606527 -6187808 -1713538 -2020350 -8541459 -13683664 -12488227 -9139666 -8892393 -10289213
6502 -10289213 -9548787 -7350995 -6625565 -7419792 -8173212 -8917591 -9305349 -6519153 468774
6493 468774 6753408 6073959 -1468084 -9759480 -13732151 -12816104 -8387092 -1586173 5927355
6484 5927355 11825606 14767452 15229951 14739645 14861452 16008068 16487782 14175854 10112228
6475 10112228 8432197 10984240 13967882 12368114 6389307 847703 -1071678 -824937
6467 -824937 -1309115 -2740870 -2310457 2752599 11535540 18706979 18910292 12706928 6355822
6458 6355822 4584228 5978322 7416206 9996878 16533576 24754489 28056585 23870467
6450 23870467 17310510 14570879 15426918 14667554 9416686 2623749 -389430 2834719
6442 2834719 10155411 16979833 19633979 17604206 13603371 11396151 12545643 14768719
6434 14768719 14102291 9095406 2059594 -4128890 -8719800 -11325027 -9758364 -2857505
6426 -2857505 5511403 9124914 6538361 2239304 5596 -1294015 -3877245 -6736558
6418 -6736558 -7800782 -7827147 -9316627 -13019589 -17455220 -20432296 -19883981 -15614262 -11686393
6409 -11686393 -13946476 -22649058 -30314817 -29857434 -22419980 -14164944 -7949721 -2041494
6401 -2041494 4859316 11507384 16202544 17905273 16521921 14779068 17516696 25429365
6393 25429365 31775434 29802780 21711311 15577466 15118324 17720491 20806814 23517846
6385 23517846 22654016 14352499 1219501 -8620098 -11480605 -11290946 -11236900 -9111967 -4095738
6376 -4095738 -1211351 -3880692 -7476086 -6252310 -2734258 -3958254 -10913666 -17685665
6368 -17685665 -19569724 -16616432 -10320274 -2408228 3343498 3593620 696510 877893
6360 877893 5590946 8504251 3287112 -8201682 -17677134 -18896472 -12720705 -4663027
6352 -4663027 1070553 4812460 9097864 14106178 17241372 17570825 17982053 20838259 23727613
6343 23727613 22659227 17989777 13458243 10125018 5594694 -399591 -4154404 -3467852
6335 -3467852 -1118424 -404011 -504154 512966 811726 -2857108 -9342887 -14167265 -16197999
6326 -16197999 -18582869 -22016363 -22017777 -16018614 -9124654 -7860986 -10325135 -8497048 -381795
6317 -381795 6334519 5181532 105175 -587980 4336216 9195715 10789718 11279459 11815519
6308 11815519 9706652 4049464 -1002793 -1844488 -466525 -360555 -424312 2978907 9796420
6299 9796420 16207815 19827457 21263488 20967125 18298924 14148767 11196478 10560954 10776563
6290 10776563 11034693 12711793 15981243 17319215 13224527 5527267 130824 42054 2017608
6281 2017608 1525548 -848494 -654283 3192265 5795155 2622224 -3991144 -7607262 -5810707
6272 -5810707 -2430471 -1978817 -5151662 -10256381 -15696545 -19629612 -20054049 -17253335 -14208710
6263 -14208710 -13027775 -12828479 -12288984 -11732975 -11039731 -8254251 -2626346 3320157 7111312
6254 7111312 9274332 10479728 8734611 3072943 -2483426 -3090994 393076 3469616
6246 3469616 5180067 8236068 12634952 14562522 12249774 8027628 3521201 -2366607
6238 -2366607 -8866344 -11264066 -6375406 2779209 10211689 12768762 11267385 8494434
6230 8494434 7693767 10361331 13623605 12042476 3742210 -7153079 -15136034 -17942264
6222 -17942264 -16068712 -11413099 -7906083 -9523890 -15248349 -19582283 -20444482 -22146603
6214 -22146603 -26934438 -28331266 -18863817 -1668562 11966798 15520339 11877441 5892427
6206 5892427 -986495 -7503542 -10154191 -7089134 -836873 5072876 9007172 9279103
6198 9279103 3647960 -6052759 -12286105 -9256920 -643379 3876466 -527818 -9431671
6190 -9431671 -15403473 -15577798 -12204139 -8395343 -5577458 -4158615 -4291026 -5178601 -4993234
6181 -4993234 -2853282 -353678 300630 -671708 -1387401 -1947168 -4270294 -7120431 -4920054
6172 -4920054 5199913 17635365 23617449 20755584 13147946 3746569 -7371263 -17216426
6164 -17216426 -19524858 -13160996 -5419878 -3118730 -4698747 -5013925 -3487201 -2362330
6156 -2362330 -625294 3791299 7790936 6074951 114444 -2366640 2011657 8030819
6148 8030819 10173360 9851866 11288088 14412798 15645093 13080907 7542999 355275
6140 355275 -6948626 -12052594 -13547652 -12303568 -9562124 -5286495 -171468 2840182
6132 2840182 1795568 -934508 -1424497 588935 2020386 1360835 423706 1198071 3570321
6123 3570321 6511543 9143266 9953755 7199009 1459221 -3637665 -4868712 -3171625
6115 -3171625 -2638258 -5407943 -8410873 -6384053 1657168 10422182 14195293 13412068 12895786
6106 12895786 14297708 14138924 10241406 5981365 5523639 8024882 9822060 9758579 8577327
6097 8577327 5226867 -1567607 -8950775 -11777147 -9105683 -5149422 -3309097 -2576427
6089 -2576427 -490914 3168304 6284970 5986508 730031 -6920641 -10812234 -7615034
6081 -7615034 -1307481 2528462 4955504 10826493 19184896 23703468 22963872 22486073 24600014
6072 24600014 24403266 19613488 16624194 20840977 27320013 27970860 23218184 19143861
6064 19143861 16893917 13064778 8426733 7900932 11865498 14461938 11405419 4091133
6056 4091133 -4267555 -11228348 -13683783 -9500927 -1666990 3996051 6154074 8491253
6048 8491253 12424352 14514067 12628730 9803463 9641336 11635864 13212471 13366441 12583856
6039 12583856 11809498 12550486 15362128 17878594 17527004 16179228 17982018 22177789 22843089
6030 22843089 17017920 8465726 1762373 -2599902 -5167956 -4632442 -1241111 1025591
6022 1025591 -615055 -3637396 -4122989 -1970230 587586 2722211 4353222 4510727 3268496
6013 3268496 2857908 4384097 6184378 7742869 11695557 18792082 24359386 23838428 19300488
6004 19300488 16534796 17683949 20275327 21536528 20378167 17263970 15276940 18741172
5996 18741172 27358297 34534069 35264143 32464172 31044282 29343359 22543723 11959326
5988 11959326 3879379 249518 -2645318 -6529641 -9072736 -9982191 -12245967 -15741175
5980 -15741175 -16227266 -13234640 -12755651 -18422321 -25182547 -26066788 -21257218 -16062345 -13188704
5971 -13188704 -11750771 -11506898 -12824687 -13280296 -9233324 -1490732 4409110 5005107 3207387
5962 3207387 3901440 7270014 9133439 7361322 5056587 6155422 10011940 12785661
5954 12785661 13089859 13020988 13534753 12611454 9629486 7993735 10443426 14321381 14884168
5945 14884168 11400425 6473665 1051075 -5732404 -12587539 -16113680 -14812586 -9755521
5937 -9755521 -1777546 8274460 16991342 20535579 19804240 19352674 20374799 18829036
5929 18829036 11906057 2673008 -3463836 -3994603 260217 6857455 12374333 14111099
5921 14111099 12668846 10743786 8936329 5625384 1228405 -1245580 -807761 268121
5913 268121 898263 2483532 4234482 2406152 -2776257 -4416150 2265319 12114556 16082935
5904 16082935 12519689 7202802 3801776 138052 -5787009 -11139297 -11646554 -6768056
5896 -6768056 258787 5795750 7956656 6656091 2992273 -1302155 -4319184 -4670787
5888 -4670787 -2532989 278846 2305940 4228763 7411785 11288646 14097926 15539639
5880 15539639 16062733 14170881 8290388 1652515 788292 7173076 14117472 14602855 9366550
5871 9366550 4721281 4811591 8310409 10530860 6918883 -3071821 -13862168 -18256633
5863 -18256633 -15553733 -11812925 -10823360 -9759501 -6236840 -3556542 -4031942 -2670642
5855 -2670642 5407761 14918506 15795216 7239048 -1141094 -2254053 1180592 3084608
5847 3084608 1482669 -2368824 -7174407 -11466901 -13707432 -14099161 -13610562 -11001235 -4402801
5838 -4402801 3956217 8806780 8411580 6087518 4452894 2695807 1006657 2907921
5830 2907921 10165639 18787420 23268994 22690803 20167631 18231953 17195994 16687342 16533272
5821 16533272 16561141 16690949 16899010 16943635 16854582 17168123 17463005 15825511 11811388 8467111
5811 8467111 8394850 9274018 7326473 3976271 3662929 5291524 2513668 -5612900 -10847764
5802 -10847764 -6663920 2200670 5941714 1603168 -6342315 -14199357 -21695383 -27594460
5794 -27594460 -28678594 -24175318 -17306983 -11489736 -7867952 -6762188 -7964058 -8544931
5786 -8544931 -3880651 6690386 17170342 20302166 14961671 6594410 1209702 872843
5778 872843 4415941 9510793 12890319 11356037 5632754 2038575 6642549 17332564
5770 17332564 25047028 24046654 17588951 11604079 6720136 318705 -6574281 -9699064
5762 -9699064 -7904101 -4410104 -1918917 -637531 -1118042 -4685882 -10384573 -15384010
5754 -15384010 -19050178 -22742465 -25140662 -22503638 -15078891 -8651401 -7287813 -8452629
5746 -8452629 -8025702 -6495029 -6686718 -7989885 -6608196 -555118 8030266 14721305 15607051
5737 15607051 9797777 656511 -6574246 -9157895 -7845806 -4216299 154873 2334534
5729 2334534 -40744 -4701927 -6543055 -4468883 -2448444 -2936487 -4135774 -5154235
5721 -5154235 -8170554 -12927369 -14901510 -12568846 -10897516 -13193804 -14847937 -10502789
5713 -10502789 -2591520 3155975 6228479 8821914 8991798 3956273 -2728521 -5205596
5705 -5205596 -4424394 -5280098 -6681275 -3755234 710761 -2370223 -13269533 -19612256
5697 -19612256 -12657325 320601 6041277 1854617 -4364652 -7085647 -8478919 -11763783
5689 -11763783 -15530478 -16452598 -14099967 -10798797 -8011811 -4729778 120775 4626741
5681 4626741 4852786 -626726 -8614346 -14552809 -16177846 -13096645 -5886206 1916972
5673 1916972 4328247 -320276 -5554225 -4565020 248510 1408394 -1525619 -1393144 4571421
5664 4571421 9974062 9182992 5162402 3283502 2972123 671821 -2969477 -4453252 -3638781
5655 -3638781 -3570262 -5249741 -6691188 -6468592 -4734022 -1308190 3909140 8750287 10042180
5646 10042180 7564003 4426472 2840895 1520198 -1477537 -4769453 -4718986 -781446
5638 -781446 2350102 84483 -5618617 -8431917 -6515890 -4949016 -7315661 -9465452
5630 -9465452 -5825658 1820695 7405830 9667610 11636808 12778808 9295787 2495792
5622 2495792 -570460 3514515 10849929 17242933 22080228 23443460 17360969 5965356
5614 5965356 -643056 3926887 13933174 19360215 17142612 10135014 736074 -8541629
5606 -8541629 -13148999 -11820691 -10110091 -12497920 -14843017 -11272672 -4682162 -2493374
5598 -2493374 -4666774 -4471866 -119370 2779322 899000 -2049414 -1796317 1072536 3529328
5589 3529328 3209483 -1302159 -8539130 -12698457 -9442356 -2989673 -1633130 -6236832
5581 -6236832 -9710350 -8403493 -6544343 -7329293 -7317113 -3861430 -1596824 -5668544 -12548704
5572 -12548704 -13435149 -5073586 7026826 15006954 15156715 9127359 1445472 -4264305
5564 -4264305 -7512230 -9007426 -7740558 -3118452 694331 -2388603 -11825172 -19465649
5556 -19465649 -19349678 -14079082 -8955116 -4738609 -93111 3410544 4072172 4670635 8653513
5547 8653513 13731959 14827801 12088452 10216143 10295403 8416859 3444768 166220 1728106
5538 1728106 3550356 -812541 -9985663 -15348416 -11267283 -1659355 4635104 3195288
5530 3195288 -2584761 -6516495 -6255961 -4324857 -3723009 -4355453 -4196875 -2422443 14823
5521 14823 2133941 3482570 2938351 -1088763 -7975569 -13544784 -13420537 -7902817 -1734673
5512 -1734673 1761616 4369074 8923600 13337265 12144822 3871989 -6704673 -14296462
5504 -14296462 -17318579 -15348350 -7544972 3048960 8578652 5347778 337889 2299062
5496 2299062 8791618 9841030 3424005 -1851988 -973870 196197 -3511974 -6274055
5488 -6274055 -220307 10838674 15493588 10384330 3675087 2834283 5823335 6179583
5480 6179583 1727996 -4313060 -7746632 -6689903 -2269336 2436757 5030866 5868559
5472 5868559 6897909 9019749 11757860 14587580 16771115 16569248 12744214 6806469
5464 6806469 2157132 905052 2379123 4195274 3971013 1078344 -2276905 -3069498 -1603001
5455 -1603001 -1729123 -5364852 -9062966 -8497693 -4429073 -1196033 -579074 -201381 2801018
5446 2801018 9266545 18315025 27435608 33025268 33440657 30728792 27089495 21416048
5438 21416048 12710085 5138241 4759749 11167287 16940623 16659361 12966967 12095795 15842459
5429 15842459 19576367 17195117 7814213 -1902933 -3642583 2887270 8898939 7896378
5421 7896378 4412586 6219998 11173917 9877038 800008 -6228340 -4008162 2506057
5413 2506057 4842278 2527579 538147 291312 -589336 -2428254 -3184247 -2730182 -3052565
5404 -3052565 -4893911 -7293129 -9465006 -10735002 -10009917 -7334568 -4351194 -2030221
5396 -2030221 -706876 -3175291 -12716155 -25296144 -29454695 -19332757 -3712361 3883496
5388 3883496 991080 -3961371 -4639211 -2329951 -80971 910041 -1094823 -7049834 -12021114
5379 -12021114 -8018463 5522886 19213212 24206311 21152033 16697651 15113418 15746265
5371 15746265 15600187 12271831 6331722 1380178 -492892 -2294900 -7316045 -12188959
5363 -12188959 -10792103 -4718919 -2342435 -5931297 -7730417 -2388261 4560766 6154521
5355 6154521 5136423 8510037 16029342 21929694 24698281 27061336 28170533 23891047
5347 23891047 14716691 6293111 1390904 -2350626 -5662566 -4828712 1957891 10005831
5339 10005831 12492444 6644605 -5367461 -18308645 -25808137 -24317810 -17014920 -11132824
5331 -11132824 -10299708 -11902456 -12081996 -9781955 -5393789 382714 4865647 4568373 151571
5322 151571 -3208620 -2558444 -987345 -2249417 -4730718 -4030265 527573 5050061 5507005
5313 5507005 737173 -7569911 -15666568 -19719248 -19104674 -16965200 -16080936 -15395999 -12095949
5304 -12095949 -5898234 242898 2910880 1005786 -2998757 -4396094 -990842 3268656
5296 3268656 2430561 -3090736 -6345613 -3776226 -665750 -3170937 -9002577 -10977686
5288 -10977686 -7133042 -1944364 877181 1254776 -875278 -6283150 -12805004 -16062013
5280 -16062013 -15387910 -14765506 -15990229 -14992651 -7953147 1756214 6190603 1428194 -8669758
5271 -8669758 -16573133 -17373534 -11894976 -5420054 -3176480 -5711993 -8528972 -7023544
5263 -7023544 -1682948 2643495 2996459 2494547 6404844 14306184 19257475 16755059 11659360
5254 11659360 12103631 18067018 21490654 17916008 11852689 8716621 7912012 7616183 9986292
5245 9986292 15687273 18550694 13235805 4725108 2230759 5994791 8526736 7475544
5237 7475544 7944495 11807105 14364891 13720924 14249530 17124939 16040717 7567965 -1575665
5228 -1575665 -3725345 -792193 806292 719796 3140512 8130822 11401291 11051559 8954406
5219 8954406 6703035 4613285 3137922 1492903 -2727388 -8780794 -10990418 -6579084
5211 -6579084 -1810935 -4104524 -10593706 -11562287 -4098542 4562918 7115724 3193551
5203 3193551 -3702029 -9558359 -9142290 1282155 17718444 29870966 31616233 26528269
5195 26528269 21491633 19024130 17727844 15919487 12180929 6048783 847167 2276410
5187 2276410 11019580 19746913 20975023 15668365 10524293 8596335 6894402 2925604
5179 2925604 -761960 -496777 2611402 3607562 164629 -4626636 -7228280 -8953303 -12942070
5170 -12942070 -16964145 -14456129 -4609335 3439261 715046 -10326736 -19174487 -19569150
5162 -19569150 -13448088 -4637033 4809765 11761258 11922944 5145558 -3129242 -7744780
5154 -7744780 -8283350 -6871659 -5096708 -4196062 -4858727 -5599860 -4404899 -2684572 -4029958
5145 -4029958 -8217636 -10375193 -7385764 -1335998 4723278 10389657 15403320 17327864
5137 17327864 14205863 7057047 -1492251 -8417841 -10137363 -5384089 1315455 3976875
5129 3976875 3615539 6455455 12610303 14086243 7212990 -696705 -2247668 -431629
5121 -431629 -1585533 -4107479 -2342679 2706306 5146474 3895537 2567451 1987912 1002592
5112 1002592 2728756 10834578 20241413 21162203 13499147 7846613 9570453 10938311
5104 10938311 3535850 -9435914 -19288713 -24066627 -27586483 -30265836 -28365229 -21253366
5096 -21253366 -13488476 -9283402 -8778513 -9946614 -10989703 -10504185 -7745594 -3336519
5088 -3336519 1428352 5559852 7726888 6184751 1450821 -2103024 -115932 6354646
5080 6354646 11670137 12253623 10287266 9961989 11999178 13604019 12826951 10859272 9785253
5071 9785253 9791645 9681711 9126615 8968057 9624230 10542600 11207030 11479217 10997025 9549584
5061 9549584 7890315 6507030 3850512 -1646072 -7350968 -7326251 936466 13185852
5053 13185852 23507827 29925357 32621500 29971564 20726263 8506458 -527513 -4346617
5045 -4346617 -5612003 -5766100 -2872803 3706505 10562965 14396146 16131899 18516399
5037 18516399 21611212 23227936 22680150 21560965 21060478 20753332 20457188 21253493 23349748
5028 23349748 24481926 22749397 20433937 21897300 26953416 29820712 26841776 21672217
5020 21672217 19118814 17440021 12643714 7778203 9869097 17972773 23213585 22398948
5012 22398948 22082185 25202293 23745284 11991500 -1507907 -4940414 -122659 2321571
5004 2321571 545183 2548444 11050836 18776407 20282578 18950853 19596623 21677237
4996 21677237 22433755 20782393 16414758 10421521 7302004 10460774 15619175 15055179
4988 15055179 8168123 944987 -4180125 -9300386 -12231911 -7146692 4286246 12871541
4980 12871541 15868983 20256367 28091840 30448405 22828380 15628368 19643701 29599578
4972 29599578 32523257 26075014 17918081 11892005 6220278 2775614 6699809 16368338
4964 16368338 22888586 21356128 16088154 13399776 14484186 16472718 16364316 13304222
4956 13304222 9948128 10874286 16819862 22306823 22451914 19944942 20945465 25669458
4948 25669458 27653686 21917240 10412676 -218725 -4043765 -215913 6159390 9079852
4940 9079852 8303981 7987771 8663713 6248803 558823 -2320468 224551 2487393 475225
4931 475225 -480746 4929677 11574341 11341195 6198305 4740835 8775120 12048567 10705523
4922 10705523 7427966 6121606 8497752 14510813 21239161 23759811 21551514 20371292
4914 20371292 23573545 26991896 27421594 29107649 34878156 38253940 33055907 24019688
4906 24019688 18624599 15501696 11150428 10514541 18752549 29232235 32475821 30696825
4898 30696825 30667799 29811487 24075678 21395021 29902055 40160817 38443138 30882710
4890 30882710 33103045 42144015 42839789 37283374 41304876 54471031 61876623 63879480
4882 63879480 73117463 83203769 75934023 60457268 64194912 81141488 78733437 65426580
4874 65426580 87029083 125531703 72933769 -128135317 -366047803 -464541800 -386377325
4867 -386377325 -255685911 -185104836 -164548087 -136659704 -99152575 -83931767 -88732928
4860 -88732928 -85373150 -69821041 -59643033 -57135879 -50350602 -39655787 -33945364 -29514316
4852 -29514316 -18006328 -7095611 -10035453 -21627506 -25860352 -21177725 -18213108 -18432631
4844 -18432631 -15060164 -10682057 -14060245 -21787339 -21788177 -14423905 -12903205 -22074869 -32517227
4835 -32517227 -37212134 -39522703 -41882339 -39639625 -30350559 -19070499 -10634334 -4574459
4827 -4574459 -145188 677507 -2933347 -9537757 -18431397 -28190358 -33519441 -30428286
4819 -30428286 -23588672 -21367371 -24111203 -24512188 -19419687 -14248447 -14984022 -21580483
4811 -21580483 -29747797 -34702460 -33729334 -29104093 -26699658 -27844373 -26237766 -17996342
4803 -17996342 -9746241 -9333747 -13205053 -12460965 -8094313 -9366703 -18162371 -25782502
4795 -25782502 -26170494 -22609448 -19415474 -15609858 -9474234 -2511206 3228276 6214489
4787 6214489 3587349 -5420546 -14489025 -15959208 -11756710 -11064886 -16782060 -22193325
4779 -22193325 -21825626 -17435612 -11958120 -5737254 -629402 813 -2604117 -3833065
4771 -3833065 -4337692 -9372172 -18266381 -23575805 -22663006 -20557257 -18759109 -11823403 633790
4762 633790 9185262 7984009 3502796 3342658 5349267 5110833 5313368 8847143 10403340
4753 10403340 4635632 -3591238 -6751211 -6850581 -10144938 -14710719 -14158237 -10268992 -10843326
4744 -10843326 -16637911 -20699948 -19862330 -17368875 -14668853 -10128872 -5973901 -7098441
4736 -7098441 -12091504 -14376966 -13394748 -15423682 -21291588 -22853831 -15626516 -6364300
4728 -6364300 -2833871 -3189251 -1472121 2215382 3878773 4036595 6890809 12532877 15822769
4719 15822769 13300462 7343219 2812278 1866277 2572825 1598020 -1759060 -4315387 -2970937
4710 -2970937 382521 282882 -5497359 -12987478 -16674698 -14897142 -9973094 -5549254 -4703718
4701 -4703718 -7936693 -11756288 -11714399 -7947486 -5069002 -5666352 -7405427 -8148008 -9643352
4692 -9643352 -12823234 -13279334 -6521436 4201523 10679318 9904543 6413785 4136923
4684 4136923 1630317 -1992291 -1705102 7234298 20027594 25757801 20949218 13975752
4676 13975752 12835643 13499018 6389580 -7867545 -16768577 -11593976 1558964 10095725
4668 10095725 9474217 4615117 508459 -2177390 -3437644 -2394642 -442715 -960979
4660 -960979 -4217587 -6281587 -4316451 599572 7026034 15254270 23600750 26672153
4652 26672153 21138543 11120831 4442406 4583002 8738603 12470556 13502086 11561482
4644 11561482 7104604 777766 -6638849 -13458805 -16301602 -12160017 -2609731 5881663
4636 5881663 7837664 3899352 -1341664 -4968390 -7097797 -8113629 -7538246 -5626048
4628 -5626048 -3793797 -2849239 -1920533 533677 4913825 9096812 8932439 2130136 -7411295
4619 -7411295 -11665243 -7080456 897645 4609172 3531374 3167490 5945911 8116309
4611 8116309 6291853 2479693 446001 474079 457229 -128362 -153597 804562 2733945
4602 2733945 6751870 13541057 20504141 23261211 20675185 16299753 13718109 11994444
4594 11994444 7352661 -1322663 -10467589 -15812853 -17190264 -18106044 -20669500 -22369859
4586 -22369859 -18950248 -9869215 525002 7457041 10077200 10675571 10785957 9742743
4578 9742743 7029698 4330871 3962258 5737384 6756651 4814904 1093067 -1579721
4570 -1579721 -2660397 -4468876 -8360083 -11960219 -11822717 -8116274 -4819017 -5097693 -7892108
4561 -7892108 -9392250 -6765495 -264695 7092155 11781091 13130016 14421758 18661292
4553 18661292 23251410 22193068 14928231 9070039 10955977 16790638 18217213 14464343
4545 14464343 12213897 13516543 11701400 2537634 -7337568 -8851181 -2815501 2655903
4537 2655903 4052032 4489245 5034333 2002573 -5413522 -11610378 -12117798 -9767475 -9485337
4528 -9485337 -10711122 -9404368 -5360729 -3195689 -6492855 -13745609 -19875014 -20316716
4520 -20316716 -14777880 -8419705 -7691905 -13200283 -18301092 -16556034 -8780555 -781304
4512 -781304 3710360 5214367 5530091 5694977 5843470 4718014 794941 -3952726 -4048218
4503 -4048218 2323777 8884990 8870341 5151203 6869007 16583317 27066096 31543492
4495 31543492 30729520 27817095 23072421 17277121 14935132 18400023 22131882 18638640
4487 18638640 8772956 1022721 819232 4915942 6895172 4537900 410935 -2171600
4479 -2171600 -1962449 179403 2688552 4878707 7210082 9587966 10075166 6783635 1150801
4470 1150801 -2294910 -637032 3619891 4933645 1229226 -3475001 -4312723 -2118059
4462 -2118059 -1814071 -4399400 -4734691 533506 6935273 8333635 6069563 6063139 8279294
4453 8279294 6337389 -1247174 -6576512 -2855493 5969155 10789624 8882432 4864330
4445 4864330 2496903 946308 -982435 -1211160 3337643 12106224 19333550 18075770
4437 18075770 7795991 -2607693 -3225513 4607708 9153350 3454125 -5626032 -7504741
4429 -7504741 -1960641 2857794 2902655 1546431 1898514 2759159 2418257 633602 -3626865
4420 -3626865 -10886488 -16983502 -16085805 -9641318 -6800596 -12982785 -22464528 -25869834
4412 -25869834 -21756751 -16967336 -17375505 -21863266 -25086191 -23761290 -19632235 -16857169
4404 -16857169 -16877956 -16887590 -14158503 -10038668 -7259956 -5016457 -669519 4270486 4628405
4395 4628405 -898281 -6856469 -7596956 -3366083 2101177 6799807 10600796 12655587
4387 12655587 11736651 8209739 3671535 -706904 -4423950 -7274191 -9400322 -10447020
4379 -10447020 -8533457 -2236286 5877436 10271914 8299716 3081308 -484808 -574129
4371 -574129 1586412 4216452 6024558 6594245 6945487 8209266 9283469 7916757 4559815
4362 4559815 2583893 3926708 6917123 8765722 7482069 1633722 -7604300 -13942990
4354 -13942990 -10982836 -1362734 4831233 3479872 2018160 7316561 14378437 14000610
4346 14000610 6982017 2249953 3177902 4642076 3715974 4738652 11104265 18573517
4338 18573517 20689230 16962929 12439362 11469989 13865047 15343068 11102291 1201785
4330 1201785 -7769794 -9544305 -6158218 -4629395 -5968298 -3958618 3297296 7968494
4322 7968494 3787395 -2951570 -1056026 9686592 17902477 15475374 6042522 -2401224
4314 -2401224 -6847544 -8418325 -7664467 -5118622 -3114736 -2630158 -587858 5368458 11274508
4305 11274508 11186174 6592115 5900852 13226971 22754051 26909407 25724729 24110028 23238184
4296 23238184 19913839 13092762 5718711 -187598 -5686574 -11063193 -13839806 -12561742
4288 -12561742 -9476684 -7408330 -6597711 -6793576 -9830007 -16901257 -24581882 -26839435
4280 -26839435 -21224232 -11143355 -2005128 3130505 3938893 947690 -5056920 -11999907
4272 -11999907 -16398395 -15690306 -10886512 -5885734 -3670319 -4254417 -6824244 -11731049
4264 -11731049 -18402492 -23153032 -22326532 -17215877 -12994768 -12669433 -14374304 -14387544 -10397441
4255 -10397441 -2255625 7672772 15116845 17507210 16506850 14594044 11078945 5390944
4247 5390944 1807509 4633458 9946389 9806629 4913628 4382225 10794297 14810792 9478194
4238 9478194 1422888 893104 7351502 12755507 13956455 13554901 12259763 8964436 6198787
4229 6198787 7546039 11042975 12440779 13536967 19384363 27721282 29320623 20170763
4221 20170763 6632427 -3070951 -6689814 -5941181 -2545739 1333796 3196407 3155025
4213 3155025 3847012 6460578 9946361 14325665 20772437 27564314 29742536 24418543
4205 24418543 14230759 4897553 735868 1560689 2105597 -3363306 -13059005 -17093308
4197 -17093308 -8883957 5641072 15080529 15969459 13300093 10499738 6825977 4013150
4189 4013150 6979601 15615724 22110619 19589107 9976342 1717603 2035811 11108772
4181 11108772 21275305 23372345 16612996 9672802 9183219 11753409 11706327 10454319
4173 10454319 11108710 10122352 4041826 -536833 4898457 16290921 22480836 22179569
4165 22179569 22892337 25528179 24339816 21116518 24200897 32381720 34581295 27640525
4157 27640525 20352431 17965692 17004458 17016511 22107711 29054925 30012684 28322568 33968614
4148 33968614 42991679 42608181 37409428 44641161 60913119 64745448 58400141 69973804
4140 69973804 101636606 120295392 123004432 159210224 241139142 278274683 173815797
4133 173815797 -31276254 -185415403 -201999490 -141146002 -102006994 -102284848 -101206088
4126 -101206088 -85501168 -76172332 -77350269 -70937543 -54338948 -44547176 -46769980 -48709585
4118 -48709585 -45140877 -43739848 -46688834 -47123492 -43968029 -42701270 -41651520 -33478348
4110 -33478348 -20216710 -12399045 -12867949 -14099285 -11675081 -8833362 -7538463 -5593685
4102 -5593685 -2959149 -1963314 -1553267 764134 2669013 492118 -3062133 -2577193 601796
4093 601796 159998 -5755424 -13656969 -20659952 -24792829 -22916917 -15355870 -8883995 -8139000
4084 -8139000 -8520520 -4955464 -2093131 -6670305 -15076463 -19022642 -19103621 -21263259 -23283893
4075 -23283893 -17410936 -5153280 2636701 881021 -4929616 -9322680 -12272008 -13563699
4067 -13563699 -11322387 -7295678 -5560048 -5852141 -5606175 -6712916 -11221088 -12856942
4059 -12856942 -4200621 8952518 12999708 6653920 2575448 7018223 11435919 8539000
4051 8539000 3615589 3398884 5071210 4132490 3749987 7928845 12876822 13313872 11424273
4042 11424273 11974692 13474195 11311911 5858461 1274456 -503719 414769 4382665
4034 4382665 9623054 10784997 5265715 -1867005 -3979608 -1582971 -838265 -5299927
4026 -5299927 -12599487 -17834500 -17847713 -13618696 -9546617 -8334481 -6760408 -111720 9651274
4017 9651274 15335491 14272342 10669085 7619279 3629891 -1466374 -4564041 -5599176
4009 -5599176 -8330499 -12147413 -11308862 -5870281 -4241910 -9454997 -11951081 -3504405
4001 -3504405 9580418 15851667 14681925 13399409 13765550 11589644 6562547 2489182
3993 2489182 -676955 -6057202 -11984002 -13140880 -9338657 -5905651 -5431568 -5598217 -4843283
3984 -4843283 -3972097 -2634580 -90137 1486582 479196 1020258 7633367 15894455 16499091
3975 16499091 8653015 1211248 -484985 -528441 -3006027 -4973035 -3069518 -396102
3967 -396102 -1483280 -4913534 -5862264 -3021707 945859 3626845 4497667 4244273 4572346
3958 4572346 6728455 8897878 7780055 3987864 2319992 4578159 5886768 1638052
3950 1638052 -4635762 -4676925 3939966 14328815 18011997 13688727 7018052 3093187
3942 3093187 1407306 -1005449 -3616584 -2865029 1490766 4507536 2533891 -1973578
3934 -1973578 -4974408 -6639565 -8663356 -9284743 -6492277 -3550627 -4706013 -6899612
3926 -6899612 -3186419 5815320 11847971 11559208 10788593 13318385 13632512 6402143 -3434971
3917 -3434971 -7131810 -4474270 -2518084 -4188650 -4828915 144035 9245524 17113433
3909 17113433 19484064 16099856 10983944 8938742 9936888 9001968 3688794 -1726711
3901 -1726711 -3139651 -4026854 -10237701 -19609159 -23625495 -19328961 -13031524 -10785224
3893 -10785224 -11041450 -9282330 -4897269 -22011 4587142 8614831 9727078 5981571
3885 5981571 -493825 -5216759 -5953112 -3536091 421410 3965187 4120769 -962822 -9018732
3876 -9018732 -15160899 -16740126 -15078478 -12525146 -9760755 -6229757 -1464299 4347105
3868 4347105 9586638 11056768 6765482 -575836 -5029721 -3623866 614614 2987555
3860 2987555 2653244 2125531 2963047 4542801 6471334 9543055 13776646 17245249 17632429
3851 17632429 14228349 8431027 3103223 960935 2279999 4404757 4625131 2926534
3843 2926534 585777 -2658291 -7420999 -11416258 -10932493 -6135658 -1587150 -284851
3835 -284851 -393618 419585 852697 -893227 -2575995 -385508 5290226 10107627 11193046
3826 11193046 9110614 4845486 -1425719 -7693514 -9598607 -4885075 3070400 8230185
3818 8230185 8210020 6410300 7536926 11708506 14107087 10933703 4380950 -209538 -1342555
3809 -1342555 -2358945 -5000343 -5984385 -2543494 1861133 1278117 -4911029 -11659016 -14773485
3800 -14773485 -14088358 -10706056 -5118538 1266319 5860473 7069545 4662261 -1804416
3792 -1804416 -12031329 -22407817 -27779273 -26753394 -22537747 -17743334 -11345968 -2117962
3784 -2117962 7742740 14490077 16712809 15802787 13786319 11814622 9852645 7227503
3776 7227503 4146138 2256366 2486720 3454504 4137836 6453669 11383344 13726940 6426657
3767 6426657 -8666063 -19829496 -18360595 -8389624 -444011 1308213 1297055 4454785
3759 4454785 10406339 15182432 15454348 11052638 5156533 1496848 311657 -1381564
3751 -1381564 -4433216 -5199831 -775373 6106327 10576741 11901046 12567034 12665928 9427531
3742 9427531 2246820 -5216607 -8375391 -5151744 3073203 11426430 13645661 7628065
3734 7628065 -1438743 -6341486 -5505365 -2479776 489522 3588953 5115450 2440325
3726 2440325 -1483569 828046 10368331 17333980 13020163 1898766 -4348880 -2301983
3718 -2301983 590178 -1878936 -7229853 -10483462 -11050074 -9911235 -5531537 2218250
3710 2218250 7990595 6996752 2926224 3253299 7563044 8075416 2893884 443610 6358970
3701 6358970 13275313 11067672 2431080 -915334 4211008 8421411 4630268 -2159739
3693 -2159739 -4105708 -2064528 -1687338 -3224939 -2636838 -371146 -1660271 -7873492 -13391113
3684 -13391113 -12615536 -6150325 1463823 7138526 10871637 14131243 17897279 21175178
3676 21175178 21292160 17077913 11423745 8660127 9432548 10287860 8466163 4889318 2003912
3667 2003912 952763 1841156 4869283 9690163 14493215 16763402 14814537 8812773
3659 8812773 1284901 -3569379 -2677738 2934295 8471729 9056894 3281372 -5903900 -13068651
3650 -13068651 -14190471 -10122286 -5635879 -4062705 -4106890 -3171362 -1628961 -1014317 126421
3641 126421 4278505 9212012 8831581 1081451 -8725316 -14204015 -14226067 -11056566 -5810317
3632 -5810317 846135 5921996 6157597 2327259 -1525380 -2960374 -2894108 -2913089 -3450989
3623 -3450989 -4740555 -7119221 -9734546 -10850918 -10188155 -9448860 -9879613 -10662995 -10271888
3614 -10271888 -7987393 -3511660 3088275 9749778 12400292 8773445 1645284 -3785146
3606 -3785146 -5582492 -6089242 -7193956 -7354523 -4889347 -1877750 -1726870 -3552836 -2349375
3597 -2349375 4155939 11320704 12418694 6575002 -278167 -2306044 179215 2211587
3589 2211587 314462 -4318951 -8471284 -10991333 -13052580 -15101575 -15419578 -12340403
3581 -12340403 -6625310 -710746 3428131 4774789 2894700 -1502590 -6620117 -11599230
3573 -11599230 -17089591 -21903228 -21157825 -11524234 2439748 11507074 11858989 8105449
3565 8105449 5692896 4864072 3727235 2468838 1524552 -339427 -2712178 -2151321 2044400
3556 2044400 4529323 1066979 -4601535 -6547461 -5807908 -6776094 -7278969 -1303334 8838027
3547 8838027 13022023 8515987 5312333 11334176 20555370 23101473 20736393 22864360
3539 22864360 30379415 33700864 27345987 17499712 12063177 10239625 6618298 534375
3531 534375 -4276517 -6600205 -8695734 -11157201 -11795280 -10083605 -8523539 -8452396 -8139117
3522 -8139117 -6500866 -5015855 -3811203 149632 7372655 11976427 8848126 2312550
3514 2312550 1197504 6019390 8303398 3694548 -1875210 -2263591 -119411 -646682 -2533504
3505 -2533504 -1868771 -472632 -2463346 -5292985 -2413383 6047246 12968456 14727473
3497 14727473 14779005 15923499 16151041 14238877 13094428 14581183 16065258 14793577 11278147
3488 11278147 6182164 -1361730 -9718264 -13677436 -10717488 -4914382 -2022828 -3766774
3480 -3766774 -8567695 -13938995 -16582848 -14781342 -12529845 -16009969 -23736312 -26363090
3472 -26363090 -19543994 -10293060 -5901687 -3458719 2939946 10694839 13017775 10680306
3464 10680306 10274803 12823385 13064263 9457463 6315054 5295395 2789947 -2311413
3456 -2311413 -5321201 -3192257 131192 -1217478 -8458733 -18490578 -26924941 -29382822
3448 -29382822 -23886615 -13822557 -5234674 -179658 3726893 7130417 7590559 5468094
3440 5468094 4955768 6359928 3395524 -7054466 -17364593 -17652726 -9144659 -2408293
3432 -2408293 -2762098 -3832214 2318971 13318027 18679883 12550484 925240 -4934705
3424 -4934705 -810890 6694004 8891781 5298633 2935387 6354312 11719489 11959079
3416 11959079 5411376 -2623633 -5824940 -2665533 3182514 6813438 6238296 3282808
3408 3282808 1111470 1648048 5411873 12117601 19829695 24754677 24314935 20307154 17074725
3399 17074725 16713592 17920484 18990170 19343414 18259241 15170018 11830941 11241055 13228531
3390 13228531 13702274 9716166 2981440 -3129084 -7745171 -11771935 -15065330 -16763595
3382 -16763595 -17276432 -17809457 -18636527 -19533772 -21044421 -23405207 -24841172 -23097405 -18799605
3373 -18799605 -15436174 -15314852 -16896007 -17157848 -15618914 -14384750 -14391640 -13824238 -11587855
3364 -11587855 -10289495 -12742828 -16491802 -16106519 -11566924 -9264181 -11870271 -12410968
3356 -12410968 -3966440 8375336 12793337 7006199 1355288 4093627 11007288 13437208
3348 13437208 10438374 7295412 5926914 3364629 -1378872 -4888245 -5001098 -4860438
3340 -4860438 -8943857 -16702957 -22351463 -21352734 -16121221 -13773352 -17736084 -23530748
3332 -23530748 -24843137 -21785321 -19349475 -18647185 -14968539 -5879748 3567551 6527629
3324 6527629 1858652 -6578898 -14646433 -18963132 -16705255 -8605360 -262854 3162796
3316 3162796 2131597 -172536 -3386500 -8542084 -13008088 -11977637 -5173793 1813869
3308 1813869 3541221 -594109 -7624517 -14254167 -18662834 -21200493 -23134927 -23363539
3300 -23363539 -18286717 -7666077 1782748 3269487 -820999 -1971074 2271679 5326681
3292 5326681 2610421 -666845 2884749 11604366 16596348 12946725 4105269 -4430255
3284 -4430255 -10881836 -15376742 -16475071 -12754491 -6384979 -2133731 -2423129 -4996319
3276 -4996319 -6031819 -4302297 -1285643 1919093 6151740 12418160 19566875 24259080
3268 24259080 23066414 15082504 3422709 -6290355 -10502885 -10889566 -11448828 -12614567
3260 -12614567 -10717476 -4002720 3646342 6983554 5352438 2076180 -434261 -2187773
3252 -2187773 -3148731 -2256999 751916 4461140 7115612 7840480 6800160 5098358 3860732
3243 3860732 2453403 -1296395 -7859158 -14273969 -17155275 -16002011 -11925148 -5199852
3235 -5199852 3221485 9688501 11170350 9858187 10695424 14477470 17151434 16223721 13833029
3226 13833029 12258338 10193936 5798871 692510 -1828024 -1165117 143800 -331365
3218 -331365 -2687186 -5292912 -6784072 -7537833 -8819290 -9825658 -6976084 1533613 11372779
3209 11372779 15660784 13097113 8941729 7043096 4971817 -602656 -7372000 -10016013
3201 -10016013 -7390315 -3367310 -1400803 -1543762 -2475201 -3313349 -3068988 -944571 2071373
3192 2071373 3905529 4305858 5150445 7223268 8868876 9181777 10364986 14372358 18380646
3183 18380646 17018768 9733283 2810877 1962063 5148414 5855910 2123378 -1779153
3175 -1779153 -2735365 -3115658 -5569459 -7668458 -5744901 -1471726 103996 -1918680 -3291388
3166 -3291388 -1080733 3165033 7288390 11255491 14492593 14401112 10015070 4349412 645981
3157 645981 -1563799 -4460755 -8048131 -10502364 -10595500 -7637837 -1055648 7281422 12126828
3148 12126828 9668781 2562021 -2880283 -4081575 -3806237 -4664939 -5548612 -4396258 -1371945
3139 -1371945 2341969 6303185 9127488 7194944 -1600472 -13182292 -19517497 -16667488
3131 -16667488 -8810502 -3154221 -2458938 -4035505 -4537416 -3238305 -1103842 618348
3123 618348 346656 -2992750 -8200006 -12830990 -16583292 -21064054 -25224315 -24588886 -17614713
3114 -17614713 -9570124 -6317321 -6788622 -6099367 -3875257 -3665991 -5156542 -3853898 593753
3105 593753 2709865 421859 -621723 3630243 7640316 3713091 -6337336 -13797209
3097 -13797209 -15556004 -17023743 -22222926 -27320436 -26551305 -20296552 -13989833 -11126747
3089 -11126747 -10312241 -8862318 -7293288 -8924066 -14640164 -19244113 -15821894 -4732309
3081 -4732309 4905223 5555382 658866 -313622 5378449 10988933 10255691 4705738 -776571
3072 -776571 -4676136 -7606009 -8106863 -4688420 -670797 -2024584 -9572635 -16941961 -17944860
3063 -17944860 -13488197 -9063145 -7248919 -5816036 -3057340 -1573651 -4534286 -9891227
3055 -9891227 -11497356 -6380295 1622195 6864497 8684010 11188589 17304794 25313049
3047 25313049 31101974 31770395 26785570 17763380 8124528 1249483 -2508774 -5845069
3039 -5845069 -10059205 -11867438 -7342987 888999 3528245 -5979426 -23108124 -35658437
3031 -35658437 -35228595 -23526650 -8145694 4526851 11489306 12248846 9150700 6805644
3023 6805644 7900453 10182875 9927861 7137702 4485402 2704521 1110615 1626819 6855330
3014 6855330 13595773 14168381 6700723 -1055404 -1844071 1521990 1319946 -3793622 -8223588
3005 -8223588 -8302985 -5955764 -3722668 -1339982 1554007 3181799 1801135 -2071492 -6411983
2996 -6411983 -9052534 -8619112 -6243737 -5679511 -8969869 -12568887 -11014035 -4295307 1865730
2987 1865730 3239891 1053880 -1560644 -3072603 -2620982 75702 2059835 -1295098
2979 -1295098 -9135788 -13319560 -7634639 3760837 11014695 9674049 3188229 -3641070
2971 -3641070 -8639473 -10438377 -8276538 -4815410 -4516461 -7366471 -8391179 -5676612
2963 -5676612 -4310788 -8332038 -12647177 -8991948 1719161 9653375 9285504 6058651
2955 6058651 7408235 12812528 16889210 17789643 17000167 13909262 7093768 -96172 -1750360
2946 -1750360 2177297 5236345 3377337 -805681 -4022053 -6483001 -7507649 -3115290
2938 -3115290 7194336 15961521 15837748 9140562 3786117 2129117 46446 -4112896
2930 -4112896 -6399205 -4061944 -62703 1257273 -658939 -3547759 -5689958 -6836901
2922 -6836901 -7776903 -9785188 -12850564 -14552054 -12860363 -9769741 -9607665 -13874519 -20121654
2913 -20121654 -25161377 -26298613 -20528254 -7415940 6600255 11825892 5790763 -3186121
2905 -3186121 -5297905 570694 8115331 12118728 12341869 10555966 7565390 3895169
2897 3895169 1081594 434004 775805 -931985 -5381648 -8379432 -5318768 1619473 4543926
2888 4543926 3140 -5951163 -6226669 -2270832 -211645 -878525 -454384 880619 -1093590
2879 -1093590 -5860067 -7215700 -3141449 208770 -2657228 -9325916 -13866213 -13492449
2871 -13492449 -8750643 -2655181 -1768188 -11361804 -25921572 -31294438 -21276161 -5959944
2863 -5959944 1850198 2163001 2823737 5178226 4359253 781647 1360314 9216829 19965749
2854 19965749 28543530 32748065 29956962 18298643 3174717 -4417272 266540 10271001
2846 10271001 16233514 16603006 15292382 13459270 8780552 1422886 -3984154 -3509951
2838 -3509951 1179229 4653680 3964770 1629473 1577377 3385705 2888886 -1708984 -7391003
2829 -7391003 -10644261 -10792065 -7912510 -1931201 3603433 1751894 -9117040 -20578472
2821 -20578472 -23481234 -19105461 -15372297 -14929094 -14176646 -12336382 -13030299 -16159442 -16061019
2812 -16061019 -10175755 -3207820 90151 753670 1368951 1172167 -1131376 -3850386 -5151938
2803 -5151938 -6134887 -8019437 -9357185 -8982775 -8833772 -10711643 -12612289 -11431450 -7818777
2794 -7818777 -5758481 -8047060 -13371810 -16875899 -13738879 -4590786 2812433 851394
2786 851394 -8565083 -15781991 -15256629 -11029388 -9064253 -9492630 -9227533 -7323242 -4110076
2777 -4110076 685654 5084353 4253887 -2879964 -10213993 -12308504 -11885916 -14144269 -17301130
2768 -17301130 -15757765 -10472997 -8414900 -11716819 -14617759 -12773469 -9387038 -9271887
2760 -9271887 -11528293 -11503200 -7192410 -981646 3166315 2519421 -2734132 -9236250 -13234472
2751 -13234472 -14333833 -15204342 -17649229 -20998779 -24318825 -27548610 -29973383 -30271890
2743 -30271890 -29034115 -28848804 -30803416 -32955341 -33165901 -31325113 -27920902 -22831733
2735 -22831733 -16878928 -12414294 -10811609 -11046500 -11823108 -13029172 -13949787 -12666148 -9151795
2726 -9151795 -6532638 -6899433 -8107811 -7434611 -6077417 -6481711 -7253291 -5363147 -2295859
2717 -2295859 -2491937 -5302366 -4370627 2768257 9851174 10308112 6021257 2926050 1538190
2708 1538190 -2028405 -7615231 -10397281 -8752067 -6515520 -6245586 -6019310 -4729358 -4696396
2699 -4696396 -6056367 -4146392 3328326 11329127 14549356 15127934 17561123 19679151
2691 19679151 15823406 6948758 76259 -1928547 -3092554 -6459068 -10036583 -11534704
2683 -11534704 -10817571 -6537386 2811868 12467536 13353481 4278306 -4295541 -3546232 2167803
2674 2167803 2629148 -4044190 -10915079 -12659560 -9805952 -4317311 2579821 8212974
2666 8212974 9241969 5371078 -763564 -6822811 -10994932 -10720663 -5410296 375578
2658 375578 719098 -4543900 -9671794 -9688147 -4388335 3375186 10051751 12668753 11000998
2649 11000998 8071038 6071103 3403511 -1220946 -4336627 -2227488 1895675 1066024
2641 1066024 -5489645 -11312744 -12006191 -9990365 -8994153 -9215277 -9605712 -10032640 -9275894
2632 -9275894 -5467165 -382190 1386098 -421416 -381889 4187318 8701614 8986609 8536248
2623 8536248 12804798 19703157 21821982 16828321 10369235 8516362 11215955 13798928
2615 13798928 12386125 7405647 3276559 4222317 9298827 12803761 10856329 5832345
2607 5832345 2841353 4026202 8098949 12679381 14483880 10297328 1607094 -4286169
2599 -4286169 -2451528 2199699 868440 -6815530 -12487857 -11297549 -7951282 -8341523
2591 -8341523 -11119827 -11596650 -9470707 -7678135 -6527408 -4377948 -2605389 -4289966
2583 -4289966 -7907332 -7552508 -859494 7744588 13830539 18894208 26187041 34011731
2575 34011731 37850155 37490611 36997247 37751433 36513746 31613986 26421387 24123012 22796838
2566 22796838 18968283 13263784 8917060 6662428 4720329 2295960 -429708 -4163247
2558 -4163247 -8418720 -9289827 -4277704 1785885 1727139 -2943442 -2977740 4508558 10101259
2549 10101259 5226299 -4406694 -5677177 4090294 13477565 11739105 1332302 -6852238
2541 -6852238 -7027837 -3599265 -3577901 -7225948 -8483933 -4009664 1730977 3060841 2099372
2532 2099372 5723081 13704430 16648874 8900355 -2397904 -6557852 -3466557 -1750511
2524 -1750511 -5137485 -8194576 -5994870 -1191637 972303 -235720 -1933582 -2304389
2516 -2304389 -1562880 -333012 791476 1449933 2399426 4544995 6437752 5080684 401273
2507 401273 -3376587 -2551834 1440230 3749179 1269906 -4987468 -11395715 -14462536 -13115300
2498 -13115300 -9164924 -4864743 -20069 7101672 16075251 23583860 26793281 25454099
2490 25454099 20366786 12516594 4841159 1919607 5517446 12121696 16927924 18751915
2482 18751915 18984679 17416400 12168737 3458163 -5243932 -10523296 -12111388 -12255035
2474 -12255035 -12964374 -14206809 -14295662 -11884655 -7585535 -3288289 -102052 2095507 3216826
2465 3216826 2628575 651606 -1137132 -1629854 -662028 2447013 8282805 14283636 15406199
2456 15406199 10215706 3770655 1446926 2115095 1152315 -1770136 -3037431 -2647777 -5392111
2447 -5392111 -12610455 -18041861 -15651497 -8041998 -2673220 -1907436 -1695027 520576 1729328
2438 1729328 -1370680 -7013085 -11013913 -12354618 -12908624 -12569531 -8049289 2427762
2430 2427762 15179392 23482963 23660242 18022253 11992829 8955741 8028928 6439053
2422 6439053 3417687 1141765 1797779 4637678 6870426 6999658 5961297 4969945 3817869
2413 3817869 1872227 -812772 -4328488 -9117913 -13771382 -14520702 -9773755 -4011089
2405 -4011089 -3438863 -7712923 -10077145 -6958465 -3019155 -3715213 -6885849 -6817778 -4374667
2396 -4374667 -6626705 -15836286 -24773142 -25849157 -20573201 -15957663 -14264133 -10994516
2388 -10994516 -2526190 8244777 14931002 14166086 8323995 3069577 2428873 5172730
2380 5172730 6313367 3309752 -232188 710961 4902356 5329424 -1841945 -12018587
2372 -12018587 -17713230 -16704348 -12346777 -8126064 -5250929 -4318361 -5422723 -6328842
2364 -6328842 -3868992 1676424 6016790 5945950 3083957 1292519 2105388 4115823 5302809
2355 5302809 4260380 343982 -5442888 -10186680 -11202984 -8279961 -3146733 2253175
2347 2253175 6036094 6627180 4708718 3559240 4860501 5130053 -353493 -10105663 -16561209
2338 -16561209 -14921644 -8882274 -5696727 -8019565 -12847298 -16411810 -17302041 -15884009
2330 -15884009 -13245219 -10317264 -6551985 -853179 4510911 3675182 -5295248 -14639649
2322 -14639649 -14145526 -4016865 5224242 6686034 4511018 4481238 4175192 -1332802 -8973117
2313 -8973117 -11085332 -7215477 -4231095 -4943396 -5078069 -3069638 -4025336 -9648535 -11944809
2304 -11944809 -3629706 10461093 19493742 20471348 18665709 17158338 14454621 11643453
2296 11643453 13042641 18084111 20317798 17338215 14722584 16211000 16457219 9165020
2288 9165020 -2354668 -9232135 -8857510 -6361256 -5718417 -5640533 -4618769 -4405602 -6251969
2279 -6251969 -7254303 -3285226 5458601 13349435 14010826 6567331 -2666913 -6258215
2271 -6258215 -3984683 -2666470 -6441648 -10897225 -10150920 -6105155 -5021028 -6891555
2263 -6891555 -5296584 1544620 6499120 3328254 -4633038 -9883509 -10998973 -12349964
2255 -12349964 -15497061 -16242503 -10943917 -2092796 4156810 4352837 329078 -3712879
2247 -3712879 -5474914 -5785569 -6352172 -7399922 -7939234 -7332054 -5559732 -2879031 -714014
2238 -714014 -1925498 -7836760 -15175236 -18368282 -15213818 -8358670 -1451985 3378774
2230 3378774 4326353 222694 -6254900 -9167788 -5818955 -423575 1104317 -2047160
2222 -2047160 -6286725 -8677563 -8223817 -4289263 2232186 7234837 7109050 4122688 4211706
2213 4211706 8832812 12817809 11649316 7204953 3893430 2127363 -866776 -5382628
2205 -5382628 -8352363 -8334656 -8122253 -10948798 -16111234 -19967148 -19980957 -16232661 -10123226
2196 -10123226 -3762056 -69562 -780324 -3719124 -4407760 -1577743 1028121 -38670
2188 -38670 -2998172 -3743626 -2002591 -1203862 -2755955 -4092812 -3151451 -1795707 -3295569
2179 -3295569 -8226555 -13959981 -16904774 -14936279 -9350612 -4664651 -4488276 -7343185
2171 -7343185 -8695429 -7059464 -5163372 -4821820 -4405459 -2732027 -1709098 -2751229 -3685309
2162 -3685309 -2011573 1142873 2961681 2705749 1078340 -1973128 -6071742 -8801279
2154 -8801279 -7813504 -3106039 4320419 13420214 20921990 22081563 16967175 12293217
2146 12293217 12719343 13916978 9660316 2483864 237159 3798380 6068141 3368123
2138 3368123 79556 -36541 -1014 -3277209 -6625664 -4153940 4104933 11463480 11515069
2129 11515069 4095456 -4731349 -8422050 -7151479 -8063091 -15528112 -23411361 -22404457
2121 -22404457 -13534181 -6887415 -6654396 -6427022 -2236843 -578575 -6720812 -12809072
2113 -12809072 -7168279 8490063 20620835 21444392 16769668 15840570 20432254 25738692
2105 25738692 26792355 22076501 14501597 10013882 12130743 17297595 18551269 13683723
2097 13683723 6633153 1392018 -1427999 -2143953 -659289 1682120 2977050 4332018
2089 4332018 8446778 13611432 13650963 5996317 -4032597 -9515560 -9306885 -6724805 -4126343
2080 -4126343 -1913256 -462619 332062 1940591 4761834 6179943 3918208 280115
2072 280115 35414 4428429 10000989 13492790 15428063 18010270 21255170 22597642 19867856
2063 19867856 13858163 7900348 5195804 6673478 11013203 15664286 17466056 13949689
2055 13949689 5918693 -2094219 -6126430 -7144781 -8896186 -11996287 -13242343 -10837378
2047 -10837378 -6777832 -3398889 -1358998 -2160463 -8040365 -16757329 -20969284 -16736001
2039 -16736001 -8981974 -4205212 -1676371 2314501 5188087 1527594 -5379464 -5137511
2031 -5137511 4384091 12219094 9649440 2783343 2849066 9631113 13420013 10684273 8160058
2022 8160058 10549227 12767954 8290221 -625956 -5841447 -3276563 4091657 11008925
2014 11008925 13921606 11485793 4993519 -1359967 -3240424 -182004 4132815 5695495
2006 5695495 3596046 135836 -1489170 28033 2837301 3852243 2414218 1091044
1998 1091044 2072447 3969022 3432637 -951756 -7508448 -13056242 -14363125 -9549860 -247494
1989 -247494 8476231 12557453 12866101 12883749 13457380 12471624 9107504 5238955 2288561
1980 2288561 -457921 -3798348 -7389517 -10964725 -14016876 -13940058 -8068712 1149198 6697657
1971 6697657 5058758 722462 -49250 2744222 4294370 2357701 -628556 -1972700
1963 -1972700 -1902998 -2187767 -3734549 -5642637 -5706054 -2962212 -506227 -3284169 -11335119
1954 -11335119 -18175219 -18509094 -14271019 -9546380 -3587986 5302655 12289621 10627220
1946 10627220 3101599 155705 4855037 8075732 2540847 -5860420 -6819062 -303777
1938 -303777 4486571 1998310 -4373437 -8710522 -8803241 -6112310 -3763246 -4701848 -8780323
1929 -8780323 -12031339 -11220143 -7838406 -5140683 -3502928 -2174570 -3085124 -8089681 -14148196
1920 -14148196 -16582504 -16105374 -17002115 -19018299 -17562041 -12428561 -9335728 -10756005
1912 -10756005 -11909654 -9151828 -6140159 -7164113 -9681828 -8981416 -6151883 -5488894
1904 -5488894 -6940915 -7109211 -5588223 -4297999 -2159920 3098536 8518971 7976253 1199420
1895 1199420 -5515616 -8619516 -10846682 -13544260 -12538424 -5822068 648984 678516 -2787350
1886 -2787350 -2342255 2493251 5334156 3303245 389544 -397310 -1671408 -5471139 -7404079
1877 -7404079 -1587849 10714283 21450271 24455880 21063789 16798902 14477630 11828434
1869 11828434 5748339 -2105848 -5676299 -1465387 6481724 11024822 10460983 9220454
1861 9220454 10147343 10640611 8364981 6293505 8036974 11191715 10423227 5881922 3287994
1852 3287994 5417202 8516173 8778011 7959493 9563376 12373506 11352657 3985128 -6743325
1843 -6743325 -15175947 -17229698 -12747390 -5400492 173818 2415450 3701501 6667129
1835 6667129 10869896 13919863 14317327 11873744 7013753 1422339 -2210799 -3179913 -3950257
1826 -3950257 -5938942 -5850007 250851 10110981 16652979 16483797 13187441 11097305 9552894
1817 9552894 5460142 -1341760 -7878164 -11461332 -11232462 -7717828 -2633812 2055660
1809 2055660 6115596 10554765 14350451 14312873 9945453 5440972 3968095 2722831 -2327403
1800 -2327403 -8677756 -9130345 -1094846 10347673 19005978 23075283 23415013 20808857
1792 20808857 16949216 14555173 13917257 11850507 6417330 510473 -1578602 630941
1784 630941 4084263 5876258 4636565 222935 -5375185 -8270161 -6449788 -2428919
1776 -2428919 -37834 253198 621635 1862807 2604155 1421879 -2676915 -10325512 -19274022
1767 -19274022 -23450468 -18805457 -9451597 -3385172 -1965577 1337900 10462917 20201657
1759 20201657 23091610 18801744 12917025 9340883 8030068 8262196 9521104 9487210 5200947
1750 5200947 -2829300 -10276982 -13658767 -13562940 -12617410 -11840950 -9941691 -5472750 999480
1741 999480 6953928 10401548 12072385 13866332 15064619 12449714 5569682 -631028
1733 -631028 -1282053 1813917 2373041 -2151025 -7883170 -10130891 -8289446 -4373905 -41019
1724 -41019 3049640 2593802 -1848248 -6836379 -7981812 -4819200 -1297551 -1408605 -5240596
1715 -5240596 -9228768 -9469942 -4701385 3334635 11739091 18103693 20630154 18301071
1707 18301071 12288267 6130019 2612904 1020434 -613811 -1399884 1189895 6063095
1699 6063095 8290159 5561949 1377989 -481016 -1331380 -4003929 -6599401 -4633104
1691 -4633104 1471837 5973801 5713944 4299070 6672845 12830791 19158902 23311254
1683 23311254 25009734 24024477 20739432 18010493 19244045 24140731 28508402 28702584
1675 28702584 24371275 16701094 6679466 -3602326 -10469433 -12103040 -11267465 -11969053
1667 -11969053 -13875574 -12781071 -6836844 447663 4472967 4384422 2070449 -1342630
1659 -1342630 -5403254 -8163470 -7242824 -3127486 876264 2284371 1391715 -160019 -714308
1650 -714308 1285465 5911515 10150809 10469638 7808360 7051560 10027986 12181269 8895444
1641 8895444 2621407 85482 3629120 8956504 11260338 10266282 8907680 9616403 12684162
1632 12684162 16134219 16787088 13506659 9491657 8876432 10987920 11227216 8299624 6479604
1623 6479604 8494181 10136828 5925098 -2454773 -7902027 -6765381 -1433141 5088152
1615 5088152 11842995 16597517 15534381 9003393 3174145 2480454 3980606 3168926 2011513
1606 2011513 5725324 13441797 18379591 17453395 14692763 13513265 11278077 4813699
1598 4813699 -3173062 -7490757 -7353218 -5605658 -3193462 980088 5604243 6945575
1590 6945575 3927362 114960 -154675 4154817 10203828 12882819 8181332 -2308600
1582 -2308600 -11406732 -14113981 -14141667 -18561733 -26916589 -31017175 -25930807 -15532185
1574 -15532185 -5744122 1834700 6914579 7123522 2179716 -3096075 -4999625 -6620857
1566 -6620857 -12209547 -19309343 -22573885 -22675491 -24156379 -25632138 -20287149 -7530041
1558 -7530041 3202186 3825499 -2410876 -6186709 -3509466 2121818 6204822 7689180
1550 7689180 7956425 8524314 9720805 10116969 7882213 3591803 321111 -121263 611393
1541 611393 363306 -67242 1713040 6099021 11145684 15018290 17021443 16644290 13267791
1532 13267791 7129891 -108526 -5971589 -8586115 -8202314 -7201654 -7678785 -9216845
1524 -9216845 -10084888 -9915151 -9402225 -8138419 -5422982 -2849954 -2831104 -4415750 -4206932
1515 -4206932 -1770709 414790 3410386 12217069 26302835 35610262 32217906 22285542
1507 22285542 19158087 26069899 32919262 30489456 20978655 12362730 8108956 5891447
1499 5891447 2627326 -2644306 -8579415 -11770606 -9129351 -1836011 5016655 8029806
1491 8029806 8484191 8663907 8298428 6640510 5187910 5690738 7479645 8926526 9381727
1482 9381727 7727337 2043077 -6309594 -11275412 -8945450 -3802380 -3642535 -9492344
1474 -9492344 -15150377 -16018967 -13494891 -10590351 -8303994 -7291422 -8174111 -8400825 -3477383
1465 -3477383 6112165 13376921 13257370 8836420 5762228 4441108 2526580 1812325 6008344
1456 6008344 12482560 12952907 4250863 -6477457 -9962193 -4951697 2263257 5839234
1448 5839234 5155393 3179605 2710211 3938040 4291244 1008052 -5330940 -10414205 -9998903
1439 -9998903 -3658114 5252863 12229965 14081833 10368473 3360805 -4003884 -10171966
1431 -10171966 -14304421 -14751164 -10746849 -5328205 -3222130 -4886078 -5794180 -3188874
1423 -3188874 -386533 -1984737 -7503772 -12755364 -15406201 -15915824 -14583362 -11381548
1415 -11381548 -8149127 -7527138 -9344872 -10250433 -6961352 1457952 13136640 22867660
1407 22867660 23769274 13377101 -1944177 -11850547 -11730449 -5586358 -155714 804434
1399 804434 -2732506 -7866911 -9908455 -6386552 -739516 1083965 -1957416 -5353088
1391 -5353088 -5856001 -4590771 -2662490 1244254 6765288 10107923 9520228 8591259 10760534
1382 10760534 14127012 15385203 15495527 17070859 18968218 18417541 16521786 16399815 17001110
1373 17001110 14231006 8169507 3746353 2997899 1535648 -4730300 -12972474 -16857656
1365 -16857656 -14584308 -10116601 -6800035 -2962747 4313469 12543378 14286569 5934247
1357 5934247 -6287102 -12747130 -12082683 -11580577 -14819465 -14829471 -4121276 12580825
1349 12580825 22166566 18770868 9873035 6158787 9889100 14733442 13692788 5519859
1341 5519859 -4655274 -10210761 -9833288 -8730852 -11167606 -13864952 -10866697 -3387185
1333 -3387185 1059909 -366007 -2082421 563153 4315079 4414585 2908480 4848116 9135893
1324 9135893 9421147 3659117 -2472986 -2700534 3052249 10284613 15478999 18404070 20692727
1315 20692727 23722089 27130459 28639522 26075649 20031563 13584106 8756279 4317009
1307 4317009 -1674467 -7781448 -9625974 -5205735 1712394 5222172 3741041 1102646
1299 1102646 1598772 6235369 13820577 22333107 27828085 25723784 16501514 7625445
1291 7625445 5897571 9478888 11401273 9435250 7550901 8219719 8938947 7433697 5117258
1282 5117258 3429902 1391519 -722962 329089 5503597 10191219 9972508 6794981
1274 6794981 5555628 6917065 7707661 6753858 5764146 4919063 1842561 -4310994 -10833894
1265 -10833894 -14604387 -15367829 -15201689 -15928554 -17271653 -16844444 -12552503 -5863949 -1518934
1256 -1518934 -2569320 -6834109 -9858001 -10050737 -8774089 -6582129 -2471103 2884724
1248 2884724 5633110 1821979 -8483619 -20286866 -26844858 -24991427 -18213128 -13265408
1240 -13265408 -12667587 -11977498 -5920822 4428122 12740667 14604060 11343257 7373026
1232 7373026 5910445 6967064 7738956 5283931 263801 -2833416 -1070787 2324479
1224 2324479 1402212 -4576408 -9443689 -7491754 -760578 2762254 -1869050 -10451554
1216 -10451554 -13722128 -7934860 374663 2360128 -1895458 -4296521 -856881 2811588
1208 2811588 846506 -3469101 -2868343 3014487 8203030 9886526 10713758 11981458 11330110
1199 11330110 8631040 7931007 10528754 11212124 5643117 -1963515 -3526829 1859027
1191 1859027 6390421 3935144 -1754219 -1978371 5309516 12522703 12140277 6089576 2118829
1182 2118829 3078540 5147192 6174863 8738338 12672792 12124124 5295411 372348 3984219
1173 3984219 9115344 4529165 -6842936 -10532774 -1527780 9173311 11769907 10075592
1165 10075592 11217884 13048519 10131254 5118954 4928001 9798854 14652709 18469550
1157 18469550 23963180 29249181 27977943 18719103 8117454 3149431 4354701 7520582
1149 7520582 8545733 6172769 2800974 2460236 5514412 6742211 2066262 -4482656
1141 -4482656 -5170761 878359 6694212 7331482 5589359 6400768 10048191 13366918 14273595
1132 14273595 12411026 7692387 923427 -5331603 -8549861 -8467911 -6598411 -4274764
1124 -4274764 -1812544 1087322 4535164 7734930 9469396 9849625 10462391 11601487 10939470
1115 10939470 7168081 3622531 5237386 12414067 20916781 27425137 31609206 32615392
1107 32615392 28022432 18545665 10601708 11010872 19988677 30827379 35482811 30036922
1099 30036922 17222395 5388042 2694562 9340894 16234637 13832983 2212921 -9506523
1091 -9506523 -13500850 -10682975 -7324866 -6812290 -7079187 -5229012 -1664674 1484978 3837821
1082 3837821 6363740 8561933 8765745 7291494 6667982 8155548 10566076 13251232 17162947
1073 17162947 21488285 22738159 19828616 16741251 16460332 15324914 8420783 -1463163
1065 -1463163 -6252534 -3460709 1375235 3634061 4677110 6112036 5396925 1099740
1057 1099740 -2533410 -1292035 2213034 2685488 530698 470280 3107183 3881964 906444
1048 906444 -1599661 381636 5122149 8409646 9154591 9039532 9215548 10460909 14444547
1039 14444547 20812641 24085838 18291252 5683150 -3456617 -2182626 5291342 10240683
1031 10240683 10687829 11160033 13199277 12808869 8407712 5027614 7164630 12085906 14315794
1022 14315794 12956399 9873214 4090753 -5770484 -15265578 -17265427 -11846166 -7091200
1014 -7091200 -8407527 -12027322 -11334381 -5506571 751549 3095365 930539 -2840670
1006 -2840670 -4071311 -1453590 1286428 40318 -3194188 -2720297 2001368 5594405
998 5594405 6028014 7994043 14038413 19005347 18115766 14606119 13335371 12258294 7832000
989 7832000 4543537 9737352 20768650 26689422 23006768 16167129 12109379 9024185
981 9024185 4543698 2094163 4961061 9844220 11732970 10980278 10518619 9735618 6500912
972 6500912 2600174 1720533 3695211 5792511 8339440 13531629 19011697 18603345 11152599
963 11152599 3774482 3226668 7198858 7647910 1161674 -7501126 -12106900 -12061929 -11198184
954 -11198184 -11160592 -8930615 -1944650 6403025 9351916 5147918 28602 939707 7031134
945 7031134 10984362 8087920 1266621 -3143083 -2142489 2287223 6119415 6266694 2080598
936 2080598 -4113803 -8241938 -7626678 -3133616 2163354 5775588 6631263 4423815 74550
927 74550 -3495891 -3292668 295626 3508320 3501137 1158739 -1347565 -3980235 -7723887
918 -7723887 -11161899 -10976302 -6272635 -372876 2486197 903549 -3597923 -8572082 -12016950
909 -12016950 -13301119 -13712343 -14866508 -15908858 -14015917 -8799790 -4327163 -4908372 -10271203
900 -10271203 -16771095 -21771205 -24248478 -22589834 -15770377 -6919626 -1873090 -2538618
892 -2538618 -4410084 -2462199 2803575 7241470 8769415 8278933 6255767 2205451 -2259624
883 -2259624 -3121986 1430055 7983688 11461892 10702276 8667114 7825323 7676366 7152916
874 7152916 7091677 8699985 10941299 11443322 9584623 7013499 5361780 5116374 6444340
865 6444340 8882747 10060100 7585754 3444462 3598018 10634835 18885422 20229725 13903878
856 13903878 7087674 5681626 7897085 8113708 4174209 -1310830 -5257341 -7346978
848 -7346978 -9238580 -12074589 -15152975 -16652120 -15504969 -12326878 -8243440 -3468556
840 -3468556 2010560 6942525 9574133 9907682 9736791 10168051 10297946 8496884 3944477
831 3944477 -2813441 -9362596 -12002898 -9158756 -4308721 -3047219 -6723303 -11379393
823 -11379393 -13289901 -12315178 -8942486 -2361864 5687187 9065968 3877949 -5066321
815 -5066321 -9162628 -6546672 -3276452 -4401076 -8674777 -12802597 -15995013 -18114736
807 -18114736 -17320018 -12717057 -6928347 -3318182 -2459811 -3288720 -5258966 -6811007 -4425029
798 -4425029 2998884 10617380 12823638 11080020 11911830 16914064 19725789 14846033 5403001
789 5403001 -763664 -142104 3979667 5970649 2335742 -6156539 -14005610 -14369349 -5959990
780 -5959990 4663534 10329297 10976275 10880068 10561839 6959346 967954 -1697621 1028341
771 1028341 3858272 1949176 -2348334 -4267168 -3803431 -3220873 -844651 6351907 15214512
762 15214512 17680259 10443657 -1146249 -9704809 -12346056 -9854700 -3805983 3306827
754 3306827 8379124 10673050 12524827 15455979 17661528 16900381 13778211 10494838 8217092
745 8217092 7247076 7874314 9448830 10514447 11386691 14244872 18650213 19720106 14095933
736 14095933 5802304 2166868 4822575 8962301 11276135 13568844 16842606 16811541 9669584
727 9669584 -365609 -4540066 -445476 5186095 5685277 2061443 -1096632 -3026049
719 -3026049 -5181460 -5009703 1575183 11016927 12636153 1919517 -12242315 -18430591
711 -18430591 -16219272 -12763112 -9906979 -3419371 5844080 9545133 3560134 -5377087
703 -5377087 -9131009 -8524254 -9144553 -11332651 -10523472 -5348574 351072 3209925 3758121
694 3758121 4069507 5178409 7059326 9011234 10162538 10928489 12987807 16572753 19486236
685 19486236 20332904 20607381 21780280 22869399 23142779 24223342 26438347 26208419 21202636
676 21202636 15431116 14244359 16125474 14931136 9380318 4565014 3732633 4031728 1907081
667 1907081 -1714631 -3616747 -2534837 361576 2889739 2940901 242717 -2843848 -4327841
658 -4327841 -5521479 -8179060 -10029266 -7052312 641379 9289790 16735634 22424807
650 22424807 23563433 17851838 10014137 8290993 12871216 14934416 9638793 2780236
642 2780236 903117 2063139 1679087 1096947 3684837 7330271 7880317 6427272 6268303
633 6268303 5726332 1378928 -3807228 -3559061 1125930 2268769 -3303502 -9384951 -9658515
624 -9658515 -5810058 -3653915 -5404917 -8477533 -9058417 -5033282 2233051 8021626 8590593
615 8590593 5734955 4205476 4770886 3858102 544868 -994715 1810748 5080256 3777442
606 3777442 -879830 -2921049 689574 6751383 9884612 8055617 4084110 2409527
598 2409527 4168755 5837169 3915560 140869 -527696 3038435 6398650 5771356 2764802
589 2764802 1209867 2197643 4476565 7214418 9669328 10118770 8007350 5648657 4876456
580 4876456 3352661 -2367413 -10798864 -16446858 -17302342 -17741276 -22092838 -28072266 -29386303
571 -29386303 -23593930 -14616631 -7558524 -3408203 398279 5976610 12858862 18741559
563 18741559 20970905 18041867 11234456 4462189 925331 68159 -548580 -848942 1602204
554 1602204 6718694 10464180 10012331 7460455 6023976 5262625 3358433 1784888 3323361
545 3323361 6569498 7086563 3988230 896743 -204831 -1469766 -4078667 -5099979 -2092571
536 -2092571 2641467 5390965 5901376 5913169 5258357 2855808 -65395 -1323889 -1595551
527 -1595551 -3639315 -7942290 -11908700 -13377013 -12423408 -9537579 -4620736 1299718 5315399
518 5315399 4928497 376445 -5759888 -10457648 -11674153 -9157072 -4593380 -354467 2423878
509 2423878 4255264 5892309 7377217 8884167 11541013 16087415 20652952 21346934 16450348
500 16450348 9465229 6072770 7664799 9959894 9284752 8059509 11489162 20047236
492 20047236 28260834 30639658 26056287 16595786 5532414 -2947058 -5510629 -2919655
484 -2919655 741692 3123855 5482869 8836032 11689196 13213153 15158536 18190856
476 18190856 19662647 18102312 16750436 18670714 20889993 18160020 11188978 6258639
468 6258639 6880789 10246486 12307224 12193389 10507978 6966112 1721369 -3254064 -5745536
459 -5745536 -4965670 -1269283 3993587 8158656 9050319 7707851 7342972 9170472 11343092
450 11343092 12291094 12548592 12510307 11068391 7946071 5197320 4678545 5697503 6749114
441 6749114 7978606 10032762 11651571 10580998 6631640 2148542 -742126 -2122759
433 -2122759 -3021139 -3010265 -272626 5494549 11205480 13021066 10865916 8381865 7779740
424 7779740 7236636 5034456 3425944 5129455 8115579 8290463 6430542 7446005 12283781
415 12283781 15576655 13191806 7765394 4069626 2578763 1017710 -533450 -74493
407 -74493 2104703 3108595 1028136 -3316074 -7538078 -8881699 -5607408 565650 4524086
398 4524086 2658589 -3069739 -7940528 -9960347 -9860223 -7159144 -525598 7636323 11260265
389 11260265 7508894 918842 -1817176 559671 4139764 6477015 9380197 14300945
381 14300945 18068360 16010268 8241521 -91506 -5002534 -7219549 -8551408 -8088273
373 -8088273 -5012050 -2628442 -4905213 -9588585 -9801917 -3641740 2496545 2590954 -1112456
364 -1112456 -2338916 495498 4337211 7905256 12426928 16371620 15270618 8801483
356 8801483 3602864 5607461 12127357 15280195 12164812 7708398 6872088 7854549 5839370
347 5839370 1182342 -609693 2571910 5426908 2678411 -2722635 -3328934 2281089 7786713
338 7786713 8230526 5916482 5584954 8145943 11865682 16037366 20039885 21434845 18536417
$$ [...]
##END NTUPLES=NMR SPECTRUM
##END=
