##TITLE=31Pdec_DE-78H4
 D2O, 64 sc
 14.2.2025
##JCAMPDX= 6.0         $$ Bruker NMR JCAMP-DX V2.0
##DATA TYPE= NMR SPECTRUM
##DATA CLASS= NTUPLES
##ORIGIN= UXNMR, Bruker Analytische Messtechnik GmbH
##OWNER= root
$$ XWIN-NMR		Version 3.5
$$ Fri Feb 14 14:24:54 2025 Russian Standard Time (UT+4h)  she@DPX200
##.OBSERVE FREQUENCY= 81.013821
##.OBSERVE NUCLEUS= ^31P
##.ACQUISITION MODE= SIMULTANEOUS
##.ACQUISITION SCHEME= undefined
##.AVERAGES= 64
##.DIGITISER RES= 17
##SPECTROMETER/DATA SYSTEM= spect
##.PULSE SEQUENCE= zgpg30
##.SOLVENT NAME= D2O
##.SHIFT REFERENCE= (INTERNAL, D2O, 0, 198.062)
##AUDIT TRAIL= $$ (NUMBER, WHEN, WHO, WHERE, WHAT)
$$ ##TITLE= Audit trail, XWIN-NMR		Version 3.5
$$ ##JCAMPDX= 5.01
$$ ##ORIGIN= Bruker BioSpin GmbH
$$ ##OWNER= she
$$ F:/spectra/data/she/nmr/P31/2/pdata/1/auditp.txt
$$ ##AUDIT TRAIL=  $$ (NUMBER, WHEN, WHO, WHERE, WHAT)
(   1,<2025-02-14 14:22:56.34 +0400>,<she>,<DPX200>,
      <created by zg, POWCHK disabled, PULCHK disabled
       configuration hash MD5:
       00 E9 B6 7A A2 85 ED C7 34 08 36 98 17 FE 4E 26
       data hash MD5: 32K
       61 BC DB EA 1C 13 E5 0D 12 1A 41 FF 68 70 70 DE>)
(   2,<2025-02-14 14:23:41.32 +0400>,<she>,<DPX200>,
      <Start of raw data processing
       efp BC_mod = 2 LB = 1.5 FT_mod = 6 PKNL = 1 PHC0 = 1550.195 PHC1 = 150.6954 SI = 64K 
       data hash MD5: 64K
       AC 76 AD 55 E9 1F 10 13 D8 E6 01 82 CC E9 F0 51>)
(   3,<2025-02-14 14:23:58.75 +0400>,<she>,<DPX200>,
      <pk PHC0 = 152.8989 PHC1 = 0 
       data hash MD5: 64K
       B5 A3 C9 EB 06 94 D9 B4 8F FF CD E3 FA 63 C4 FE>)
$$ ##END=
$$ 
$$ hash MD5
$$ 8A BE 78 E3 DD 34 42 EF 76 19 BF 1A 95 15 82 D1
##$RELAX= 
##$RELAX= 
##$RELAX= 
##$RELAX= 
##$RELAX= 
##$RELAX= 
##$RELAX= 
##$RELAX= 
$$ Bruker specific parameters
$$ --------------------------
##$DU= <F:/spectra>
##$EXPNO= 2
##$NAME= <P31>
##$PROCNO= 1
##$TYPE= <nmr>
##$USER= <she>
##$AMP= (0..31)
100 100 100 100 100 100 100 100 100 100 100 100 100 100 100 100 100 100 
100 100 100 100 100 100 100 100 100 100 100 100 100 100 
##$AQSEQ= 0
##$AQ_mod= 1
##$AUNM= <au_zg>
##$AUTOPOS= <>
##$BF1= 81.014009
##$BF2= 200.13
##$BF3= 200.13
##$BF4= 200.13
##$BF5= 200.13
##$BF6= 200.13
##$BF7= 200.13
##$BF8= 200.13
##$BYTORDA= 1
##$CFDGTYP= 0
##$CFRGTYP= 5
##$CHEMSTR= <none>
##$CNST= (0..31)
1 1 145 1 1 1 1 1 1 1 1 1 1 1 1 1 1 1 1 1 1 1 1 1 1 1 1 1 1 1 1 1 
##$CPDPRG= <waltz16>
##$CPDPRG1= <>
##$CPDPRG2= <waltz16>
##$CPDPRG3= <>
##$CPDPRG4= <mlev>
##$CPDPRG5= <mlev>
##$CPDPRG6= <mlev>
##$CPDPRG7= <mlev>
##$CPDPRG8= <mlev>
##$CPDPRGB= <>
##$CPDPRGT= <>
##$D= (0..31)
0 1 0 0 0 0 0 0 0 0.06 0 0.03 2e-05 3e-06 0 0 0.0002 0 0 0 0 0 0 0 0 0 
0 0 0 0 0 0 
##$DATE= 1739528575
##$DBL= (0..7)
120 120 120 11 120 120 24 19 
##$DBP= (0..7)
150 150 150 150 150 150 150 150 
##$DBP07= 0
##$DBPNAM0= <>
##$DBPNAM1= <>
##$DBPNAM2= <>
##$DBPNAM3= <>
##$DBPNAM4= <>
##$DBPNAM5= <>
##$DBPNAM6= <>
##$DBPNAM7= <>
##$DBPOAL= (0..7)
0.5 0.5 0.5 0.5 0.5 0.5 0.5 0.5 
##$DBPOFFS= (0..7)
0 0 0 0 0 0 0 0 
$$ [...]
##$SUBNAM2= <"">
##$SUBNAM3= <"">
##$SUBNAM4= <"">
##$SUBNAM5= <"">
##$SUBNAM6= <"">
##$SUBNAM7= <"">
##$SUBNAM8= <"">
##$SUBNAM9= <"">
##$SW= 400.765351723535
##$SWIBOX= (0..15)
0 1 3 0 0 0 0 0 0 0 0 0 0 0 0 0 
##$SW_h= 32467.5324675325
##$TD= 32768
##$TD0= 1
##$TE= 0
##$TE2= 300
##$TE3= 300
##$TEG= 300
##$TL= (0..7)
0 120 53 12 22 120 120 120 
##$TP= (0..7)
150 150 150 150 150 150 150 150 
##$TP07= 0
##$TPNAME0= <>
##$TPNAME1= <>
##$TPNAME2= <>
##$TPNAME3= <>
##$TPNAME4= <>
##$TPNAME5= <>
##$TPNAME6= <>
##$TPNAME7= <>
##$TPOAL= (0..7)
0.5 0.5 0.5 0.5 0.5 0.5 0.5 0.5 
##$TPOFFS= (0..7)
0 0 0 0 0 0 0 0 
##$TUNHIN= 0
##$TUNHOUT= 0
##$TUNXOUT= 0
##$USERA1= <user>
##$USERA2= <user>
##$USERA3= <user>
##$USERA4= <user>
##$USERA5= <user>
##$V9= 5
##$VALIST= <valist>
##$VCLIST= <CCCCCCCCCCCCCCC>
##$VD= 0
##$VDLIST= <DDDDDDDDDDDDDDD>
##$VPLIST= <PPPPPPPPPPPPPPP>
##$VTLIST= <TTTTTTTTTTTTTTT>
##$WBST= 1024
##$WBSW= 4
##$XGAIN= (0..3)
0 0 0 0 
##$XL= 0
##$YL= 0
##$YMAX_a= 5337
##$YMIN_a= -16424
##$ZGOPTNS= <>
##$ZL1= 120
##$ZL2= 120
##$ZL3= 120
##$ZL4= 120
##$ABSF1= 0
##$ABSF2= 0
##$ABSG= 0
##$ABSL= 0
##$ALPHA= 0
##$AQORDER= 0
##$ASSFAC= 0
##$ASSFACI= 0
##$ASSFACX= 0
##$ASSWID= 0
##$AUNMP= <proc_1d>
##$AZFE= 0.1
##$AZFW= 0.5
##$BCFW= 0
##$BC_mod= 2
##$BYTORDP= 0
##$COROFFS= 0
##$CY= -3
##$DATMOD= 1
##$DC= 0
##$DFILT= <>
##$DTYPP= 0
##$F1P= 0
##$F2P= 0
##$FCOR= 1
##$FTSIZE= 65536
##$FT_mod= 6
##$GAMMA= 0
##$GB= 0
##$INTBC= 1
##$INTSCL= 9.790993e-09
##$ISEN= 30
##$LB= 1.5
##$LEV0= 0
##$LPBIN= 0
##$MAXI= 10000
##$MC2= 0
##$MEAN= 0
##$ME_mod= 0
##$MI= 50
##$NCOEF= 0
##$NC_proc= -8
##$NLEV= 6
##$NOISF1= 182.463
##$NOISF2= 159.3651
##$NSP= 0
##$NTH_PI= 0
##$NZP= 0
##$OFFSET= 198.0616
##$PC= 4
##$PHC0= 1703.094
##$PHC1= 150.6954
##$PH_mod= 1
##$PKNL= yes
##$PPARMOD= 0
##$PSCAL= 0
##$PSIGN= 0
##$REVERSE= no
##$SF= 81.0140089999434
##$SI= 65536
##$SIGF1= 159.3651
##$SIGF2= -187.1042
##$SINO= 113.3802
##$SIOLD= 16384
##$SREGLST= <1H.CDCl3>
##$SSB= 0
##$STSI= 65536
##$STSR= 0
##$SW_p= 32467.5324675325
##$SYMM= 0
##$S_DEV= 0
##$TDeff= 32768
##$TDoff= 0
##$TI= <>
##$TILT= no
##$TM1= 0
##$TM2= 0
##$TOPLEV= 0
##$USERP1= <user>
##$USERP2= <user>
##$USERP3= <user>
##$USERP4= <user>
##$USERP5= <user>
##$WDW= 1
##$XDIM= 65536
##$YMAX_p= 254603071
##$YMIN_p= -89577242
$$ End of Bruker specific parameters
$$ ---------------------------------
##NTUPLES= NMR SPECTRUM
##VAR_NAME=  FREQUENCY,     SPECTRUM/REAL,   SPECTRUM/IMAG
##SYMBOL=    X,             R,               I
##VAR_TYPE=  INDEPENDENT,   DEPENDENT,       DEPENDENT
##VAR_FORM=  AFFN,          ASDF,            ASDF
##VAR_DIM=   65536,         65536,           65536
##UNITS=     HZ,            ARBITRARY UNITS, ARBITRARY UNITS
##FACTOR=    0.49542278885378, 1,            1
##FIRST=     16045.7642231865, 0,            0
##LAST=      -16421.768244346, 0,            0
##MIN=       -16421.768244346, -89577242,    0
##MAX=       16045.7642231865, 254603071,    0
$$ Real data points
##PAGE= N=1
##DATA TABLE= (X++(R..R)), XYDATA
$$ [...]
##PAGE= N=2
##DATA TABLE= (X++(I..I)), XYDATA
7479a157151m75732K922250L223447O15419j962973k738551j974254k47398J596928
7470a98015J597693j362726m889498n039019j215454L166211N021175M271202
7462A351569K166639l40693k086845k184080j641834k043762k326965K5405M007519
7453c073047N064022J543959k557115l489963k639556k525234j642068K287215
7445g031787O554523O248773J798276j344609o33747P36127q5214j182546K22410
7436E282206K870521L401000J208992j307440k220158j520724J07495J713616
7428I535508J546088j635962o130188p963268n227549o95989J319275J22027j120050
7419a0250108k24422J238415J194770Q11360K387853M810414M568272J393208
$$ plain form
7479 -1157151 -1632883 1289367 4512814 5128233 3165260 426709 -1547545 -1794943 -198015
7470 -198015 1399678 36952 -4852546 -9891565 -11107019 -7940808 -2919633 1351569
7462 1351569 3518208 3177515 1090670 -1093410 -2735244 -4779006 -7105971 -7080566 -3073047
7453 -3073047 1990975 3534934 977819 -2512144 -5151700 -7676934 -9319002 -7031787
7445 -7031787 -477264 5771509 7569785 6225176 5591429 6327556 6242342 5059796 5282206
7436 5282206 8152727 11553727 12762719 11455279 9235121 7714397 7821892 9535508
7428 9535508 11081596 9445634 3315446 -4647822 -9875371 -10571360 -9252085 -9130058 -10250108
7419 -10250108 -10474530 -9236115 -8041345 -7229985 -4842132 -31718 4536554 5929762
7411E929762o48229R54331L201974J805030k739947n915535m940271j445421J111200
7402b687106R22358r80526j788402L64745L932335N189448K738093p11541k154355
7393D825049j950804j921158j820855m18235J277584J009689r17652j690563k5531
7384a632476K209334K832799J905203Q98870O61581P00779q6576j828723k714484
7375B946307q88006K249086K794379l37072l388060l088191j224823r17859j154170
7366c008409P36798L315092K898158J41373o97540J040807J477958q11971k392389
7357B699877j208116k1754j110383k186313p32208J510683J753078N65452k95486
7348I74830j476329l809416n037884k695512J447214L546135L136043K982947
$$ plain form
7411 5929762 5281533 6235864 9437838 11242868 8502921 2587386 -2352885 -3798306 -2687106
7402 -2687106 -1764748 -2745274 -4533676 -4168931 -236596 4952852 7690945 6979404 4825049
7393 4825049 2874245 953087 -867768 -1286003 -8419 1001270 83618 -1606945 -1632476
7384 -1632476 576858 3409657 5314860 6213730 6875311 7576090 7489514 5660791 2946307
7375 2946307 2058301 4307387 7101766 6764694 3376634 288443 -936380 -1854239 -3008409
7366 -3008409 -2271611 1043481 3941639 4083012 3385472 4426279 5904237 5092266 2699877
7357 2699877 1491761 1470007 359624 -1826689 -2558897 -1048214 704864 1270316 974830
7348 974830 -501499 -4310915 -9348799 -12044311 -10597097 -7050962 -3914919 -931972
7340i31972M254200N056073L619576M65776k529042l584499k213985l91405j182621
7331B562101m512974o045273k579174L088937N467437L240266q0601j358483o07217
7322h24981Q38197J883506J562627k2472q81569L24955J526895j24111l366935
7313I16112l945723p29011K717009L348723K108989R97062r9924j730869k688104
7304H94264j909100p72969j061637j792487n03679K791179N166255M499008J883632
7295I194466k62606j168877j717137k204816j650260K16597J512964J45722l157365
7286I08688n282768m392285j714485O33894J889291K027199R05332o69015q90740
7277f584889L54349O11846j301541k606638n27311K864847L453703J535065J042598
$$ plain form
7340 -931972 3322228 8378301 11997877 12463653 9934611 6350112 4136127 3744722 2562101
7331 2562101 -1950873 -7996146 -10575320 -7486383 -2018946 1221320 1140719 -217764 -824981
7322 -824981 13216 1896722 3459349 3436877 2555308 2880263 4407158 4283047 916112
7313 916112 -3029611 -3758622 -1041613 2307110 4416099 5413161 5313237 3582368 894264
7304 894264 -1014836 -1787805 -2849442 -4641929 -5145608 -2354429 2811826 7310834 9194466
7295 9194466 8931860 7762983 6045846 3841030 2190770 2407367 3920331 4066053 908688
7286 908688 -4374080 -8766365 -10480850 -9846956 -7957665 -5930466 -5025134 -5694149 -6584889
7277 -6584889 -6230540 -5618694 -6920235 -9526873 -10054184 -7189337 -3735634 -2200569 -1157971
7268a157971K542573K034899j871017m388863j213029M717988O845208L371541
7260A0881329j506097l560090k372605K48976K412529K351357p04102m785977
7252B965320o229490l676047J33436J567025K17124j202237n11484J511509K473436
7243b751408J351401m58595r89867l6667Q37292M37247o22581r25773j53921O54324
7233b658548O14579J56637L92477J539094K313082J156513j836200m433449m152985
7224f908800q52774K817654L921151K175402P2662K092J717283L048179K654709
7215H647558J190848j57288j093071j716219j761335j200919o74563l71222M63807
7206C327596J730347J539681j018496l392194k477165O89829K180845Q92224m10456
$$ plain form
7268 -1157971 1384602 3419501 1548484 -2840379 -4053408 664580 7509788 10881329
7260 10881329 9375232 5815142 3442537 3691513 6104042 8455399 7751297 2965320
7252 2965320 -3264170 -6940217 -6806781 -5239756 -5022632 -6224869 -6736353 -5224844 -2751408
7243 -2751408 -1400007 -1858602 -2848469 -2885136 -2047844 -1610597 -2233178 -3158951 -3312872 -2658548
7233 -2658548 -2043969 -1887332 -1494855 44239 2357321 3513834 1677634 -2755815 -6908800
7224 -6908800 -7761574 -4943920 -1022769 1152633 1225295 1227387 2944670 5992849 8647558
7215 8647558 9838406 9681118 8588047 6871828 5110493 3909574 3235011 2863789 3327596
7206 3327596 5057943 6597624 5579128 2186934 -290231 399598 2580443 3472667 3062211
7197C062211j11569j0183j303638k025595o03770J210882J364040N99572J14845
7188B296795r48013k887980l310935r50499J153967P1023k021493j468549O92611
7179g373073J125404O61759K516407N116841L205597l326077p733120n353562
7171a1159824N94670M148239L439968N06782k040911k215810L47179L020612K641920
7162g17175J70268m45646J392603J953864l30458k068138o71345J486276J370878
7153B141127j00377o14220k43448J05129Q97700K019886J665699m07175j645278
7144C819043q89162k36082n92818L08714K760882K854399q66832l468853j097337
7135B591954K270886J256381j855400j146663K882112M432568J761861j486917
$$ plain form
7197 3062211 2950642 2940459 1636821 -388774 -992544 218338 1582378 2181950 2296795
7188 2296795 1348782 -1539198 -4850133 -5800632 -4646665 -4575642 -6597135 -8065684 -7373073
7179 -7373073 -6247669 -5585910 -3069503 2047338 5252935 1926858 -5806262 -11159824
7171 -11159824 -10565154 -6416915 -2976947 -2470165 -4511076 -6726886 -6379707 -3359095 -717175
7162 -717175 -546907 -992553 400050 2353914 2023456 -44682 -716027 770249 2141127
7153 2141127 2040750 1426530 1183082 1288211 2185911 4205797 5871496 5464321 3819043
7144 3819043 2929881 2693799 2100981 2409695 5170577 8024976 7158144 3689291 2591954
7135 2591954 4862840 6119221 4263821 3117158 5999270 10431838 12193699 10706782
7127A0706782l156724m058443l353145O32875M977320M343673o53918l599962
7119E838458j793859O42117N35883Q3063J125606J104614j811166m467674l394163
7110b137121p9991J780839J353306J26015j011546j661424j259364m65149q10431
7101d164866j597184j54463L358464M868470K091079j994660l561519k655699
7093c810378j246018K41182J842293K402096J638372J272101J761879P77683k545108
7084B334102m883289l323311l330J072924m45363k071218k610981k282885p76411
7075a2989762J538196K353650O32825p55037J085896M370181N310976L795798
7067E342723K537616J939041M3838k928110m058840k054472J037395K753711K449672
$$ plain form
7127 10706782 7550058 3491615 138470 771345 5748665 10092338 9438420 5838458
7119 5838458 4044599 4686716 5222599 5305662 6431268 7535882 5724716 1257042 -2137121
7110 -2137121 -2217112 -436273 917033 1043048 31502 -1629922 -2889286 -3354435 -4164866
7101 -4164866 -5762050 -5916513 -2558049 2310421 4401500 2406840 -1154679 -3810378
7093 -3810378 -5056396 -4815214 -2972921 -570825 1067547 2339648 4101527 4879210 2334102
7084 2334102 -2549187 -5872498 -5875828 -4802904 -5248267 -7319485 -9930466 -12213351 -12989762
7075 -12989762 -11451566 -9097916 -8465091 -9220128 -8134232 -3764051 1546925 5342723
7067 5342723 7880339 9819380 9863218 6935108 2876268 821796 1859191 4612902 7062574
7058G062574O84906j481249k881588l588921m849298o160258m659624P6718L374089
7049a2422651J437717k359797j970944K228106M400646K603901J074544K434987
7041b573491L521717J149921k759485m520404l543731j462048N16684J286496
7033h384341j77708k481818k214328J373522M727350M776642K560925L37739j711594
7024a193611l560883l328605k70461K721389K779153J182879Q01695J454119J177736
7015A763411L39073O50238J229782k71409k894636k771496R56162M095179K858065
7006E954369j117527l099496j168406K031497K965065J151348j007561j609790
6998D099499j273377j247860q52018J168508L280890K213205j856120m359221
$$ plain form
7058 7062574 7747480 6266231 3384643 -204278 -5053576 -11213834 -15873458 -15796740 -12422651
7049 -12422651 -10984934 -13344731 -15315675 -13087569 -8686923 -6083022 -5008478 -2573491
7041 -2573491 948226 2098147 -661338 -5181742 -8725473 -10187521 -9670837 -8384341
7033 -8384341 -8562049 -11043867 -13258195 -11884673 -7157323 -2380681 180244 517983 -1193611
7024 -1193611 -4754494 -8083099 -8353560 -5632171 -2853018 -1670139 -868444 585675 1763411
7015 1763411 2102484 2752722 3982504 3711095 816459 -1955037 -998875 3096304 5954369
7006 5954369 4836842 1737346 568940 2600437 5565502 6716850 5709289 4099499
6998 4099499 2826122 1578262 726244 1894752 5175642 7388847 5532727 1173506
6990A173506k494326O49732Q76031r47827j241789p2974l75637j783739o42161
6981d859184L162989M598415Q93410l718226l750768K00135L310818L459286K603248
6972E900123K455322K437418J845189J070629K44160j066539k355984k344281
6964H186037j136341m26193r63351j549095j333584j337903k378942k977914j278803
6955e196089J634540K456730n2849l266820m050733k631188j728379k471968k912757
6946a8219513r89532K389573M320885L368077R20553q01317j019847l84677L57861
6937a0057937R15071J130301R47631O84425P70045J138431J312551J117517P77515
6928a264450J88301j146023k866257l146657n87353L266392M719711K112881j763219
$$ plain form
6990 1173506 -1320820 -671088 204943 -742884 -1984673 -2057647 -2433284 -4217023 -4859184
6981 -4859184 -1696195 2902220 3795630 77404 -3673364 -3473229 -162411 3296875 5900123
6972 5900123 8355445 10792863 12638052 13708681 13952841 12886302 10530318 8186037
6964 8186037 7049696 6623503 5660152 4111057 2777473 1439570 -939372 -3917286 -5196089
6955 -5196089 -3561549 -1104819 -1157668 -4424488 -8475221 -11106409 -12834788 -15306756 -18219513
6946 -18219513 -19209045 -16819472 -12498587 -9130510 -8209957 -9011274 -10031121 -10415798 -10057937
6937 -10057937 -9142866 -8012565 -7064934 -6380509 -5610464 -4472033 -3159482 -2041965 -1264450
6928 -1264450 -1076149 -2222172 -5088429 -8235086 -8822439 -5556047 -836336 1276545 -486674
6919d86674k692878O4809L342963M248338K903107O66166k162909n259729o457770
6910e834577l500949K451205O994944O744184K419523k423643m635208l409202
6902a193723m30232J395524M92147j575446j847296J50104J657281M95589j906238
6893b762290k555224p37915J726259L165400L243843K073303J29452r92310K72994
6884C563512K953991L728669N57183m723574q095437p052988k376871K827856
6876h617659N371605M142617Q27742j774450k365457j728545j006180m59938K711
6867e607554K94810M90810O10004r9623k178033l972223k718412J356793M186554
6858g636874K960325J76426N2428K286506K659958n13058l956123m172716j673437
$$ plain form
6919 -486674 -3179552 -3114743 228220 4476558 7379665 8045831 5882922 623193 -5834577
6910 -5834577 -9335526 -6884321 110623 6854807 9274330 6850687 2215479 -1193723
6902 -1193723 -1623955 -228431 263716 -1311730 -3159026 -3008922 -1351641 -856052 -2762290
6893 -2762290 -5317514 -6055429 -4329170 -1163770 2080073 4153376 4282828 3290518 3563512
6884 3563512 6517503 10246172 10803355 6079781 -2015656 -9068644 -11445515 -8617659
6876 -8617659 -3246054 896563 1724305 -50145 -2415602 -4144147 -5150327 -5610265 -5607554
6867 -5607554 -5312744 -4821934 -4211930 -4311553 -6489586 -10461809 -13180221 -11823428 -7636874
6858 -7636874 -4676549 -4500123 -4447695 -2161189 498769 -14289 -3970412 -8143128 -9816565
6849i816565R12061K525707L586908L896745K780740O36580j242084k028851j609988
6840c58747j90609J350004J549429K3743j611476j656907n06619L60639Q50657
6831a89886K011124L604251L807447J753601j081563k647757k406814j173066
6823C677337k1677m1266j961387m795652n700893k876347J527989L189973R20007
6814f081916j487679j37104L533602M537972J233508k413053k418764O5816J350604
6805a817014P95001O13074J201798M58691j944315l184292j543201Q34068J219361
6796c366829L2739o10885j18460P96527J794805K358399J260232j217966k211069
6787a282507N5025L000755K944011L79403j133320m38221L40028j2327l93976
$$ plain form
6849 -9816565 -8904504 -6378797 -2791889 1104856 3885596 4522176 3280092 1251241 -358747
6840 -358747 -549356 800648 2350077 2373820 762344 -894563 -1401182 -1040543 -189886
6831 -189886 1821238 5425489 9232936 10986537 9904974 7257217 4850403 3677337
6823 3677337 3655660 3614394 1653007 -3142645 -8843538 -11719885 -10191896 -7001923 -6081916
6814 -6081916 -7569595 -7706699 -4173097 364875 1598383 -814670 -3233434 -3167618 -1817014
6805 -1817014 -1022013 -408939 792859 1251550 -692765 -3877057 -5420258 -4586190 -3366829
6796 -3366829 -3334090 -3944975 -4063435 -3266908 -1472103 886296 2146528 928562 -1282507
6787 -1282507 -1227482 1773273 4717284 5096687 3963367 3525146 3865174 3852847 3458871
6778C458871m14018j245605k670888k584416n85135R66287P86291O41732J902701
6769B55820K891830J631256j067659l151479l838661k879048K30529M099929M962147
6760C134664J206378l397414l935532m34335L086513M213698L597536J951077
6752I422585o70113k799525k352903n401J234537M15829k95857K92540L36207
6743E577899j521657l289928k508475j37527P94984n71447k174242k083825n38618
6734f452836J045423J685638J181549j16683j315655j195397Q97222M000425N623953
6725E353639L769539o24643m084019m376356l081525k982672l704858k292099
6717a2022994J823103N148657M654992J718343l39900r17700j865888l504858
$$ plain form
6778 3458871 3044853 1799248 -871640 -3456056 -4041191 -3074904 -2288613 -1646881 255820
6769 255820 3147650 4778906 3711247 559768 -3278893 -6157941 -5927412 -1827483 3134664
6760 3134664 4341042 943628 -2991904 -3426239 -339726 3873972 7471508 9422585
6752 9422585 8752472 5952947 3600044 3594643 4829180 5245009 4949152 5241692 5577899
6743 5577899 4056242 766314 -1742161 -1879688 -1084704 -1656151 -3830393 -5914218 -6452836
6734 -6452836 -5407413 -3721775 -2540226 -2656909 -3972564 -5167961 -4270739 -270314 5353639
6725 5353639 9123178 8498535 4414516 38160 -3043365 -6026037 -9730895 -12022994
6717 -12022994 -10199891 -5051234 -396242 1322101 982201 64501 -1801387 -5306245
6709e306245l747127j463838J611192L259435L348842K901907K012338L10565
6701B927069j245854r65414R48968J931437J53212k838995l804562j791038Q34583
6692c850594J489852K83952q22902p36255R007O37351R62260Q21889j20281j539322
6682b865043k181484j042312J439856L641564M064633K468559Q1010j371621j259477
6673B975685n88398n64335j010172r93752o47568j052022k187772k453955r36089
6664g458378J032685J624370R86789P14048J304655J548177O07757m71350r0501
6655b01748J551247K304655N76118k433788l713040j847201J303199K983058K830073
6646C352573K491688K456567J327161j250948l042626k086940L80222J671216
$$ plain form
6709 -5306245 -9053372 -10517210 -8906018 -5646583 -2297741 604166 2616504 2927069
6701 2927069 1681215 715801 1664769 3596206 3749418 910423 -2894139 -4685177 -3850594
6692 -3850594 -2360742 -2076790 -2899692 -3635947 -3626940 -2989589 -2027329 -1205440 -1325721 -2865043
6682 -2865043 -5046527 -6088839 -4648983 -1007419 3057214 5525773 5606783 4235162 2975685
6673 2975685 2387287 1822952 812780 -180972 -828540 -1880562 -4068334 -6522289 -7458378
6664 -7458378 -6425693 -4801323 -3814534 -3100486 -1795831 -247654 360103 -111247 -201748
6655 -201748 1349499 3654154 4230272 1796484 -1916556 -3763757 -2460558 522500 3352573
6646 3352573 5844261 8300828 9627989 8377041 5334415 3247475 3627697 5298913
6638E298913J220831L50512o92443k772748m935280m345287l63181L573362L910034
6629A244713J326145o74169l62039J030938J975118K236781J879246P82601l86065
6620I053269m90595J65727r4883j550543k116553m91586J297498M56093k454482
6611C773945m234499l532793k155097j552478n88014J807452L850199L037866
6603D06581M4169j887516j252373J94760N44017K13103L10410L80349m62058j320904
6593b829462o13015R76125Q80394j529581l540439k646329J01640J860270J858769
6584e481628J478159J234606J78421j606604k418411j690209j065412j411075
6576a0782153r15408J873420M926014N228312L216740J827139J712536O08044
$$ plain form
6638 5298913 6519744 6870256 6177813 3405065 -1530215 -5875502 -6238683 -2665321 1244713
6629 1244713 2570858 1896689 1534650 2565588 4540706 6777487 8656733 9439334 9053269
6620 9053269 8562674 8728401 8633518 7082975 4966422 4474836 5772334 6228427 3773945
6611 3773945 -460554 -3993347 -6148444 -7700922 -8288936 -6481484 -2631285 406581
6603 406581 450750 -1436766 -2689139 -2494379 -1950362 -1737259 -1426849 -1046500 -1508558 -2829462
6593 -2829462 -3442477 -2466352 -1585958 -3115539 -6655978 -9302307 -9200667 -7340397 -5481628
6584 -5481628 -4003469 -2768863 -2590442 -4197046 -6615457 -8305666 -9371078 -10782153
6576 -10782153 -11697561 -9824141 -4898127 330185 3546925 5374064 7086600 7694644
6568G694644k301874m537228l916266j411953Q86316K367687K988366J998990
6560C768682m59772k217165j589785K24413J068859Q26772O24249M06024m85107
6551B167170j384375j251543p07073r13607j290723o86367Q5690m32606j270570
6542e684004l80600J376019J074505j292917k291103k77503K308999L084189K715774
6533F33359K150851L13979k984719m848788l048602K35228J483724Q34402Q25435
6524d405131J679360J429455j7213n60132L19287O87814m02233j360317p59753
6515c388863O68374J617392J894168J682796P31767q96421k489879l570993l955240
6506g706899k930451r1602K795028K822393l27221l391571l235805j60348L226868
$$ plain form
6568 7694644 5392770 855542 -3060724 -4472677 -3586361 -1218674 1769692 3768682
6560 3768682 3308910 1091745 -498040 -273627 795232 1622004 2246253 2652277 2167170
6551 2167170 782795 -468748 -1175821 -2089428 -3380151 -4066518 -3980828 -4413434 -5684004
6542 -5684004 -6064604 -4688585 -3614080 -4906997 -7198100 -7475603 -5166604 -2082415 633359
6533 633359 2784210 3098189 113470 -4735318 -7783920 -7548692 -6064968 -5230566 -4405131
6524 -4405131 -2725771 -1296316 -1313529 -1873661 -1554374 -866560 -1268793 -2629110 -3388863
6515 -3388863 -2720489 -1103097 791071 2473867 3205634 2309213 -180666 -3751659 -7706899
6506 -7706899 -10637350 -10728952 -7933924 -5111531 -5438752 -8830323 -12066128 -12226476 -8999608
6497h999608M849652M000016J107251j955543k749439r35882J014606J004722
6489b664225r1128l73390R3239K03086L58741J537586K606244J462977j209238
6480A923892k258269p19937O68420j35252j191835K28288L117030M028588J956541
6471G617466p03631j880878k087046k461886k631996j653433J66134J521906J543888
6462e69476K79668j548457k619910j693748P98669K426606J218825j709641l101406
6453f518870j259363K165135M373671M416573L311489K014843N47730r28736j486941
6444F635531o54087M74572M05357o68367j034874J14078J531842J720468Q29049
6435I353569j23467r03052j619843j497304L3123J369950J52081k975563m294087
$$ plain form
6497 -8999608 -4149956 -149940 957311 -998232 -3747671 -4683553 -3668947 -2664225
6489 -2664225 -2755353 -3128743 -3035504 -2832418 -2473677 -936091 1670153 3133130 1923892
6480 1923892 -334377 -1054314 -385894 -521146 -1712981 -1484693 1632337 5660925 7617466
6471 7617466 6913835 5032957 2945911 484025 -2147971 -3801404 -3635270 -2113364 -569476
6462 -569476 -289808 -1838265 -4458175 -6151923 -5353254 -2926648 -1707823 -3417464 -6518870
6453 -6518870 -7778233 -5613098 -1239427 3177146 6488635 8503478 9051208 8122472 6635531
6444 6635531 5981444 6456016 6861373 6193006 5158132 5272210 6804052 8524520 9353569
6435 9353569 9230102 8327050 6707207 5209903 5243026 6612976 6765057 3789494 -504593
6426e04593j827555J743598K595427O20517j166124r70109J91651P08575J07517
6417A498904j366041l119976m015811l224155j391926K04554J432992K846947
6409g134512L797451K854890K66404j786668j872727p94452M7738L64098N04106
6400c753672N27740L72710R9900k69842m13054M39099K075201K383807j54308
6391A307581l450306l852951j339658K54913j028713k443978j132919J319596
6383a0366435J561865k53010q99754J012768L258130L205098R54595j155088j220521
6374c902352L54221J487794J011306M4984j03663k86583j558505j912715J321537
6365c543976N842737N829121N06776l643274k104866J057664Q1807l332129l539762
$$ plain form
6426 -504593 -2332148 -588550 2006877 2627394 1461270 491161 682812 1391387 1498904
6417 1498904 132863 -2987113 -7002924 -10227079 -11619005 -11414451 -9981459 -7134512
6409 -7134512 -3337061 -482171 -215767 -2002435 -3875162 -4669614 -4621876 -4257778 -3753672
6400 -3753672 -3225932 -2853222 -2753322 -3023164 -3436218 -2997119 -921918 1461889 1307581
6391 1307581 -2142725 -5995676 -7335334 -7080421 -8109134 -10553112 -11686031 -10366435
6383 -10366435 -8804570 -9057580 -9957334 -8944566 -5686436 -2481338 -1526743 -2681831 -3902352
6374 -3902352 -3548131 -2060337 -1049031 -1004047 -1107710 -1394293 -2952798 -4865513 -3543976
6365 -3543976 2298761 8127882 8634658 4991384 2886518 3944182 4025989 693860 -2845902
6356b845902n33757P83574n68159o16090J706523K557306M43030r03215N98037
6347F21347J359606j486332m526075l296174M11633J240849j746128m259247l154505
6338a4835026K02308K969707M184018M429826M196065L474912K165888M24289
6330G211987j260228k480380l251270l400934k158246N15465K873152L395198
6322A444744L135629L739258L942089J414668k223254k577078N04299J788793
6314A1169148j408318m807686l968565j304751j770909m643819m905909j256165
6306a2896974K403260L061775J685394J47548q83981o58844J290688K910568J311625
6297a628941k479291l903330j175491K114569K350213P50992O11474K167208L039407
$$ plain form
6356 -2845902 -3379659 -2596085 -3164244 -3780334 -2073811 483495 926525 23310 621347
6347 621347 1980953 494621 -4031454 -7327628 -6915995 -5675146 -7421274 -11680521 -14835026
6338 -14835026 -14632718 -11663011 -7478993 -3049167 1146898 4621810 6787698 7211987
6330 7211987 5951759 3471379 220109 -3180825 -5339071 -4823606 -1950454 1444744
6322 1444744 4580373 8319631 12261720 13676388 11453134 8876056 9380355 11169148
6314 11169148 9760830 4953144 984579 -320172 -2091081 -6734900 -11640809 -12896974
6306 -12896974 -10493714 -7431939 -5746545 -5598997 -6482978 -7141822 -5851134 -2940566 -1628941
6297 -1628941 -4108232 -8011562 -9187053 -7072484 -4722271 -3971279 -3359805 -1192597 1846810
6288A846810K341523J503238J454854J387832N53165n19377j242905k133802l703589
6279A487749m759205l164431J138263M786606M078516n60350m591674m452178
6271f036704j329700J097957J348475R06489J119789J364746N15621j192463k357820
6262d563610j903242j64142J364619J627090J248726J337140J289148m14124k986333
6253c164728l427338r62305J350371J342380J118171K827630M014733J474182
6245D573096k393384k417842R95210K135801q96673l203180j144790K003080J715356
6236A366674p94406j277150Q73139K726378K658203J375741n70256k967558m513958
6227a123193m013993k284971p37132O64453J927922J529642p71281j735626J013440
$$ plain form
6288 1846810 4188333 5691571 7146425 8534257 9087422 8568045 7325140 5191338 1487749
6279 1487749 -3271456 -6435887 -5297624 -511018 3567498 3007148 -1584526 -6036704
6271 -6036704 -7366404 -6268447 -4919972 -4013483 -2893694 -1528948 -1013327 -2205790 -4563610
6262 -4563610 -6466852 -6630994 -5266375 -3639285 -2390559 -1053419 235729 -178395 -3164728
6253 -3164728 -6592066 -7554371 -6204000 -4861620 -3743449 -915819 3098914 4573096
6245 4573096 2179712 -238130 757080 2892881 1996208 -1206972 -2351762 -348682 1366674
6236 1366674 572268 -704882 168257 2894635 5552838 6928579 6358323 3390765 -1123193
6227 -1123193 -5137186 -7422157 -8159289 -7494836 -5566914 -4037272 -4808553 -6544179 -5530739
6218e530739M236502L152940r66055k530527n79155L2459k516015l303741J089498
6209f914833O131290N715338R63769k463739k860688k644617k059590R32986M827881
6200A627797M983462J087363j477480P4235J561464r49336m318876l376290O97762
6191h9899K534541J178704P01042K594921L292418N51102k544524k357859J25853
6182E986299J575863J084662l4699j162154k331837k673637j480334J6244J23119
6173A103526p64434j051299o47514p19595j235001q74364O53677K025308K190294
6164F80598J420651L84903n48467r80427n62066M34344J363148J927951K108016
6155F228651J832616J356756J277646J471345Q96304p33452k164846k457597k359901
$$ plain form
6218 -5530739 -1294237 1858703 892648 -1637879 -2217034 -2184575 -4700590 -8004331 -6914833
6209 -6914833 -783543 4931795 5895564 3431825 571137 -2073480 -4133070 -3200084 1627797
6200 1627797 6611259 7698622 6221142 6295377 7856841 6907505 2588629 -787661 -89899
6191 -89899 2444642 3623346 4324388 6919309 10211727 10762829 8218305 5860446 5986299
6182 5986299 7562162 8646824 8612125 7449971 5118134 2444497 964163 980407 1103526
6173 1103526 339092 -712207 -1359721 -2079316 -3314317 -4188681 -3535004 -1509696 680598
6164 680598 2101249 2486152 1937685 957258 395192 829536 2192684 4120635 6228651
6155 6228651 8061267 9418023 10695669 12167014 13063318 12329866 10165020 7707423 5347522
6146E347522k716623k995481k762807k863613l358566k296993J015018L511760
6138g119783K292422o01455j020191R63823J766473N15379k08714K26288m46501
6129c632259k039651r34668L469473O235976L774942r33639l285556l368132l558067
6120d271581l371049j326890P24184J86933j103442N42762L882129L935074R0424
6111g11456k359187j95252L006580K652129k05616j332258N4400Q11894r33611
6102G87623l380977l988747k399695J36817K370043L147995J441197k202116m935033
6093i022893m067889l74753K502082K389013Q25560J63304K23415l63226j002717
6084h728104q1951J561798J265680j037289k090960l9261K936665M176298M085011
$$ plain form
6146 5347522 2630899 -364582 -3127389 -5991002 -9349568 -11646561 -10631543 -7119783
6138 -7119783 -4827361 -5428816 -6449007 -5485184 -3718711 -3203332 -3412046 -3185758 -3632259
6129 -3632259 -5671910 -6606578 -3137105 3098871 6873813 5940174 2654618 -713514 -4271581
6120 -4271581 -7642630 -8969520 -8245336 -8058403 -9161845 -8619083 -4736954 -801880 -711456
6111 -711456 -3070643 -3265895 -259315 2392814 2187198 854940 909340 1721234 787623
6102 787623 -2593354 -6582101 -8981796 -8844979 -6474936 -3326941 -1885744 -4087860 -9022893
6093 -9022893 -13090782 -13465535 -10963453 -8574440 -7748880 -7585576 -7362161 -7725387 -8728104
6084 -8728104 -8810055 -7248257 -5982577 -7019866 -9110826 -9150087 -6213422 -2037124 2047887
6075B047887M145834L746329J529275j703376l947064m759590m889998m218210
6067h048913k265064J30359J737169K708531L478584K952982J28779l284093m301221
6058f762887k290795R12706L759733N490429M750171P67391m140720o157343m487060
6049h158375j813922j464J836251M218158N198583L179048j49995j660937o22419
6040B024928P92909L17016k055080m179458l768330o61315K779092L997558K781330
6031B028650Q76515l43876p40493n10307O4832K18127m51283r03439N858J291149
6021A535733P74320j575007l059893j578067J885309M564396M512008J662570
6013H721369k313125m780690m001093q02890K274678L502968K896678J205454
$$ plain form
6075 2047887 6193721 9940050 11469325 9765949 5818885 1059295 -3830703 -8048913
6067 -8048913 -10313977 -10183618 -8446449 -5737918 -2259334 693648 822427 -2461666 -6762887
6058 -6762887 -9053682 -8140976 -4381243 1109186 5859357 6626748 2486028 -3671315 -8158375
6049 -8158375 -9972297 -9973761 -8137510 -3919352 1279231 4458279 4308284 2647347 2024928
6040 2024928 2817837 3134853 1079773 -3099685 -6868015 -7529330 -4750238 -752680 2028650
6031 2028650 2905165 2561289 1820796 1310489 1375321 1593448 1142165 238726 244584 1535733
6021 1535733 2310053 735046 -2324847 -3902914 -2017605 2546791 7058799 8721369
6013 8721369 6408244 1627554 -2373539 -3176429 -901751 2601217 5497895 6703349
6005F703349o17062j297217k63818J205921J279598j16067j627593k646877l410694
5996g90460l423215j958716Q180O22244n2068k80152K54093Q7146j033794j441355
5986h008097m24920P98287J743936L488214N630592N300366J222002l421314m519906
5977A809160k083816L07437K40069j136963j122417J302489M237996M689362K051544
5968A0294861p39345p53857R36013Q39164j864026m460668m902557l898242k410312
5959f958969k33799K019543K596438J419762L23535m39669k460441m803298l652843
5950a2189741J398548M967042L090043r14181j702256K95428R12211n24462j110291
5941e777659L995Q83829R98051J549265J968871M67047j888330j798914J167059
$$ plain form
6005 6703349 6086287 4789070 4525252 5731173 7010771 6894704 5267111 2620234 -790460
5996 -790460 -4213675 -6172391 -6164211 -5541967 -5594035 -5874187 -5620094 -5532948 -6566742 -8008097
5986 -8008097 -8433017 -7634730 -5890794 -2402580 3228012 8528378 9750380 6329066 1809160
5977 1809160 -274656 32781 272850 -864113 -1986530 -684041 3553955 8243317 10294861
5968 10294861 9555516 8801659 9737672 10576836 8712810 4252142 -650415 -4548657 -6958969
5959 -6958969 -7192768 -5173225 -2576787 -1157025 -833490 -1273159 -3733600 -8536898 -12189741
5950 -12189741 -10791193 -5824151 -2734108 -3648289 -5350545 -5055117 -4142906 -4667368 -5777659
5941 -5777659 -5773664 -4889835 -3891784 -2342519 -373648 93399 -1794931 -3593845 -2426786
5932b426786L837601M177522L162574J590542j076548l814352l800282o45991
5924A004280K203756J883855o02938k723303l474667k884183j027530R70980J194664
5915c455086l87853j478288q04445K10033K16894L86L79753M59817k83123l94990
5905e536902J060207K355377J647787r08m66194K1743j62912p52389o2189J649588
5895b46792K070227M29733j152652q33124K42801k52400k296919l305781j472210
5886f817117J717109K996185J097205j768926k553193q23289J216897J744003
5878c191126J188466R89113J596689K289303K311977J626706Q13273N14760Q13319
5869H952480J131430Q98523R0018j021954k054158k201051q11280J049384J033048
$$ plain form
5932 -2426786 1410815 5588337 8750911 10341453 9264905 5450553 1650271 1004280
5924 1004280 3208036 5091891 4488953 1765650 -1709017 -4593200 -5620730 -4649750 -3455086
5915 -3455086 -3842939 -5321227 -6125672 -5915639 -5698745 -5698359 -5318606 -4858789 -5141912 -5536902
5905 -5536902 -4476695 -2121318 -473531 -474439 -940633 -918890 -1081802 -1834191 -1896380 -246792
5895 -246792 1823435 2253168 1100516 267392 510193 257793 -2039126 -5344907 -6817117
5886 -6817117 -5100008 -2103823 -1006618 -2775544 -5328737 -6152026 -4935129 -3191126
5878 -3191126 -2002660 -1013547 583142 2872445 5184422 6811128 7624401 8139161 8952480
5869 8952480 10083910 10982433 11072451 10050497 7996339 5795288 4984008 6033392 7066440
5860G066440j135382k235418L23310M091610M202975J0459m083368m735195l292639
5851B12792k292451j660812m43413L91692m39421j864060j927301o97892N80209
5842h140657J976945L958728N009210L185460k03070j479272L61872K208894J426780
5833H304890n61494r61280M689l00815k709597m903603m557078k176413p0045
5824g930746M54163o0427n67792o53969l55026K66712R90929J386254J293168
5815e176734J105230J282499J762019K019247J561250M08908n77907r7331K069790
5806D356971L990527L213767j40841l136303l497659k027145o27743M94648J934574
5797D560796K692855J184186j667365k830864j189408Q49535O67169j204471k221575
$$ plain form
5860 7066440 5931058 3695640 4018950 8110560 12313535 12323994 8240626 3505431 212792
5851 212792 -2079659 -3740471 -4183884 -3792192 -4231613 -6095673 -8022974 -8720866 -8140657
5842 -8140657 -6163712 -2204984 2804226 5989686 5786616 4307344 4669216 6878110 8304890
5833 8304890 7743396 6782116 6786805 6485990 3776393 -1127210 -5684288 -7860701 -7930746
5824 -7930746 -7476583 -7537010 -8104802 -8758771 -9113797 -8847085 -7856156 -6469902 -5176734
5815 -5176734 -4071504 -2789005 -1026986 992261 2553511 2962419 2384512 2287181 4356971
5806 4356971 8347498 11561265 11420424 8284121 4786462 2759317 2131574 2626222 4560796
5797 4560796 7253651 8437837 6770472 3939608 2750200 3599735 4266904 3062433 840858
5788H40858j356326j78305n33028j998109k204279J70685L251750L858673J566648
5779C418567p04031q31882k96662j265070k746765k209587J57666J806571K009407
5770f61786K551432L994446M302667K216134n17436j690747j582434j926633l175667
5761C509976m072123l391233j418928J57499M4893p54008L7160K359976L210607
5752c16181J261855l82302J074025L111434J809743j259506j483971N48191k65019
5743D098269m260784n404545j067414L249396K511211l97038l43705J862129K209548
5734B457067O73951K34054J230552J598586Q04059n40730k744214m840794l254000
5725d381469K720729P053684M179232k257634m008587m7846K799925N96810l031623
$$ plain form
5788 840858 -515468 -693773 -1226801 -3224910 -5429189 -5258504 -2006754 1851919 3418567
5779 3418567 2714536 1882654 1585992 320922 -2425843 -4635430 -4477764 -2671193 -661786
5770 -661786 1889646 5884092 10186759 12402893 11885457 10194710 8612276 6685643 3509976
5761 3509976 -562147 -3953380 -5372308 -5214809 -5169916 -5923924 -5886764 -3526788 -316181
5752 -316181 945674 563372 1637397 4748831 6558574 5299068 3815097 4363288 4098269
5743 4098269 -162515 -5567060 -6634474 -3385078 -873867 -1270905 -1614610 247519 2457067
5734 2457067 3131018 3365072 4595624 6194210 6998269 6457539 3713325 -1127469 -4381469
5725 -4381469 -1660740 5392944 9572176 7314542 3305955 3258109 6058034 6654844 3623221
5716C623221l829852k514930j637163j626669j824074j698942N7116L945419O629900
5707A124026L851976k727534o193566l307536J691521L887003L608103L091510
5699E025503J744523j553868m554308l974627k22106L106534L465059J234599
5691D271309j489462k568571j410929K39656L31243n68006k96962J106788J417240
5682A032306J64181o39017j61801L10363P25878K649630N242213N056922J517165
5673A5897840j564039j933050k052271l822587m627962k037848J528102K646098
5665D034283J897275J194870l16335l280223m443945j165971K993498K723727
5657C637179q54642k115159K05105J936905R34388k23929L08665P13246n56322
$$ plain form
5716 3623221 -206631 -2721561 -4358724 -5985393 -7809467 -9508409 -9451293 -5505874 1124026
5707 1124026 4976002 2248468 -3945098 -7252634 -5561113 -1674110 1933993 5025503
5699 5025503 6770026 5216158 661850 -3312777 -3534883 -428349 3036710 4271309
5691 4271309 2781847 213276 -1197653 -957997 -626754 -1194760 -1491722 -384934 1032306
5682 1032306 1196487 557470 395669 706032 1431910 4081540 9323753 14380675 15897840
5673 15897840 14333801 12400751 10348480 6525893 1897931 -139917 1388185 4034283
5665 4034283 5931558 7126428 6810093 3529870 -914075 -2080046 913452 3637179
5657 3637179 2782537 667378 872483 2809388 3743776 3519847 3828512 4541758 3985436
5648C985436k213003l020472l551578l704554j930865J564875L934716L470702
5640a464743J603517N594j469751k764103k499136n31824R50660N98822j49629
5631e720593M9252k8773j700677l424436k762035p1936K046040K351778J999563
5622g261817K125314K097375P07280j699673l019962j622678J388387L022047
5614d263727J995700L68718M99158J625465J351818l99772j357159m95256Q16906
5605A41851J321369J106988J58397j756538l269970k165198J130513L317503K666753
5596B651668J305107J634849K745464K228301k26210k894192m260565l609662
5588d25240q92560K246976K741911n54144m704846n714787l015528O50239K975738
$$ plain form
5648 3985436 1772433 -1248039 -4799617 -8504171 -10435036 -8870161 -4935445 -1464743
5640 -1464743 138774 144368 -1325383 -4089486 -6588622 -7120446 -6169786 -5570964 -5720593
5631 -5720593 -5671341 -5700114 -7400791 -10825227 -13587262 -13659198 -11613158 -9261380 -7261817
5622 -7261817 -5136503 -3039128 -2331848 -4031521 -7051483 -8674161 -7285774 -4263727
5614 -4263727 -2268027 -1899309 -1400151 225314 1577132 1177360 -179799 -675055 141851
5605 141851 1463220 2570208 2728605 972067 -2297903 -4463101 -3332588 -15085 2651668
5596 2651668 3956775 5591624 8337088 10565389 10339179 7444987 3184422 -425240
5588 -425240 -1317800 929176 3671087 3116943 -1587903 -7302690 -10318218 -9667979 -6692241
5579f692241L889648M149455M033061L490216K312511J93395k414063l867084
5571E094898k927175n72900Q94194M86792o60780j020306k34531J149621K621789
5562D831602L846784M172870K675170o82307l947359m332985j398971J777726
5554F942530K049122J51496o84877L72784Q32059q67766k966613l385253k598265
5545a54783j881822q89859J022352K791872L029950K049692P08887j228822l583531
5536A863936m280646j936464J298191K173317P79897q4476P25179J794083K196748
5527D529765K502639K621781J404451j087257l170173l825131l395030j971198
5519b390153N55812K718477K463302M74102k17386J195798J876704k10953l102477
$$ plain form
5579 -6692241 -2802593 1346862 5379923 8870139 11182650 11376045 8961982 5094898
5571 5094898 2167723 1594823 2489017 2975809 2315029 1294723 1060192 2209813 4831602
5562 4831602 8678386 12851256 15526426 14844119 10896760 6563775 5164804 6942530
5554 6942530 8991652 9143148 8458271 8831055 9663114 8795348 5828735 2443482 -154783
5545 -154783 -2036605 -2926464 -1904112 887760 3917710 5967402 6676289 5447467 1863936
5536 1863936 -2416710 -4353174 -3054983 -881666 -101769 -186245 538934 2333017 4529765
5527 4529765 7032404 9654185 11058636 9971379 6801206 2976075 -418955 -2390153
5519 -2390153 -1834341 884136 3347438 3821540 3604154 4799952 6676656 6465703 3363226
5510C363226l854933k473352p83238O26577K013059K589207J551851P3087q1434
5501C024050O36768L11939j162697j699036j31245J994660K315954L14593k320567
5492C284419l411350k270982l02766O00000L67017O65138K194120L356096K525469
5483G007161L89579j271313k032467k491346k457488j386761p2245O6605p75255
5474c023530j007836n801J408522K643863L628020L508640J258771k038681l681229
5465B690739k886381j814886k048708k108262j00203K802911L620073J500059
5457A655342j482387l130215l082341k024685m95368R84281J526686M67321j597121
5448g178487k681630r79760K838341N415799M048730J23434k350270j810301p12640
$$ plain form
5510 3363226 -491707 -2965059 -3748297 -3121720 -1108661 1480546 3032397 3105484 3024050
5501 3024050 3660818 3972757 2810060 1111024 979779 2974439 5290393 5604986 3284419
5492 3284419 -126931 -2397913 -2700679 -2100679 -1733662 -1068524 1125596 4481692 7007161
5483 7007161 7396740 6125427 4092960 1601614 -855874 -2242635 -2314880 -2248275 -3023530
5474 -3023530 -4031366 -4037167 -2628645 15218 3643238 7151878 8410649 6371968 2690739
5465 2690739 -195642 -2010528 -4059236 -6167498 -6267701 -3464790 155283 1655342
5457 1655342 172955 -2957260 -6039601 -8064286 -8559654 -7575373 -6048687 -5581366 -7178487
5448 -7178487 -9860117 -10839877 -8001536 -2585737 1462993 1586427 -763843 -2574144 -3286784
5439c286784j266164k028167o81229J791299K498596J148336J71245O28428R24688
5430i9752k3890j022537q70675j52849K84452O91791J158863Q24667m42319j264876
5420i17125r39640p48305j670766k435455j528445L67985J772296K707510L464609
5411G2664K636486p43145m138145l932368o75536J449958O98289k05205R08275
5402c928727K191367J444934J66071R14012K683359K303662m93915k637464k170315
5393D72984k73623J449126K997218M345356M062273J160109k867592n221173m503784
5384A620894j595968J472709K897178K041126k17180k299160l310686l279864
5376b670951k283278l98878J404480J703329N37686l21444J65509P17973k80248
$$ plain form
5439 -3286784 -4552948 -6581115 -7262344 -5471045 -2972449 -1824113 -1652868 -1024440 -99752
5430 -99752 -123642 -1146179 -2016854 -2169703 -1885251 -1193460 -34597 790070 347751 -917125
5420 -917125 -1856765 -2605070 -4275836 -6711291 -8239736 -7871751 -6099455 -3391945 72664
5411 72664 2709150 1966005 -2172140 -6104508 -6780044 -5330086 -4631797 -4837002 -3928727
5402 -3928727 -1737360 -292426 -126355 787657 3471016 5774678 5280763 2643299 472984
5393 472984 199361 1648487 4645705 8991061 13053334 14213443 11345851 6124678 1620894
5384 1620894 24926 1497635 4394813 6435939 6218759 3919599 608913 -2670951
5376 -2670951 -4954229 -5353107 -3948627 -2245298 -1707612 -2029056 -1863547 -1145574 -1425822
5367a425822k122827k506243n44070K164712L454586K739330J223803M90740Q48058
5358D322267J032397K4417j121982o52504O39347j66784l352215m839609j684056
5349e798722K900919L532668L51803j533922m7331J182245o35311k826279j853389
5340d727319J106819K600589K226019J825161J330762n59325k689435k503059
5332a389788m66669M21156k91355K25658K889292M512344K596940p11631j787671
5323E998276m56196P05110N01602k2971k29897r46829k493987l302281j586210
5314a833383J942717L945941J835194k786300n277990l215495R11840L438667
5306a038809M061814M308949L448883l3188l685589k863143J835343L914688J8331
$$ plain form
5367 -1425822 -3548649 -6054892 -6598962 -4434250 -979664 1759666 2983469 3474209 4322267
5358 4322267 5354664 5379081 4257099 3604595 4243942 4077158 724943 -4114666 -5798722
5349 -5798722 -2897803 634865 986668 -547254 -594585 587660 -47651 -2873930 -4727319
5340 -4727319 -3620500 -1019911 1206108 3031269 4362031 3802706 1113271 -1389788
5332 -1389788 -1856457 -1435301 -1726656 -1500998 1388294 5900638 8497578 7785947 5998276
5323 5998276 5542080 6247190 6748792 6725821 6495924 5549095 3055108 -247173 -1833383
5314 -1833383 109334 4055275 5890469 3104169 -2173821 -5389316 -4477476 -1038809
5306 -1038809 3023005 7331954 10780837 10747649 7062060 4198917 6034260 9948948 9967279
5297I967279n038855n587727l187318k838627m497763m043375r44529R89871L94409
5288a4786635M86796L422848O911326P852145N850005K030294k232321m379955
5280E154503k097057K810325N261898L197279k05507k032564l413074n478270
5272C197533n724491k218659J780493J909565p13563j590742o9234M39530j112153
5263d101721j835903l00497J253802J449932K122652M030093M276598J077743
5255G972699k184703j467228J598340K002131j184068l871630l324451j315429
5247a774339l8926J237833L386075M404981K220579j296837k309496l86798R73257
5238F416329o49732l526889m436466k515289M81761K384242K144322K75046j340472
$$ plain form
5297 9967279 4928424 -659303 -3846621 -6685248 -11183011 -15226386 -16170915 -15181044 -14786635
5288 -14786635 -14299839 -10876991 -3965665 3886480 9736485 11766779 9534458 5154503
5280 5154503 3057446 5867771 11129669 14326948 14121441 12088877 8675803 3197533
5272 3197533 -2526958 -4745617 -2965124 -1055559 -1769122 -3359864 -3429098 -2989568 -4101721
5263 -4101721 -5937624 -6238121 -4984319 -3534387 -1411735 2618358 6894956 7972699
5255 7972699 5787996 4320768 5919108 7921239 6737171 2865541 -458910 -1774339
5247 -1774339 -1813265 -575432 2810643 7215624 9436203 8139366 5829870 5443072 6416329
5238 6416329 5766597 2239708 -2196758 -4712047 -4230286 -1846044 298278 573324 -767148
5229g67148r12412J229069K796673K263350M97854q63137j489163j865616j829352
5220i39882r08845M79317J332076J210149L50429p64445j324655o54051M70967
5211g48940K53176j284311j493902J120972L918447L400991L62603j205350J82319
5202D506005K088604K471359K064257J737291P74044q30682j329695l17071k13810
5193A0950302k470339m648314l892535j352857j94814p06928o87784K12286J74284
5184b616699q23390m23787J757592K587259J92654k379332j091517K999664M734057
5175D936501J746685k460225l217853l14437K551009K502796p7631l013837m307832
5166a654824k925789M26194L055522K580738r0541j811926j572381j492879k627931
$$ plain form
5229 -767148 -1679560 -450491 2346182 4609532 5107386 4244249 2755086 889470 -939882
5220 -939882 -1848727 -1369410 -37334 1172815 1523244 758799 -565856 -1219907 -748940
5211 -748940 -495764 -1780075 -3273977 -2153005 1765442 5166433 5529036 4323686 4506005
5202 4506005 6594609 9065968 11130225 12867516 13641560 12810878 11481183 11164112 10950302
5193 10950302 8479963 3831649 -60886 -1413743 -1608557 -2315485 -3003269 -2790983 -2616699
5184 -2616699 -3440089 -3863876 -2106284 480975 673629 -1705703 -2797220 202444 4936501
5175 4936501 6683186 4222961 1005108 690671 3241680 5744476 5666845 2653008 -1654824
5166 -1654824 -4580613 -4154419 -1098897 1481841 1391300 -420626 -1993007 -3485886 -6113817
5157f113817k772040n28504J376043K01949j651113M8200M138988N141906J647157
5148A488769j429416l30122K455770K888015J098300o05063k091118m141061n200638
5139e866564l204928N94328K875353K564999J274066K55464m87035o85478J16276
5130b563519J215780J402101O48024k49214r21057r88804L69437K832292M333805
5121F078845L735526K435227J528698l51427l811190n780014l431842Q44897K464125
5112C712845J233587N09542Q34291m22446l166984l820854j607354m31502k363482
5103e522357l878668j555482K284777L143841Q15966j242919j191967j87926L71826
5094f962909J66706p90969j937759j800604K27715K412434K755544J866746J909750
$$ plain form
5157 -6113817 -8885857 -9414361 -8038318 -7836369 -9487482 -9439282 -5300294 -158388 1488769
5148 1488769 59353 -270769 2185001 5073016 6171316 5566253 3475135 -665926 -5866564
5139 -5866564 -9071492 -8477164 -5601811 -3036812 -1762746 -1507282 -1994317 -2679795 -2563519
5130 -2563519 -1347739 54362 702386 453172 -467885 -1456689 -1087252 1745040 6078845
5121 6078845 9814371 12249598 13778296 13426869 9615679 3835665 403823 1248720 3712845
5112 3712845 4946432 5455974 6290265 5867819 2700835 -1120019 -2727373 -3158875 -5522357
5103 -5522357 -9401025 -10956507 -8671730 -5527889 -4711923 -5954842 -7146809 -7334735 -6962909
5094 -6962909 -6796203 -7587172 -9524931 -11325535 -11097820 -8685386 -5929842 -4063096 -2153346
5085b153346L157272L525672J653694j066058k077589o01514J442650J478111
5077E358892p46138k693433k179405k62760L78743n81669q29278Q48257K753734
5068B046943K840987J102125j308517l385467l986716k355067J32276Q39725n11310
5059d585021j344470l61102N35013m4479l23371J237976K685385J735063j32229
5050e97235j84798Q51817M55220p35586K9674K181215K044622j014165l018621
5041A2143j403877J180877J222655o14027j461183r71849j002280j741475j200877
5032e979893J323515L538381K793152o35605l754171m110756k262407o33927k40626
5023i962337L02304J957376K973458J258649j842820k690959k67968K683500L965373
$$ plain form
5085 -2153346 1003926 4529598 6183292 5117234 3039645 2438131 3880781 5358892
5077 5358892 4612754 1919321 -260084 -522844 -144101 -725770 -1555048 -706791 2046943
5068 2046943 4887930 5990055 4681538 1296071 -2690645 -5045712 -4913436 -4073711 -4585021
5059 -4585021 -5929491 -6290593 -5755580 -5800059 -6123430 -4885454 -2200069 -465006 -597235
5050 -597235 -782033 69784 525004 -210582 -180908 2000307 4044929 3030764 12143
5041 12143 -1391734 -210857 1011798 397771 -1063412 -2035261 -3037541 -4779016 -5979893
5032 -5979893 -4656378 -1117997 1675155 1039550 -2714621 -6825377 -9087784 -9721711 -9962337
5023 -9962337 -9660033 -7702657 -4729199 -3470550 -5313370 -8004329 -8272297 -5588797 -1623424
5014a623424M464205N083242M165813M79228l544729m633594l171621j687825
5006d68705k68693K582328N294139M241106K5374k132601j52470J469538r41196
4997I648820l858556k240663J830121K211141j276251k499304J051876M418931
4989I286115L279660K57789k16610J126084P63758j388530k569395k189611k093884
4980F255376k663232k305917o06934J015269J802597K351809K777860K252631
4972A0879459N13640j618175l078690l011764j272103N97562L80009j666626k607597
4963h84285j170076K63762l0141Q2705K427479M232146K184752j633022k596891
4954B876429n43337J048692J436816K716018M357138L431230L17419j414435j224993
$$ plain form
5014 -1623424 2840781 7924023 12089836 12569064 9024335 4390741 1219120 -468705
5006 -468705 -737398 1844930 7139069 11380175 11405549 9272948 9120478 10590016 9648820
4997 9648820 5790264 3549601 5379722 7590863 6314612 3815308 4867184 9286115
4989 9286115 12565775 12823564 12606954 13733038 14496796 13108266 10538871 8349260 6255376
4980 6255376 3592144 1286227 679293 1694562 3497159 5848968 8626828 10879459
4972 10879459 11393099 9774924 6696234 3684470 2412367 3009929 3389938 1723312 -884285
4963 -884285 -2054361 -1790599 -1820740 -1738035 689444 4921590 7106342 5473320 2876429
4954 2876429 2333092 3381784 4818600 7534618 11891756 15322986 15640405 14225970 13000977
4945A3000977k101687m135859l528667M60813L321758K270246J71596k3883K10713
4936I646007j067578k350774j895453r74415r34282n93770O66195P96162j132886
4927B159206k430564q76670J764964K811141K262165J258359J03743l45756J207216
4918G913804L292825K349906j710923m610760l898352j727709j71276J235760
4910B673275J947313J53748k272263q52953L590450M983910J976672M1330J151355
4901A3392837M47417l227729l563226J297458L558356q29433m171765n23414L480683
4892I861184R29756k624575J30414M616204L577539O04170J553962J977956k909884
4883A7716726n719086N3180N121735M43202l462527N359202J5167423J0254217
$$ plain form
4945 13000977 10899290 6763431 3234764 3695577 7017335 9287581 9459177 9435294 9646007
4936 9646007 8578429 6227655 4332202 3357787 2423505 1829735 2495930 3292092 2159206
4927 2159206 -271358 -1148028 616936 3428077 5690242 6948601 7052344 6706588 7913804
4918 7913804 11206629 13556535 11845612 7234852 3336500 1608791 1437515 2673275
4910 2673275 4620588 4774336 2502073 1649120 5239570 10223480 12200152 12241482 13392837
4901 13392837 13840254 10612525 7049299 8346757 11905113 11075680 6903915 6380501 9861184
4892 9861184 10790940 8166365 8296779 12912983 16490522 17094692 18648654 20626610 17716726
4883 17716726 11997640 12050820 17172555 17615757 14153230 19512432 34679855 44934072
4875D4934072L465224J3611518J8741408k1294319r0064547j13004446n4107267
4868a97718357K8519045N7198558L0706524N742349Q843376J5687289P547930
4861d3473286j054953L034478Q636977M879064R3053K677811N452465J754751
4853a7999640j311131K338538N426531J202734l753154j641670L048012K616142
4845a0073638r21108j731063o78534r40157m19652L057283N371484K648622j522586
4836e209349k269504j236649j731075j780012J116138L479511J262339k436259
4828h804860k047947J369194K350433j18405k126798j657811n24313k97294m54538
4819a2312339r9864J204794L390133M944951L754019J37562l193064m880784n518781
$$ plain form
4875 44934072 48399296 62010814 80752222 59457903 -30606644 -143611090 -197718357
4868 -197718357 -169199312 -112000754 -81294230 -75551881 -66708505 -51021216 -43473286
4861 -43473286 -44528239 -41493761 -32856784 -27977720 -27884667 -25206856 -19754391 -17999640
4853 -17999640 -19310771 -16972233 -11545702 -10342968 -14096122 -15737792 -12689780 -10073638
4845 -10073638 -10994746 -12725809 -13404343 -14344500 -14764152 -11706869 -6335385 -3686763 -5209349
4836 -5209349 -7478853 -8715502 -10446577 -12226589 -11110451 -7630940 -6368601 -8804860
4828 -8804860 -10852807 -9483613 -7133180 -7251585 -9378383 -11036194 -11560507 -11857801 -12312339
4819 -12312339 -12412203 -11207409 -7817276 -2872325 881694 1019256 -2173808 -7054592 -12573373
4810a2573373m330903J16912N121101N404907J264332q57275J550730K976299
4802a327270m36881l974973k524113N51473m21842l299138k026590K529206L883105
4793g047023P40676j310775P38791L033036J681532j540777k736312j389992J02341
4784g728503J84430n51734q29631l22720J35129J7071L76168K232892L839906
4775b646992K117064k487152n566082m612466k190349j306740r45229R78646L256962
4766a3402338L532907K536295K508059L048352K134475J40716n91315L72136J038057
4757A317344J35692j385910j793616j73687K666658M126736K179778j531669l226989
4748B314337k250487j643135k504224j996125R97057K861010J142442r81325j89680
$$ plain form
4810 -12573373 -16904276 -16787364 -11666263 -6261356 -4997024 -5854299 -4303569 -1327270
4802 -1327270 -1764151 -5739124 -8263237 -7711764 -8133606 -11432744 -13459334 -10930128 -7047023
4793 -7047023 -6306347 -7617122 -6878331 -3845295 -2163763 -3704540 -6440852 -7830844 -7728503
4784 -7728503 -7544073 -8095807 -8925438 -9248158 -9113029 -9095958 -8719790 -6486898 -2646992
4775 -2646992 -529928 -3017080 -8583162 -13195628 -15385977 -16692717 -17637946 -16659300 -13402338
4766 -13402338 -9869431 -7333136 -4825077 -1776725 357750 498466 -92849 279287 1317344
4757 1317344 1453036 67126 -1726490 -1900177 766481 4893217 7072995 5541326 2314337
4748 2314337 63850 -1579285 -4083509 -6079634 -5082577 -2221567 -1079125 -2060450 -2250130
4739b250130J227533k9846j789339k81457K635551K464978r884m54414Q84873
4730B397865k55125l923631n174519k114981J491748K720035K850684K995638
4722I87714J860726m71970j556642j059402j448366k698683j436048K643647M769009
4713A589985K284591j064217j348348l65908j368883k929490j784510J128115
4705c858665K302198J393368P62103O63796n73705k244232j643485R41335J689694
4696e67593j106683m146617l677695n71959J330666N50710p01737k39866J196140
4687g934634J574784O63872j05175l32773j238803l072596l841836k010491R21161
4678a5376491K282247J693471P88437L42851n1913N3583J735949M206748M928989
$$ plain form
4739 -2250130 -1022597 -1052443 -2841782 -3123239 -487688 1977290 1967406 1512992 2397865
4730 2397865 2142740 -1780891 -6955410 -9070391 -7578643 -4858608 -2007924 987714
4722 987714 2848440 2376470 819828 -239574 -1687940 -4386623 -5822671 -3179024 1589985
4713 1589985 3874576 2810359 1462011 1096103 -272780 -3202270 -4986780 -3858665
4705 -3858665 -1556467 -163099 599004 1262800 689095 -1555137 -3198622 -2257287 -567593
4696 -567593 -1674276 -5820893 -9498588 -10070547 -8739881 -8189171 -8890908 -9130774 -7934634
4687 -7934634 -6359850 -5695978 -5801153 -6133926 -7372729 -10445325 -14287161 -16297652 -15376491
4678 -15376491 -13094244 -11400773 -10612336 -10269485 -10321398 -10267815 -8531866 -4325118 603871
4669F03871K942340K76453n97716O98046K721462L526344J709826k084877m732875
4660E062874l710747o49099M57341j306682k793300j716650M33315J529898J914630
4651g78420K583556K830448J882516Q32317O70091J57401j937876m020669l759120
4642a539756j910159j205393j944209j650403O32658K464662J543273q96311j811356
4633f316994l93057J264378J268601K03234k86171j63203r12352k804831l765618
4624a1906013k019137J083749K398283Q38933j557169k351184j003111J613594
4616a2902055M264516N349338L486857p24406m422040m941311k190628J674054
4608a0405675M192002M132580K242149P51764R98132J442260l30224l440692l944010
$$ plain form
4669 603871 3546211 3822664 3224948 3922994 6644456 10170800 11880626 9795749 5062874
4660 5062874 1352127 703028 1160369 -146313 -2939613 -4656263 -4222948 -2693050 -778420
4651 -778420 1805136 4635584 6518100 7350417 8020508 8177909 6240033 2219364 -1539756
4642 -1539756 -3449915 -4655308 -6599517 -8249920 -7617262 -5152600 -3609327 -4505638 -6316994
4633 -6316994 -6710051 -5445673 -4177072 -3973838 -4260009 -4423212 -5335564 -8140395 -11906013
4624 -11906013 -13925150 -12841401 -10443118 -9604185 -11161354 -13512538 -14515649 -12902055
4616 -12902055 -8637539 -3288201 198656 -525750 -4947790 -9889101 -12079729 -10405675
4608 -10405675 -6213673 -2081093 161056 912820 1910952 3353212 3022988 -417704 -4361714
4599d361714m10656L183878K506143r84358k094318O18251L036588J886533m94276
4590B886071j19419K253877K178179j564482m743078l675315n14247R2026k162449
4581e368837l216239j065818J527464J800971J010382J439803K178376J061590
4573f32308r37713q74666J291939K505982J392139n2329k11185k19908j258040
4564A003911k076198j127725N80707P57935r28993k435981j794128R35571L800686
4555a284215M518533K346421j218816l847804m334825k826457k16K807207L547403
4546b92769J449719j275056j672661J80136J646867J543358J186958J265774M64288
4537D496614j840777l947731m161579k829517j003820R67351K454348K220668
$$ plain form
4599 -4361714 -4772370 -1588492 917651 -66707 -2161025 -1542774 1493814 3380347 2886071
4590 2886071 2766652 5020529 7198708 5634226 891148 -2784167 -3298414 -3206388 -5368837
4581 -5368837 -8585076 -9650894 -8123430 -6322459 -5312077 -3872274 -1693898 -632308
4573 -632308 -1570021 -2444687 -1152748 1353234 2745373 2693044 2481859 2261951 1003911
4564 1003911 -1072287 -2200012 -1619305 -861370 -1790363 -4226344 -6020472 -5084901 -1284215
4555 -1284215 3234318 5580739 4361923 514119 -3820706 -6647163 -6647379 -3840172 -292769
4546 -292769 1156950 -118106 -1790767 -1610631 36236 1579594 2766552 4032326 4496614
4537 4496614 2655837 -1291894 -5453473 -8282990 -9286810 -8319459 -5865111 -3644443
4529c644443M29324q44993m08189N32672Q75874J586101L422086M565894K743592
4520I257918j331147m540932m809747k705849l27311M65641m16461q63466J176386
4511d094968M596409N964864L938990P20301j536804l078857m210805l790353
4503a491223k045797j666716l260884k846559K238931P446897N984998j385197
4495B974450o634735m898462L6030K056285M91335r31518j31794J333449J317478
4486d387482k10741j585499j387761K88382K135087K993814K682879J524302q3839
4477A969142j197099o38914J159470J792597j02226k360835j692349J898502M942231
4468E770519M610751J354356k399492m463447l778850q31360K321183L563918
$$ plain form
4529 -3644443 -3215119 -4060112 -4468301 -3935629 -3059755 -1473654 1948432 6514326 9257918
4520 9257918 7926771 3385839 -1423908 -4129757 -4457068 -3991427 -4407888 -5271354 -4094968
4511 -4094968 501441 6466305 10405295 11125596 9588792 6509935 2299130 -1491223
4503 -1491223 -3537020 -5203736 -8464620 -11311179 -9072248 -1625351 4359647 2974450
4495 2974450 -3660285 -8558747 -8522717 -6466432 -5975097 -6906615 -7038409 -5704960 -4387482
4486 -4387482 -4598223 -6183722 -7571483 -7283101 -5148014 -2154200 528679 2052981 1969142
4477 1969142 772043 133129 1292599 3085196 2982970 622135 -1070214 828288 5770519
4468 5770519 10381270 11735626 9336134 4872687 1093837 262477 2583660 6147578
4460F147578K605904P43904q10320j423504o53806J110290K207566J572765M87293
4451A1987670N89638Q25903j049603m154669m790929j875833R37101K84080k206300
4442E47058k591429l27662J461211Q04428p27972q89048R7933M22607m38108j086966
4432b727948k59240J466572K365186J542477k51146j712826k362858k492887k135510
4423f568180q63306J180079K737978K667351J535381J149179K206562L203956
4415G249000K391576J92567j430128j695016j691521k306080l015554l110650
4407c415806k475384o87265K544658N177917L805524j256301m596596k359877
4399c263130K121181L045698M36819r36849M21669J332077M13784J20080J191723
$$ plain form
4460 6147578 8753482 9497386 8687066 7263562 6609756 7720046 9927612 11500377 11987670
4451 11987670 12577308 13403211 12353608 8198939 3408010 1532177 2469278 2753358 547058
4442 547058 -2044371 -2372033 -910822 -106394 -834366 -1723414 -1625481 -1202874 -1640982 -2727948
4432 -2727948 -2987188 -1520616 844570 2387047 2135901 423075 -1939783 -4432670 -6568180
4423 -6568180 -7431486 -6251407 -3513429 -846078 689303 1838482 4045044 7249000
4415 7249000 9640576 9833143 8403015 6707999 5016478 2710398 -305156 -3415806
4407 -3415806 -5891190 -6578455 -4033797 1144120 4949644 3693343 -903253 -3263130
4399 -3263130 -1141949 1903749 2340568 1403719 1825388 3157465 3571249 3691329 4883052
4390D883052P80063j785703k746815l68971J323360j033124m346230l984836r38316
4381h217520M75109o74499j888138j751726n15013J790689M142797L737755J62676
4372b737870k190002K4405L524240L324876N79846P2035K056629K701845J347871
4363H703875J002823K033402J522485q51554k076958j457782j494896k547375
4355D834020k123819k12989L11138n01312O20718L413071L361391k27544j946822
4346G527852Q67219L299256R33530k951384l223208j057188o35770j534785m92751
4337B732771J760788J526760j234451k766226j658613m18518p73206j449253j097579
4328c377527q5578J147445K701086L718925K787775L64492j290987j079556j88594
$$ plain form
4390 4883052 5663115 3877412 1130597 761626 2084986 1051862 -3294368 -7279204 -8217520
4381 -8217520 -7742411 -8416910 -10305048 -12056774 -12571787 -10781098 -6638301 -2900546 -2737870
4372 -2737870 -4927872 -4903467 -1379227 1945649 2525495 2597530 4654159 7356004 8703875
4363 8703875 9706698 11740100 13262585 12411031 10334073 8876291 7381395 4834020
4355 4834020 2710201 2497212 2808350 2307038 2927756 6340827 9702218 9474674 7527852
4346 7527852 8395071 11694327 12627857 9676473 6453265 5396077 4760307 3225522 2732771
4337 2732771 4493559 6020319 4785868 2019642 361029 -57489 -830695 -2279948 -3377527
4328 -3377527 -3463105 -2315660 385426 4104351 6892126 7256618 5965631 4886075 4697481
4319D697481O5315j77908l34922m97968q77004j066566m60399R88907K585314
4310D922250L260703K346393K87699j594940k215664j441254P5470J367590J855207
4301H863454K096379L095755M151796K775817j675103n757363n779865k805984
4293D964886q96684j150534r87495Q46827K399429K155599R31398o61641l028048
4284D573737m911134l720046O6634K554286K084895J414331K423369K844930Q69443
4275H200445j063159m40477R03661K87028r90799l50185J114635N93592j540802
4266F713939k895194l349028m040543l689110n07216L214097L216275j50607j997637
4257c485024r5711K237915J745039k9611K23659K382159L242183R56538k784342
$$ plain form
4319 4697481 4762796 4584888 4249966 3751998 2874994 1808428 1348029 2336936 4922250
4310 4922250 8182953 10529346 10817045 9222105 7006441 5565187 5640657 7008247 8863454
4301 8863454 10959833 14055588 18207384 20983201 19308098 13550735 7770870 4964886
4293 4964886 4068202 2917668 1930173 2777000 5176429 7332028 8263426 7601785 4573737
4284 4573737 -337397 -4057443 -3990809 -1436523 648372 2062703 4486072 7331002 8200445
4275 8200445 7137286 6696809 7600470 7887498 6896699 6546514 7661149 8254741 6713939
4266 6713939 3818745 469717 -3570826 -7259936 -7767152 -4553055 -1336780 -1487387 -3485024
4257 -3485024 -3580735 -1342820 402219 372608 596267 2978426 6220609 7177147 4392805
4248D392805m796599l642371q25373Q88987L22191j007458o61675K067658N275740
4239B013905N943723K697375k353704n211159m368037k557030k651608l377466
4231i864001j793839J322486K483473J417545J479345L593585M466334K309756
4223E414684j16554k67041N33768N62918P90403J787922J463469j008112k624858
4214F536599j236499O36311Q7013j429437j322562o23872j482790k726048k086113
4205c647398n12584k77376q89837n99297J67069L63053R58536K511823K706801
4196G80790P3763k433643j540490J160406K094534J246966P30959L71694r76733
4187A508246k009060j033961P47302J748429L027497N077424N038701J458959
$$ plain form
4248 4392805 -403794 -4046165 -4871538 -3982551 -3660360 -4667818 -5329493 -3261835 2013905
4239 2013905 7957628 10655003 8301299 3090140 -1277897 -3834927 -6486535 -9864001
4231 -9864001 -11657840 -10335354 -7851881 -6434336 -4954991 -1361406 3104928 5414684
4223 5414684 5298130 5031089 5564857 6127775 6918178 8706100 10169569 9161457 6536599
4214 6536599 5300100 5936411 6023424 4593987 3271425 2647553 1164763 -1561285 -3647398
4205 -3647398 -4159982 -4437358 -5327195 -5926492 -5759423 -5396370 -4437834 -1926011 780790
4196 780790 854553 -1579090 -3119580 -1959174 135360 1382326 2113285 2484979 1508246
4187 1508246 -500814 -1534775 -787473 960956 3988453 9065877 14104578 15563537
4179A5563537j792623j175404O90374K1473j306802J22031K213181J095693j447751
4170A3983709j226539O21835J49290j818983j612349K43268O80553K10300Q81889
4161A2112973J222403k98539o14267K321813M024462J061036j538892J012254
4153A9303243L721122R91730j897820J697722O421358M696303J802769N380159
4145D2116586Q680998L184044j587417N994432J4225238Q884531J0054856M5596384
4137A37149652Q7185328O5197118l1593434j19047760j16835752m8354743J560453
4130b4739138M86031j2158656m633927O357163Q24560q028825k501010Q641310
4122c5752492R627213M391999M301350O968935M676326K40950m45116m56368l690759
$$ plain form
4179 15563537 13770914 12595510 13285884 13307357 12000555 12122586 14335767 15431460 13983709
4170 13983709 12757170 13379005 13528295 11709312 10096963 10340231 11020784 11231084 12112973
4161 12112973 13335376 13036837 12422570 14744383 18768845 19829881 18290989 19303243
4153 19303243 23024365 24016095 22118275 23815997 30237355 34933658 36736427 42116586
4145 42116586 50797584 53981628 52394211 58388643 72613881 81498412 91553268 137149652
4137 137149652 224334980 289532098 257938664 138890904 22055152 -26299591 -24739138
4130 -24739138 -24253107 -36411763 -41045690 -34688527 -33863967 -41892792 -44393802 -35752492
4122 -35752492 -26125279 -21733280 -17431930 -10462995 -5786669 -5545719 -5990835 -6447203 -10137962
4113a0137962m910268M86092N993056M137319j149754k226065j20426J83200l23565
4104h068373J413844L026607J576054q5367N36129n30763n818915q986591m070806
4095b1008181L520824M502267l23819k748594l30594K068967J638422K65817p79347
4086a3194238j714947j051237K167904M403645J966926k194235k134151J923718
4078i826615M157843K150585o13103j197328p19760p84299r41672o24111j93266
4069h591726M97371J833305K688846J506373r70219k279921j368158O09054K048170
4060d026905K068682Q46221j52336L76518J238036Q2722k304149k339815M86332
4051c724694K037261k071k207047j035669J567016J984037Q33121P44777J181111
$$ plain form
4113 -10137962 -15048230 -14562138 -8569082 -4431763 -5581517 -7807582 -7928008 -7744808 -8068373
4104 -8068373 -6654529 -3627922 -2051868 -2137235 -1601106 -2131869 -7950784 -16937375 -21008181
4095 -21008181 -17487357 -12985090 -13308909 -16057503 -16388097 -14319130 -12680708 -12414891 -13194238
4086 -13194238 -14909185 -15960422 -13792518 -9388873 -7421947 -9616182 -11750333 -9826615
4078 -9826615 -5668772 -3518187 -4131290 -5328618 -6048378 -6832677 -7774349 -8398460 -8591726
4069 -8591726 -8094355 -6261050 -3572204 -2065831 -3036050 -5315971 -6684129 -6075075 -4026905
4060 -4026905 -1958223 -1112002 -1264338 -887820 350216 432938 -1871211 -4211026 -3724694
4051 -3724694 -1687433 -1689504 -3896551 -4932220 -3365204 -1381167 -548046 196731 1377842
4042A377842O5444j691735j756673n99470p2424K59485J330815J406647q05671
4033d85740k182578N17856M307892L681481n58505k355088O0013K038299O68741
4024E692371j147554o78274J64422q09933j808193n70233J303519J061030o19952
4015B587203j098450r3427N87277M98466P51049J283579P66566o04646p81825
4006C895792P45589J340958j222527m843582n160198j560344J367648l22818m629987
3997a0389469o237351l116028K007039N839117P145554N550686J264611l281091
3989a216932m714924k817523o36820L12742J727988M196444M985191K502404l30311
3980D008259j52328J905863K330496K08280k644369m624338m837632k620899Q55724
$$ plain form
4042 1377842 1443286 -248449 -2005122 -2604592 -2677016 -2417531 -1086716 319931 -485740
4033 -485740 -2668318 -2150462 2157430 5838911 5280406 2925318 2985331 5023630 5692371
4024 5692371 4544817 3866543 4030965 3221032 1412839 842606 2146125 3207155 2587203
4015 2587203 1488753 1395326 1982603 2481069 3232118 4515697 5282263 4677617 3895792
4006 3895792 4641381 5982339 4759812 -83770 -5243968 -6804312 -5436664 -5759482 -10389469
3997 -10389469 -16626820 -19742848 -17735809 -11896692 -4751138 799548 2064159 -1216932
3989 -1216932 -5931856 -8749379 -9386199 -9073457 -7345469 -3149025 1836166 4338570 4008259
3980 4008259 3855931 5761794 8092290 8300570 5656201 1031863 -3805769 -6426668 -5570944
3971e570944K482344J180629k31065M08189J047001m35714j713858N2591K463503
3962c17324J259914k306130l093494k65796J848546J192577N53965J527478J336559
3953A736295j878335n013942m484326j735585r32325k840934m065006j864068
3945b1078226K539844N747955N965775M286525K547739R93685q64644j839877
3937a701224k7529L323078L921850K65520l439805k889272K65584J420640L2200
3928A171042o35864K94878J9297k732489n160073m262301n33001L145984M377438
3919d315089K730097P4761p76784O55488J582088J37442j277175K59650K936866
3910B007344K642999n51681k747490k472983j983774k329378j861014l08242K11571
$$ plain form
3971 -5570944 -3088600 -1907971 -2139036 -1730847 -683846 -1119560 -2833418 -2780827 -317324
3962 -317324 942590 -1363540 -4457034 -4722830 -2874284 -1681707 -1127742 399736 1736295
3953 1736295 -142040 -5155982 -9640308 -11375893 -12308218 -15149152 -19214158 -21078226
3945 -21078226 -18538382 -12790427 -6824652 -2538127 9612 1003297 138653 -1701224
3937 -1701224 -1728753 1594325 5516175 5781695 2341890 -547382 -281798 1138842 1171042
3928 1171042 535178 830056 849353 -1883136 -7043209 -11305510 -11838511 -8692527 -4315089
3919 -4315089 -1584992 -1510231 -2287015 -1631527 -49439 88003 -1189172 -929522 2007344
3910 2007344 4650343 4098662 1351172 -1121811 -3105585 -5434963 -7295977 -7604219 -7392648
3901g392648o34672m75864J203354J736373Q9161j059336p380J042702R5615j063458
3891f466153r9377J894915K359568J039354n32769j470821j547549n52943P69554
3882d606221Q98730j63603p24224l58143n18958j296912o56180J652914K665975
3873c106622P46726j427201q57489J378519K292275J326927l5775j118189j985546
3864b786375k033232q01108J008321K711136M146421M073302Q47413l788483m963475
3855a586080j241306K325975R79675k839272l350226J29356L178848L326064K323694
3846C246728J670035M10710j768234k954051j944553k14197L52634j01017j81022
3837a482967Q62385K539535L392373J936020j407274l640967k162098J626251
$$ plain form
3901 -7392648 -8027320 -8503184 -7299830 -5563457 -5474296 -6533632 -6541012 -5498310 -5402695 -6466153
3891 -6466153 -6565530 -4670615 -2311047 -1271693 -1804462 -3275283 -4822832 -5375775 -4606221
3882 -4606221 -3707491 -3871094 -4595318 -4953461 -5472419 -6769331 -7425511 -5772597 -3106622
3873 -3106622 -2359896 -3787097 -4644586 -3266067 -973792 353135 317360 -800829 -2786375
3864 -2786375 -4819607 -5620715 -4612394 -1901258 2245163 6318465 7165878 3377395 -1586080
3855 -1586080 -2827386 -501411 478264 -2361008 -5711234 -5581878 -2403030 923034 3246728
3846 3246728 4916763 5327473 3559239 605188 -1339365 -1553562 -1200928 -1301945 -1482967
3837 -1482967 -620582 1918953 5311326 7247346 5840072 2199105 37007 1663258
3829A663258L443360J247072k323612l326816j229043P38541l43158l405376m429690
3820g965464j362074K924243L879142R62765j966837k044466n99484J3738N2851
3811f105586P59964J275867O2858j711598j195735J818813M073116K970477j27933
3802A820243j610668J54574L028697L561829R74951j964111k471512j120741l74107
3793A999155q12829j048888o63704l60767M74415K924154N140894L805781k89502
3784A1168709k554884j813582k146077n209160o322361k235762K452393K159724
3776d501000p16886k52247K834798K871385p02765k696685j287673k64459j299725
3767f015257j118277J730758L762346K737638J107864N60022j041598l880598
$$ plain form
3829 1663258 5106618 6353690 4030078 703262 -525781 212760 -130398 -3535774 -7965464
3820 -7965464 -9327538 -6403295 -2524153 -1561388 -3528225 -5572691 -6172175 -6158437 -6105586
3811 -6105586 -5345622 -4069755 -4006897 -5718495 -6914230 -5095417 -1022301 1948176 1820243
3802 1820243 209575 364149 3392846 6954675 7929626 5965515 3494003 2373262 1999155
3793 1999155 1186326 137438 -526266 -887033 -412618 2511536 7652430 11458211 11168709
3784 11168709 8613825 6800243 4654166 -554994 -6877355 -9113117 -6660724 -4501000
3776 -4501000 -5217886 -5470133 -2635335 236050 -466715 -3163400 -4451073 -4715532 -6015257
3767 -6015257 -7133534 -5402776 -1640430 1097208 2205072 2765094 1723496 -2157102
3759b157102l246658K834959P988798N381903k157062n964569l328063N86565
3751f1229J477420M62596m34779j725716l596820l946501j727379O73787P22562
3742h156059o61276r05445L23759J114193L91773p62861o89600J098121L637070
3733d610325N268415M841056K698348L13294j268737k142732k516068j958627
3725F24624n36269J58751j377392m046057m836867k527002P04626K223047K153325
3716g459214K243659K658043K069076O00601K05035J490109K353683R88775j522002
3707C627765l067425l372622l198953k088119O68900L502607L679107J172418
3699I23678q96091m38260R16704M65141j721059l076140j931567P54030K878470
$$ plain form
3759 -2157102 -5403760 -2568801 5419997 10801900 8644838 2680269 -647794 -61229
3751 -61229 1416191 1878787 1444008 -281708 -3878528 -7825029 -9552408 -8878621 -8156059
3742 -8156059 -8817335 -9722780 -9399021 -8284828 -7893055 -8655916 -9345516 -8247395 -4610325
3733 -4610325 658090 5499146 8197494 8510788 7242051 5099319 2583251 624624
3725 624624 88355 247106 -1130286 -5176343 -10013210 -12540212 -11835586 -9612539 -7459214
3716 -7459214 -5215555 -2557512 -488436 112165 317200 1807309 4160992 5149767 3627765
3707 3627765 560340 -2812282 -6011235 -8099354 -7430454 -3927847 -248740 923678
3699 923678 27587 -410673 506031 971172 -749887 -3826027 -5757594 -5003564 -2125094
3690b125094L340666K521085J321794J85169j000824k204585k691985j545601
3682b199375J047828L364832L610415J927204L03782K9379k8910j580430l963104
3673B511621m823012l656218k310934j389410P87135L895397L881396q46186m585687
3664f535898j221130N686619O424628r19126p228804n497097j76058J108492r25306
3655i283680m84865K665561L410151M85219j656865m01785J570816J467818J75087
3646b052543n05762m92939l6735R70343J357234m52479l132343l249389k42122
3637g836735K601702L097441K798831L414970L872750K791073J112168J80080
3629A2032280o34139k340198m013372l952786k056165L32003K023711K504393
$$ plain form
3690 -2125094 1215572 3736657 5058451 5243620 4242796 2038211 -653774 -2199375
3682 -2199375 -1151547 2213285 5823700 7750904 8054686 8084065 8055155 6474725 2511621
3673 2511621 -2311391 -5967609 -8278543 -9667953 -8880818 -4985421 -1104025 -1950211 -6535898
3664 -6535898 -7757028 -2070409 4354219 3435093 -3793711 -9290808 -9466866 -8358374 -9283680
3655 -9283680 -9768545 -7102984 -3692833 -3207614 -4864479 -5266264 -3695448 -2227630 -2052543
3646 -2052543 -2558305 -3051244 -3087979 -2117636 -760402 -1212881 -4345224 -7594613 -7836735
3637 -7836735 -5235033 -2137592 661239 4076209 7948959 10740032 11852200 12032280
3629 12032280 11398141 9057943 5044571 1091785 -964380 -632377 1391334 3895727
3621C895727J767534L51231j084713k257052k641894j217960J632389L063399
3613C508661J032728k202006k815422j042810m80467j868031j845172J056296
3605d656223L439366K257050m94290j089674M82612J317259J60901j481598j900924
3596a965521q52199P04267J266670J8317j759558j685736N09596K201268J293451
3587b69445r24355j502857N20810L130832L462901O37199l073059m335922k676307
3578e030203j033152j192969q74295K019455M656555L110006o14358q10351K896336
3569C127024M547569R45054l848051n113672l473080j686123j28144J462990J732499
3560b433934L31261o26147l31952q79444k687013k632558K79566K013918N0497
$$ plain form
3621 3895727 5663261 6014492 4929779 2672727 30833 -1187127 445262 3508661
3613 3508661 4541389 2339383 -476039 -1518849 -1999316 -3867347 -5712519 -4656223
3605 -4656223 -1216857 1040193 545903 -543771 -61159 1256100 1417001 -64597 -1965521
3596 -1965521 -2817720 -2113453 -846783 -828466 -2588024 -4273760 -3764164 -1562896 -269445
3587 -269445 -1193800 -2696657 -2175847 954985 4417886 5055085 1982026 -2353896 -5030203
3578 -5030203 -6063355 -7256324 -8130619 -6111164 -1454609 1655397 1041039 230688 3127024
3569 3127024 7674593 8619647 4771596 -342076 -3815156 -5501279 -5629423 -4166433 -2433934
3560 -2433934 -2102673 -2728820 -3060772 -3940216 -6627229 -9259787 -8980221 -6966303 -6915806
3551f915806j740043N65194L923370L188078l93224j651170j09173K04515j650996
3542d579255k281033k70503J625842J316955R9738k83773Q0374N94904J080872
3533b615879J137605O26302L51789M85353l56035k373402k903515k36104K918858
3524b965028L009704P93339n03901k44064P9439M03686J184952Q09902j720303
3515H47726l294297o86197L414445L560529k20658k738521j767570l74552q06924
3506b066019j307147j03136J805663K973383L044606J456138j909191m637091
3498g42794l928471p87001J445187K159679L134074L973752K632895N652j027853
3489F865120q99638k426341m721783l887681k44491J286013p48574j969970K62226
$$ plain form
3551 -6915806 -8655849 -8090655 -4167285 -979207 -1372431 -3023601 -3132774 -2928259 -4579255
3542 -4579255 -6860288 -7130791 -5504949 -4187994 -4088256 -4372029 -4291655 -3696751 -2615879
3533 -2615879 -1478274 -851972 -500183 -14830 -370865 -2744267 -5647782 -5883886 -2965028
3524 -2965028 44676 838015 334114 90050 169489 573175 1758127 2568029 847726
3515 847726 -2446571 -3132768 281677 3842206 3621548 883027 -884543 -1259095 -2066019
3506 -2066019 -3373166 -3476302 -1670639 1302744 4347350 5803488 3894297 -742794
3498 -742794 -4671265 -5458266 -4013079 -1853400 1280674 5254426 7887321 7892973 6865120
3489 6865120 5965482 3539141 -1182642 -5070323 -5314814 -4028801 -4777375 -6747345 -6485119
3480f485119K812846K742595J788519J960554J670008n23249k614830k701187
3472a349863j994535j622092k92672K208409L088702R17043j622985j917876r00425
3463c486294o6240J224969K999350K952913J47047k888235l967417l804565l042907
3454i931379p16969K491067L769923K854611K624338L357239J838404j757696
3446D529538k488473P95934K309672j105211m187447k313178M74893r20837l282101
3437f187210j133580L027420L140254K05950m17970P08213j092103m365960k773230
3428h888216L509428O728658L232820j699088k675615r45710M5691j5904m8027
3419g55963n5139K34980J532484K621481J426639j058526j732115m41322K0552
$$ plain form
3480 -6485119 -3672273 -929678 858841 2819395 4489403 3966154 1351324 -1349863
3472 -1349863 -3344398 -4966490 -5259162 -3050753 37949 954992 -667993 -2585869 -3486294
3463 -3486294 -3552534 -2327565 671785 3624698 3771745 883510 -3083907 -6888472 -9931379
3454 -9931379 -10648348 -8157281 -4387358 -1532747 1091591 4448830 6287234 4529538
3446 4529538 2041065 2836999 5146671 4041460 -145987 -2459165 -1984272 -2905109 -6187210
3437 -6187210 -7320790 -4293370 -1153116 -947166 -1365136 -656923 -1749026 -6114986 -8888216
3428 -8888216 -5378788 1349870 4582690 2883602 207987 -737723 -692032 -707936 -755963
3419 -755963 -811102 -576122 956362 3577843 5004482 3945956 2213841 1772519 1793071
3410A793071r90838j277058l07281J43414R3063J441417L611616L733732J539677
3401I780813n00817j943203m184711n581715k762728K422790L649497m10141l545114
3392c075329j515106J779327J118855k124642l082790p39213J759879J769601
3384d109418o90987l455944l346516P26662N006062M562317K62899k183718q03640
3375d032283L09990j364686k810547j734720p53193j658474j272860K376883M992751
3366e947139K527684j632635j818847J232884K813467K223765J966646J423112
3358B788937j805865n508660m682527J99727K940387N39363l020815l273942q32298
3349a2655693J326611K150471J994471Q86194o05856r36035L32797J649093J790320
$$ plain form
3410 1793071 802233 -474825 -782106 -638692 -545629 895788 4507404 8241136 9780813
3401 9780813 9279996 7336793 3152082 -2429633 -5192361 -2769571 879926 469785 -3075329
3392 -3075329 -4590435 -2811108 -1692253 -3816895 -6899685 -7638898 -5879019 -4109418
3384 -4109418 -4800405 -8256349 -11602865 -10876203 -5870141 -1307824 -1044925 -3228643 -4032283
3375 -4032283 -3722293 -5086979 -7897526 -9632246 -10385439 -12043913 -13316773 -10939890 -5947139
3366 -5947139 -3419455 -5052090 -6870937 -5638053 -2824586 -600821 1365825 2788937
3358 2788937 983072 -4525588 -9208115 -9008388 -6068001 -5528638 -8549453 -11823395 -12655693
3349 -12655693 -11329082 -9178611 -7184140 -6297946 -6903802 -7839837 -7507040 -5857947 -4067627
3340d067627J467749J655023J837556J026529n82981k022066k989616l945831
3332g621264m792785m164534r21684L399110M999296K219999j599380k107065
3324a0588307J11273J010971J8947O85608L587858M200732N59169k362845j83863
3315b960457L628828L337491m1995j427631n23059j119675l101138k283452J822100
3306b668988M719746M225794L036060K788486J394359j804922l619886k283197
3298E787452n15324o99944j189394j78803O29832o66961k451873k240366m23343
3289a948724J251311K336165K472708M38392k958596l992091j079184K008654
3281a471365J319180j487999k261907q98970l34768o91538N16446K782037K340880
$$ plain form
3340 -4067627 -2599878 -944855 892701 1919230 1336249 -685817 -3675433 -7621264
3332 -7621264 -12414049 -16578583 -17500267 -14101157 -9101861 -6881862 -8481242 -10588307
3324 -10588307 -10477034 -9466063 -9447116 -8761508 -5173650 -972918 -413749 -2776594 -2960457
3315 -2960457 668371 4005862 3963867 2536236 2013177 893502 -2207636 -4491088 -2668988
3306 -2668988 2050758 6276552 9312612 12101098 13495457 11690535 8070649 5787452
3298 5787452 5272128 4572184 3382790 3203987 3833819 3166858 714985 -1525381 -1948724
3289 -1948724 -697413 1638752 4111460 4549852 1591256 -2400835 -3480019 -1471365
3281 -1471365 -152185 -1640184 -3902091 -4801061 -5135829 -5827367 -5310921 -2528884 -188004
3272a88004j484694m112569j983393K276807L630611J420428n44054J82650J640533
3263H38315R01049j460517k126359J63508K537322J781510j117658k223453j17103
3254h23386K169086J350450j922620m269687l598649p67502J714730J793919k42870
3245d596529j492853M34701L691327L968453Q10411j028095J476698M647073L436674
3236A1347860j002172l493776k788096k184881k826303k011760P98880J721141
3228d39107j268467m188003k617304J830056M304194L591017K247201J463366
3220D922953L6782j932419k317709o26965P89432L11173o84091m11375N58230
3211F46011O77753K3026j58075M36671R97887J048274Q22868M94100N198n10399
$$ plain form
3272 -188004 -1672698 -5785267 -7768660 -5491853 -1861242 -440814 -984868 -802218 838315
3263 838315 1739364 278847 -1847512 -1684004 853318 2634828 1517170 -706283 -823386
3254 -823386 1345700 2696150 773530 -3496157 -7094806 -7862308 -6147578 -4353659 -4596529
3245 -4596529 -6089382 -5654681 -1963354 2005099 2815510 1787415 3264113 7911186 11347860
3236 11347860 10345688 6851912 4063816 1878935 -947368 -2959128 -2160248 -439107
3228 -439107 -1707574 -5895577 -8512881 -6682825 -2378631 1212386 3459587 4922953
3220 4922953 4959735 3027316 709607 82642 872074 1183247 499156 87781 646011
3211 646011 1323764 1346790 1188715 1625386 2623273 3671547 4494415 4988515 4993713 4483314
3201D483314r28417j525249k422824k906882k199929q30313k07781n57922l00021
3192g396024J671126L719547K887089j062202m292135k957423J805490M705846
3184i18686K616781j678824l427781k066190j012339j911978k233956L78861M012545
3175f241567M883341K371608n87235j484680n93947M63913P41651L40611k3643
3166a29948L12360R91545P69961n14524j041730M43136K132010J285710j770507
3157B478013m206424m834577m788636m059121r49579L860187O249990L920720
3149b329427n1392j483688m90647K75228M86492J486714K281009N35070k681798
3140a972439l392936o88986J618358P56233j012542l08189K236359L519460K752656
$$ plain form
3201 4483314 3554897 2029648 -393176 -3300058 -5499987 -6330300 -6538081 -7096003 -7396024
3192 -7396024 -5724898 -2005351 881738 -180464 -4472599 -7430022 -5624532 -918686
3184 -918686 1698095 19271 -3408510 -5474700 -6487039 -8399017 -10632973 -10254112 -6241567
3175 -6241567 -1358226 1013382 426147 -1058533 -1652480 -1188567 -446916 -106305 -129948
3166 -129948 182412 1173957 1943918 1429394 387664 830800 2962810 4248520 2478013
3157 2478013 -1728411 -6562988 -11351624 -15410745 -16360324 -12500137 -6250147 -2329427
3149 -2329427 -2380819 -3864507 -4355154 -4079926 -3593434 -2106720 174289 709359 -1972439
3140 -1972439 -5365375 -6054361 -4436003 -3679770 -4692312 -5000501 -2764142 755318 3507974
3131C507974J670026R08549p31952l254934m341635k394118R07367K456899J398665
3122A26841k48336m19689O24276J066040q2740j971085k921567j888635P25631
3113d989264K977786K564118o60721l571696k911362K47694J377086j232396l604690
3104i803445j590397K992595M948202L100075J233846J834523K938909K273571
3096G927879P98755L1918j166151m287901p552726p560676l788863R37243L979834
3087a0680688M827625L874426J458956j467862l222728k638762k1127K981793
3079d888367M088189J849314k510760n401864m347589p82834J835652K192880
3071g965379J832447K040898K045833Q75071o85655j153257m19434M02142P73153
$$ plain form
3131 3507974 5178000 6086549 5354597 2099663 -2241972 -4636090 -3728723 -1271824 126841
3122 126841 -121495 -541184 83092 1149132 1066392 -904693 -3826260 -5714895 -4989264
3113 -4989264 -2011478 552640 -108081 -3679777 -6591139 -6343445 -4966359 -6198755 -9803445
3104 -9803445 -11393842 -8401247 -3453045 -352970 880876 2715399 5654308 7927879
3096 7927879 8726634 8758552 7592401 3304500 -4248226 -11808902 -15597765 -14660522 -10680688
3087 -10680688 -5853063 -1978637 -519681 -1987543 -5210271 -7849033 -7870160 -4888367
3079 -4888367 -800178 1049136 -1461624 -6863488 -11211077 -11993911 -10158259 -7965379
3071 -7965379 -6132932 -4092034 -2046201 -1171130 -1856785 -3010042 -3429476 -3027334 -2254181
3062b254181J291188K354335L076437K163124k44236k262103k314848j118343
3054F91373p02025j464148j490444N24873K959860L263587J461987j53407n93584
3045D498072j274334k902462l337557l47230M552903P084316N021452M09723l268115
3036A0436768m517608l767441j667751Q36186J792713r7479l091008l762299j359888
3027e197807J063979Q31089r05998j399132l54874M02311K87123N37045J742429
3018b993835K996464L495463L030595J065686k378630m923609l675972M48458
3010b935380K978013J661589o36923m90566J212451J378347l12257j527063j330989
3001b778j160954j979834k926073k987051k133355o49849J072311K088682J783883
$$ plain form
3062 -2254181 -962993 1391342 4467779 6630903 6386667 4124564 1809716 691373
3054 691373 -10652 -1474800 -2965244 -2440371 519489 3783076 5245063 5091656 4498072
3045 4498072 3223738 321276 -3016281 -3363511 1189392 8273708 13295160 13704883 10436768
3036 10436768 5919160 2151719 483968 1320154 3112867 3015388 -75620 -3837919 -5197807
3027 -5197807 -4133828 -3302739 -4208737 -5607869 -5962743 -5560432 -5273309 -4736264 -2993835
3018 -2993835 2629 3498092 6528687 7594373 5215743 292134 -3383838 -2935380
3010 -2935380 42633 1704222 1067299 576733 1789184 3167531 2855274 1328211 -2778
3001 -2778 -1163732 -3143566 -6069639 -9056690 -11190045 -11839894 -10767583 -8678901 -6895018
2992f895018J117615J412063K013162R96483j573620k999713j398497J605196
2984e722329K704243P09074k327311l494621k012425K04647R04542J67102N8289
2975h808789J608668L347866L448805K012805K15913j401550k350245j416886
2967c343413J377843L237928J706436j306432j611916J146559K659911P9573l936188
2958A0301m889079j982649J732511L177005J649163j256743k669214n35210L850712
2949i13203O321020M129355r58970m781765m964540k117986J649394L889882K769896
2940E023083j097380m314497l969250r56175J417368J617755R49264Q41978J191894
2931G04040J579435K045793J954295O558l362467n139143k994540J410393M080268
$$ plain form
2992 -6895018 -5777403 -4365340 -2352178 -1355695 -2929315 -5929028 -7327525 -5722329
2984 -5722329 -3018086 -2309012 -4636323 -8130944 -10143369 -9938722 -9034180 -8867078 -8808789
2975 -8808789 -7200121 -3852255 -403450 1609355 1825268 423718 -1926527 -3343413
2967 -3343413 -1965570 1272358 2978794 1672362 60446 1207005 3866916 3946489 10301
2958 10301 -4878778 -6861427 -5128916 -1951911 -302748 -1559491 -4228705 -4763915 -913203
2949 -913203 5407817 9537172 8578202 3796437 -1168103 -3286089 -1636695 2253187 5023083
2940 5023083 3925703 -388794 -4358044 -5314219 -3896851 -2279096 -1329832 -487854 704040
2931 704040 2283475 4329268 6283563 6290121 2927654 -2211489 -5206029 -3795636 284632
2922B84632L333898J204952K25892N38829P92094L68272m28374j334808j930486
2913C054901j229066J004319K983979K633416M29503j219938j367974j195782
2905E093358j104653J34945K243457K331086q47261l892500k928381Q96771L274741
2896E201563K875317J977585J567775p2051l278046n301871m217482j653753p7813
2887b978776K33760J13834k46137m65889M35173K150476K842884K036961J399435
2878E521721J367812l1200l055871m193169j246887K305438J822055j674336l354815
2869b539252j976949r22630k113017l241988j864049J290955M174800N764808
2861a427322N612162L604199J080746q5320j57231r78131k427239k338178o18333
$$ plain form
2922 284632 3618530 4823482 5049374 5588203 6380297 6748569 6320195 4985387 3054901
2913 3054901 1825835 2830154 5814133 8447549 8877052 7657114 6289140 5093358
2905 5093358 3988705 4123650 6367107 8698193 7850932 3958432 1030051 1926822 5201563
2896 5201563 8076880 10054465 11622240 11550189 8272143 2970272 -1247210 -2900963 -2978776
2887 -2978776 -2745016 -2631182 -2877319 -3343208 -2908035 -757559 2085325 4122286 5521721
2878 5521721 6889533 6858333 3802462 -390707 -1637594 667844 2489899 815563 -2539252
2869 -2539252 -4516201 -5438831 -7551848 -10793836 -12657885 -11366930 -7192130 -1427322
2861 -1427322 4184840 7789039 8869785 8784465 8627234 7649103 5221864 2883686 2265353
2852B265353q0737j719405k543026m03241K083753J488014j013364j798842p25364
2843b446859p89355k450651k549565L48301L240273L062169R22488k87134l64301
2834a314634j086299k238937j549059J238558L031324J407533j959263l584855
2826f055632k654116j283497r26653o99394M43903J802018K174162J751614J643434
2817c804161K193087K641991K089488L63997j572051k051978n03521J226327Q94127
2808A477306o40041j47290K960376N036270L373012K84311p44137o14597k504031
2799H481179n676861n983923k463140R86971J476982P07321J103431J932434J533575
2790B097969O18985P80643J600166J531247L13785j219199k403020k494681q68697
$$ plain form
2852 2265353 2184616 465211 -2077815 -2481056 -397303 1090711 77347 -1721495 -2446859
2843 -2446859 -3236214 -5686865 -8236430 -7888129 -4647856 -1585687 -663199 -950333 -1314634
2834 -1314634 -2400933 -4639870 -6188929 -4950371 -1919047 -511514 -2470777 -6055632
2826 -6055632 -8709748 -9993245 -10919898 -11619292 -11175389 -9373371 -7199209 -5447595 -3804161
2817 -3804161 -1611074 1030917 3120405 3484402 1912351 -139627 -643148 583179 1477306
2808 1477306 837265 689975 3650351 8686621 12059633 12343944 11599807 10985210 8481179
2799 8481179 2804318 -3179605 -5642745 -4655774 -3178792 -2471471 -1368040 564394 2097969
2790 2097969 2716954 3497597 5097763 6629010 6942795 5723596 3320576 825895 -42802
2781d2802J228351J183173j113144k167423K66967L519469L793427J559708K2795
2772H250521j28807p72292k078536k070727m71030N33343m0724n79235K6125O24962
2762C293600K40182j66864L24316Q61177M58698k96250o05205j095774k466331
2753E47549l442482j910216J909586M749346L531589r05957m108965k777750J154960
2744a252340K710178K88713k345040j738904K51513k4727j627837m52188L529829
2735f60803N220404J798929k945120l927217j210117J545385K547078K680090
2727E048629K437124J231143o73491j975183k054677j357272m78092j25350j124856
2718I27975k976680l397311j055809K150946L470180K995700K715383K696555
$$ plain form
2781 -42802 1185549 2368722 1255578 -911845 -644878 2874591 6668018 8227726 8250521
2772 8250521 8121714 7349422 5270886 3200159 2729129 3262472 3221748 2642513 2668638 3293600
2762 3293600 3533782 3366918 3691234 4552411 5011109 4714859 4109654 3013880 547549
2753 547549 -2894933 -4805149 -2895563 1853783 5385372 4479415 370450 -2407300 -1252340
2744 -1252340 1457838 1746551 -598489 -2337393 -2085880 -2110607 -3738444 -4190632 -660803
2735 -660803 4559601 6358530 3413410 -513807 -1723924 -178539 2368539 5048629
2727 5048629 7485753 8716896 8043405 6068222 4013545 2656273 2178181 2052831 927975
2718 927975 -2048705 -5446016 -6501825 -4350879 -880699 2115001 4830384 7526939
2710G526939J184167j543682k614329q66000R90698J80875k193119k995807j482149
2701a812407K25247M14118m35767j082239j100166o79492O409P21395J094712
2692b648190R56526L93312m65099j198026r05293P76587K525664K496245J018189
2683B949915O37811K409024L608819J112289l763268o277046m212430l04647J941665
2674a897868K211576J742827M80822j544000k151720J97731K722937J281875l235524
2665a91344n464669l096458K27986J063646J117895L212277N639525M560757K72055
2656G341670k941410k682005p36743M92328P66000P16477L98771J1645J45125
2647C511858N84053M31314j65282q1322N93965L06345j299534k311122j320600
$$ plain form
2710 7526939 8711106 7167424 4553095 3687095 4677793 4858668 2665549 -330258 -1812407
2701 -1812407 -1587160 -1173042 -1608809 -2691048 -3791214 -4470706 -4464297 -3742902 -2648190
2692 -2648190 -1691664 -1298352 -1763451 -2961477 -3866770 -3090183 -564519 1931726 2949915
2683 2949915 3587726 5996750 9605569 10717858 6954590 677544 -3534886 -3839533 -1897868
2674 -1897868 313708 2056535 2537357 993357 -1158363 -960632 1762305 3044180 -191344
2665 -191344 -5656013 -8752471 -8524485 -7460839 -6342944 -3130667 2508858 7069615 7341670
2656 7341670 4400260 1718255 981512 1473840 2239840 2956317 3355088 3366733 3511858
2647 3511858 4095911 4527225 4361943 4280621 4874586 5180931 3881397 1570275 249675
2638B49675K53996J58491j359372j925512n20427J024475O20901j044209j425530
2629c967512o1129J24650l009115o538037n321276N80467M873330L396861J13589
2620i808172J056436M924415N096135K68959l060565l87659M043720L775722o29162
2611E279829l350662j878519Q32677J782496J183381K05991q53064j366162k96893
2602A539074J569750J670041q16559l308151k947029l8830K718940L321895J807230
2593E516361m55860j811221j395003m789P04765L59128K29815R06394R94817o31148
2583D413259k534526k548340j213760j146205k899491l739058j437217K533768
2575h571570M891968M254825J633802j397675l292591k519653P07993L344311
$$ plain form
2638 249675 503671 662162 -697210 -2622722 -3143149 -2118674 -1497773 -2541982 -3967512
2629 -3967512 -4028641 -3903991 -6913106 -13451143 -18772419 -18191952 -13318622 -9921761 -9808172
2620 -9808172 -8751736 -3827321 1268814 1537773 -1522792 -1910451 2133269 5908991 5279829
2611 5279829 1929167 50648 883325 2665821 3849202 4055193 3202129 1835967 1539074
2602 1539074 3108824 4778865 3962306 654155 -2292874 -2331704 387236 3709131 5516361
2593 5516361 5060501 3249280 1854277 1849488 2554253 2913381 3143196 4049590 5044407 4413259
2583 4413259 1878733 -669607 -1883367 -3029572 -5929063 -9668121 -11105338 -8571570
2575 -8571570 -3679602 575223 2209025 811350 -2481241 -5000894 -4292901 -948590
2567i48590K643607P5928o04897R18321J173238j053307k306353j77173K344120
2558B064894J517298j257538k293913j847377k518181l131138j73069M848263
2550b790761N807382J250484k613909j035710K453719K308975m22328q94144J192641
2541E256349J747719n75368k829516l206971l134013l254715j774489J543615
2533f227389L357584J149478k631369l286057L06903M448007M920618J454917
2525C492692k164017k158453J132496L685038K661517j78729j032619R51418K936039
2516I325382K212561r49790m132731m956518k636030J146796L111768J605592
2508D727030j276840k248042r67797K44131K93448L88385J115974J123185l10280
$$ plain form
2567 -948590 1695017 1770945 1166048 2084369 3257607 2204300 -102053 -279226 2064894
2558 2064894 3582192 2324654 30741 -1816636 -4334817 -7465955 -7639024 -2790761
2550 -2790761 3016621 4267105 1653196 617486 3071205 5380180 4957852 4063708 5256349
2541 5256349 7004068 6428700 3599184 392213 -2741800 -5996515 -7771004 -6227389
2533 -6227389 -2869805 -1720327 -4351696 -7637753 -7330850 -2882843 2037775 3492692
2525 3492692 1328675 -829778 302718 3987756 6649273 6470544 5437925 6389343 9325382
2516 9325382 11537943 10588153 6455422 1498904 -1137126 9670 3121438 4727030
2508 4727030 3450190 1202148 234351 478482 771930 1160315 2276289 3399474 3089194
2499C089194j538917p66611J409135K870420K450196O69904j223406k322089k660868
2490A976958k912265l080862k145603n471J260809L1861j689902l90025L664959
2481c289541O031347L740460j079086m275129m247380k287491k75602N72335P7608
2472e032479o03053j05302J189022J718857J491357K201601M013678M575830K407640
2463A1857151q77341l088677m162836m822620m506911k561675o6319J359234J597047
2454e272947J551628J648209J824371J877655J131663p92671k481117k086837
2446b600046o04366r38329k838802k326024J949806N447523L786055j060800m036405
2437c221388l733819k082667J57915L099853M708863K925660o2944k88306J697846
$$ plain form
2499 3089194 1550277 783666 2192801 5063221 7513417 8183321 6959915 4637826 1976958
2490 1976958 -935307 -4016169 -6161772 -6167243 -4906434 -4874573 -6564475 -6954500 -3289541
2481 -3289541 2741806 6482266 5403180 1128051 -3119329 -5406820 -5682422 -5110087 -5032479
2472 -5032479 -5635532 -5740834 -4551812 -2832955 -1341598 860003 4873681 9449511 11857151
2463 11857151 10979810 7891133 3728297 -1094323 -5601234 -8162909 -8229228 -6869994 -5272947
2454 -5272947 -3721319 -2073110 -248739 1628916 2760579 1967908 -513209 -2600046
2446 -2600046 -3204412 -4142741 -6981543 -9307567 -7357761 -1910238 1875817 815017 -3221388
2437 -3221388 -6955207 -9037874 -8879959 -5780106 -1071243 1854417 1791473 1503167 3201013
2428C201013J554172j811209m533897l827936j488674j87653R37R333M903N56102
2418f522909K531802M535545L435360j021117m825999m552120j262621J777506
2410e904553K987469K686003J622983P91479J003336J671075J656649J562399
2402H076840K766453M045526K487668j455508l538412j837145M19604J67494j096372
2393A0036148r37609l87606j228199j979981o84616P18378p64955l607733l598771
2384b434944l95567K193773K214419J539518J516128Q22119j169990k477813j696937
2375A10706m17825o58396j816621j790598J80152K931449M619526M011365J676429
2366H846187L2198O92272J787014J436m430343p246502n619447j700176P40002
$$ plain form
2428 3201013 4755185 2943976 -1589921 -5417857 -6906531 -7094184 -7093247 -7083914 -7079011 -6522909
2418 -6522909 -3991107 544438 3979798 2958681 -1867318 -6419438 -7682059 -5904553
2410 -5904553 -2917084 -231081 1391902 2183381 3186717 4857792 6514441 8076840
2402 8076840 10843293 14888819 17376487 15920979 12382567 10545422 10965026 11132520 10036148
2393 10036148 9098539 8710933 7482734 5502753 4818137 5536515 4771560 1163827 -2434944
2384 -2434944 -2830511 -636738 1577681 3117199 4633327 5455446 4285456 1807643 110706
2375 110706 -307119 -965515 -2782136 -4572734 -4392582 -1461133 3158393 7169758 8846187
2366 8846187 8878385 9570657 11357671 11359107 6928764 -317738 -5937185 -7637361 -6897359
2357f897359R69834O37759M19629k9071O4758J873558M338599M901347L212354
2348I491408J707947J691091J202442j545860m477967l937675k9496K956062J959005
2339I016957j174553k578112j187823J000073K237767K390369J498131n77669
2331A0625140k654661k559496m0361K281149K121643L65893o86075o69209r64066
2322G819957j944072k470454k060915j675879j872343j686826j97970J788886
2314b299616K580060J686450K89484l26954k26558l98342j113026j337714k79676
2305a425892R57882L89673k018437l777196k876824l05309J515589J903994J996582
2296c639938K141620J163157j284388l206647k322552J001496L953515M345848
$$ plain form
2357 -6897359 -5927525 -5289766 -4870137 -4899208 -4834450 -2960892 1377707 6279054 9491408
2348 9491408 11199355 12890446 14092888 12547028 8069061 4131386 4101890 7057952 9016957
2339 9016957 7842404 5264292 4076469 5076542 7314309 9704678 11202809 10625140
2331 10625140 7970479 5410983 5370622 7651771 9773414 10139307 9453232 8784023 7819957
2322 7819957 5875885 3405431 1344516 -331363 -2203706 -3890532 -4088502 -2299616
2314 -2299616 280444 1966894 2256378 1929424 1702866 1304524 191498 -1146216 -1425892
2305 -1425892 -468010 -78337 -2096774 -5873970 -8750794 -9056103 -7540514 -5636520 -3639938
2296 -3639938 -1498318 -335161 -1619549 -4826196 -7148748 -6147252 -2193737 2152111
2288B152111K689528R92961J88487m59763j503408j971444p35182J401559K320090
2279E074939J405015M50456J124536K567751K511399K31813k607371l900760l094784
2270C762994j168620P58799K327605L411202L207628Q38861k811451n057108m358328
$$ plain form
2288 2152111 4841639 5834600 6023087 5563324 4059916 2088472 1353290 2754849 5074939
2279 5074939 6479954 6930410 8054946 10622697 13134096 13365909 10758538 6857778 3762994
2270 3762994 2594374 3353173 5680778 9091980 12299608 13138469 10327018 5269910 911582
$$ [...]
##END NTUPLES=NMR SPECTRUM
##END=
