##TITLE=31Pdec_DE-78H3
 D2O, 64 sc
 31.1.2025
##JCAMPDX= 6.0         $$ Bruker NMR JCAMP-DX V2.0
##DATA TYPE= NMR SPECTRUM
##DATA CLASS= NTUPLES
##ORIGIN= UXNMR, Bruker Analytische Messtechnik GmbH
##OWNER= root
$$ XWIN-NMR		Version 3.5
$$ Fri Jan 31 14:21:14 2025 Russian Standard Time (UT+4h)  she@DPX200
##.OBSERVE FREQUENCY= 81.013821
##.OBSERVE NUCLEUS= ^31P
##.ACQUISITION MODE= SIMULTANEOUS
##.ACQUISITION SCHEME= undefined
##.AVERAGES= 64
##.DIGITISER RES= 17
##SPECTROMETER/DATA SYSTEM= spect
##.PULSE SEQUENCE= zgpg30
##.SOLVENT NAME= CDCl3
##.SHIFT REFERENCE= (INTERNAL, CDCl3, 0, 198.062)
##AUDIT TRAIL= $$ (NUMBER, WHEN, WHO, WHERE, WHAT)
$$ ##TITLE= Audit trail, XWIN-NMR		Version 3.5
$$ ##JCAMPDX= 5.01
$$ ##ORIGIN= Bruker BioSpin GmbH
$$ ##OWNER= she
$$ F:/spectra/data/she/nmr/P31/2/pdata/1/auditp.txt
$$ ##AUDIT TRAIL=  $$ (NUMBER, WHEN, WHO, WHERE, WHAT)
(   1,<2025-01-31 14:20:02.87 +0400>,<she>,<DPX200>,
      <created by zg, POWCHK disabled, PULCHK disabled
       configuration hash MD5:
       00 E9 B6 7A A2 85 ED C7 34 08 36 98 17 FE 4E 26
       data hash MD5: 32K
       2D 0F 56 64 83 18 A5 AD AD AC 7A 40 72 3F F1 C6>)
(   2,<2025-01-31 14:20:05.15 +0400>,<she>,<DPX200>,
      <Start of raw data processing
       efp BC_mod = 2 LB = 1.5 FT_mod = 6 PKNL = 1 PHC0 = 1587.805 PHC1 = 460.2905 SI = 64K 
       data hash MD5: 64K
       0E 04 40 EA 3C AA B4 BD 55 58 C2 C4 DB 83 C7 1A>)
(   3,<2025-01-31 14:20:20.45 +0400>,<she>,<DPX200>,
      <pk PHC0 = 21.4248 PHC1 = 0 
       data hash MD5: 64K
       F8 84 A8 E3 A0 72 2E 2E 14 0C DA E2 0F C5 9A 68>)
(   4,<2025-01-31 14:20:36.89 +0400>,<she>,<DPX200>,
      <pk PHC0 = -18 PHC1 = 0 
       data hash MD5: 64K
       39 FA C3 83 E9 6D B9 AF 40 43 99 3C 93 D8 4C 04>)
(   5,<2025-01-31 14:20:47.09 +0400>,<she>,<DPX200>,
      <abs ABSG = 5 
       data hash MD5: 64K
       31 06 55 A5 D4 9A B7 23 29 DC 99 D3 91 87 6F A4>)
$$ ##END=
$$ 
$$ hash MD5
$$ 5B CE 8C E2 43 EA 75 1C 4C 0C CD 90 5C FB 74 42
##$RELAX= 
##$RELAX= 
##$RELAX= 
##$RELAX= 
##$RELAX= 
##$RELAX= 
##$RELAX= 
##$RELAX= 
$$ Bruker specific parameters
$$ --------------------------
##$DU= <F:/spectra>
##$EXPNO= 2
##$NAME= <P31>
##$PROCNO= 1
##$TYPE= <nmr>
##$USER= <she>
##$AMP= (0..31)
100 100 100 100 100 100 100 100 100 100 100 100 100 100 100 100 100 100 
100 100 100 100 100 100 100 100 100 100 100 100 100 100 
##$AQSEQ= 0
##$AQ_mod= 1
##$AUNM= <au_zg>
##$AUTOPOS= <>
##$BF1= 81.014009
##$BF2= 200.13
##$BF3= 200.13
##$BF4= 200.13
##$BF5= 200.13
##$BF6= 200.13
##$BF7= 200.13
##$BF8= 200.13
##$BYTORDA= 1
##$CFDGTYP= 0
##$CFRGTYP= 5
##$CHEMSTR= <none>
##$CNST= (0..31)
1 1 145 1 1 1 1 1 1 1 1 1 1 1 1 1 1 1 1 1 1 1 1 1 1 1 1 1 1 1 1 1 
##$CPDPRG= <waltz16>
##$CPDPRG1= <>
##$CPDPRG2= <waltz16>
##$CPDPRG3= <>
##$CPDPRG4= <mlev>
##$CPDPRG5= <mlev>
##$CPDPRG6= <mlev>
##$CPDPRG7= <mlev>
##$CPDPRG8= <mlev>
##$CPDPRGB= <>
##$CPDPRGT= <>
##$D= (0..31)
0 1 0 0 0 0 0 0 0 0.06 0 0.03 2e-05 3e-06 0 0 0.0002 0 0 0 0 0 0 0 0 0 
0 0 0 0 0 0 
$$ [...]
##$SUBNAM3= <"">
##$SUBNAM4= <"">
##$SUBNAM5= <"">
##$SUBNAM6= <"">
##$SUBNAM7= <"">
##$SUBNAM8= <"">
##$SUBNAM9= <"">
##$SW= 400.765351723535
##$SWIBOX= (0..15)
0 1 3 0 0 0 0 0 0 0 0 0 0 0 0 0 
##$SW_h= 32467.5324675325
##$TD= 32768
##$TD0= 1
##$TE= 0
##$TE2= 300
##$TE3= 300
##$TEG= 300
##$TL= (0..7)
0 120 53 12 22 120 120 120 
##$TP= (0..7)
150 150 150 150 150 150 150 150 
##$TP07= 0
##$TPNAME0= <>
##$TPNAME1= <>
##$TPNAME2= <>
##$TPNAME3= <>
##$TPNAME4= <>
##$TPNAME5= <>
##$TPNAME6= <>
##$TPNAME7= <>
##$TPOAL= (0..7)
0.5 0.5 0.5 0.5 0.5 0.5 0.5 0.5 
##$TPOFFS= (0..7)
0 0 0 0 0 0 0 0 
##$TUNHIN= 0
##$TUNHOUT= 0
##$TUNXOUT= 0
##$USERA1= <user>
##$USERA2= <user>
##$USERA3= <user>
##$USERA4= <user>
##$USERA5= <user>
##$V9= 5
##$VALIST= <valist>
##$VCLIST= <CCCCCCCCCCCCCCC>
##$VD= 0
##$VDLIST= <DDDDDDDDDDDDDDD>
##$VPLIST= <PPPPPPPPPPPPPPP>
##$VTLIST= <TTTTTTTTTTTTTTT>
##$WBST= 1024
##$WBSW= 4
##$XGAIN= (0..3)
0 0 0 0 
##$XL= 0
##$YL= 0
##$YMAX_a= 9141
##$YMIN_a= -6135
##$ZGOPTNS= <>
##$ZL1= 120
##$ZL2= 120
##$ZL3= 120
##$ZL4= 120
##$ABSF1= 198.0616
##$ABSF2= -202.7028
##$ABSG= 5
##$ABSL= 3
##$ALPHA= 0
##$AQORDER= 0
##$ASSFAC= 0
##$ASSFACI= 0
##$ASSFACX= 0
##$ASSWID= 0
##$AUNMP= <proc_1d>
##$AZFE= 0.1
##$AZFW= 0.5
##$BCFW= 0
##$BC_mod= 2
##$BYTORDP= 0
##$COROFFS= 0
##$CY= -3
##$DATMOD= 1
##$DC= 0
##$DFILT= <>
##$DTYPP= 0
##$F1P= 0
##$F2P= 0
##$FCOR= 1
##$FTSIZE= 65536
##$FT_mod= 6
##$GAMMA= 0
##$GB= 0
##$INTBC= 1
##$INTSCL= 9.790993e-09
##$ISEN= 30
##$LB= 1.5
##$LEV0= 0
##$LPBIN= 0
##$MAXI= 10000
##$MC2= 0
##$MEAN= 0
##$ME_mod= 0
##$MI= 50
##$NCOEF= 0
##$NC_proc= -9
##$NLEV= 6
##$NOISF1= 182.463
##$NOISF2= 159.3651
##$NSP= 0
##$NTH_PI= 0
##$NZP= 0
##$OFFSET= 198.0616
##$PC= 4
##$PHC0= 1591.23
##$PHC1= 460.2905
##$PH_mod= 1
##$PKNL= yes
##$PPARMOD= 0
##$PSCAL= 0
##$PSIGN= 0
##$REVERSE= no
##$SF= 81.0140089999434
##$SI= 65536
##$SIGF1= 159.3651
##$SIGF2= -187.1042
##$SINO= 113.3802
##$SIOLD= 16384
##$SREGLST= <1H.CDCl3>
##$SSB= 0
##$STSI= 65536
##$STSR= 0
##$SW_p= 32467.5324675325
##$SYMM= 0
##$S_DEV= 0
##$TDeff= 32768
##$TDoff= 0
##$TI= <>
##$TILT= no
##$TM1= 0
##$TM2= 0
##$TOPLEV= 0
##$USERP1= <user>
##$USERP2= <user>
##$USERP3= <user>
##$USERP4= <user>
##$USERP5= <user>
##$WDW= 1
##$XDIM= 65536
##$YMAX_p= 426808728
##$YMIN_p= -158024599
$$ End of Bruker specific parameters
$$ ---------------------------------
##NTUPLES= NMR SPECTRUM
##VAR_NAME=  FREQUENCY,     SPECTRUM/REAL,   SPECTRUM/IMAG
##SYMBOL=    X,             R,               I
##VAR_TYPE=  INDEPENDENT,   DEPENDENT,       DEPENDENT
##VAR_FORM=  AFFN,          ASDF,            ASDF
##VAR_DIM=   65536,         65536,           65536
##UNITS=     HZ,            ARBITRARY UNITS, ARBITRARY UNITS
##FACTOR=    0.49542278885378, 1,            1
##FIRST=     16045.7642231865, 0,            0
##LAST=      -16421.768244346, 0,            0
##MIN=       -16421.768244346, -158024599,   0
##MAX=       16045.7642231865, 426808728,    0
$$ Real data points
##PAGE= N=1
##DATA TABLE= (X++(R..R)), XYDATA
$$ [...]
7369h642797j907174L089250K403135j746988l347354q35695K513949L594916
$$ -8642797 -10549971 -7460721 -5057586 -6804574 -10151928 -10987623 -8473674 -4878758
7361d878758J884087j335607l749428l268401k64810K660112M201653N583493
$$ -4878758 -2994671 -4330278 -8079706 -11348107 -11612917 -8952805 -4751152 832341
7353H32341O913620N275085o35071o455936o907936l286835j520832l004506k820741
$$ 832341 7745961 13021046 12385975 5930039 -977897 -4264732 -5785564 -8790070 -11610811
7344a1610811J356021M292837J295774l097977q73239O760990R686849L236824
$$ -11610811 -10254790 -5961953 -4666179 -7764156 -8637395 -1876405 7810444 11047268
7336A1047268m585537m479015Q59450J575661l787796n993607K71115P442555
$$ 11047268 6461731 1982716 2842166 4417827 630031 -5363576 -5092461 2350094
7328B350094N784928k581668p466681n453656k825701l910920m884458j796260
$$ 2350094 8135022 5553354 -1913327 -7366983 -10192684 -14103604 -18988062 -20784322
7320b0784322K584389M437969N309066P252122O873204J220794m541757l630519
$$ -20784322 -18199933 -13761964 -8452898 -1200776 5672428 6893222 2351465 -1279054
7312a279054R23547N98129m157774m293798K062799N435509M49058n317067m291228
$$ -1279054 -355507 242622 -3915152 -8208950 -6146151 -710642 -261584 -5578651 -9869879
7303i869879r29199k068340l653391J721979R730834R379802O91532n174509l493591
$$ -9869879 -10799078 -12867418 -16520809 -14798830 -5067996 4311806 5003338 -171171 -3664762
7294c664762j538516m219874n686833m86688O204567O483472J586694j030630
$$ -3664762 -5203278 -9423152 -15109985 -15596673 -9392106 -2908634 -1321940 -2352570
7286b352570J404592M895656N145950J712083k591958l695869M8241M431858L094744
$$ -2352570 -947978 3947678 9093628 10805711 8213753 4517884 4566125 8997983 12092727
7277A2092727l582135p856864n352604r92448m24015j254522J340383N011064
$$ 12092727 8510592 653728 -4698876 -5691324 -6115339 -7369861 -6029478 -1018414
7269a018414L767449j362987k987358J556661O533366O395496K533856m82633
$$ -1018414 2749035 1386048 -1601310 -44649 6488717 12884213 15418069 14935436
7261A4935436j190988j319733k151429k977149k319688L7168J947705P29521k977948
$$ 14935436 13744448 12424715 10273286 7296137 4976449 5013617 6961322 7690843 4712895
7252D712895m887598k432589J360806J894634p65901k776454k379031j331752
$$ 4712895 -174703 -2607292 -1246486 648148 -117753 -2894207 -5273238 -6604990
7244f604990r45376k50892J380619K588829J951985o9672j657546j245638J107366
$$ -6604990 -7550366 -7801258 -6420639 -3831810 -1879825 -1949497 -3607043 -4852681 -3745315
7235c745315L299005L095274J042082k06072l1334n66822k052974j181397L305831
$$ -3745315 -446310 2648964 3691046 3484974 3453640 2886818 833844 -347553 2958278
7226B958278P061368N962390K264345L98287m94837m254681r760494j1430277
$$ 2958278 10019646 15982036 18246381 18644668 18149831 13895150 4134656 -7295621
7218g295621p365795j553188K283057M027070M023840J665115j734788l029002
$$ -7295621 -14661416 -16214604 -13931547 -9904477 -5880637 -4215522 -5950310 -8979312
7210h979312j581642M14K22321J43981o6062j899386m649351m603589J61271O871759
$$ -8979312 -10560954 -10560540 -10338219 -10194238 -10260300 -12159686 -16809037 -21412626 -21251355 -14379596
7200a4379596J1035976J0134841M427383k945584o807248m306035J365454M494034
$$ -14379596 -3343620 6791221 11218604 8273020 1465772 -2840263 -1474809 3019225
7192C019225L449480O06386k581611n686534o073322j690496L512607L578844
$$ 3019225 6468705 7075091 4493480 -1193054 -7266376 -8956872 -5444265 -1865421
7184a865421o3826l89830L531058M823577O55297k908720j531041L01917k006304
$$ -1865421 -1929247 -2319077 1211981 6035558 6690855 3782135 2251094 2553011 546707
7175E46707m860922l230427N08577J254337l08311m83363M89109N48659P08140
$$ 546707 -4314215 -7544642 -7036065 -5781728 -6090039 -6573402 -6084293 -5535634 -4827494
7166d827494J754443O22311l416247m011814K939393J0071378Q168779J254290
$$ -4827494 -3073051 -2450740 -5866987 -9878801 -6939408 3131970 11300749 12555039
7158A2555039R93797P808278R663093Q56430r536217j1633773p186890k964834
$$ 12555039 13548836 21357114 31020207 31876637 22340420 10706647 3519757 554923
7150E54923k73477K408659K921462r39040n169721m046088Q86426K391121k049410
$$ 554923 281446 2690105 5611567 4672527 -497194 -4543282 -3656856 -1265735 -3315145
7141c315145o338659l765798L959397Q047849L011262n906547q055980n29407
$$ -3315145 -9653804 -13419602 -9460205 -1412356 1598906 -4307641 -12363621 -12893028
7133a2893028P594834O919726j26225m087236k582197j986431n395425p385166
$$ -12893028 -5298194 1621532 1495307 -2591929 -5174126 -7160557 -12555982 -19941148
7125a9941148l374820L035618O102708N535373L851115J331953j763965k517845
$$ -19941148 -23315968 -20280350 -14177642 -8642269 -4791154 -3459201 -5223166 -7741011
7117g741011K52131K849324K567449K410366M706056M627350k896495j3152356
$$ -7741011 -7488880 -4639556 -2072107 338259 5044315 9671665 6775170 -6377186
7109f377186j6426926j1050794l840746J352322O804323J2147134J1843320M821153
$$ -6377186 -22804112 -33854906 -37695652 -36343330 -29539007 -17391873 -5548553 -727400
7101g27400j309185o63078K526060J594782j593651k79126N621056Q847436N263175
$$ -727400 -2036585 -2699663 -173603 1421179 -172472 -451598 5169458 14016894 19280069
7092A9280069j084724m307729l426696j330816n49240j716899l689593l837032
$$ 19280069 18195345 13887616 10460920 9130104 8580864 6863965 3174372 -662660
7084f62660m21630M161630M821980O5469n129192m911853J04533L484473Q83414
$$ -662660 -1084290 3077340 7899320 7964789 2835597 -2076256 -1971723 1512750 2396164
7075B396164m664313o328616j496659N063928O576835K150271k209205j127137
$$ 2396164 -2268149 -8596765 -10093424 -5029496 1547339 3697610 1488405 361268
7067C61268L305528M440271j4129n198501n923302l013981o84485j87229O13979
$$ 361268 3666796 8107067 8092938 2894437 -3028865 -6042846 -6727331 -6914560 -6300581
7058f300581K644524M168663L857101K268949O1229k310466k743286J068929O852027
$$ -6300581 -3656057 512606 4369707 6638656 6699885 4389419 1646133 2715062 9567089
7049I567089P976420J400438p081334r055059l573042K572351L933281J730907
$$ 9567089 17543509 18943947 11862613 2807554 -765488 1806863 5740144 7471051
7041G471051l65211j611389l050318l921045k507549M60667K097010J035137j212956
$$ 7471051 7105840 5494451 2444133 -1476912 -3984461 -3523794 -1426784 -391647 -1604603
7032a604603k654715k707206j460064R15092L158802L151755N58126k119615k672331
$$ -1604603 -4259318 -6966524 -8426588 -7511496 -4352694 -1200939 -642813 -2762428 -5434759
7023e434759k055398k169329k165022o3986K504460J242783l990512p144102l367760
$$ -5434759 -7490157 -9659486 -11824508 -11888494 -9384034 -8141251 -12131763 -19275865 -22643625
7014b2643625M396543R336068R121072O838600N149962L514717Q45740k535005
$$ -22643625 -18247082 -8911014 210058 7048658 12198620 15713337 16559077 14024072
7006A4024072n628700o838849m168833J553973M972603J961577l813508n106113
$$ 14024072 8395372 1556523 -2612310 -1058337 3914266 5875843 2062335 -3043778
6998c043778j385405J044631m17292j068678K000696M403505K123652j579389
$$ -3043778 -4429183 -3384552 -3801844 -4870522 -2869826 1533679 3657331 2077942
6990B077942k105636j145688k726648n932641p184841n831692k114624N603163
$$ 2077942 -27694 -1173382 -3900030 -9832671 -17017512 -22849204 -24963828 -19360665
6982a9360665J5019169J6611201N164843r199491j1772364k903105L963307K851597
$$ -19360665 -4341496 12269705 17434548 8235057 -3537307 -6440412 -2477105 374492
6974C74492J381066M714065O636910K235410k035205Q32030O288995O132194J925383
$$ 374492 1755558 6469623 13106533 15341943 13306738 14138768 20427763 26559957 28485340
6965B8485340P48337K052028r30206q391706j2190122p735581k44718K702266
$$ 28485340 29233677 31285705 30355499 21963793 9773671 2038090 1793372 4495638
6957D495638m17030n610750q167487n590642R33996O782918P812378M491314O01297
$$ 4495638 4078608 -1532142 -9699629 -15290271 -14356275 -7573357 239021 4730335 5331632
6948E331632j417367j923200k205154l555207o824215j0343603r933048l990438
$$ 5331632 3914265 1991065 -214089 -3769296 -10593511 -20937114 -30870162 -34860600
6940c4860600L045686N720738M561529M240102N989804O314816L056756j528313
$$ -34860600 -31814914 -26094176 -21532647 -17292545 -11302741 -4987925 -1931169 -3459482
6932c459482m415203n019546l849710q59690L601558P913587J0002755Q443154
$$ -3459482 -7874685 -12894231 -16743941 -17603631 -14002073 -6088486 3914269 12357423
6924A2357423L651251j063054j633282J734350L969054J857838j586500k640955
$$ 12357423 16008674 14945620 13312338 15046688 19015742 20873580 19287080 16646125
6916A6646125l170681o483603r933282q102210j827322K711555L414946L913142
$$ 16646125 13475444 6991841 -2941441 -11043651 -12870973 -10159418 -6744472 -2831330
6908b831330N552971M996235J419361q14881N76641J889193n9743k853782l210740
$$ -2831330 2721641 7717876 9137237 8322356 8898997 10788190 10728447 7874665 4663925
6899D663925j968445j108870m05133j47772k404522o193829o447028j711560K219812
$$ 4663925 2695480 1586610 1181477 1033705 -1370817 -7564646 -14011674 -15723234 -13503422
6890a3503422R38544j504340L23425M080336M379212K474955L273159N555151
$$ -13503422 -12564878 -14069218 -13745793 -9665457 -5286245 -2811290 461869 6017020
6882F017020L985927l25237m63271M311606O112564P19054n575075n810449k634327
$$ 6017020 10002947 9677710 9214439 13526045 19638609 20357663 14782588 8972139 6337812
6873F337812l051541p330239r386447o156010j008043J675132Q45618k332482
$$ 6337812 3286271 -4043968 -13430415 -19586425 -20594468 -18919336 -18073718 -20406200
6865b0406200n877437o376268p22672R201399J5917714J3452873M477018k203261
$$ -20406200 -26283637 -32659905 -33382577 -24181178 -8263464 5189409 9666427 7463166
6857G463166j454012L278198N514468L314250p04637m116970n801343m104347
$$ 7463166 6009154 9287352 14801820 18116070 17411433 13294463 7493120 3388773
6849C388773J264272N828597M104248k251312n327146j917283J908016K63443
$$ 3388773 4653045 10481642 14585890 12334578 7007432 5090149 6998165 7261608
6841G261608m124140n517042m036543k955923j387181L137954P578521O536794
$$ 7261608 3137468 -2379574 -6416117 -9372040 -10759221 -7621267 -42746 6494048
6833F494048J169149k321159k251747k205380k819398r24773K641577K746049
$$ 6494048 7663197 5342038 3090291 884911 -1934487 -2859260 -217683 2528366
6825B528366q66053k248214N95560K494001J040816R85203M300169M754956j346206
$$ 2528366 1662313 -585901 9659 2503660 3544476 4529679 8829848 13584804 12238598
6816A2238598p194166n979217k135863l072801n901086l059703L157845L481412
$$ 12238598 5044432 -934785 -3070648 -6143449 -12044535 -15104238 -11946393 -8464981
6808h464981k653501n918048k054520K828389L964278M712966P815046Q843584
$$ -8464981 -11118482 -17036530 -19091050 -16262661 -12298383 -7585417 229629 9073213
6800I073213L870761k981627n300877l009351m94522l4848j178115l085393l828394
$$ 9073213 12943974 9962347 4661470 1652119 1157597 1122749 -55366 -3140759 -6969153
6791f969153q38651M565333O764187L368561p48520p79898P77494r47711m655443
$$ -6969153 -7807804 -3242471 3521716 6890277 6141757 5361859 6139353 5191642 536199
6782E36199n115423j682592J410276K179921K591478L293906K059811j566622
$$ 536199 -4579224 -6261816 -4851540 -2671619 -80141 3213765 5273576 3706954
6774C706954m462555m200524j899824K55921J523029J786045R89656L36452J549331
$$ 3706954 -755601 -4956125 -6855949 -6600028 -5076999 -3290954 -2301298 -1964846 -415515
6765d15515L869364M012707L68514m442742o288501l580445J916929O869232Q385442
$$ -415515 3453849 7466556 7835070 3392328 -2896173 -6476618 -4559689 2309543 10694985
6756A0694985N832770J734812l4105K067523N565659O282858K293282m149594
$$ 10694985 16527755 18262567 18228462 20295985 25861644 32144502 34437784 30288190
6748C0288190q463923q103586n205505l869863m809672m719182j631215J778071
$$ 30288190 21824267 13720681 8515176 4645313 -164359 -4883541 -6514756 -4736685
6740d736685K094644n8546j692053j776107r49514J052696M009497M826203Q08681
$$ -4736685 -2642041 -2700587 -4392640 -6168747 -7118261 -6065565 -2056068 2770135 3578816
6731C578816n341931p908455n219329m84337L736515P260248Q785719O113730
$$ 3578816 -1763115 -9671570 -14890899 -15375236 -11638721 -4378473 4407246 10520976
6723A0520976P36909k935701m106038o024862q566532o713480O31749O612563
$$ 10520976 11257885 8322184 4216146 -1808716 -10375248 -17088728 -16456979 -9844416
6715i844416N640902J308009P9313K019206L475493M290570N507437L963329k747743
$$ -9844416 -4203514 -2895505 -2816192 -796986 2678507 6969077 12476514 16439843 13692100
6706A3692100q830285o882400m27848J41413n571567o143504L363748J1966553
$$ 13692100 4861815 -2020585 -2448433 -2307020 -7878587 -14022091 -10658343 1308210
6698A308210Q350436k449405o705091r47983O044522P339484M542866Q24531l800127
$$ 1308210 9658646 7209241 504150 -443833 5600689 12940173 17483039 18307570 14507443
6689A4507443p987921p197804n17156N354378L590875l677983p836244m478022
$$ 14507443 6519522 -678282 -1195438 4158940 7749815 4071832 -3764412 -8242434
6681h242434J733580L420181n63700m289244k662116J687059J706963l927219
$$ -8242434 -6508854 -3088673 -3652373 -7941617 -10603733 -8916674 -7209711 -11136930
6673a1136930p484800j822943R037967J3557775O699051m212185q975986n903207
$$ -11136930 -18621730 -20444673 -11406706 2151069 8850120 4637935 -4338051 -10241258
6665a0241258j180675J82561p33941l2133L459668O389964M274856k735046q207776
$$ -10241258 -11421933 -11239372 -11973313 -12005446 -8545778 -2155814 2119042 -616004 -8823780
6656h823780o084832J175812M982335K039861j614814o80559J131761j438518
$$ -8823780 -14908612 -13732800 -8750465 -6710604 -8325418 -9005977 -7874216 -9312734
6648i312734m372657K76399J0081779J3263965N691730k517313j827561L430119
$$ -9312734 -13685391 -13408992 -3327213 9936752 15628482 13111169 11283608 14713727
6640A4713727L421911j735114l677422J52795L381140J617008j669801k302692
$$ 14713727 18135638 16400524 12723102 12875897 16257037 17874045 16204244 13901552
6632A3901552j856739l551704o370789p021185m776028j223145K471121N217348
$$ 13901552 12044813 8493109 2122320 -4898865 -9674893 -10898038 -8426917 -3209569
6624c209569M931304P74435m619993p479176o681444l692946o9278L225025N397485
$$ -3209569 1721735 2496170 -2123823 -9602999 -16284443 -19977389 -20046667 -16821642 -11424157
6615a1424157O700911Q463177J0263873Q647328J480745p354044j0927429p072642
$$ -11424157 -4723246 3739931 14003804 22651132 24131877 16777833 5850404 -1222238
6607a222238m46205L550561M016291K886536J182590r25250k566250l413658n118784
$$ -1222238 -1668443 1882118 5898409 8784945 9967535 9042285 6476035 3062377 -2056407
6598b056407q545196j0360465o091181K742217Q313007N754326j05300r18706
$$ -2056407 -10601603 -20962068 -27053249 -24311032 -15998025 -10243699 -10348999 -11267705
6590a1267705L993609P422832N257833K122910L255792N513236J948809o627700
$$ -11267705 -7274096 148736 5406569 7529479 10785271 16298507 18247316 11619616
6582A1619616j0947354n368896M143689P119300J015373o639521p622330j783333
$$ 11619616 672262 -4696634 -552945 6566355 7581728 942207 -6680123 -8463456
6574h463456M136215M847948J975356O03937J815671J588775k131845n008485
$$ -8463456 -4327241 520707 2496063 3100000 4915671 6504446 4372601 -635884
6566f35884k363511L080078M591783J239933j818349k890401o161042j1969405
$$ -635884 -2999395 80683 4672466 5912399 4094050 1203649 -4957393 -16926798
6558a6926798j2460626l000357P969593Q796641J224779k034675M122776J0574738
$$ -16926798 -29387424 -32387781 -24418188 -15621547 -14396768 -16431443 -12308667 -1733929
6550a733929Q531165J858421r78213n30451l421210r007029q739956j10089P402185
$$ -1733929 6797236 8655657 7677444 7146993 3725783 -5281246 -14021202 -14131291 -6729106
6541f729106N187477j712631j764832O123856J1101334O215653k349281n441988
$$ -6729106 -1541629 -3254260 -5019092 1104764 12206098 18421751 16072470 10630482
6533A0630482l427780k423304l139054j556470J724442J668620j610404k091365
$$ 10630482 7202702 4779398 1640344 83874 1808316 3476936 1866532 -224833
6525b24833J506479K816208q63930k679085K534973Q307384N643562k983261p327745
$$ -224833 1281646 4097854 3233924 554839 3089812 11397196 17040758 14057497 6729752
6516F729752m002883J089256L208321L073913J085536m194313j0350942j1415413
$$ 6729752 2726869 3816125 7024446 10098359 11183895 6989582 -3361360 -14776773
6508a4776773o348417j202327m42907j563149o57577J950640M327624O271245
$$ -14776773 -21125190 -22327517 -22770424 -24333573 -24991150 -23040510 -18712886 -12441641
6500a2441641P133098M744746m61751m195218l933933k007752o60663J457459
$$ -12441641 -5308543 -563797 -1025548 -5220766 -9154699 -11162451 -11823114 -10365655
6492a0365655M764210N453965J141130l946722m246438n96492J971627J889300
$$ -10365655 -5601445 -147480 993650 -2953072 -7199510 -7796002 -5824375 -3935075
6484c935075J593251J920098J038820j153571j895843K68612L037572L112601
$$ -3935075 -2341824 -421726 617094 -536477 -2432320 -2163708 873864 3986465
6476C986465L0679l215965l154036j20798Q82473l942801j0638021j0940717l536700
$$ 3986465 4017144 801179 -2352857 -2473655 -1591182 -5533983 -16172004 -27112721 -30649421
6467c0649421L168738K640877m86646K059714R222879J2065652O817030l45479
$$ -30649421 -27480683 -24839806 -25326452 -23266738 -14043859 -1978207 4838823 4493344
6459D493344k407609K5981J424229j103546n049902n561212l26401P486533J1528294
$$ 4493344 2085735 2111716 3535945 2432399 -2617503 -8178715 -8505116 -1018583 10509711
6450A0509711Q809383K891675r31435j706068j853150k598188l729605n749584
$$ 10509711 19319094 22210769 21279334 19573266 17720116 15121928 11392323 5642739
6442E642739q217404p770332k383601L834585N152764K466555J495347L377301
$$ 5642739 -2574665 -10344997 -12728598 -8894013 -3741249 -1274694 220653 3597954
6434C597954L465632J5610k735096k175910j572476l469719m561449j402660L305352
$$ 3597954 7063586 7079196 4344100 2168190 595714 -2874005 -7435454 -8838114 -5532762
6425e532762M767456K970328J077151m7341j222208j526368k63646j50871l388716
$$ -5532762 -765306 2205022 3282173 3234832 2012624 486256 222610 71739 -3316977
6416c316977o151323k727386N253852R533787O020858m03364l448001k685062
$$ -3316977 -9468300 -12195686 -6941834 2591953 8612811 8209447 4761446 2076384
6408B076384q02128J342441K908590O70306n915222j0042258m854004N347444
$$ 2076384 1274256 2616697 5525287 6195593 280371 -9761887 -14615891 -9268447
6400i268447Q764848K531497k470490K249426R266008O138416m864600q981243
$$ -9268447 -503599 2027898 -442592 1806834 11072842 17211258 12346658 3365415
6392C365415p73602P461720L355035q545547j4384381r375212o71485M352921
$$ 3365415 2591813 10053533 13408568 4863021 -9521360 -18896572 -19568057 -15215136
6384a5215136M703882K393832j97767q388L482849N179219N33287n912697n155897
$$ -15215136 -10511254 -8117422 -8315189 -8323577 -4840728 338491 871778 -5040919 -10196816
6375a0196816K854136Q098376M632854j694438l094013m76389P61170P0858Q08162
$$ -10196816 -7342680 755696 5388550 3694112 600099 123710 884880 955738 1763900
6366A763900L354795N001695M962471M784951M876187M374734L413668K378105
$$ 1763900 5118695 10120390 15082861 19867812 24743999 29118733 32532401 34910506
6358C4910506K32414l469431o424867o442513m966131m725312n393756m783674
$$ 34910506 35142920 31673489 25248622 18806109 13839978 9114666 3720910 -1062764
6350a062764k943322j606922o23844J514554M166914M911904L221337Q83388r72278
$$ -1062764 -4006086 -5613008 -6236852 -4722298 -555384 4356520 7577857 8461245 7488967
6341G488967k601534l807379m021473l747940l338655j187981L644399P692647
$$ 7488967 4887433 1080054 -2941419 -6689359 -10028014 -11215995 -7571596 121051
6333A21051N975707q64236o010398m413769J509959N448843M065567r87950n698233
$$ 121051 6096758 5232522 -777876 -5191645 -3681686 1767157 5832724 4844774 -853459
6324h53459o749870l573643J170946M055537M446123M429175M992976M286241
$$ -853459 -7603329 -11176972 -10006026 -5950489 -1504366 2924809 7917785 12204026
6316A2204026O30846m449735p469612o191667j044983N082072P844995M500149
$$ 12204026 12834872 8385137 915525 -5276142 -6321125 -1239053 6605942 11106091
6308A1106091k417205o400565m149699J14021K32992l214807l701222J499855
$$ 11106091 8688886 2288321 -1861378 -1747357 -1514365 -4729172 -8430394 -6930539
6300f930539O654401N232325q79869l816957j31290N503633P248783M659128P43786
$$ -6930539 -276138 4956187 4076318 259361 128071 5631704 12880487 17539615 18283401
6291A8283401k789447n455237n841315l165899L00291J572688Q33374J08193o99773
$$ 18283401 15493954 10038717 4197402 1031503 1331794 2904482 3737856 3846049 3146276
6282C146276k905717n094706m303995j066869J027595J198723K327330M969404
$$ 3146276 240559 -4854147 -9158142 -10225011 -9197416 -7998693 -5671363 -701959
6274g01959N460182K079243j580511k337663k253890m138195o057859m788945
$$ -701959 4758223 6837466 5256955 2919292 665402 -3472793 -9530652 -14319597
6266a4319597j837058j061683j997026m96402M347384Q170581O869001J429749
$$ -14319597 -16156655 -17218338 -19215364 -19711766 -15364382 -7193801 -324800 1104949
6258A104949l318431l341802R14991M658786L749161j35253j968919j343478l196873
$$ 1104949 -2213482 -5555284 -4640293 18493 3767654 3632401 1663482 320004 -2876869
6249b876869q501806j0197393l396560N438600O530564P12370k483222R73055
$$ -2876869 -11378675 -21576068 -24972628 -19534028 -13003464 -12291094 -14774316 -13801261
6241a3801261N452266N772548L506255J427948j287660n162882p031125m090355
$$ -13801261 -8348995 -2576447 929808 2357756 1070096 -4092786 -11123911 -15214266
6233a5214266J907075O797698P920392N300835J924865K447827P585510J0556930
$$ -15214266 -13307191 -6509493 1410899 6711734 8636599 11084426 18669936 29226866
6225B9226866M498682o959688j2989190r800327m332925k516999k158796m60833
$$ 29226866 33725548 26765860 13776670 3976343 -356582 -2873581 -5032377 -5493210
6217e493210M1556j922672j823773K086859K903314m101963j0828564o427127
$$ -5493210 -5451654 -7374326 -9198099 -7111240 -4207926 -8309889 -19138453 -25565580
6209b5565580N607371J0949672M131677n157651o573676j082732M373281O725425
$$ -25565580 -19958209 -9008537 -4876860 -10034511 -16608187 -17690919 -13317638 -6592213
6201f592213O928685N394786K102616j170845k264993j196259M95674J681818
$$ -6592213 336472 5731258 7833874 6663029 4398036 3201777 3697451 5379269
6193E379269J708897n1742l374070o461761o729613k559387M668286R968502Q425411
$$ 5379269 7088166 7036424 3662354 -2799407 -9529020 -12088407 -7420121 2548381 10973792
6184A0973792J153372m616371l722699R04201L191892K188218J292385J524898
$$ 10973792 12127164 7510793 3788094 4692295 7884187 10072405 11364790 12889688
6176A2889688Q63944p05028r45050r9263o45147k107939j573832L7584j643416
$$ 12889688 13753632 13048604 12103554 12004291 11359144 9251205 7677373 7714957 6071541
6167F071541o088182o451994j5124N877794L488467m105439p514172m049151J68981
$$ 6071541 -16641 -6468635 -6483759 -605965 2882502 -1222937 -8737109 -12786260 -12617279
6158a2617279L10129j102678M49222M641903P317304N950722K042072r52203r81825
$$ -12617279 -12307150 -13409828 -12960606 -8318703 -1001399 4949323 6991395 6039192 5057367
6149E057367P62192J131317j269880m092402m176957k009784j281355l659194
$$ 5057367 5819559 6950876 5680996 1588594 -2588363 -4598147 -5879502 -9538696
6141i538696o095900m793160m72821K453564J725276q3582L15536K218970K648201
$$ -9538696 -15634596 -20427756 -20900577 -18447013 -16721737 -16805319 -16489783 -14270813 -11622612
6132a1622612J577865K066524M749250N771989K327839k523445l630917o28061
$$ -11622612 -10044747 -7978223 -3228973 2543016 4870855 2347410 -1283507 -1911568
6124a911568K242897K191644M65065o94248m87716J023934L057162L588307J311906
$$ -1911568 331329 2522973 2988038 2293790 1806074 2830008 5887170 9475477 10787383
6115A0787383k066832l985904m506813m433746j615713N763420J3028268J2724012
$$ 10787383 8720551 4734647 227834 -4205912 -5821625 -58205 12970063 25694075
6107B5694075N420773j05030K15832J5440o106807j2723287j1913863n976375
$$ 25694075 31114848 31009818 31225650 31241090 25134283 12410996 497133 -5479242
6099e479242l530979o043635o777921k282346K926070L909374J265010j519668
$$ -5479242 -9010221 -15053856 -21831777 -24114123 -21188053 -17278679 -16013669 -17533337
6091a7533337j688271K102371P870276R505403L485846m159674m356199J602326
$$ -17533337 -19221608 -17119237 -9248961 256442 3742288 -417386 -4773585 -3171259
6083c171259L301932k626851o798303j789848O001909O017226j387641p240000
$$ -3171259 130673 -2496178 -9294481 -11084329 -5082420 934806 -452835 -7692835
6075g692835o813099k399876L366637Q712849R217610J669678q520200j1392417
$$ -7692835 -14505934 -16905810 -13539173 -4826324 4391286 6060964 -2459236 -13851653
6067a3851653n061648K261753M059485K690752K742810L805640L585876K964578
$$ -13851653 -18913301 -16651548 -12592063 -9901311 -7158501 -3352861 233015 3197593
6059C197593L492292L564117J406030r26094o53294Q23881K61309j702998j331639
$$ 3197593 6689885 10254002 11660032 10733938 10080644 10904525 11165834 9462836 8131197
6050H131197K226741N456862N228702K095397j583920m286875n380426m621369
$$ 8131197 10357938 15814800 21043502 23138899 21554979 17268104 11887678 7266309
6042G266309k677571r11900O7839O63876P20169r21075m254519o569635m921454
$$ 7266309 4588738 3676838 3744677 4408553 5128722 4207647 -46872 -6616507 -11537961
6033a1537961k91102K551072O54913k981589l201758K5053J515183j140682l543253
$$ -11537961 -11829063 -9277991 -8623078 -11604667 -14806425 -14781372 -13266189 -14406871 -17950124
6024a7950124j247603L062930L749661J079190Q1420J575287J022118k772482
$$ -17950124 -19197727 -16134797 -12385136 -11305946 -11224526 -9649239 -8627121 -11399603
6016a1399603m539486r16039L856016M447787J938044O27419J493951L221811
$$ -11399603 -15939089 -16855128 -12999112 -8551325 -6613281 -5985862 -4491911 -1270100
6008a270100N857012Q545189P301077O92825n372105m841564r91571j700410o942675
$$ -1270100 4586912 13132101 20433178 21126003 15753898 10912334 9920763 8220353 1277678
5999A277678q882916m324891J018862K252153J689813K573579L131613J063610
$$ 1277678 -7605238 -11930129 -10911267 -8659114 -6969301 -4395722 -1264109 -200499
5991b00499j362268j268332k60660j210563l036476k767781m23411J737219K728933
$$ -200499 -1562767 -2831099 -3091759 -4302322 -7338798 -10106579 -10529990 -8792771 -6063838
5982f063838K486879K57429l368311m799197j274439M866945Q506477P183555
$$ -6063838 -3576959 -3319530 -6687841 -11487038 -12761477 -7894532 611945 7795500
5974G795500K171353l926124q156283p845353l346295J103379J891601J91794
$$ 7795500 9966853 6040729 -2115554 -9960907 -13307202 -12203823 -10312222 -10120428
5966a0120428n37988N78408J990060K852509L052481J703059j263297l268154
$$ -10120428 -10658416 -10080008 -8089948 -5237439 -2184958 -481899 -1745196 -5013350
5958e013350j957864J033206J974582k17775l509802n588234m708791J59463O634946
$$ -5013350 -6971214 -5938008 -3963426 -4181201 -7691003 -13279237 -17988028 -17828565 -11193619
5949a1193619Q443341K090412p070738j0001498m791776K051335M771368L833049
$$ -11193619 -2750278 -659866 -7730604 -17732102 -22523878 -20472543 -15701175 -11868126
5941a1868126J719879j255151m490137m795994l18021N365766O477596J983224
$$ -11868126 -10148247 -11403398 -15893535 -20689529 -21007550 -15641784 -9164188 -7180964
5933g180964k857068k312197L273822P530818N289901q31147l293518M99167M688411
$$ -7180964 -10038032 -12350229 -9076407 -1545589 3744312 2913165 -380353 118814 4807225
5924D807225L534339l74212r22700J496815R93098l720357o904180m656670m01135
$$ 4807225 8341564 7967352 7044652 8541467 9534565 5814208 -1089972 -5746642 -6147777
5915f147777Q44707r09022k438739k154881m96686J768794L484260L596151L023577
$$ -6147777 -5303070 -6212092 -8650831 -10805712 -11302398 -9533604 -6049344 -2453193 570384
5906E70384L518850L970811J279377m094241p456759o353840l590074j837423
$$ 570384 4089234 8060045 9339422 5245181 -2211578 -8565418 -12155492 -13992915
5898a3992915K40353L656034N449150L313704J01716o76421o66163l261450p049253
$$ -13992915 -13752562 -10096528 -4647378 -1333674 -1231958 -1908379 -2574542 -5835992 -12885245
5889a2885245p856944n551754l465339k051547J367578O422713Q585826N745117
$$ -12885245 -20742189 -26293943 -29759282 -31810829 -30443251 -24020538 -15434712 -9689595
5881i689595J756238J264793L729604M720200J610828l640592o741393n311703
$$ -9689595 -7933357 -6668564 -2938960 1781240 3392068 -248524 -6989917 -12301620
5873a2301620j074492K305213L444834L886827M206298K277806k510020o048792
$$ -12301620 -13376112 -11070899 -7626065 -3739238 467060 2744866 234846 -5813946
5865e813946m187422Q48953K761132m86335m481123m768610j736849J798111M428685
$$ -5813946 -10001368 -9152415 -6391283 -6877618 -11358741 -16127351 -17864200 -16066089 -11637404
5856a1637404N848284N329082K684949n11460k122582j159905K034604N984285
$$ -11637404 -5789120 -460038 2224911 1713451 -409131 -1569036 465568 6449853
5848F449853Q207712O999164L826461K250484L474684M489933J841931l970925
$$ 6449853 14657565 21656729 25483190 27733674 31208358 35698291 37540222 33569297
5840C3569297r166695j0914863r624867p442986n679321l950865j395395J545053
$$ 33569297 24402602 13487739 3862872 -3580114 -9259435 -13210300 -14605695 -13060642
5832a3060642K897812J304268j671791k395993R64007N983523Q384362O793376
$$ -13060642 -10162830 -8858562 -10530353 -12926346 -11962339 -5978816 2405546 9198922
5824I198922L892356K284156P59269l210013p888912p606268k27683Q556868J1225552
$$ 9198922 13091278 15375434 16134703 12924690 5035778 -2570490 -2798173 5758695 16984247
5815A6984247O724329k94943o336898j0672990j1599659p103575J73139M372707
$$ 16984247 23708576 23413633 17076735 6403745 -5195914 -12299489 -12126350 -7753643
5807g753643M345242M587488O411616M675755k976043r904934r094965l145107
$$ -7753643 -3408401 1179087 7590703 12266458 9290415 -614519 -9709484 -12854591
5799a2854591M88972L29040L60474J763001K204889J543583J576241J489002j82812
$$ -12854591 -12365619 -12036579 -11676105 -9913104 -7708215 -6164632 -4588391 -3099389 -3282201
5790c282201p73675K508106N514016K007272n284706p148496j780737K799466
$$ -3282201 -4055876 -1547770 3966246 5973518 688812 -6459684 -8240421 -5440955
5782e440955J893669N75187L709671P871253P719187L583697j545448o181232
$$ -5440955 -3547286 -2972099 737572 8608825 16328012 19911709 18366261 12185029
5774A2185029p713485k784094N212864O576815j075605p195825l288367L919312
$$ 12185029 4471544 1687450 6900314 13477129 12401524 5205699 1917332 5836644
5766E836644L149944l975672o889069l228823l80143j541594j786462J228562
$$ 5836644 8986588 5010916 -1878153 -5106976 -5487119 -7028713 -8815175 -7586613
5758g586613L045218J217774o16706m63666j728199n597167o891476k090254M323945
$$ -7586613 -4541395 -3323621 -3940327 -4403993 -6132192 -11729359 -18620835 -20711089 -16387144
5749a6387144O342660M666970L763354M390532L940381J916486O09060J158587
$$ -16387144 -10044484 -5377514 -1614160 2776372 6716753 8633239 9242299 10400886
5741A0400886K011691J016515k363237o140626o767604k812487K223077L358657
$$ 10400886 12412577 13429092 11065855 4925229 -1842375 -4654862 -2431785 926872
5733I26872N43308j627814q42067L79051k0409l73509P22023J544421R10879N70909
$$ 926872 1470180 -157634 -999701 -620650 -641059 -1014568 -292545 1251876 2162755 2733664
5723B733664J111425k63249m292058o183669k262983L207317L184201k227921
$$ 2733664 3845089 3581840 -710218 -6893887 -9156870 -5949553 -2765352 -4993273
5715d993273o246842m689544Q2496L934930N104595L555387K93275k151194j736580
$$ -4993273 -11240115 -15929659 -15847163 -11912233 -6807638 -3252251 -2958976 -5110170 -6846750
5706f846750L38492J476787J648915K457449L151888J499361j692614l146312
$$ -6846750 -6508258 -5031471 -3382556 -925107 2226781 3726142 2033528 -1112784
5698a112784k490259k731140m396591l609810J845391Q016837R059582L980213
$$ -1112784 -3603043 -6334183 -10730774 -14340584 -12495193 -4478356 4581226 8561439
5690H561439k913252o762314o027591l097409j820746k942683k286877L678598
$$ 8561439 5648187 -1114127 -7141718 -10239127 -12059873 -15002556 -17289433 -13610835
5682a3610835J0763447J0244739Q12008p560914n488860L602613P936494K241782
$$ -13610835 -2847388 7397351 8209359 648445 -4840415 -1237802 6698692 8940474
5674H940474o736504r346662l477630M897171Q545816N164619j333942m746430
$$ 8940474 2203970 -7142692 -10620322 -5723151 2822665 7987284 6653342 1906912
5666A906912k649369J578992L539050L137987L063950L467590J817321j976911
$$ 1906912 -742457 836535 4375585 7513572 10577522 14045112 15862433 13885522
5658A3885522m193553k574382O5098k42990l168599n062998m074709j576647J066403
$$ 13885522 9691969 7117587 7182685 6939695 3771096 -1291902 -5366611 -6943258 -5876855
5649e876855M275874P855321Q972022M734589l519924j0346692j1430881p768549
$$ -5876855 -1600981 6254340 15226362 19960951 16441027 6094335 -5336546 -13105095
5641a3105095l655037j357901M17758K853444M315696K987444N52541N88828L385777
$$ -13105095 -16760132 -18118033 -17700275 -14846831 -10531135 -7543691 -6991150 -6402322 -3016545
5632c016545M832061J577272m234821o968408l796212K260878N740157M292968
$$ -3016545 1815516 3392788 -842033 -7810441 -11606653 -9345775 -3605618 687350
5624F87350L36327k239566j999140m57225L33947j47554p78599k5639K241457
$$ 687350 1023677 -1215889 -3215029 -3672254 -3338307 -3485861 -4264460 -4290099 -2048642
5615b048642L658073J332721l790055o145729j786443N574150Q251793M205966
$$ -2048642 1609431 2942152 -847903 -6993632 -8780075 -3205925 5045868 9251834
5607I251834r93280k419797j444336j286116j602477q11182J10315K6495M79464
$$ 9251834 8258554 5838757 4394421 3108305 1505828 694646 804961 831456 1310920
5598A310920K132419J958626j330239k947089P28592M181864O1441p820051q384496
$$ 1310920 3443339 5401965 4071726 1124637 1853229 6035093 6096534 -1723517 -10108013
5589a0108013k49371N330379J140068n865237n968942k44578L507097K227309
$$ -10108013 -10357384 -5027005 -3886937 -9752174 -15721116 -15965694 -12458597 -10231288
5581a0231288j523957n416245p615537m976172K624425Q870926P760257J548927
$$ -10231288 -11755245 -17171490 -24787027 -29763199 -27138774 -18267848 -10507591 -8958664
5573h958664l062421l901706l163267j365242K126797M709966L355357N48123
$$ -8958664 -12021085 -15922791 -19086058 -20451300 -18324503 -13614537 -10259180 -9711057
5565i711057J037299L667371L083725q23375k087730J908561O406257O276081
$$ -9711057 -8673758 -5006387 -1922662 -2746037 -4833767 -2925206 3481051 9757132
5557I757132K112350k012080k829475M50239M720018L914522l665901j0078243
$$ 9757132 11869482 9857402 7027927 7478166 12198184 16112706 12446805 2368562
5549B368562o187908N084371J1331405O907320j395048o211496q144996r265658
$$ 2368562 -3819346 1265025 12596430 19503750 18108702 11897206 3752210 -5513448
5541e513448p311941j983385Q79811j748787l563448J114098O708444M538091
$$ -5513448 -12825389 -14808774 -13928963 -15677750 -19241198 -18127100 -11418656 -6880565
5533f880565k761491m874543K17320M038533J715243j385593J15248K915752J368831
$$ -6880565 -9642056 -14516599 -14299279 -10260746 -8545503 -9931096 -9815848 -6900096 -5531265
5524e531265l180858m974683k578963K86408J448800K960627O303888Q662115
$$ -5531265 -8712123 -13686806 -16265769 -15979361 -14530561 -11569934 -5266046 3396069
5516C396069O564570J574087r49290Q62329K597083K72197l059729j669349L350020
$$ 3396069 9960639 11534726 10585436 11447765 14044848 14317045 11257316 9587967 12937987
5507A2937987M655404m68014n625948m557234J29021J662760j175388l919807
$$ 12937987 17593391 17125377 11499429 6942195 7071216 8733976 7558588 3638781
5499C638781l609809j278692J395749L486334L543279Q48280k356185l192535
$$ 3638781 28972 -1249720 146029 3632363 7175642 8023922 5667737 2475202
5491B475202k329371k784408m926805n630614k398677L860404R767247J1513912
$$ 2475202 145831 -2638577 -7565382 -13195996 -15594673 -11734269 -1967022 9546890
5483I546890P342552J11291m241097l186265p44992j669322m999553o765437o382842
$$ 9546890 16889442 17000733 12759636 9573371 8828379 7159057 2159504 -4605933 -10988775
5474a0988775n766574m162745N72929O253446P468401L073829j834214k275721
$$ -10988775 -16755349 -20918094 -20345165 -14091719 -6623318 -3549489 -5383703 -7659424
5466g659424J721486O747941R088815O340173l59454n762894n648569k099747
$$ -7659424 -5937938 810003 9898818 16238991 15879537 10116643 4468074 2368327
5458B368327j81563o16451l41438R10999M52980j240410o21435J976008J813912
$$ 2368327 2186764 1570313 1228875 2139874 2592854 1352444 731009 2707017 4520929
5449D520929k319257n805828n713892m363535l078562Q12883P129667R675586
$$ 4520929 2201672 -3604156 -9318048 -13681583 -16760145 -15947262 -8817595 857991
5441H57991M973716j538142l686654l662394o186713q117614k516247Q677785
$$ 857991 5831707 4293565 606911 -3055483 -9242196 -17359810 -19876057 -11198272
5433a1198272J4751457J0156079J478927j971437N50386K532891l78137n577085
$$ -11198272 3553185 13709264 15188191 13216754 13767140 16300031 15921894 10344809
5425A0344809p241904k991381L505962O591866N068472L008289L433959L888235
$$ 10344809 3102905 111524 3617486 10209352 15277824 18286113 21720072 25608307
5417B5608307Q78847l608931m320317q67991R28564k834045q364452r115114m319978
$$ 25608307 26487154 22878223 18557906 17689915 18618479 15784434 7419982 -1695132 -6015110
5408f015110M96747J045424n79962N48898N300092R386059Q900815M521147p58021
$$ -6015110 -5518363 -4472939 -5052901 -4504003 796089 10182148 19082963 23604110 22846089
5399B2846089n551772r331557r762274m812147K586912N931951K489385l645378
$$ 22846089 17294317 7962760 -1799514 -6611661 -4024749 1907202 4396587 751209
5391G51209o996385o317360l391180N01626M371507O210939M963582K675275K214933
$$ 751209 -6245176 -12562536 -15953716 -15452090 -11080583 -4869644 93938 2769213 4984146
5382D984146L446921L550753Q36767l040043m598711j941748K977637O005773
$$ 4984146 8431067 11981820 12818587 9778544 5179833 3238085 6215722 12221495
5374A2221495N566764M246235L635608L02613q394486j6414489j4225894k671326
$$ 12221495 17788259 22034494 25670102 25972715 17578229 1163740 -13062154 -15733480
5366a5733480O078494M441499j136664j386049K360293K991257R0012j284394
$$ -15733480 -9654986 -5213487 -6350151 -7736200 -5375907 -2384650 -2294638 -3579032
5358c579032q81604k856081o134422m455595K744219P559621M472893k348310
$$ -3579032 -4460636 -7316717 -13451139 -17906734 -15162515 -7602894 -3130001 -5478311
5350e478311n731958m328200j378428J229866L903800O624454Q126349O763877
$$ -5478311 -11210269 -15538469 -16916897 -15687031 -11783231 -5158777 2967572 9731449
5342I731449J474106o107205j0469192o709629K613117Q537034N524655k514018
$$ 9731449 11205555 5098350 -5370842 -12080471 -9467354 -930320 4594335 2080317
5334B080317p823982p554221m429977j164445K164893N573908P083231M686205
$$ 2080317 -5743665 -13297886 -17727863 -18892308 -16727415 -11153507 -4070276 615929
5326F15929l88225l856042k783991P66775K362669J611392L031912Q800060J3754674
$$ 615929 227704 -3628338 -6412329 -5645554 -3282885 -1671493 1360419 10160479 23915153
5317B3915153J1238584K085100o299634r033707p986273p127890p534242p629458
$$ 23915153 35153737 37238837 30939203 21905496 13919223 6791333 -742909 -8372367
5309h372367n461947k91698N900735R021518P369880M246190L112952K221948
$$ -8372367 -13834314 -14126012 -8225277 796241 8166121 12412311 15525263 17747211
5301A7747211j643893o174211o170343k159332K15359o29479o67902J318035J442623
$$ 17747211 16103318 9929107 3758764 1599432 1814791 1185312 517410 1835445 3278068
5292C278068r59455n48548M600550Q002482M379547j840009l512596j140543N548
$$ 3278068 2318613 1770065 6370615 14373097 18752644 16912635 13400039 12259496 12265044
5283A2265044j167678k062622k414689l267666k734215O09378K529341j563029
$$ 12265044 11097366 9034744 6620055 3352389 618174 1227552 3756893 2193864
5275B193864p679537p016068J629388J0030698J1449961P000257O39152n408399
$$ 2193864 -5485673 -12501741 -10872353 -841655 10608306 17608563 18247715 12839316
5267A2839316q616755o046376P69735N778408N972939M640972M766234M173574
$$ 12839316 4222561 -1823815 -1054080 4724328 10697267 15338239 20104473 24278047
5259B4278047O46763k733355k074090N58818j79845m894933q480976o892518j590314
$$ 24278047 24924810 22191455 20117365 20676183 20496338 15601405 7120429 227911 -1362403
5250a362403K873482L336153J10370l472949l611078M05001N241485P054515N383704
$$ -1362403 1511079 4847232 4957602 1484653 -2126425 -1721424 3520061 10574576 15958280
5241A5958280K704447J253777J549188K799201L108319M33427m567983p541593
$$ 15958280 18662727 19916504 21465692 24264893 27373212 27806639 23238656 15697063
5233A5697063m900741Q62036L078731j100198p007219q267082m472117q23028
$$ 15697063 10796322 11658358 14737089 13636891 6629672 -1637410 -6109527 -6932555
5225f932555r36118k646613j655607K711725P138739Q672131P220092L726246
$$ -6932555 -7868673 -10515286 -12170893 -9459168 -2320429 6351702 13571794 17298040
5217A7298040j527890p196959r417674n091712L384746R171665P683033P28345
$$ 17298040 15770150 8573191 -844483 -5936195 -2551449 6620216 14303249 15031594
5209A5031594o414204r967103q884354l910269K126478N033230L576627K146363
$$ 15031594 8617390 -1349713 -10234067 -14144336 -12017858 -6984628 -3408001 -1261638
5201a261638N452312J0867266J0643124L071595l561397j839219M036508M111798
$$ -1261638 4190674 15057940 25701064 28772659 25211262 23372043 27408551 31520349
5193C1520349k802601p593513m503661Q63324P16736l690706n624904l615996
$$ 31520349 28717748 21124235 16620574 17483898 18200634 14509928 8885024 5269028
5185E269028j729961r91653J829321O160245N646265k452592j1249627j2018644
$$ 5269028 3539067 2547414 4376735 10536980 16183245 13730653 2481026 -9537618
5177i537618m678596L515180P124731O261996L221354k3685j641241j234298j196343
$$ -9537618 -14216214 -10701034 -3576303 2685693 5907047 5883362 4242121 3007823 1811480
5168A811480l519249n733968l733733J509391M286306K077693r71060l15713K875342
$$ 1811480 -1707769 -7441737 -11175470 -9666079 -5379773 -3302080 -4273140 -4588853 -1713511
5159a713511M447816L200612J051676o74606j928372k183610j084130j31870q99392
$$ -1713511 2734305 5934917 6986593 6311987 4383615 2200005 1115875 984005 84613
5150H4613k004179o86269K700905M592730K915321p35827l997023n918692n479484
$$ 84613 -1919566 -2605835 95070 4687800 7603121 6867294 2870271 -3048421 -8527905
5141h527905j348019M798998P728362M623650k89807o63187L415185N562211J785901
$$ -8527905 -9875924 -5076926 2651436 7275086 6985279 6322092 9737277 15299488 17085389
5132A7085389m723165q433841p694950m393443l95880L083239M597051L797875
$$ 17085389 12362224 3928383 -3766567 -8160010 -8555890 -5472651 -875600 2922275
5124B922275K587095K567907K411426K80942k198487j741416R94846J340014k635611
$$ 2922275 5509370 8077277 10488703 10769645 8571158 6829742 7824588 9164602 6528991
5115F528991o560905n331912n3445L510375K454678k65083n65419J608761L217148
$$ 6528991 -31914 -5363826 -5417271 -1906896 547782 282699 -282720 1326041 4543189
5106D543189K711835J770728K432551L884251L161247j022756o049153p856948
$$ 4543189 7255024 9025752 11458303 15342554 18503801 17481045 11431892 3574944
5098C574944n514999k243985j266263j744963m62701K931131M842965K889873
$$ 3574944 -1940055 -4184040 -5450303 -7195266 -7657967 -4726836 116129 3006002
5090C006002k86791p24112J106690J688970P27802J455792L936098L215812k895984
$$ 3006002 2719211 1995099 3101789 4790759 5518561 6974353 10910451 14126263 11230279
5081A1230279q674025p581889j246357L741773N139169M999541K654513m128697
$$ 11230279 2556254 -5025635 -6271992 -2530219 2608950 7608491 10263004 6134307
5073F134307j1062635r291464J766722J1073255R453900J42790q055912j1506644
$$ 6134307 -4928328 -14219792 -12453070 -1379815 8074085 8216875 160963 -11345681
5065a1345681j0671578n066553L698329Q916087O342710J118215K18300J905130
$$ -11345681 -22017259 -27083812 -23385483 -14469396 -8126686 -7008471 -6790171 -4885041
5057d885041M25748k543756n48789N474666P391200K277343l948097n899103m006132
$$ -4885041 -4459293 -7003049 -7551838 -2077172 5314028 7591371 3643274 -2255829 -6261961
5048f261961j33868M333957N873538K363598p86686K942590Q592374M435242q950156
$$ -6261961 -6395829 -2061872 3811666 6175264 5388578 8331168 16923542 21358784 12408628
5039A2408628j6356900r233123K336719N739317L217483M009555P825812P207482
$$ 12408628 -3948272 -13181395 -10844676 -5105359 -1887876 2121679 9947491 17154973
5031A7154973J226522l655371m000562k294141j092538r44244k321088m091977
$$ 17154973 18381495 14726124 10725562 8431421 7338883 6394639 4073551 -18426
5023a8426k634625K399838M929815O89268n189846n188399l03985L057874L752111
$$ -18426 -2653051 -253213 4676602 5365870 176024 -5012375 -5316360 -2258486 1493625
5014A493625N597044Q597882Q480233M239691q07611m980037q887621j0804623
$$ 1493625 7090669 15688551 24168784 28408475 27600864 22620827 13733206 2928583
5006B928583p831546j802421J517251m73671m955730p697295n702723J811400
$$ 2928583 -4902963 -6705384 -5188133 -5661804 -10617534 -18314829 -24017552 -22206152
4998b2206152J0677551J2984112O259422j711017k925224q9283n11453l419176
$$ -22206152 -11528601 1455511 7714933 6003916 3078692 2989409 2477956 -941220
4990i41220k699768O67095k24405n274081o504689j395247L050206K088134j48789
$$ -941220 -3640988 -2973893 -3198298 -8472379 -14977068 -16372315 -13322109 -11233975 -11382764
4981a1382764P72239K624506K163258P76021N34281N02675K70927J450618K837971
$$ -11382764 -10610525 -7986019 -5822761 -5046740 -4512459 -4009784 -3738857 -2288239 549732
4972E49732K60019n602031p713353l091353J501463m30424m600993k008340P338210
$$ 549732 809751 -4792280 -12505633 -15596986 -14095523 -14525947 -19126940 -21135280 -13797070
4963a3797070J3425692R127600o23410m589189J591759J0273793J0912792K811633
$$ -13797070 -371378 8756222 8132812 3543623 5135382 15409175 26321967 29133600
4955B9133600m703572n014074j833992j467607l352027l540562k367280j829384
$$ 29133600 24430028 19415954 17581962 16114355 12762328 9221766 6854486 5025102
4947E025102J24095M776268O339027o0215p367615m562011N870151J0035149K613792
$$ 5025102 5149197 9925465 16264492 16204277 8836662 4274651 10144802 20179951 22793743
4938B2793743o675650q519693n043255k127212n00033J141016J870342J304315
$$ 22793743 16118093 7598400 2555145 427933 -72100 1068916 2939258 4243573
4930D243573P23535l11794k534664k601293K169646N991580J408431p020913p521370
$$ 4243573 4967108 4655314 2120650 -480643 1689003 7680583 9089014 2068101 -5453269
4921e453269K57760M422097K94956l164508J07239M207812L869642K928225M091587
$$ -5453269 -5195509 -773412 -478456 -3642964 -3535725 672087 4541729 7469954 11561541
4912A1561541K772618k136152l215108K660386P648746O076352L278021M354871
$$ 11561541 14334159 12198007 8982899 11643285 19292031 25368383 28646404 33001275
4904C3001275N014332R00148m183649o173482p065426p715472m595349J553016
$$ 33001275 38015607 38915755 34732106 28558624 21493198 13777726 9182377 10735393
4896A0735393M664444M300062N617346O940706K245428l514565j72269O268307
$$ 10735393 15399837 19699899 25317245 32257951 34503379 30988814 30816545 37084852
4888C7084852R93275r823805m844405J3255437J7871088N011083J166268J2834060
$$ 37084852 38078127 28254322 23409917 36665354 54536442 59547525 60713793 73547853
4880G3547853J3065541k687313R65646L1556089M1860639J6156365J9262285Q7032029
$$ 73547853 86613394 83926081 84891727 116447816 158308455 174464820 193727105 280759134
4872B80759134J24979586K1070008j66123088k49861960j56269335j2578944L8927407
$$ 280759134 405738720 426808728 260685640 10823680 -145445655 -158024599 -119097192
4865a19097192J0836218m187108J3267274J7609122K274673K536470J8623849
$$ -119097192 -108260974 -112448082 -99180808 -81571686 -79297013 -76760543 -58136694
4858e8136694J5652451p447748j4636079K801191J4687244P341868J090230O865617
$$ -58136694 -42484243 -49931991 -64568070 -61766879 -47079635 -39737767 -38647537 -31781920
4850c1781920R058873n8155o378761l208747j972851o010265l434680O690513
$$ -31781920 -22723047 -22781202 -29159963 -32368710 -34341561 -40351826 -43786506 -37095993
4842c7095993R035830R7960m623417J268563M865185n49568l914166J017509L962144
$$ -37095993 -28060163 -27962203 -32585620 -31317057 -26451872 -27001440 -30915606 -29898097 -25935953
4833b5935953j394473n367865m85942O155944P559765P207685O966283J098416
$$ -25935953 -27330426 -32698291 -33184233 -27028289 -19468524 -12260839 -5294556 -4196140
4825d196140r589185j3304933n305716L808930N259739L729460M815430M683475
$$ -4196140 -13785325 -27090258 -32395974 -28587044 -23327305 -19597845 -14782415 -10098940
4817a0098940K8584m052416l637962k606971l800220l991533j955066p31693Q16822
$$ -10098940 -10070356 -14122772 -17760734 -20367705 -24167925 -28159458 -30114524 -30846217 -30029395
4808c0029395O431340J0821130M522148p188269p417370N640473J3306192M969235
$$ -30029395 -23598055 -12776925 -8254777 -15443046 -22860416 -17219943 -3913751 1055484
4800A055484o120754n465066J530356L339990J990357M788179Q595300O669815
$$ 1055484 -5065270 -10530336 -8999980 -5659990 -3669633 1118546 9713846 16383661
4792A6383661J857320J21541r46064n617054r786554p992527l382475j120336
$$ 16383661 18240981 18362522 17416458 11799404 2012850 -5979677 -9362152 -10482488
4784a0482488L76764K753459J305861n158143p552903k71383P509537N615704
$$ -10482488 -10105724 -7352265 -6046404 -11204547 -18757450 -19028833 -11519296 -5903592
4776e903592j082121k586652p91128k824860n257197k84439P832966Q154166J699424
$$ -5903592 -6985713 -9572365 -10363493 -13188353 -18445550 -18729989 -10897023 -2742857 -1043433
4767a043433k33634M971386P920341L148129l857985o864599n953489l135307
$$ -1043433 -1277067 3694319 11614660 14762789 10904804 4040205 -1913284 -5048591
4759e048591O31581L289475L377503L216842M488887L554499j900848n740671
$$ -5048591 -4417010 -1127535 2249968 5466810 9955697 13510196 11609348 5868677
4751E868677j709381M923658M089401l601850q676022p933639o557794o099520
$$ 5868677 4159296 9082954 13172355 9570505 894483 -7039156 -13596950 -19696470
4743a9696470k129567N027755Q146249M427312m2035j78397J328438J30909l137393
$$ -19696470 -21826037 -16798282 -8652033 -4224721 -4266756 -4445153 -3116715 -2985806 -6123199
4734f123199n155224m319679j269817J580867J261674j747828k697555N03749
$$ -6123199 -11278423 -15598102 -16867919 -15287052 -14025378 -15773206 -18470761 -17967012
4726a7967012L134656J363068p07312J631827M668522L241671J461926N585456
$$ -17967012 -14832356 -13469288 -14176600 -12544773 -7876251 -4634580 -3172654 2412802
4718B412802J0469565O145530m214495o999431O60589O312164J614112o402482
$$ 2412802 12882367 19027897 14813402 7813971 8474560 14786724 16400836 9998354
4710I998354p932943l189263K290707N423029M047524l212546j0974680r789115
$$ 9998354 2065411 -1123852 1166855 6589884 10637408 7424862 -3549818 -13338933
4702a3338933N41787Q711650P259864J442572j628715l088223n654152o159058
$$ -13338933 -12797146 -4085496 3174368 4616940 2988225 -99998 -5754150 -11913208
4694a1913208k126037J983278K556057L784332R291070J3600518J0221136K341317
$$ -11913208 -14039245 -12055967 -9499910 -5715578 3575492 17176010 27397146 29738463
4686B9738463l068198o510986j2072077j6492601j2367992p97912Q119764P662865
$$ 29738463 26670265 20159279 8087202 -8405399 -20773391 -21571303 -13451539 -5788674
4678e788674P26517o009492q191895m483253L072952Q938681Q671057L846657
$$ -5788674 -5062157 -11071649 -19263544 -23746797 -20673845 -11735164 -3064107 782550
4670G82550m56701j768875q99283J047691K541128J064482l063066m912502j590099
$$ 782550 325849 -1443026 -2342309 -1294618 1246510 2310992 -752074 -5664576 -7254675
4661g254675K262051J148530j929166J65093O523695Q425163K544510l643495
$$ -7254675 -4992624 -3844094 -5773260 -5608167 915528 9340691 11885201 8241706
4653H241706k572419L281629O031353L069098j326819k967397k218174j782108
$$ 8241706 5669287 8950916 14982269 18051367 16724548 13757151 11538977 9756869
4645I756869k946891m738824n273567l266283P73663M005885K930434k522183
$$ 9756869 6809978 2071154 -3202413 -6468696 -5695033 -1689148 1241286 -1280897
4637a280897o908705m359423L068532N931052m47513q135146o509867K695676
$$ -1280897 -8189602 -12549025 -9480493 -3549441 -3996954 -12132100 -18641967 -15946291
4629a5946291P849574M053562j545955k411346j046879r67301L22102L903630
$$ -15946291 -8096717 -4043155 -5589110 -8000456 -9047335 -10014636 -9692534 -5788904
4621e788904L359461n309705j4041184j2554959l279618L328627M616286O061860
$$ -5788904 -2429443 -7739148 -21780332 -34335291 -37614909 -34286282 -29669996 -23608136
4613b3608136Q264422N918352R8048q40210M288127N651523j633522p960413l354242
$$ -23608136 -15343714 -9425362 -9327314 -10167524 -5879397 -227874 -1861396 -9821809 -13176051
4604a3176051O820874R522873K447930m669697m945870j613996q6524k97187M58713
$$ -13176051 -6355177 3167696 5615626 945929 -3999941 -5613937 -5700461 -5997648 -5538935
4595e538935J876473J055834l219148q222281q872731k311211P685346J2329620
$$ -5538935 -3662462 -2606628 -5825776 -14048057 -22920788 -25231999 -17546653 -5217033
4587e217033O601020m353934j0414697p506732m89051M154313M412188J413004
$$ -5217033 1383987 -2969947 -13384644 -20891376 -21380427 -17226114 -12813926 -11400922
4579a1400922l109712o022829l742089K832723P535088O477165L415516L661671
$$ -11400922 -14510634 -20533463 -24275552 -21442829 -13907741 -7430576 -4015060 -353389
4571c53389N737468M573784P42007n61759P90935q29714o196631q115628k815823
$$ -353389 5384079 9957863 10699870 10138111 10929046 10099332 3902701 -4212927 -7028750
4562g028750L142633L047383L47958J506598M403429K938289j045818p79803K808583
$$ -7028750 -3886117 -838734 -490776 1015822 5419251 8357540 7311722 6531919 9340502
4553I340502K444174k063083l116943O41201J232635m311377p738227l179504
$$ 9340502 11784676 9721593 6604650 7245851 8478486 4167109 -3571118 -6750622
4545f750622L150097L644596O78440l45215r57618l814084m355196J549892P396207
$$ -6750622 -3600525 44071 722511 377296 -580322 -4394406 -8749602 -7199710 196497
4536A96497M338232m268935p405435k815028J700844J817572J000984J629807
$$ 196497 4534729 265794 -7139641 -9954669 -8253825 -6436253 -5435269 -3805462
4528c805462J732086J179808K215332L228368N69300l163083j712338L371880
$$ -3805462 -2073376 -893568 1321764 4550132 5119432 1956349 244011 3615891
4520C615891L511009l185856q736399p979242m537562j397558L716975R345023
$$ 3615891 7126900 3941044 -4795355 -12774597 -17312159 -18709717 -14992742 -5647719
4512e647719P941563q74009n308384J621935R375865M905077o894465j0274785
$$ -5647719 2293844 1419835 -3888549 -2266614 7109251 12014328 5119863 -5154922
4504e154922j981885N668004M386027R1716P19004M177442L943743j18953k700290
$$ -5154922 -7136807 -1468803 2917224 3008940 3727944 7905386 11849129 11730176 9029886
4495I029886j477638N65361K66289j900613l492856l470006k694294j621718Q07607
$$ 9029886 7552248 8117609 8383898 6483285 2990429 -479577 -3173871 -4795589 -3987982
4486c987982M624466O422328K499423n303014j0181478q260217l092000m42888
$$ -3987982 636484 7058812 9558235 4255221 -5926257 -14186474 -17278474 -17721362
4478a7721362j198052j722659P89283N552523R282756Q654009L480285j700761
$$ -17721362 -18919414 -20642073 -19852790 -14300267 -5017511 3636498 7116783 5416022
4470E416022j780381K377361M743583K268925j869001m223272n042782m258229
$$ 5416022 3635641 6013002 10756585 13025510 11156509 6933237 1890455 -2367774
4462b367774L47221P304543R925076N534678M22313j25328m06479n392979r589889
$$ -2367774 -2020553 5283990 15209066 20743744 21166057 21040729 20634250 15241271 5651382
4453E651382n294220K371169J304200p893038j1327187k917544O710374P331404
$$ 5651382 357162 2728331 4032531 -3860507 -15187694 -18105238 -11394864 -4063460
4445d063460L425997L714534O130297L422950k708634m324143j089617n47192
$$ -4063460 -637463 3077071 9207368 12630318 9921684 5597541 4507924 3960732
4437C960732m719098o524652k081126K046693j128737p876120r076114l476996
$$ 3960732 -758366 -7283018 -9364144 -7317451 -8446188 -16322308 -25398422 -28875418
4429b8875418J207931N1740k652238j028632L291059M228385Q77893j241362J484949
$$ -28875418 -27667487 -27615747 -30267985 -31296617 -28005558 -23777173 -22899280 -24140642 -22655693
4420b2655693N931156P176702M423479j2697m056005n662954k733473L326156
$$ -22655693 -16724537 -9547835 -5124356 -5137053 -9193058 -14856012 -17589485 -14263329
4412a4263329O849117M578217N31983M7370J717246N88761k882126l709644j297194
$$ -14263329 -7414212 -2835995 -2304012 -2256642 -539396 49365 -2832761 -6542405 -7839599
4403g839599k78508j874221j630919K300084N512423M888319L274727K915791
$$ -7839599 -8118107 -9992328 -11623247 -9323163 -3810740 1077579 4352306 7268097
4395G268097P72133m410519o460495m05346P477702O516216l165939j0284550
$$ 7268097 8040230 3629711 -2830784 -3236130 4241572 10757788 7591849 -2692701
4387b692701p384205J025955O804271Q012043P264548N530166K229526j166112
$$ -2692701 -10076906 -9050951 -2246680 5765363 13029911 18560077 20789603 19623491
4379A9623491k049536n78754L83509o79057k034188j303352J356270L362235K485789
$$ 19623491 17573955 16995201 17378710 16699653 14665465 13362113 14718383 18080618 20566407
4370B0566407j005028m839556o792927n966408k884975M00296Q24668k730073
$$ 20566407 19561379 14721823 7928896 1962488 -922487 -522191 302477 -2427596
4362b427596o379677m005616M701751J1429905Q227011j848292p678587m211300
$$ -2427596 -8807273 -12812889 -8111138 3318767 11545778 9697486 2018899 -2192401
4354b192401J364193K57786n568550o905513r59064N059560M932261J810030J923783
$$ -2192401 -828208 -570422 -6138972 -13044485 -14003549 -8943989 -4011728 -2201698 -277915
4345b77915M671006M698736J368985n64760M70793M94166k054523k749774N72306
$$ -277915 4393091 9091827 10460812 9896052 10366845 10861011 8806488 6056714 6629020
4336F629020K314578k084687o980373m308860K527819K356136o328640j1877845
$$ 6629020 8943598 6858911 -121462 -4430322 -1902503 453633 -5875007 -17752852
4328a7752852o480498K838501N962704M419513O092520J0608714J0009037K441039
$$ -17752852 -24233350 -21394849 -15432145 -11012632 -4920112 5688602 15697639 18138678
4320A8138678m257455m114386o56443j32074k896566n197610n372105m318796
$$ 18138678 13881223 9766837 9110394 8978320 6081754 884144 -4487961 -8806757
4312h806757k461282L3536J518002N99450j093107n76471K255424M274313L130392
$$ -8806757 -11268039 -11234503 -9716501 -9117051 -10210158 -10786629 -8531205 -4256892 -1126500
4303a126500j55628k982932m067304l795819k676406n58186K575704N655365O853429
$$ -1126500 -1282128 -4265060 -8332364 -12128183 -14804589 -15362775 -12787071 -7131706 -278277
4294b78277N045594Q88852l650825o737767p539785o133337l360362q25708P2608
$$ -278277 4767317 5656169 2005344 -4732423 -12272208 -18405545 -21765907 -22591615 -22519007
4285b2519007p9485J175892M821291P747026N869800K17982l196696j513855K27424
$$ -22519007 -22598492 -21422600 -16601309 -8854283 -2984483 -2766501 -5963197 -7477052 -7249628
4276g249628l549545r338701q442300j18585O477207N689425L082681M899065
$$ -7249628 -10799173 -20137874 -28580174 -28698759 -22221552 -16532127 -13449446 -8550381
4268h550381P102749L032263l414208k876669L457310M630737k345385p279025
$$ -8550381 -1447632 1584631 -1829577 -4706246 -1248936 3381801 1036416 -6242609
4260f242609l407419J777030m43215n227203k390317O318313R271298K421514
$$ -6242609 -9650028 -7872998 -8316213 -13543416 -15933733 -9615420 -344122 2077392
4252B077392n537542o371943k065049J289535K392898L292659L647704J515568
$$ 2077392 -3460150 -9832093 -11897142 -10607607 -8214709 -4922050 -1274346 241222
4244B41222j753212j742545L054088P931300O800173n1217n643798n299447l122041
$$ 241222 -1511990 -3254535 -200447 7730853 14531026 14479809 8836011 3536564 414523
4235D14523n508290j0156845q103153K483104J1706528J0720673K992346k201607
$$ 414523 -5093767 -15250612 -23353765 -20870661 -9164133 1556540 4548886 2347279
4227B347279k444412k216771l920890n459504m957955k482181J436091M724495
$$ 2347279 -97133 -2313904 -6234794 -11694298 -16652253 -19134434 -17698343 -12973848
4219a2973848L841997o30344k158834K379824N726271J84472q932854r168610
$$ -12973848 -9131851 -9762195 -11921029 -9541205 -3814934 -3630462 -12563316 -21731926
4211b1731926J094342J0140919R089689J779301l261505k955131N32986L594564
$$ -21731926 -20637584 -10496665 -1406976 372325 -2889180 -5844311 -5311325 -1716761
4203a716761K762851j874117m185785P94408P389368N185886m889795r958385
$$ -1716761 1046090 -828027 -5013812 -4219404 3169964 8355850 3466055 -6492330
4195f492330l360610O108975P694707K665606j173844j566297j425429j682783
$$ -6492330 -9852940 -3743965 3950742 6616348 5442504 3876207 2450778 767995
4187G67995j148503r3727Q68871K209117K547568j134456p178873q682041l121065
$$ 767995 -380508 -474235 394636 2603753 5151321 4016865 -3162008 -11844049 -14965114
4178a4965114L103743L923847J449213k2375j324286l871570l939639J388671
$$ -14965114 -11861371 -7937524 -6488311 -6510686 -7834972 -11706542 -15646181 -14257510
4170a4257510P299035P400112L052119q1350j222119l392098n996372n330564
$$ -14257510 -6958475 441637 3493756 3412406 2190287 -1201811 -7198183 -12528747
4162a2528747j082563L063186M304547K641248k77596j893688j169852j368538
$$ -12528747 -13611310 -10548124 -6243577 -3602329 -3879925 -5773613 -6943465 -8312003
4154h312003n806677j0683508r406905m316261l902725p171641m218826M259952
$$ -8312003 -14118680 -24802188 -34209093 -38525354 -42428079 -49599720 -53818546 -49558594
4146d9558594M603268n815259j1032231l911518k04953q908879j1622416L765537
$$ -49558594 -44955326 -50770585 -61802816 -65714334 -65919287 -74828166 -86450582 -82685045
4138h2685045J1737245j1749565l5022774m013872P0530462J10088175O9279237
$$ -82685045 -70947800 -82697365 -117720139 -121734011 -51203549 58884626 128163863
4131A28163863m115842l6685171k0285234l67637j339805p285250n405248n639155
$$ 128163863 124048021 87362850 67077616 66709979 65370174 58084924 52679676 47040521
4123D7040521j3380499j5829392n648143M890652L695592l920870o660430k913447
$$ 47040521 33660022 17830630 12182487 17073139 20768731 16847861 10187431 7273984
4115G273984K463552O535724P098349J713000o822279j1051662q505303m305943
$$ 7273984 9737536 16273260 23371609 25084609 18262330 7210668 -1294635 -5600578
4107e600578k107499K98081M219287O400969M897278K108512l10449l265926n145195
$$ -5600578 -7708077 -7409996 -3190709 3210260 8107538 10216050 9905601 6639675 1494480
4098A494480j814375N714897J0073367P055521P63291l450927n474772o773842
$$ 1494480 -319895 5395002 15468369 22523890 23287181 19836254 14361482 7587640
4090G587640n881850j847158J933764J727883j205619k837781k170900j812311
$$ 7587640 1705790 -141368 1792396 3520279 2314660 -523121 -2694021 -4506332
4082d506332l471213n007764k593139M069817R295534O728416j917356p172990
$$ -4506332 -7977545 -12985309 -15578448 -11508631 -2213097 4515319 2597963 -4575027
4074d575027l612702K870985M021386J035781P98941L812161M485168K059674
$$ -4575027 -8187729 -5316744 -1295358 -259577 539364 4351525 8836693 10896367
4066A0896367J903886N108914N817678J480390k446086j860558p77475l732693
$$ 10896367 12800253 17909167 23726845 25207235 22761149 20900591 20123116 16390423
4058A6390423p411316n857884j34668L224752J591250r36014J81182M206781O342032
$$ 16390423 8979107 3121223 2986555 6211307 7802557 6866543 7047725 11254506 17596538
4049A7596538L343393k482493n395013k943960J024867J907090N02373K24313
$$ 17596538 20939931 18457438 13062425 10118465 11143332 13050422 13552795 13777108
4041A3777108O53671r27661l188976k249482Q80396J074408k096683l289647p35607
$$ 13777108 14430779 13503118 10314142 8064660 8945056 10019464 7922781 4633134 3897527
4032C897527M29006k889477o043293l985464J087884L907302L674101L093645
$$ 3897527 4326533 1437056 -4606237 -8591701 -7503817 -3596515 77586 3171231
4024C171231L216401L147293K347505L68890l079494n830904m459825L01449L355618
$$ 3171231 6387632 9534925 11882430 12251320 9171826 3340922 -1118903 -817454 2538164
4015B538164K553642J668676L420496M417621P82972n261688q293072n950344
$$ 2538164 5091806 6760482 10180978 14598599 15381571 10119883 1826811 -4123533
4007d123533M91850P878992J0885886N084027n824500j0816328m332829O119466
$$ -4123533 -3631683 4247309 15133195 20217222 14392722 3576394 -756435 5363031
3999E363031J0008815O861361L516607K525144N66389l671758p041035p135908
$$ 5363031 15371846 22233207 25749814 28274958 28841347 25169589 18128554 10992646
3991A0992646m822220j763488P51949J397000N21774P71605L023030M099136J741224
$$ 10992646 6170426 4406938 5158887 6555887 7077661 7849266 10872296 14971432 16712656
3982A6712656j246766j629645j069443k333505l661451k057566R70238K225386
$$ 16712656 15465890 13836245 12766802 10433297 6771846 4714280 5684518 7909904
3974G909904K070559J494217j869149q083722r752188j317631R683276J0742074
$$ 7909904 9980463 11474680 9605531 1521809 -8230379 -9548010 135266 10877340
3966A0877340K226300l446101l39946M418837M317291K382942K283663Q59900
$$ 10877340 13103640 9657539 9317593 13736430 18053721 20436663 22720326 23580226
3958B3580226m155500p279948l435206L116453M976487J979653j119957k958391
$$ 23580226 19424726 12144778 8709572 11826025 16802512 18782165 17662208 14703817
3950A4703817m754062m807732j137089K614261J116447l816715n191631j472104
$$ 14703817 9949755 5142023 4004934 6619195 7735642 3918927 -1272704 -2744808
3942b744808J568700O35059l51799J727605K635748k307735q604676o891700L463698
$$ -2744808 -1176108 -541049 -892848 834757 3470505 1162770 -7441906 -14333606 -10869908
3933a0869908J1672557R013133j5830m428870j207564K916057K753878P65320
$$ -10869908 802649 9815782 9799952 5371082 4163518 7079575 9833453 10598773
3925A0598773N02316N07458j666658m412309n269393m972978m009308L41204Q020783
$$ 10598773 11101089 11608547 9941889 5529580 260187 -4712791 -8722099 -8380895 -360112
3916c60112J1629707N136273n671784r365168m079987J400529J149037j689798
$$ -360112 11269595 16405868 10734084 1368916 -2711071 -1310542 -161505 -1851303
3908a851303k829582k654067k086685j15377K077530J262770j324631n13327L574246
$$ -1851303 -4680885 -7334952 -9421637 -9537014 -7459484 -6196714 -7521345 -8034672 -4460426
3899d460426M456085L35496k142579N51763K097754k741116q316356o955552j235101
$$ -4460426 -4341 331155 -1811424 -1259661 838093 -1903023 -10219379 -17174931 -18410032
3890a8410032J098402n02137r26373M29475J30942r84061J157354N480203O477186
$$ -18410032 -17311630 -17813767 -18740140 -18310665 -18179723 -19163784 -18006430 -12526227 -6049041
3881f049041L083712k40207j007081n98515P43527L795732N607034K356518k804438
$$ -6049041 -2965329 -3205536 -4212617 -4811132 -4067605 -271873 5335161 7691679 4887241
3872D887241k549581K956303N244412N88490m147607k397858K623105M281576
$$ 4887241 2337660 5293963 10538375 11126865 6979258 4581400 7204505 11486081
3864A1486081K375924Q33779L1279k334478n219040m841546o05619L675784M227024
$$ 11486081 13862005 14695784 14727063 12392585 7173545 2331999 1726380 5402164 9629188
3855I629188N70386m582252o789285l135023L760265P095011L697222j748371
$$ 9629188 10199574 5617322 -1171963 -4306986 -546721 6548290 10245512 8497141
3847H497141k994909k71439J526303N45435o66007o93881j453189m057150o170879
$$ 8497141 5502232 5230793 6757096 7302531 6636524 5942643 4489454 432304 -5738575
3838e738575n106985j327854K493763M505134M865436M818295N029000M520011
$$ -5738575 -10845560 -12173414 -9679651 -5174517 -309081 4509214 9538214 14058225
3830A4058225J905934j764090l123667j083865P55805q53484l331010k085119
$$ 14058225 15964159 14200069 11076402 9992537 10748342 9894858 6563848 4478729
3822D478729J535710K005198l73398J555366R635970J4376065P562805m305696
$$ 4478729 6014439 8019637 7646239 9201605 18837575 33213640 40776445 36470749
3814C6470749p930576k110450J152318m901225j2300071j1356172m449750j51324
$$ 36470749 28540173 26429723 27582041 22680816 10380745 -975427 -5425177 -5576501
3806e576501n1546L93584J935025J148902j759663k944824k291088l124228m394619
$$ -5576501 -5628047 -5234463 -3299438 -2150536 -3910199 -6855023 -9146111 -12270339 -16664958
3797a6664958j210134N372535P263450J173839n889599p077333m735212l898768
$$ -16664958 -17875092 -12502557 -5239107 -4065268 -9954867 -17032200 -21767412 -25666180
3789b5666180l293306M93225M991877N529392L382397K788892K626461r35290
$$ -25666180 -28959486 -28466261 -23474384 -17944992 -14562595 -11773703 -9147242 -10082532
3781a0082532n298869l728066L170091O866483L608839k40076J195636M450812
$$ -10082532 -15381401 -19109467 -15939376 -9072893 -5464054 -5704130 -4508494 -57682
3773e7682L269440j430799l923583k712886j431475j998918j966807Q19834M439196
$$ -57682 3211758 1780959 -2142624 -4855510 -6286985 -8285903 -10252710 -9432876 -4993680
3764d993680N140259J730015l291849o295020n509749j609236L663293Q102558
$$ -4993680 146579 1876594 -1415255 -7710275 -13220024 -14829260 -11165967 -3063409
3756c063409Q704714L613848m078172p337869k973663L665626N117811R09015
$$ -3063409 5641305 9255153 5176981 -2160888 -5134551 -1468925 3648886 4557901
3748D557901l707504n830753o336161m888686l50020M006309L075790j083696
$$ 4557901 850397 -4980356 -11316517 -16205203 -16555223 -12548914 -9473124 -10556820
3740a0556820n10035N952696R280773L861609l518776m554757k016419l059268
$$ -10556820 -11066855 -5114159 4166614 8028223 4509447 -45310 -2061729 -5120997
3732e120997n719284k608680M771391O640976K24778n830715m830690p69226M29895
$$ -5120997 -10840281 -13448961 -8677570 -2036594 -1811816 -7642531 -12473221 -13242447 -12812552
3723a2812552M78859L483863O891338M932973j561934n442298k920916K158935
$$ -12812552 -12333693 -8849830 -1958492 2974481 1412547 -4029751 -6950667 -4791732
3715d791732M458699L681059L312650M973318O013985K909402l536931p667134
$$ -4791732 -333033 3348026 6660676 11633994 17647979 20557381 17020450 9353316
3707I353316n196949P48381K752596j213056m778516j927245M585528P172986
$$ 9353316 4156367 4904748 7657344 6444288 1665772 -261473 4324055 11497041
3699A1497041L476392k064095n736918q479868j1293548j1575792p094567o64964
$$ 11497041 14973433 12909338 7172420 -1307448 -12600996 -24176788 -31271355 -31936319
3691c1936319K704745K079021R48375J839842L414003L221655J054432j185135
$$ -31936319 -29231574 -27152553 -26204178 -24364336 -20950333 -17728678 -16674246 -17859381
3683a7859381j338005J750909P024404J0541531Q104830K71047o731380p329641
$$ -17859381 -19197386 -17446477 -10422073 119458 8224288 8495335 1763955 -5565686
3675e565686l190658j078228m045274p378433m807998L007631Q699215O932466
$$ -5565686 -8756344 -9834572 -13879846 -21258279 -26066277 -23058646 -14359431 -7426965
3667g426965Q60491j648436K482352P764980O768020q98578q222900r039188m089524
$$ -7426965 -6566474 -8214910 -5732558 2032422 8800442 7901864 -321036 -9360224 -13449748
3658a3449748J829318N709204O855333M198406k365549q325518p220999R64433
$$ -13449748 -11620430 -5911226 944107 5142513 2776964 -5548554 -12769553 -11805120
3650a1805120P737533N572176k846352q266485o320530j455547L93008r64067
$$ -11805120 -4067587 1504589 -1341763 -9608248 -15928778 -17384325 -16991317 -17955384
3642a7955384j646385L01350L214004M890716M935111M038002K702196J311934
$$ -17955384 -19601769 -19300419 -16086415 -11195699 -6260588 -2222586 479610 1791544
3634A791544N26370Q59107K040620L041136K689084N71909k093713k742737J44680
$$ 1791544 2317914 3177021 5217641 8258777 10947861 11519770 9426057 6683320 6828000
3625F828000M429464N437115J048767n254761q255666p235063n824140n803642
$$ 6828000 11257464 16694579 17743346 12488585 4232919 -3002144 -8826284 -14629926
3617a4629926m655334p28245K914273L097217K177976M592546R199167J0160360
$$ -14629926 -19285260 -20013505 -17099232 -14002015 -11824039 -7231493 1967674 12128034
3609A2128034N534503j2921k278930k532229l236912l256728q95709J606566Q70819
$$ 12128034 17662537 17649616 15370686 12838457 9601545 6344817 5449108 7055674 7926493
3600G926493k202605l760798k649473j095291l52700P75674K886482M392099L708751
$$ 7926493 5723888 1963090 -686383 -1781674 -2134374 -1358700 1527782 5919881 9628632
3591I628632J212903j253256j655663P55977L802770L518538r46288n012944m072885
$$ 9628632 10841535 9588279 7932616 8688593 12491363 16009901 15063613 10050669 5977784
3582E977784J27519K038599L36237r22588P41259K783336K554574J379555J194721
$$ 5977784 6105303 8143902 8480139 7557551 8298810 11082146 13636720 15016275 16210996
3573A6210996N09136k971762p656335r206284n779671p5473L533338K788336q84495
$$ 16210996 16720132 13748370 6092035 -3114249 -8893920 -8969393 -5436055 -2647719 -3532214
3564c532214l846571l938572k575781j839924n32929L554914P800815O266926
$$ -3532214 -7378785 -11317357 -13893138 -15733062 -16265991 -12711077 -4910262 1356664
3556A356664j107237o088628k802504L654161M559879O3168k394159l19973R83222
$$ 1356664 249427 -5839201 -8641705 -4987544 -427665 -364497 -2758656 -3078629 -2095407
3547b095407j416510k641040J848406Q287088R375811L661294l909834q378051
$$ -2095407 -3511917 -6152957 -4304551 3982537 13358348 17019642 13109808 4731757
3539D731757q018289l341200L021217O399967L847889k106228o033794n691596
$$ 4731757 -3286532 -6627732 -3606515 2793452 6641341 4535113 -1498681 -7190277
3531g190277l244583j006634J179027M017408O585494O988996M242895m65476
$$ -7190277 -10434860 -11441494 -10262467 -6245059 340435 7329431 11572326 11106850
3523A1106850l830389l023873N36031J913635p89971l000335k51280M029303K628928
$$ 11106850 7276461 4252588 4788619 6702254 5912283 2911948 2660668 6689971 9318899
3514I318899m166263p604954k495389N286146O561986R6978p528726j0318545
$$ 9318899 5152636 -2452318 -4947707 338439 6900425 6997403 -531323 -10849868
3506a0849868p573161k415678J063314O78579j401026q14180K705549M259247
$$ -10849868 -18423029 -20838707 -19775393 -19096814 -20497840 -21312020 -18606471 -14347224
3498a4347224J288058j864939o11388K751981L650371L157318M699452N790994
$$ -14347224 -13059166 -14924105 -15535493 -12783512 -9133141 -5975823 -1276371 4514623
3490D514623J282905o155584p646502j302124M563094L897988O54340M03342J801327
$$ 4514623 5797528 -358056 -8004558 -9306682 -4743588 -845600 -191260 212082 2013409
3481B013409J584078J443477L542016M445985N76675m231461l952997l35333m7741
$$ 2013409 3597487 5040964 8582980 13028965 13605640 9374179 5421182 5085849 5038108
3472E038108l486505m288521q7253L700795K578976p06446j204623J515878M480601
$$ 5038108 1551603 -2736918 -2824171 876624 3455600 2749154 1544531 3060409 7541010
3463G541010N758244N198320L027669j75593l321534n448134n558264k548543
$$ 7541010 13299254 18497574 21525243 21349650 18028116 12579982 7021718 4473175
3455D473175K685479O266633N453223K599925J412536P24739k901752p216948
$$ 4473175 7158654 13425287 18878510 21478435 22890971 23615710 20713958 13497010
3447A3497010n610201K364462Q486474O826582J171402k410191m531986q298604
$$ 13497010 7886809 10251271 18737745 25564327 26735729 24325538 19793552 11494948
3439A1494948j0829880o501121L060832R242724P099595L54681m962986o974414
$$ 11494948 665068 -5836053 -2775221 6467503 13567098 13921779 8958793 1984379
3431A984379o626638m327685n86155K575270L404975K612128K389679L827207
$$ 1984379 -4642259 -8969944 -9556099 -6980829 -3575854 -963726 1425953 5253160
3423E253160N693142N228312P86523n089205o596998j347201M867087L856192
$$ 5253160 10946302 16174614 16961137 11871932 5274934 3927733 8794820 12651012
3415A2651012m147263r851536o841129J70000K453375q25705k876686j4651L535152
$$ 12651012 8503749 -1347787 -8188916 -8018916 -5565541 -6391246 -9267932 -9282583 -5747431
3406e747431K690997j196528k931047p10332K366830L054401J528774L3510j87392
$$ -5747431 -3056434 -4252962 -7184009 -7894341 -5527511 -2473110 -944336 -910826 -1098218
3397a098218L07447P77603J722243L895498N987187N001040N27755k922075r80558
$$ -1098218 -790771 -13168 1709075 5604573 11591760 16592800 17120555 14198480 13217922
3388A3217922L876608N009198J502771j10206L442522N836024R01348o549340
$$ 13217922 17094530 22103728 23606499 23496293 26938815 32774839 33676187 27126847
3380B7126847p607371l566448l462227q308469r081963k655105J888470j488822
$$ 27126847 19519476 15953028 12490801 4182332 -4899631 -7554736 -5666266 -7155088
3372g155088m926792J95364Q159971Q183337K379417J358036N266109L525831
$$ -7155088 -12081880 -11886516 -3726545 4456792 6836209 8194245 13460354 16986185
3364A6986185o108463j2194946p236746J385420M081862K354694J938845J383497
$$ 16986185 10877722 -1317224 -8553970 -7168550 -3086688 -731994 1206851 2590348
3356B590348l137390p545284m460889M566995J0210075P908743K166781j351858
$$ 2590348 -547042 -8092326 -12553215 -7986220 2223855 10132598 12299379 10947521
3348A0947521j755216p21918K91175r761j627483k186498m90201P9614l808511
$$ 10947521 9192305 8470387 8761562 8751801 7124318 4937820 4447619 4527233 718722
3339G18722q734355q125518k203138J955322J228648P66167M754357Q854067O557954
$$ 718722 -8015633 -16141151 -18344289 -16388967 -15160319 -14394152 -9639795 -785728 5772226
3330E772226q88137o206874n667536j998487J331997L770919N041459L469630
$$ 5772226 4884089 -1322785 -6990321 -8988808 -7656811 -3885892 1155567 4625197
3322D625197o00369k829263K07012N436695O279731J441268k861726j307060K889416
$$ 4625197 4024828 1195565 1402577 6839272 13119003 14560271 11698545 10391485 13280901
3313A3280901K269783m193282q891985m967898N135710J2219910R768356k97039
$$ 13280901 15550684 11357402 2465417 -2502481 2633229 14853139 24621495 24324456
3305B4324456r860891j1728256n766774J390813L484694O98936k900700n768355
$$ 24324456 14463565 2735309 -3031465 -1640652 1844042 2542978 -357722 -6126077
3297f126077q513824q649958k408781O978691R934299L218249m172114k933862
$$ -6126077 -14639901 -23289859 -25698640 -18719949 -8785650 -5567401 -9739515 -12673377
3289a2673377L914926O558347K355286k790741m170757k092928K077704O303645
$$ -12673377 -8758451 -2200104 155182 -2635559 -6806316 -8899244 -6821540 -517895
3281e17895N750488j730135q640881n166195N747984R969344J596558q434188
$$ -517895 5232593 3502458 -5138423 -10304618 -4556634 5412710 7009268 -1424920
3273a424920q216699j059395J680454k025940l826902R61639O878306O964199
$$ -1424920 -9641619 -10701014 -9020560 -11046500 -14873402 -13911763 -7033457 -69258
3265f9258J839115k353258j892989Q85248J112736k275283m380299j90720P485713
$$ -69258 1769857 -583401 -2476390 -1591142 -478406 -2753689 -7133988 -7324708 161005
3256A61005R433874J390663r288503j1883334n214382J756201J574290l404243
$$ 161005 9594879 10985542 1697039 -10186295 -15400677 -13644476 -12070186 -15474429
3248a5474429n356487j043103M494009M257848j608469m917177O34068J0352463
$$ -15474429 -20830916 -21874019 -17380010 -13122162 -14730631 -19647808 -19013740 -8661277
3240h661277J3601886P941099K469452M417869Q291144M194576o846748j3580719
$$ -8661277 4940609 12881708 15351160 19769029 28060173 32254749 25408001 11827282
3232A1827282r976174k599286l90504k933074l083454J926101O739400N148799
$$ 11827282 1851108 -748178 -1138682 -4071756 -7155210 -5229109 1510291 6659090
3224F659090j826731o582219l243071N558968J1217243Q540947J022601m234021
$$ 6659090 4832359 -1749860 -4992931 566037 11783280 20324227 21346828 17112807
3216A7112807m737512l327519k353723j082446Q84798J491781n35984k888164
$$ 17112807 12375295 9047776 6694053 5611607 6496405 7988186 7452202 4564038
3208D564038k576270l60905J50505k361067m750023l250553J581505N220314M591804
$$ 4564038 1987768 1626863 1777368 -583699 -5333722 -8584275 -7002770 -1782456 2809348
3199B809348J690774M96670J317083O17381l403403p800564q637446n383844j19465
$$ 2809348 4500122 4996792 6313875 6931256 3527853 -4272711 -12910157 -18294001 -18413466
3190a8413466N022143P599249N188631n85396l058813J756128Q269406P702490
$$ -18413466 -13391323 -5792074 -603443 -1188839 -4247652 -2491524 5777882 13480372
3182A3480372O08193l530280j70222L807933Q26401o298627r304898o260763k175013
$$ 13480372 14088565 10558285 10388063 14195996 15022397 8723770 -581128 -6841891 -9016904
3173i016904j64808J527165L977375M805531K353641j321403l140636k079050
$$ -9016904 -9181712 -7654547 -3677172 1128359 3482000 2160597 -980039 -3059089
3165c059089J014220M035080L968709k20317m766748m685922p34510J164852j412349
$$ -3059089 -2044869 1990211 5958920 5738603 971855 -3714067 -4448577 -3283725 -4696074
3156d696074l742808j290541L529622N368912L326756L82337j808224l273752
$$ -4696074 -8438882 -9729423 -6199801 -830889 2495867 2878204 1069980 -2203772
3148b203772l088917r75718P8638k386065n099896k867641L027890N868690L231850
$$ -2203772 -5292689 -6268407 -6189769 -8575834 -13675730 -16543371 -13515481 -7646791 -4414941
3139d414941j18444k80500O11075m91167k544518l528872m012893m490483l325506
$$ -4414941 -4533385 -4813885 -4202810 -4693977 -7238495 -10767367 -14780260 -19270743 -22596249
3130b2596249m16262J288109R40054J703366M175621L770331m43024p79622P646622
$$ -22596249 -23012511 -21724402 -20784348 -19080982 -14905361 -11135030 -11578054 -12357676 -4711054
3121d711054J6028737J2267079q48194q735496n523481j73531n28926k626623
$$ -4711054 11317683 23584762 22736568 14001072 8477591 8304060 7775134 5148511
3113E148511o18138K510995J304104k082727j953664J221448K514225J214263
$$ 5148511 4530373 7041368 8345472 6262745 4309081 5530529 8044754 9259017
3105I259017J071518L130418M080574J696786k270152m856149m846101l277997
$$ 9259017 10330535 13460953 17541527 19238313 16968161 12112012 7265911 3987914
3097C987914k696542m714578p063784n390956M14822M772459L657687Q8882o89623
$$ 3987914 1291372 -3423206 -10486990 -15877946 -15463124 -10690665 -7032978 -6944096 -7633719
3088g633719J476681K682913Q60000k778508n945861n931336q63143O358111Q703713
$$ -7633719 -6157038 -3474125 -2614125 -5392633 -11338494 -17269830 -18132973 -11774862 -3071149
3079c071149L739841j607259K3390N860131P383059K938284r84745l11656J703756
$$ -3071149 668692 -938567 -915177 4944954 12328013 15266297 14281552 13969896 15673652
3070A5673652Q68690k564494o224845q393925p233019j799212M848125P596999
$$ 15673652 16542342 13977848 7753003 -640922 -7873941 -9673153 -4825028 2771971
3062B771971N447914K057448k96553k888075n888865o388335k988518J565865
$$ 2771971 8219885 10277333 9980780 7092705 1203840 -5184495 -8173013 -6607148
3054f607148M290179N152573M878609L046213M1429k226709l030626l337537k832470
$$ -6607148 -2316969 2835604 7714213 10760426 10801855 8575146 5544520 2206983 -625487
3045f25487n2519L553934L916431L77980k621305j877425N83781K004815L002213
$$ -625487 -678006 2875928 6792359 7170339 4549034 2671609 3255390 5260205 8262418
3036H262418M181150K964891j993346o469061n420713k08223L199588K116808
$$ 8262418 12443568 15408459 13415113 6946052 1525339 1317116 4516704 6633512
3028F633512n53980j356704l32512M5385k185158o464367r358582p262183q09583
$$ 6633512 6079532 4722828 4390316 4435701 2250543 -4213824 -13572406 -20834589 -21644172
3019b1644172M946194O323284N018402M352493L978761J614457j734856k485707
$$ -21644172 -16697978 -10374694 -5356292 -1003799 2974962 4589419 2854563 368856
3011C68856r0620K097232K304837K913846N673218P592148N033265K16364p80178
$$ 368856 278236 2375468 4680305 7594151 13267369 20859517 25892782 26109146 25328968
3002B5328968K927819M462172j324576r362378j0631214n147169j734713m197083
$$ 25328968 28256787 32718959 31394383 22032005 11400791 6253622 4518909 321826
2994C21826n815309j437694L056801O11010m274174k591260L513494L796065k638029
$$ 321826 -5493483 -6931177 -3874376 -3263366 -7537540 -10128800 -6615306 -2819241 -5457270
2985e457270n429640l40059L691146l68444o274550n064891J580130N949867N475757
$$ -5457270 -10886910 -11226969 -7535823 -7904267 -14178817 -19243708 -17663578 -11713711 -6237954
2976f237954K340409j802043m036576K65617Q871998J0702865J062847q113072
$$ -6237954 -3897545 -5699588 -9736164 -9470547 -598549 10104316 11167163 3054091
2968C054091l848852Q023923J1194917L017649l790148k337027L41497j419428
$$ 3054091 -794761 7229162 18424079 21441728 17651580 15314553 15656050 14236622
2960A4236622k488802J585107M954571P66566p661863j1914831r425306l984305
$$ 14236622 11747820 13332927 18287498 19054064 11392201 -522630 -9947936 -13932241
2952a3932241K10567Q63744j763413l343672P71869P925023R854730M425988j015252
$$ -13932241 -13721674 -12857930 -14621343 -17965015 -17193146 -9268123 586607 5012595 3997343
2943C997343j168094p7799k165685l646204K86166N952693O552555K405864j425854
$$ 3997343 2829249 2751450 585765 -3060439 -2774273 3178420 9730975 12136839 10710985
2934A0710985l483257m540000k296650M100681P889784K528481o634916q551660
$$ 10710985 7227728 2687728 391078 4491759 12381543 14910024 8275108 -276552
2926b76552l166197j054531n725374p937330j491795O034641N113112j353802
$$ -276552 -3442749 -4497280 -10222654 -18159984 -19651779 -13617138 -8504026 -9857828
2918i857828l715220k59822K427703J062070o64405K33187J543121N30751j738540
$$ -9857828 -13573048 -13832870 -11405167 -10343097 -11007502 -10774315 -9231194 -8700443 -10438983
2909a0438983k660660j557635N64831K420200K602027L68605k799759m069126
$$ -10438983 -13099643 -14657278 -14092447 -11672247 -9070220 -8701615 -11501374 -15570500
2901a5570500k419463M69423K909442M982306O763778O606839L027446k395797
$$ -15570500 -17989963 -17520540 -14611098 -9628792 -2865014 3741825 6769271 4373474
2893D373474n771965m853723j303517J384515J632962Q98053J292250K914588
$$ 4373474 -1398491 -6252214 -7555731 -6171216 -4538254 -3640201 -2347951 566637
2885E66637M076432L681745K284793O37904j417722l498275l257235J292575P706410
$$ 566637 4643069 8324814 10609607 11247511 9829789 6331514 3074279 4366854 12073264
2876A2073264R648906L487689o412629j1136546o611940J700112M641519n27222
$$ 12073264 21722170 25209859 18797230 7660684 1048744 2748856 7390375 6863153
2868F863153p143112o905898L27998O407729N064944j69332j075917L456624N589252
$$ 6863153 -279959 -7185857 -6857859 -450130 4614814 4445482 3369565 6826189 12415441
2859A2415441J42862o918071o415708P04482M639606R25446l816198k641986J718702
$$ 12415441 12558303 5640232 -775476 -70994 4568612 5494058 1677860 -964126 754576
2850G54576K319167j225501l227279o28183M285904Q306463R280910M998903m287923
$$ 754576 3073743 1848242 -1379037 -2007220 2278684 10585147 19866057 24864960 20577037
2841B0577037j2729553j3917259r201590n464748m609038k036470L320268N551063
$$ 20577037 7847484 -6069775 -15271365 -20736113 -25345151 -27381621 -24061353 -18510290
2833a8510290K119864p373N117552J1807604J0653505L150063o62213K197831
$$ -18510290 -16390426 -16397799 -11280247 527357 11180862 14330925 13668712 15866543
2825A5866543L800101j389616p796665p552616j902061J748329O42676j249639
$$ 15866543 19666644 18277028 10480363 2927747 1025686 2774015 3416691 2167052
2817B167052q40425k65344k233013m585412k614126L795026Q208836M744291m044222
$$ 2167052 1326627 1061283 -1171730 -5757142 -8371268 -4576242 3632594 8376885 4332663
2808D332663r259292o055831J177641N528358N810962M867872L154848m82017
$$ 4332663 -4926629 -10982460 -9804819 -4276461 1534501 6402373 9557221 9075204
2800I075204l512804j884621K394333K604433k184148m868137j652810J442471
$$ 9075204 5562400 3677779 6072112 8676545 6492397 1624260 -28550 1413921
2792A413921j296749n111351k542312L096334J839653o492039j0159639k219768
$$ 1413921 117172 -4994179 -7536491 -4440157 -2600504 -9092543 -19252182 -21471950
2784b1471950R239935J2351998O640199J066050R99735L459847L698255R24409
$$ -21471950 -12232015 119983 6760182 7826232 8825967 12285814 15984069 16908478
2776A6908478k771574n232573n093363k295048J449237L840988L659243R09353
$$ 16908478 14136904 8904331 3810968 1515920 2965157 6806145 10465388 11374741
2768A1374741l272238o159656n264904k192198j862753n435689p159516k118936
$$ 11374741 8102503 1942847 -3322057 -5514255 -7377008 -12812697 -19972213 -22091149
2760b2091149N755689Q710856O269077M741223O007517M398312k844741r008330
$$ -22091149 -16335460 -7624604 -1355527 3385696 9393213 13791525 10946784 1938454
2752A938454o723070J397312O580810N584129K950817K876901M302106M628914
$$ 1938454 -4784616 -3387304 3193506 8777635 11728452 14605353 18907459 23536373
2744B3536373L910122L459615K813840J33856m900978r499114r567440m051043
$$ 23536373 27446495 30906110 33719950 33853806 28952828 19453714 9886274 5835231
2736E835231K553477L989884m95384m821778l619102J121267L360173J075861
$$ 5835231 8388708 12378592 11883208 7061430 3442328 4563595 7923768 8999629
2728H999629k202848l067320k193115k335946m557207o951743o186199p88314
$$ 8999629 6796781 3729461 1536346 -799600 -5356807 -12308550 -18494749 -19283063
2720a9283063O300504R733114P382706K313897j786255m301563n079113k117823
$$ -19283063 -12982559 -3249445 4133261 6447158 4660903 359340 -4719773 -6837596
2712f837596M205416P926871M030718l509352n981579j661719K399646O09055
$$ -6837596 -2632180 5294691 9325409 5816057 -165522 -1827241 572405 1181460
2704A181460m650516p794729o300932q21461O133383R916970O873903p1938l340953
$$ 1181460 -3469056 -11263785 -17564717 -18386178 -12252795 -2335825 4538078 4466140 1125187
2695A125187m81507K597328J108882q70714K929923R960189J0665548J067788
$$ 1125187 643680 3241008 4349890 3479176 6409099 16369288 27034836 28102624
2687B8102624j1218543j5145680q164672J588808M626703M44984k999024l27028
$$ 28102624 16884081 1738401 -6426271 -4837463 -210760 234224 -2764800 -3091828
2679c091828L992486K578100l554163o506019l541973n26314j631594k668583
$$ -3091828 900658 3478758 -75405 -6581424 -10123397 -10649711 -12281305 -14949888
2671a4949888J193514O715389P225990K523870j449042j137307J166607J782975
$$ -14949888 -13756374 -7040985 185005 2708875 1259833 122526 1289133 3072108
2663C072108K0601j889032j377746J408115K738517l83259m926430m716017M86156
$$ 3072108 3092709 1203677 -174069 1234046 3972563 3589304 -1337126 -6053143 -5566987
2654e566987L727873Q15470l825409m511631k135929k51950J533396M714528O692479
$$ -5566987 -1839114 -1023644 -4849053 -9360684 -11496613 -11748563 -10215167 -5500639 1191840
2645A191840M523661O84874o46370j17238n22224r90784J04295n6521m038751
$$ 1191840 5715501 6400375 5754005 5636767 5114543 4123759 4228054 4171533 132782
2636A32782p263573l550477M548292Q737856O651094K720294q21080m965617p032438
$$ 132782 -7130791 -10681268 -6132976 2604880 9255974 11976268 11155188 6189571 -842867
2627h42867k602465M954489O395772k06780o971449q533674p561113n860012n58745
$$ -842867 -3445332 1509157 7904929 7698149 726700 -7806974 -15368087 -21228099 -21786844
2618b1786844O559826O553325k881704j0007694m005539R220280J5011102Q982774
$$ -21786844 -15227018 -8673693 -11555397 -21563091 -25568630 -16348350 -1337248 7645526
2610G645526n30900n594473n565509k680306J040157K427176o88450n191401n465971
$$ 7645526 7114626 1520153 -4045356 -6725662 -5685505 -3258329 -3946779 -9138180 -14604151
2601a4604151r00906L505223M125531K429374J514834K321854L721936L835384
$$ -14604151 -15505057 -11999834 -7874303 -5444929 -3930095 -1608241 2113695 5949079
2593E949079J228003l145003n689710l883952M24920L201994K704672J30945k733194
$$ 5949079 7177082 4032079 -1657631 -5541583 -5116663 -1914669 790003 920948 -1812246
2584a812246m495641m140198k050251M9468J542517L541074N746082N402094J703273
$$ -1812246 -6307887 -10448085 -12498336 -12448868 -10906351 -7365277 -1619195 3782899 5486172
2575E486172j386790J25459M517836O497852L875319o91591l603528l480575j288191
$$ 5486172 4099382 4224841 8742677 15240529 19115848 18424257 14820729 11340154 10051963
2566A0051963N54193m4548k435327l722021k682990j200016n60757Q59238M031745
$$ 10051963 10606156 10561608 8126281 4404260 1721270 521254 -39503 819735 4851480
2557D851480O045372L433228k842256q183860q898541m419401K895780Q342611
$$ 4851480 10896852 14330080 11487824 3303964 -5594577 -10013978 -7118198 1224413
2549A224413P605111J331142m634892n364506j595468K564602M227655L002859
$$ 1224413 8829524 10160666 5525774 161268 -1434200 1130402 5358057 8360916
2541H360916M55171p55379J16337p9955l570125o105876k591977K598600J82605
$$ 8360916 8816087 8060708 8177045 8097090 4526965 -1578911 -4170888 -1572288 -1389683
2532a389683p950711q628391K097722J0487193N436993m119178l868588L258672
$$ -1389683 -9340394 -17968785 -15871063 -5383870 53123 -4066055 -7934643 -4675971
2524d675971L789400l159438n758976l57746L386912m32690n647535n731376k135144
$$ -4675971 -886571 -4046009 -9804985 -10162731 -6775819 -7208509 -12856044 -18587420 -20722564
2515b0722564K245825P312655J0323654O401758j960532n337571p78681M257225
$$ -20722564 -18476739 -11164084 -840430 5561328 3600796 -1736775 -2515456 1741769
2507A741769M394759L109737L496793K401692j579814l940729l169189m210800
$$ 1741769 6136528 9246265 12743058 15144750 13564936 9624207 6455018 2244218
2499B244218p669945n827584L732838J0705529O830535r94504j948078K339165
$$ 2244218 -5425727 -11253311 -7520473 3185056 10015591 9021087 7073009 9412174
2491I412174L056109q04743l700424m653939o239998o349315j504330M475467
$$ 9412174 12468283 11663540 7963116 3309177 -2930821 -9280136 -10784466 -6308999
2483f308999M955758J179804n74665M13509P49198J455192M795031N884429q75251
$$ -6308999 -1353241 -173437 -748102 -334593 414605 1869797 6664828 12549257 11674006
2474A1674006r299353q078411R69152M746287m04098m062043o01080J908399k609699
$$ 11674006 2374653 -5703758 -4734606 11681 -392417 -4454460 -5055540 -3147141 -5756840
2465e756840p282724n314467k151492m496682o862067o95899J0013195J4213289
$$ -5756840 -13039564 -18354031 -20505523 -25002205 -31864272 -32560171 -22546976 -8333687
2457h333687J0441204O529159N372511K262350m193087q814903q595999o102087
$$ -8333687 2107517 8636676 14009187 16271537 12078450 3263547 -5332452 -11434539
2449a1434539k898420K334093P411874O481201n90381n700504l426308J450173
$$ -11434539 -14332959 -11998866 -4586992 1894209 1303828 -4396676 -7822984 -6372811
2441f372811J788110j685540l240005j360641N77746N97865j62261p84172j083457
$$ -6372811 -4584701 -6270241 -9510246 -10870887 -10293141 -9695276 -9857537 -10641709 -11725166
2432a1725166K28894L538665N302567J736770m581708o604127k037816L813293
$$ -11725166 -11496272 -7957607 -2655040 -918270 -5499978 -12104105 -14141921 -10328628
2424a0328628N603884L877273J810211O98103J139822M009121O841865L982954
$$ -10328628 -4724744 -847471 962740 1660843 2800665 6809786 13651651 17634605
2416A7634605m971163j1270116p724420K00512J609155l728031n605761K25424
$$ 17634605 12663442 1393326 -6331094 -6130582 -4521427 -8249458 -13855219 -13629795
2408a3629795N775326M065264l41742K69685M875836P187919O104045N358985
$$ -13629795 -7854469 -3789205 -4130947 -3861262 1014574 8202493 14306538 19665523
2400A9665523N785986M910494K537242N49300j553373n108366p565893n410594
$$ 19665523 25451509 30362003 32899245 33448545 31895172 26786806 19220913 13810319
2392A3810319j021027k43771l228436m290515j641453l05766l104508n310043
$$ 13810319 12789292 12545521 9317085 5026570 3385117 3079351 -25157 -5335200
2384e335200k197444L213490M690949J628190j328866j371922J31038J440575
$$ -5335200 -7532644 -4319154 371795 1999985 671119 -700803 -569765 870810
2376H70810K754350M468891N709587N280566K927367m52607l188378l719271j758480
$$ 870810 3625160 8094051 13803638 19084204 22011571 21558964 18370586 14651315 12892835
$$ [...]
##END NTUPLES=NMR SPECTRUM
##END=
